##TITLE=31Pdec_DE-106_ch_10_TFA
CDCl3, 64 sc
 20.8.2025
##JCAMPDX= 6.0         $$ Bruker NMR JCAMP-DX V2.0
##DATA TYPE= NMR SPECTRUM
##DATA CLASS= NTUPLES
##ORIGIN= UXNMR, Bruker Analytische Messtechnik GmbH
##OWNER= root
$$ XWIN-NMR		Version 3.5
$$ Wed Aug 20 14:07:31 2025 Russian Standard Time (UT+4h)  she@DPX200
##.OBSERVE FREQUENCY= 81.013821
##.OBSERVE NUCLEUS= ^31P
##.ACQUISITION MODE= SIMULTANEOUS
##.ACQUISITION SCHEME= undefined
##.AVERAGES= 64
##.DIGITISER RES= 17
##SPECTROMETER/DATA SYSTEM= spect
##.PULSE SEQUENCE= zgpg30
##.SOLVENT NAME= CDCl3
##.SHIFT REFERENCE= (INTERNAL, CDCl3, 0, 198.062)
##AUDIT TRAIL= $$ (NUMBER, WHEN, WHO, WHERE, WHAT)
$$ ##TITLE= Audit trail, XWIN-NMR		Version 3.5
$$ ##JCAMPDX= 5.01
$$ ##ORIGIN= Bruker BioSpin GmbH
$$ ##OWNER= she
$$ F:/spectra/data/she/nmr/P31/2/pdata/1/auditp.txt
$$ ##AUDIT TRAIL=  $$ (NUMBER, WHEN, WHO, WHERE, WHAT)
(   1,<2025-08-20 14:06:12.14 +0400>,<she>,<DPX200>,
      <created by zg, POWCHK disabled, PULCHK disabled
       configuration hash MD5:
       00 E9 B6 7A A2 85 ED C7 34 08 36 98 17 FE 4E 26
       data hash MD5: 32K
       9F 05 EB F6 5C 81 99 08 52 D4 E3 B8 94 46 66 CA>)
(   2,<2025-08-20 14:06:15.25 +0400>,<she>,<DPX200>,
      <Start of raw data processing
       efp BC_mod = 2 LB = 1.5 FT_mod = 6 PKNL = 1 PHC0 = 1590.746 PHC1 = -437.5005 SI = 64K 
       data hash MD5: 64K
       18 6E 7D 2F 4D F8 9B 0B 32 D0 69 E3 EE A6 C1 32>)
(   3,<2025-08-20 14:06:33.10 +0400>,<she>,<DPX200>,
      <pk PHC0 = 0.568023 PHC1 = 0 
       data hash MD5: 64K
       7D 32 D0 DF 8B B1 01 8A FC 92 14 3C DA B0 8F B1>)
(   4,<2025-08-20 14:06:53.56 +0400>,<she>,<DPX200>,
      <pk PHC0 = -3.599999 PHC1 = 0 
       data hash MD5: 64K
       BE 0B 7A 84 78 2B 3C 31 B6 79 03 84 26 7D EE F4>)
$$ ##END=
$$ 
$$ hash MD5
$$ 9C E3 E2 D4 B3 96 4E 3A 86 79 1E 23 43 A8 E1 8C
##$RELAX= 
##$RELAX= 
##$RELAX= 
##$RELAX= 
##$RELAX= 
##$RELAX= 
##$RELAX= 
##$RELAX= 
$$ Bruker specific parameters
$$ --------------------------
##$DU= <F:/spectra>
##$EXPNO= 2
##$NAME= <P31>
##$PROCNO= 1
##$TYPE= <nmr>
##$USER= <she>
##$AMP= (0..31)
100 100 100 100 100 100 100 100 100 100 100 100 100 100 100 100 100 100 
100 100 100 100 100 100 100 100 100 100 100 100 100 100 
##$AQSEQ= 0
##$AQ_mod= 1
##$AUNM= <au_zg>
##$AUTOPOS= <>
##$BF1= 81.014009
##$BF2= 200.13
##$BF3= 200.13
##$BF4= 200.13
##$BF5= 200.13
##$BF6= 200.13
##$BF7= 200.13
##$BF8= 200.13
##$BYTORDA= 1
##$CFDGTYP= 0
##$CFRGTYP= 5
##$CHEMSTR= <none>
##$CNST= (0..31)
1 1 145 1 1 1 1 1 1 1 1 1 1 1 1 1 1 1 1 1 1 1 1 1 1 1 1 1 1 1 1 1 
##$CPDPRG= <waltz16>
##$CPDPRG1= <>
##$CPDPRG2= <waltz16>
##$CPDPRG3= <>
##$CPDPRG4= <mlev>
##$CPDPRG5= <mlev>
##$CPDPRG6= <mlev>
##$CPDPRG7= <mlev>
##$CPDPRG8= <mlev>
##$CPDPRGB= <>
##$CPDPRGT= <>
##$D= (0..31)
0 1 0 0 0 0 0 0 0 0.06 0 0.03 2e-05 3e-06 0 0 0.0002 0 0 0 0 0 0 0 0 0 
0 0 0 0 0 0 
##$DATE= 1755684371
##$DBL= (0..7)
120 120 120 11 120 120 24 19 
##$DBP= (0..7)
150 150 150 150 150 150 150 150 
##$DBP07= 0
##$DBPNAM0= <>
$$ [...]
##$SUBNAM3= <"">
##$SUBNAM4= <"">
##$SUBNAM5= <"">
##$SUBNAM6= <"">
##$SUBNAM7= <"">
##$SUBNAM8= <"">
##$SUBNAM9= <"">
##$SW= 400.765351723535
##$SWIBOX= (0..15)
0 1 3 0 0 0 0 0 0 0 0 0 0 0 0 0 
##$SW_h= 32467.5324675325
##$TD= 32768
##$TD0= 1
##$TE= 0
##$TE2= 300
##$TE3= 300
##$TEG= 300
##$TL= (0..7)
0 120 53 12 22 120 120 120 
##$TP= (0..7)
150 150 150 150 150 150 150 150 
##$TP07= 0
##$TPNAME0= <>
##$TPNAME1= <>
##$TPNAME2= <>
##$TPNAME3= <>
##$TPNAME4= <>
##$TPNAME5= <>
##$TPNAME6= <>
##$TPNAME7= <>
##$TPOAL= (0..7)
0.5 0.5 0.5 0.5 0.5 0.5 0.5 0.5 
##$TPOFFS= (0..7)
0 0 0 0 0 0 0 0 
##$TUNHIN= 0
##$TUNHOUT= 0
##$TUNXOUT= 0
##$USERA1= <user>
##$USERA2= <user>
##$USERA3= <user>
##$USERA4= <user>
##$USERA5= <user>
##$V9= 5
##$VALIST= <valist>
##$VCLIST= <CCCCCCCCCCCCCCC>
##$VD= 0
##$VDLIST= <DDDDDDDDDDDDDDD>
##$VPLIST= <PPPPPPPPPPPPPPP>
##$VTLIST= <TTTTTTTTTTTTTTT>
##$WBST= 1024
##$WBSW= 4
##$XGAIN= (0..3)
0 0 0 0 
##$XL= 0
##$YL= 0
##$YMAX_a= 15691
##$YMIN_a= -10865
##$ZGOPTNS= <>
##$ZL1= 120
##$ZL2= 120
##$ZL3= 120
##$ZL4= 120
##$ABSF1= 0
##$ABSF2= 0
##$ABSG= 0
##$ABSL= 0
##$ALPHA= 0
##$AQORDER= 0
##$ASSFAC= 0
##$ASSFACI= 0
##$ASSFACX= 0
##$ASSWID= 0
##$AUNMP= <proc_1d>
##$AZFE= 0.1
##$AZFW= 0.5
##$BCFW= 0
##$BC_mod= 2
##$BYTORDP= 0
##$COROFFS= 0
##$CY= -3
##$DATMOD= 1
##$DC= 0
##$DFILT= <>
##$DTYPP= 0
##$F1P= 0
##$F2P= 0
##$FCOR= 1
##$FTSIZE= 65536
##$FT_mod= 6
##$GAMMA= 0
##$GB= 0
##$INTBC= 1
##$INTSCL= 9.790993e-09
##$ISEN= 30
##$LB= 1.5
##$LEV0= 0
##$LPBIN= 0
##$MAXI= 10000
##$MC2= 0
##$MEAN= 0
##$ME_mod= 0
##$MI= 50
##$NCOEF= 0
##$NC_proc= -9
##$NLEV= 6
##$NOISF1= 182.463
##$NOISF2= 159.3651
##$NSP= 0
##$NTH_PI= 0
##$NZP= 0
##$OFFSET= 198.0616
##$PC= 4
##$PHC0= 1587.714
##$PHC1= -437.5005
##$PH_mod= 1
##$PKNL= yes
##$PPARMOD= 0
##$PSCAL= 0
##$PSIGN= 0
##$REVERSE= no
##$SF= 81.0140089999434
##$SI= 65536
##$SIGF1= 159.3651
##$SIGF2= -187.1042
##$SINO= 113.3802
##$SIOLD= 16384
##$SREGLST= <1H.CDCl3>
##$SSB= 0
##$STSI= 65536
##$STSR= 0
##$SW_p= 32467.5324675325
##$SYMM= 0
##$S_DEV= 0
##$TDeff= 32768
##$TDoff= 0
##$TI= <>
##$TILT= no
##$TM1= 0
##$TM2= 0
##$TOPLEV= 0
##$USERP1= <user>
##$USERP2= <user>
##$USERP3= <user>
##$USERP4= <user>
##$USERP5= <user>
##$WDW= 1
##$XDIM= 65536
##$YMAX_p= 483551855
##$YMIN_p= -142671311
$$ End of Bruker specific parameters
$$ ---------------------------------
##NTUPLES= NMR SPECTRUM
##VAR_NAME=  FREQUENCY,     SPECTRUM/REAL,   SPECTRUM/IMAG
##SYMBOL=    X,             R,               I
##VAR_TYPE=  INDEPENDENT,   DEPENDENT,       DEPENDENT
##VAR_FORM=  AFFN,          ASDF,            ASDF
##VAR_DIM=   65536,         65536,           65536
##UNITS=     HZ,            ARBITRARY UNITS, ARBITRARY UNITS
##FACTOR=    0.49542278885378, 1,            1
##FIRST=     16045.7642231865, 0,            0
##LAST=      -16421.768244346, 0,            0
##MIN=       -16421.768244346, -142671311,   0
##MAX=       16045.7642231865, 483551855,    0
$$ Real data points
##PAGE= N=1
##DATA TABLE= (X++(R..R)), XYDATA
$$ [...]
$$ plain form
7405 10419099 12909875 12874043 8883259 4329973 3281479 4808555 5006445 2935087 1236247
7396 1236247 2007447 5089445 9617341 14381947 17129572 16289122 13482578 12148268 13630960
7387 13630960 16475864 19245359 21678759 22959140 21432186 17127031 12657631 10230888
7379 10230888 9018460 6926398 4102989 2915178 4376298 6269531 6048143 4755392
7371 4755392 5908664 9801623 11308456 6096127 -2224206 -5269847 -810203 4076446
7363 4076446 3288686 494339 2659255 8285149 9461734 4932666 2973663 8960037
7355 8960037 17461539 21059251 20588032 20569660 19940297 15414056 10642737 12638955 19830257
7346 19830257 22919504 18680889 13817180 12628913 10369540 3808264 -630834 2949189
$$ packed form
7405A0419099K490776l5832l990784m553286j048494J527076J97890k071358j698840
7396A236247P71200L081998M527896M764606K747625q40450k806544j334310J482692
7387A3630960K844904K769495K433400J280381j526954m305155m469400k426743
7379A0230888j212428k092062k823409j187811J461120J893233k21388j292751
7371D755392J153272L892959J506833n212329q320333l045641M459644M886649
7363D076446p87760k794347K164916N625894J176585m529068j959003N986374
7355H960037Q501502L597712m71219j8372o29363m526241m771319J996218P191302
7346A9830257L089247m238615m863709j188267k259373o561276m439098L580023
$$ plain form
7338 2949189 8509802 6227503 -2270690 -6447256 -2189713 4920228 10490999 15548222
7330 15548222 19178987 16731909 8365900 1394224 562576 2737474 4352343 6936661
7322 6936661 11203197 12750768 9083667 4960397 4972890 6102642 3778074 315344 289889
7313 289889 1706066 -323593 -3974612 -3072284 2316767 5761745 4935193 4696679 8605889
7304 8605889 13863826 16373431 15383155 11609891 5863342 1068599 722294 3533891 4095257
7295 4095257 583508 -2689116 -2263144 -473133 -932813 -3274819 -5295706 -6660449 -7234300
7286 -7234300 -4863232 1472412 8282851 10857084 9076112 7348831 9122798 13182442
7278 13182442 15266247 12605147 7111727 3846490 5496864 9236658 10472694 8159178
$$ packed form
7338B949189N560613k282299q498193m176566M257543P109941N570771N057223
7330A5548222L630765k447078q366009o971676q31648K174898J614869K584318
7322F936661M266536J547571l667101m123270J2493J129752k324568l462730k5455
7313B89889J416177k029659l651019R02328N389051L444978q26552k38514L909210
7304H605889N257937K509605r90276l773264n746549m794743l46305K811597N61366
7295D095257l511749l272624M25972J790011m59680k342006k020887j364743n73851
7286g234300K371068O335644O810439K574233j780972j727281J773967M059644
7278A3182442K083805k661100n493420l265237J650374L739794J236036k313516
$$ plain form
7270 8159178 4088373 -790777 -5206992 -4738406 3728960 14897981 18955069 13833347
7262 13833347 7317197 5207268 4495168 1624181 127477 4221480 10486550 12684980
7254 12684980 10856418 8974443 6958254 2303027 -2550210 -2136511 3262810 7672263
7246 7672263 8518307 9342929 12632976 16022062 17305347 17786984 18229732 15991585 9097837
7237 9097837 30072 -6998644 -10306051 -10756392 -9802132 -8707871 -7589673 -4610133 1420770
7228 1420770 7480896 8739521 5176660 2004530 2184339 2595253 -23209 -3167992 -2173202
7219 -2173202 2826464 7316911 8495419 7603895 6743110 6289708 5752897 5207858 5200649
7210 5200649 5840092 6005337 3652630 -1947587 -8356637 -12288514 -14080230 -17225069 -22443904
$$ packed form
7270H159178m070805m879150m416215M68586Q467366J1169021M057088n121722
7262A3833347o516150k109929p12100k870987j496704M094003O265070K198430
7254A2684980j828562j881975k016189m655227m853237M13699N399321M409453
7246G672263Q46044Q24622L290047L389086J283285M81637M42748k238147o893748
7237I097837r067765p028716l307407m50341R54260J094261J118198K979540O030903
7228A420770O060126J258625l562861l172130J79809M10914k618462l144783R94790
7219b173202M999666M490447J178508q91524q60785m53402n36811n45039p209
7210E200649O39443J65245k352707n600217o409050l931877j791716l144839n218835
$$ plain form
7201 -22443904 -25362568 -22421162 -16461249 -13299205 -14559234 -17235750 -18913350 -19442204
7193 -19442204 -17901481 -12215331 -2997031 5348646 9026684 8526898 7048135 7187135
7185 7187135 9856375 14141211 17031462 15522275 10621901 7396756 9240424 13806932
7177 13806932 16585243 16635446 15998945 14935337 11682316 6991529 4909444 7407650 11244965
7168 11244965 12427362 11542223 12023014 14760565 17534545 18959409 19607574 19064949 15251900
7159 15251900 7987836 657317 -3308569 -3583846 -1125360 4241403 11775202 17406605
7151 17406605 17194386 12838173 10322311 12726415 17511973 21453716 24444888 26501772
7143 26501772 24692231 16842181 6422971 -314834 -1688092 -1594378 -3177805 -5073430
$$ packed form
7201b2443904k918664K941406N959913L162044j260029k676516j677600n28854
7193a9442204J540723N686150R218300Q345677L678038m99786j478763J39000
7185G187135K669240M284836K890251j509187m900374l225145J843668M566508
7177A3806932K778311N0203o36501j063608l253021m690787k082085K498206L837315
7168A1244965J182397q85139M80791K737551K773980J424864O48165n42625l813049
7159A5251900p264064p330519l965886k75277K458486N366763P533799N631403
7151A7406605k12219m356213k515862K404104M785558L941743K991172K056884
7143B6501772j809541p850050j0419210o737805j373258R3714j583427j895625
$$ plain form
7135 -5073430 -4801364 -2412002 1003073 5396644 9966882 11899995 10023656 7748483
7127 7748483 8705582 10759510 8720944 2818844 -382101 2953947 8213192 8451768 3068856
7118 3068856 -2923865 -5979537 -6625329 -6254207 -5104532 -3430565 -1841307 -325700 995233
7109 995233 776385 -1412952 -2848143 -1030837 1223608 -1429829 -8191302 -11014203 -4773360
7100 -4773360 5274071 9761023 6399649 1104495 -479238 1426034 3260754 2696514
7092 2696514 -31987 -2860059 -2988875 1178690 8356249 15319648 19615280 20848786
7084 20848786 20039638 18762585 18170481 17650084 15341121 11353423 9122569 11270296 15007553
7075 15007553 14542354 8104691 -50220 -4995272 -5901569 -4800085 -3324879 -2235589
$$ packed form
7135e073430K72066K389362L415075M393571M570238J933113j876339k275173
7127G748483R57099K053928k038566n902100l200945L336048N259245K38576n382912
7118C068856n992721l055672o45792L71122J149675J673967J589258J515607J320933
7109I95233k18848k189337j435191J817306K254445k653437o761473k822901O240843
7100d773360J0047431M486952l361374n295154j583733J905272J834720n64240
7092B696514k728501k828072j28816M167565P177559O963399M295632J233506
7084B0848786q09148j277053n92104n20397k308963l987698k230854K147727L737257
7075A5007553m65199o437663q154911m945052r06297J101484J475206J089290
$$ plain form
7067 -2235589 -2085553 -2444337 -1697609 807685 3372542 3876326 1996329 -1473186 -5758408
7058 -5758408 -8884972 -7353867 -211808 7337646 8053223 1111612 -6643621 -9197232
7050 -9197232 -7986904 -7636892 -7994831 -4844498 2132443 6886927 4281467 -3297238 -8900303
7041 -8900303 -8480882 -3200226 3665775 9101894 10825744 8786123 6204072 6350382 8116327
7032 8116327 7466900 3528685 57413 -283485 -63984 -3396775 -10200191 -16415729 -18631968
7023 -18631968 -16506386 -11617684 -5864979 -553558 4248507 8963842 12464965 12181788
7015 12181788 7511266 1676053 -1613719 -2319990 -3008344 -4450841 -4636218 -2408178 -263482
7006 -263482 -2260120 -9123229 -15980876 -16250523 -8981152 -1228977 -626299 -5943520 -8360458
$$ packed form
7067b235589J50036l58784P46728K505294K564857N03784j879997l469515m285222
7058e758408l126564J531105P142059P549454P15577o941611p755233k553611
7050i197232J210328L50012l57939L150333O976941M754484k605460p578705n603065
7041h900303M19421N280656O866001N436119J723850k039621k582051J46310J765945
7032H116327o49427l938215l471272l40898K19501l332791o803416o215538k216239
7023a8631968K125582M888702N752705N311421M802065M715335L501123k83177
7015A2181788m670522n835213l289772p06271o88354j442497j85377K228040K144696
7006b63482j996638o863109o857647k69647P269371P752175O02678n317221k416938
$$ plain form
6997 -8360458 -2684895 6585547 12192298 13174858 13779594 16274676 18694389 18059608 12684511
6988 12684511 3054955 -6523592 -9388164 -3548802 4395070 6386736 2517875 -606896
6980 -606896 595624 3955892 7408878 11617382 16020635 17627619 15491057 12300926
6972 12300926 10194525 8854338 8737705 11642069 16214116 17308755 12726535 7418472
6964 7418472 8075755 15494229 24212423 27949451 24386962 16825996 11913656 13310775
6956 13310775 17270445 17336844 13122797 10258283 11642589 14228294 15625413 17693623
6948 17693623 20876469 21125744 16689519 12635410 13571845 16457761 16342476 15221138 18286654
6939 18286654 23723492 23503886 14335211 2170352 -4751496 -3153931 4894972 14545485
$$ packed form
6997h360458N675563R270442N606751R82560O04736K495082K419713o34781n375097
6988A2684511r629556r578547k864572N839362P943872J991666l868861l124771
6980f06896J202520L360268L452986M208504M403253J606984k136562l190131
6972A2300926k106401j340187j16633K904364M572047J094639m582220n308063
6964G418472O57283P418474Q718194L737028l562489p560966m912340J397119
6956A3310775L959670O6399m214047k864514J384306K585705J397119K068210
6948A7693623L182846K49275m436225m054109R36435K885916j15285j121338L065516
6939A8286654N436838k19606r168675j2164859o921848J597565Q048903R650513
$$ plain form
6931 14545485 20594170 20761916 17172999 12742897 7456476 879020 -3918932 -3289363
6923 -3289363 1394573 5440278 7209311 8452812 9394194 8544019 6828520 6382279 5157011
6914 5157011 -1341727 -11841907 -18731364 -17949956 -14243742 -13713553 -15872937 -16691277 -15495273
6905 -15495273 -14451520 -13762377 -11708412 -8285389 -5339565 -3647380 -2447080 -1456995
6897 -1456995 -1395915 -2828599 -5697124 -9231020 -11456855 -10194795 -5772631 -1389052 523682
6888 523682 972914 2183397 4214008 5450586 5297315 4599755 4094041 3986584 4644879
6879 4644879 6397469 8738766 10476486 10626597 9128626 7175321 6515774 7402046 7690898
6870 7690898 5557874 2616025 2132431 4449937 7056676 9265955 13003871 17668224
$$ packed form
6931A4545485O048685J67746l588917m430102n286421o577456m797952O29569
6923c289363M683936M045705J769033J243501R41382q50175j715499m46241j225268
6914E157011o498738j0500180o889457P81408L706214N30189k159384q18340J196004
6905a5495273J043753O89143K053965L423023K945824J692185J200300R90085
6897a456995O1080j432684k868525l533896k225835J262060M422164M383579J912734
6888E23682M49232J210483K030611J236578j53271o97560n05714j07457O58295
6879D644879J752590K341297J737720J50111j497971j953305o59547Q86272K88852
6870G690898k133024k941849m83594K317506K606739K209279L737916M664353
$$ plain form
6862 17668224 18463037 13072589 6793971 6581485 11399810 13071334 7018619 -1652632
6854 -1652632 -4287759 1587328 10465186 15321963 13903805 8913671 3999446 1022496
6846 1022496 590559 2819196 6127610 7109888 4291272 1212122 2598750 7551601 10279368
6837 10279368 8495600 6919087 10038809 15160528 16381590 12911496 9162824 7862239
6829 7862239 7207652 4581362 -346905 -6101311 -9946606 -8304562 17251 10917863
6821 10917863 18485305 21512436 23407374 25890638 27040127 26168443 25641276 25740600 22605764
6812 22605764 14889218 8219112 7992092 10717092 8740912 2441223 843694 8643657
6804 8643657 18645228 20649750 13727436 5458835 1790450 2498473 5488589 10189271
$$ packed form
6862A7668224P94813n390448o278618k12486M818325J671524o052715q671251
6854a652632k635127N875087Q877858M856777j418158m990134m914225k976950
6846A022496m31937K228637L308414R82278k818616l079150J386628M952851K727767
6837A0279368j783768j576513L119722N121719J221062l470094l748672j300585
6829G862239o54587k626290m928267n754406l845295J642044Q321813J0900612
6821A0917863P567442L027131J894938K483264J149489q71684n27167R9324l134836
6812B2605764p716546o670106k27020K725000j976180o299689j597529P799963
6804H643657J0001571K004522o922314q268601l668385P08023K990116M700682
$$ plain form
6796 10189271 15238488 16698383 11557649 1875685 -6358883 -8234729 -3514042 3446914
6788 3446914 6753916 3616129 -2656913 -5335821 -1334981 5143118 7271524 3149989
6780 3149989 -2675562 -4523216 -679605 6520890 13810350 19529925 24031231 28105290
6772 28105290 30946736 30327474 25474288 18842628 13758460 11085678 9698923 9202646
6764 9202646 9852815 10373409 8749040 5389001 2605539 438601 -3528448 -8633766 -9150425
6755 -9150425 -1330522 9745253 14471075 9397820 113234 -6595270 -9719140 -11785377
6747 -11785377 -13029423 -11224871 -6451254 -2688517 -3192516 -5806199 -4944176 1704708
6739 1704708 10333150 15923866 18177838 20011918 21202540 17794725 9291896 2198786
$$ packed form
6796A0189271N049217J459895n140734r681964q234568j875846M720687O960956
6788C446914L307002l137787o273042k678908M000840O478099K128406m121535
6780C149989n825551j847654L843611P200495P289460N719575M501306M074059
6772B8105290K841446o19262m853186o631660n084168k672782j386755m96277
6764I202646O50169N20594j624369l360039k783462k166938l967049n105318n16659
6755i150425P819903J1075775M725822n073255r284586o708504l123870k066237
6747a1785377j244046J804552M773617L762737n03999k613683Q62023O648884
6739A704708Q628442N590716K253972J834080J190622l407815q502829p093110
$$ plain form
6731 2198786 2352795 6129326 4523745 -4268435 -11697242 -9930035 -1346108 6134425
6723 6134425 9247164 10351683 10898707 9907230 8707676 11197076 17246250 20586864 16619386
6714 16619386 8950319 4389708 4077636 4023954 2688132 2655286 4815837 6159874 4810406
6705 4810406 2668615 869882 -3036158 -10000418 -15115212 -12769428 -4304263 3545716
6697 3545716 6686377 6348578 4789480 2685755 954614 1163291 3036173 4434659 4631328
6688 4631328 5109172 6699725 8635907 10872768 14453532 18956096 22473927 24687444
6680 24687444 26713825 27298775 23271635 15486402 10061611 10664094 12977531 10522396
6672 10522396 3420897 -2562283 -3855966 -1817406 1246439 4387512 6197242 4648635
$$ packed form
6731B198786J54009L776531j605581q792180p428807J767207Q583927P480533
6723F134425L112739J104519N47024r91477j199554K489400O049174L340614l967478
6714A6619386p669067m560611l12072n3682j335822l2846K160551J344037j349468
6705D810406k141791j798733l906040o964260n114794K345784Q465165P849979
6697C545716L140661l37799j559098k103725j731141K08677J872882J398486J96669
6688D631328M77844J590553J936182K236861L580764M502564L517831K213517
6680B4687444K026381N84950m027140p785233n424791O02483K313437k455135
6672A0522396p101499n983180j293683K038560L063845L141073J809730j548607
$$ plain form
6664 4648635 177042 -3605238 -3803557 -1527854 -334532 -2241630 -5883860 -8121118
6656 -8121118 -7111419 -3733319 168434 4201693 8655032 11822238 10785359 5622288
6648 5622288 255936 -2049381 -1429875 1383073 6850580 13260304 15616803 11846054
6640 11846054 6862864 5860611 6533385 3619793 -1307663 -1756242 2850180 6066945
6632 6066945 5084304 4528450 6884680 6965479 999333 -5266460 -4360451 1428999 3851042
6623 3851042 1435460 555328 4192375 7407430 6041989 3598648 5782671 12364471
6615 12364471 18334527 20476544 19125790 15161789 9104370 2929007 -355494 213917
6607 213917 2446891 3305342 1258243 -3312193 -8395641 -10970766 -9040987 -3664255 2101106
$$ packed form
6664D648635m471593l782280j98319K275703J193322j907098l642230k237258
6656h121118J009699L378100L901753M033259M453339L167206j036879n163071
6648E622288n366352k305317O19506K812948N467507O409724K356499l770749
6640A1846054m983190j002253O72774k913592m927456m48579M606422L216765
6632F066945r82641n55854K356230Q0799n966146o265793R06009N789450K422043
6623C851042k415582q80132L637047L215055j365441k443341K184023O581800
6615A2364471N970056K142017j350754l964001o057419o175363l284501N69411
6607B13917K232974Q58451k047099m570436n083448k575125J929779N376732N765361
$$ plain form
6598 2101106 6301116 8632381 8160025 3573692 -2757115 -4118369 3481807 14749659
6590 14749659 19424075 13370450 2305290 -5649208 -7498316 -4793452 -42781 3619862
6582 3619862 2856748 -1882301 -4951453 -1818451 4877202 9280727 10609472 12849101
6574 12849101 17107603 19692579 18403120 15532585 12993170 9428848 4773831 2909100
6566 2909100 5762631 8520957 5727043 -280416 -2613337 -519453 -743814 -7034972
6558 -7034972 -13759690 -13300447 -6305036 -405627 -168375 -2328766 -1320007 3723640 9146977
6549 9146977 12084880 13353417 15178225 17579049 17798739 13125265 4098750 -5106288
6541 -5106288 -9821309 -8693273 -4060927 1476099 7511529 13659197 16478664 11810236
$$ packed form
6598B101106M200010K331265m72356m586333o330807j361254P600176J1267852
6590A4749659M674416o053625j1065160p954498j849108K704864M750671L662643
6582C619862p63114m739049l069152L133002O695653M403525J328745K239629
6574A2849101M258502K584976j289459k870535k539415l564322m655017j864731
6566B909100K853531K758326k793914o007459k332921K093884k24361o291158
6558g034972o724718M59243O995411N899409K37252k160391J008759N043647N423337
6549I146977K937903J268537J824808K400824K19690m673474r026515r205038
6541e106288m715021J128036M632346N537026O035430O147668K819467m668428
$$ plain form
6533 11810236 796596 -9312634 -12180224 -8311783 -2453852 2351996 5279241 4559002
6525 4559002 -1566549 -10593127 -16283676 -14663204 -7134851 2551201 11227880 15685380
6517 15685380 13321111 5910575 -304282 -1251374 370305 -163535 -2599110 -3137205 -1215331
6508 -1215331 -187983 -1211641 -1096677 2023578 4679615 2737475 -2260456 -5031718
6500 -5031718 -4060134 -3515084 -6742769 -10697838 -9093538 137814 12573870 21806340
6492 21806340 24181191 19707659 11448548 4951588 5108208 10933458 15289652 12608976
6484 12608976 5604995 1287686 1521464 1663780 -1513366 -5364898 -6538084 -6243838 -7149004
6475 -7149004 -8150164 -6302801 -2333750 -151076 -1166935 -2634513 -2204579 -1391796 -3396585
$$ packed form
6533A1810236j1013640j0109230k867590L868441N857931M805848K927245p20239
6525D559002o125551r026578n690549J620472P528353R686052Q676679M457500
6517A5685380k364269p410536o214857r47092J621679n33840k435575n38095J921874
6508a215331J027348j023658J14964L120255K656037j942140m997931k771262
6500e031718R71584N45050l227685l955069J604300R231352J2436056R232470
6492B1806340K374851m473532q259111o496960J56620N825250M356194k680676
6484A2608976p003981m317309K33778J42316l177146l851532j173186K94246r05166
6475g149004j001160J847363L969051K182674j015859j467578M29934Q12783k004789
$$ plain form
6466 -3396585 -9082510 -15883380 -19768095 -18339201 -13224115 -9213347 -9611673 -12621524
6458 -12621524 -13753389 -11304228 -7429744 -4183190 -1341756 1233143 2045359 558593
6450 558593 -827818 353433 3055276 3985944 1440668 -3930567 -10779186 -16867997 -18310121
6441 -18310121 -12664756 -3170647 3569953 5284389 6029678 8769734 9991391 5616279
6433 5616279 -788481 -1498380 4264343 8541599 5298318 -2205384 -7121373 -7567695 -6014483
6424 -6014483 -3933801 -1590706 -693253 -2443897 -4285441 -3179385 -1313072 -3736221
6416 -3736221 -10211545 -14118483 -10693604 -2688007 3477418 4189728 403990 -3994913
6408 -3994913 -4653688 -455625 4513217 5495158 3564899 3899955 7640387 10567862 10814004
$$ packed form
6466c396585n685925o800870l884715J428894N115086M010768l98326l009851
6458a2621524j131865K449161L874484L246554K841434K574899Q12216j486766
6450E58593j386411J181251K701843R30668k545276n371235o848619o088811j442124
6441a8310121N645365R494109O740600J714436P45289K740056J221657m375112
6433E616279o404760p09899N762723M277256l243281p503702m915989m46322J553212
6424f014483K080682K343095Q97453j750644j841544J106056J866313k423149
6416c736221o475324l906938L424879Q005597O165425P12310l785738m398903
6408c994913o58775M198063M968842R81941j930259L35056L740432K927475K46142
$$ plain form
6399 10814004 11839537 15141000 16158956 11875887 7074591 7136744 8706018 4367483
6391 4367483 -5711620 -13654221 -14452127 -10412290 -5295592 -138618 4339856 6698931
6383 6698931 7678866 9776471 12708188 13330775 10947209 8337493 6466700 2939368 -2507865
6374 -2507865 -5755047 -4161600 -450600 2140357 4351685 6912269 6215169 -761580
6366 -761580 -9660107 -12521210 -7799855 -1851438 -281553 -2088633 -3186674 -1826206
6358 -1826206 1165904 4524604 6781890 6285760 3001685 -701484 -2354196 -1530850 1120067
6349 1120067 5358818 10204243 12587233 9693426 2880945 -2604535 -2694885 1627948 6004897
6340 6004897 7266915 5588204 2893972 378095 -2197712 -5351182 -8506985 -10028145
$$ packed form
6399A0814004J025533L301463J017956m283069m801296O2153J569274m338535
6391D367483j0079103p942601p97906M039837N116698N156974M478474K359075
6383F698931R79935K097605K931717O22587k383566k609716j870793l527332n447233
6374b507865l247182J593447L711000K590957K211328K560584o97100o976749
6366g61580q898527k861103M721355N948417J569885j807080j098041J360468
6358a826206K992110L358700K257286m96130l284075l703169j652712Q23346K650917
6349A120067M238751M845425K382990k893807o812481n485480r0350M322833M376949
6340F004897J262018j678711k694232k515877k575807l153470l155803j521160
$$ plain form
6332 -10028145 -8765330 -5227410 -673503 4464958 10006062 14090406 13932151 9454707
6324 9454707 4363708 2065296 1923291 1097420 -1591367 -5624410 -10583870 -14942372 -14865752
6315 -14865752 -8565405 -1236924 -815809 -8028062 -15036674 -15221736 -9984521 -4168635
6307 -4168635 668788 5651029 11223864 17500206 24522015 29409176 27338059 18935848
6299 18935848 12454485 13958672 19210063 20583466 18172328 17368959 18611071 17700307
6291 17700307 14771240 14019329 14206537 8763271 -1939952 -7068102 838098 14887538
6283 14887538 22470025 20293170 15020553 12308131 11499859 9991352 7387269 4820155
6275 4820155 3573835 4733978 7827045 9977068 8710858 5654013 5438174 10320427
$$ packed form
6332a0028145J262815L537920M553907N138461N541104M084344j58255m477444
6324I454707n090999k298412j42005q25871k688787m033043m959460m358502P6620
6315a4865752O300347P328481M21115p212253p008612j85062N237215N815886
6307d168635M837423M982241N572835O276342P021809M887161k071117q402211
6299A8935848o481363J504187N251391J373403k411138q03369J242112r10764
6291A7700307k929067p51911J87208n443266j0703223n128150P906200J4049440
6283A4887538P582487k176855n272617k712422q08272j508507k604083k567114
6275D820155j246320J160143L093067K150023j266210l056845k15839M882253
$$ plain form
6267 10320427 16894800 18860607 13429973 5205062 2599160 8925328 18057620 21300976
6259 21300976 17658566 13850968 14482691 16766887 16300555 13503789 11365884 10078670
6251 10078670 7377764 2413688 -3439089 -8304331 -10467066 -9010450 -5532394 -3465322
6243 -3465322 -4219069 -6001483 -7471962 -9412453 -11054970 -8630207 -817515 7574284
6235 7574284 11292580 11524921 12936213 15890243 16391004 12776969 7718173 3560751 44353
6226 44353 -2637401 -2468184 1023785 4792146 5542986 3433691 1145396 306634 47649
6217 47649 -1166428 -3084144 -3703608 -2043998 87807 574011 426154 2194540 5233153
6208 5233153 6103791 4417230 4188816 7454083 10549214 9604826 6022942 3004832 261789
$$ packed form
6267A0320427O574373J965807n430634q224911k605902O326168R132292L243356
6259B1300976l642410l807598O31723K284196m66332k796766k137905j287214
6251A0078670k700906m964076n852777m865242k162735J456616L478056K067072
6243c465322p53747j782414j470479j940491j642517K424763P812692Q391799
6235G574284L718296K32341J411292K954030N00761l614035n058796m157422l516398
6226D4353k681754J69217L491969L768361P50840k109295k288295q38762k58985
6217D7649j214077j917716o19464J659610K131805M86204j47857J768386L038613
6208E233153Q70638j686561k28414L265267L095131r44388l581884l018110k743043
$$ plain form
6199 261789 -3380497 -5251569 -2158828 3386553 5696395 3771714 1655230 1555416 1639618
6190 1639618 575503 -602900 -1538174 -2938947 -3385504 -155766 5794974 9628461 8481319
6181 8481319 4166804 -536046 -4667047 -7544389 -8235245 -7598902 -7585348 -7862707 -6508643
6172 -6508643 -4356784 -4687014 -7903988 -10535978 -10331714 -8282208 -4978775 179648 4979006
6163 4979006 5038950 872266 -723003 4529832 12428127 16183639 14136227 8530513 1201933
6154 1201933 -5452540 -7408720 -3814521 314201 821289 632373 4180336 8828643 8303192
6145 8303192 2957069 -138257 2737075 7751508 9933736 8322159 3780021 -2916524
6137 -2916524 -8938315 -10197692 -6976799 -4984154 -7980403 -12454628 -12594235 -8038614
$$ packed form
6199B61789l642286j871072L092741N545381K309842j924681k116484r9814Q4202
6190A639618j064115j178403r35274j400773m46557L229738N950740L833487j147142
6181H481319m314515m702850m131001k877342o90856O36343J3554k77359J354064
6172f508643K151859l30230l216974k631990K04264K049506L303433N158423M799358
6163D979006N9944m166684j595269N252835P898295L755512k047412n605714p328580
6154A201933o654473j956180L594199M128722N07088j88916L547963M648307n25451
6145H303192n346123l095326K875332N014433K182228j611577m542138o696545
6137b916524o021791j259377L220893J992645k996249m474225j39607M555621
$$ plain form
6129 -8038614 -3493693 -2245202 -3017679 -2296294 2801098 13076294 25751543 34435582
6121 34435582 33463107 23688029 12615862 7457109 8436271 9678776 6295867 -356112
6113 -356112 -4655975 -3219340 1369059 3395117 -11298 -6208380 -10072245 -8998457
6105 -8998457 -4564681 264581 4395944 8203170 10647642 9042617 2866736 -3876314
6097 -3876314 -6408390 -4717329 -2958562 -3409501 -3811476 -1513783 2606728 6168739 8836029
6088 8836029 11319037 12513158 10681946 6883480 4293709 3862003 3054827 -348613 -5100169
6079 -5100169 -8206069 -8733320 -8951779 -11953809 -18206754 -24120639 -24687038 -18688707 -10866827
6070 -10866827 -7465219 -9839949 -14117493 -16868070 -18364073 -19097379 -15927892 -5087346
$$ packed form
6129h038614M544921J248491p72477P21385N097392J0275196J2675249Q684039
6121C4435582r72475r775078j1072167n158753R79162J242505l382909o651979
6113c56112m299863J436635M588399K026058l406415o197082l863865J073788
6105h998457M433776M829262M131363L807226K444472j605025o175881o743050
6097c876314k532076J691061J758767m50939m01975K297693M120511L562011K667290
6088H836029K483008J194121j831212l798466k589771m31706q07176l403440m751556
6079e100169l105900n27251k18459l002030o252945n913885n66399N998331P821880
6070a0866827L401608k374730m277544k750577j496003p33306L169487J0840546
$$ plain form
6062 -5087346 11324197 24887638 28396168 22591910 14251310 8606013 5286736 1378224
6054 1378224 -3698583 -7629476 -8552697 -7393566 -6611095 -7353001 -8283012 -7277829 -4349736
6045 -4349736 -2403236 -3975781 -7222663 -7048134 -1376452 5681826 9286869 11028514
6037 11028514 16998050 28548212 38763604 40110364 33130479 25209461 22299846 24214465
6029 24214465 27063593 27658095 25240828 20741769 15338397 9518911 3554534 -1178320
6021 -1178320 -2365066 977819 7061645 12924379 16940848 19162044 19928429 19049609 16035116
6012 16035116 10703809 4093893 -1067438 -1923531 1748835 7060749 10782894 11894383
6004 11894383 11340419 10629158 11018621 12475380 12731513 8984205 1463650 -6148048 -10701345
$$ packed form
6062e087346J6411543J3563441L508530n804258q340600n645297l319277l908512
6054A378224n076807l930893r23221J159131P82471p41906r30011J005183K928093
6045d349736J946500j572545l246882J74529N671682P058278L605043J741645
6037A1028514N969536J1550162J0215392J346760o979885p921018k909615J914619
6029B4214465K849128N94502k417267m499059n403372n819486n964377m732854
6021a178320j186746L342885O083826N862734M016469K221196P66385q78820l014493
6012A6035116n331307o609916n161331q56093L672366N311914L722145J111489
6004A1894383n53964p11261L89463J456759K56133l747308p520555p611698m553297
$$ plain form
5995 -10701345 -12468676 -13396694 -14421988 -15364349 -15234637 -11707192 -3218986 6811291
5987 6811291 11307612 7868486 2663605 2579001 6509135 8771372 8173267 7689338 6879497
5978 6879497 1963729 -5891847 -9429183 -5120676 1566306 4134986 3371939 3528193 4401167
5969 4401167 2646263 -1312364 -3152752 -984896 2489064 4225640 3734711 1604845
5961 1604845 -1428818 -3260897 -1314323 4040065 9039819 10495295 8475882 4575264
5953 4575264 -84903 -3875278 -4042555 558382 7068968 10917011 10173768 6521150 2929034
5944 2929034 2062118 5812987 13450953 20056720 19908582 13066371 6436916 6326162 11649921
5935 11649921 16774520 19280885 21359667 24182477 25285220 22912145 19359553 17573670
$$ packed form
5995a0701345j767331r28018j025294r42361J29712L527445Q488206J0030277
5987F811291M496321l439126n204881q4604L930134K262237n98105m83929q09841
5978F879497m915768p855576l537336M308507O686982K568680p63047J56254Q72974
5969D401167j754904l958627j840388K167856L473960J736576m90929k129866
5961A604845l033663j832079J946574N354388M999754J455476k019413l900618
5953D575264m660167l790375j67277M600937O510586L848043p43243l652618l592116
5944B929034q66916L750869P637966O605767j48138o842211o629455j10754N323759
5935A1649921N124599K506365K078782K822810J102743k373075l552592j785883
$$ plain form
5927 17573670 17010425 15612052 13833012 13398421 13226264 10138149 3637726 -2968528 -6678783
5918 -6678783 -7673187 -7731517 -8091007 -9378407 -11351221 -11917046 -8654892 -2471367 2197538
5909 2197538 2198118 -799312 -2621172 -825046 4444353 11736586 18473561 21444070 19619447
5900 19619447 15931978 14338424 15608418 17653859 19049202 19841644 19501898 17143489
5892 17143489 14150185 13495883 15214670 15472800 12243086 9226328 10831132 14969124
5884 14969124 15107583 9478924 4054132 4908531 11108455 17365753 20693516 21339032 19493080
5875 19493080 15155348 10471515 8407842 8915523 9314960 8331405 6647035 3788934 -1437439
5866 -1437439 -6821432 -7515896 -2745553 2278183 3557238 3577183 6234726 10045288 10539870
$$ packed form
5927A7573670n63245j398373j779040m34591j72157l088115o500423o606254l710255
5918f678783r94404n8330l59490j287400j972814n65825L262154O183525M668905
5909B197538N80k997430j821860J796126N269399P292233O736975K970509j824623
5900A9619447l687469j593554J269994K045441J395343P92442l39746k358409
5892A7143489k993304o54302J718787K58130l229714l016758J604804M137992
5884A4969124J38459n628659n424792Q54399O199924O257298L327763O45516j845952
5875A9493080m337732m683833k063673N07681L99437r83555j684370k858101n226373
5866a437439n383993o94464M770343N023736J279055J9945K657543L810562M94582
$$ plain form
5857 10539870 6941436 2180296 -1911046 -5073339 -5636786 -1647059 5340798 11368035
5849 11368035 14574526 15274821 12815466 6771532 448956 -1901564 -1377242 -2761579
5841 -2761579 -6217380 -6476111 -1790889 2412640 1865092 -69762 1482918 4731217 4253991
5832 4253991 -747377 -6330198 -10013245 -12143116 -12204480 -8798014 -3495128 -507885 -1575515
5823 -1575515 -4260383 -6059461 -7275598 -8643024 -8689144 -5550969 -447937 2369937 -400046
5814 -400046 -7306220 -12638531 -11576222 -5136468 1016763 3106528 3099353 5147127 9997994
5805 9997994 14818830 17348437 17928446 17740912 17027925 15376028 12625037 9288219 6529496
5796 6529496 5361177 5631950 6685843 9000405 13258207 17315931 16947132 11500984 6241330
$$ packed form
5857A0539870l598434m761140m091342l162293n63447L989727O987857O027237
5849A1368035L206491P00295k459355o043934o322576k350520N24322j384337
5841b761579l455801k58731M685222M203529n47548j934854J552680L248299m77226
5832D253991n001368n582821l683047k129871o1364L406466N302886K987243j067630
5823a575515k684868j799078j216137j367426m6120L138175N103032K817874k769983
5814d00046o906174n332311J062309O439754O153231K089765p175K047774M850867
5805I997994M820836K529607N80009j87534p12987j651897k750991l336818k758723
5796F529496j168319K70773J053893K314562M257802M057724l68799n446148n259654
$$ plain form
5787 6241330 6215433 9776244 11521123 10079891 8921211 10118263 11849153 12704594 14153192
5778 14153192 16923705 18554535 17206438 15308985 16302984 19248369 19838201 16320272
5770 16320272 11418831 7814584 4411892 -946176 -6531507 -7510507 -2526890 2801524
5762 2801524 1523336 -6128357 -12777760 -13139814 -10159158 -9733101 -11866849 -11005782 -4647568
5753 -4647568 2440878 4101288 219746 -3812230 -3724967 -520919 1497231 -812298 -7167941
5744 -7167941 -14796615 -20438788 -21413653 -16144380 -5572593 5726061 11935691 11142927
5736 11142927 7085287 4468262 3854443 2936478 1224497 437223 990438 1604326 2480836
5727 2480836 5084798 7904288 6739332 1654471 -433354 5593831 14487324 16130956
$$ packed form
5787F241330k5897L560811J744879j441232j158680J197052J730890Q55441J448598
5778A4153192K770513J630830j348097j897453R93999K945385N89832l517929
5770A6320272m901441l604247l402692n358068n585331r79000M983617N328414
5762B801524j278188p651693o649403l62054K980656M26057k133748Q61067O358214
5753d647568P088446J660410l881542m031976Q7263L204048K018150k309529o355643
5744g167941p628674n642173r74865N269273J0571787J1298654O209630p92764
5736A1142927m057640k617025o13819r17965j711981p87274N53215O13888Q76510
5727B480836K603962K819490j164956n084861k087825O027185Q893493J643632
$$ plain form
5719 16130956 8754440 813642 -1237866 -857040 -3651538 -7268349 -5529075 117754
5711 117754 1315870 -4235535 -8222467 -3955794 3140662 3596697 -1644626 -2942059 2803988
5702 2803988 7082729 2407567 -6901727 -11213610 -8282005 -4171525 -4141045 -7914105 -13170938
5693 -13170938 -19029743 -25258232 -30898389 -34550931 -34839693 -31193601 -25511758 -21670837
5685 -21670837 -21327123 -21444144 -18104294 -11380614 -4239479 1409995 4538359 2937803
5677 2937803 -4389777 -13664281 -19297058 -20070266 -18618733 -15728260 -10078264 -3441675
5669 -3441675 -367962 -1241537 -816821 4163068 10473662 13957394 15153025 16451839 17715331
5660 17715331 18140494 18897842 20261606 19367851 14694880 9720203 7886991 6806797 2383080
$$ packed form
5719A6130956p376516p940798k051508L80826k794498l616811J739274N646829
5711A17754J198116n551405l986932M266673P096456M56035n241323j297433N746047
5702B803988M278741m675162r309294m311883K931605M110480L0480l773060n256833
5693a3170938n858805o228489n640157l652542k88762L646092N681843L840921
5685b1670837L43714j17021L339850O723680P141135N649474L128364j600556
5677B937803p327580r274504n632777p73208J451533K890473N649996O636589
5669c441675L073713q73575M24716M979889O310594L483732J195631J298814J263492
5660A7715331M25163P57348J363764q93755m672971m974677j833212j080194m423717
$$ plain form
5651 2383080 -3603955 -5612810 -2792942 360101 1451957 2537259 4318428 3650827
5643 3650827 -995771 -6125414 -8059970 -7799311 -8223063 -9217520 -8763313 -7084219 -6439829
5634 -6439829 -7268651 -7129923 -3941054 1143859 4719724 4611659 1984927 -352644 -1535524
5625 -1535524 -3131068 -5376631 -5155224 -223549 6147774 8438969 6373540 5196624
5617 5196624 8042444 12153128 13894495 13130566 10293677 3515250 -7394233 -17342935
5609 -17342935 -21031329 -19860908 -19398025 -21235424 -21954294 -19520012 -15801210 -12336495
5601 -12336495 -8412688 -4871927 -5561009 -12363962 -21542249 -27334710 -27232621 -22200351
5593 -22200351 -14243586 -5894103 48091 2685589 3675608 4292560 3843028 2548819 3112711
$$ packed form
5651B383080n987035k008855K819868L153043J091856J085302J781169o67601
5643C650827m646598n129643j934556K60659m23752r94457M54207J679094O44390
5634f439829q28822J38728L188869N084913L575865j08065k626732k337571j182880
5625a535524j595544k245563K21407M931675O371323K291195k065429j176916
5617E196624K845820M110684J741367p63929k836889o778427j0909483r948702
5609a7342935l688394J170421M62883j837399p18870K434282L718802L464715
5601a2336495L923807L540761o89082o802953r178287n792461J02089N032270
5593b2200351P956765Q349483N942194K637498R90019O16952m49532j294209N63892
$$ plain form
5584 3112711 6421917 7989428 2642468 -8077185 -16719480 -17895402 -12535375 -4724906
5576 -4724906 2272318 6637215 8003273 7937579 8213436 8114930 5626624 1367204 -1438908
5567 -1438908 -1418321 -635576 -817611 -668080 1816211 6541706 11788054 15366234 14856084
5558 14856084 9542438 2920624 58136 1248666 1789704 -352191 -895398 3770352
5550 3770352 9935292 11291799 7604087 3931276 2937963 2898099 2598438 3296254 5285336
5541 5285336 6553498 5870120 4186264 2308025 -9900 -2107016 -2338883 -685423 1006014
5532 1006014 2004242 3647027 6866627 11025557 15444761 19482947 20750315 16394232
5524 16394232 7522498 -233304 -2413064 -409943 934508 -856007 -3645305 -3349403
$$ packed form
5584C112711L309206J567511n346960j0719653q642295j175922N360027P810469
5576d724906O997224M364897J366058o5694K75857r8506k488306m259420k806112
5567a438908K0587P82745j82035J49531K484291M725495N246348L578180n10150
5558A4856084n313646o621814k862488J190530N41038k141895n43207M665750
5550C770352O164940J356507l687712l672811r93313l9864k99661O97816J989082
5541E285336J268162o83378j683856j878239k317925k097116k31867J653460J691437
5532A006014R98228J642785L219600M158930M419204M038186J267368m356083
5524A6394232q871734p755802k179760K003121J344451j790515k789298K95902
$$ plain form
5516 -3349403 1910961 9719158 15282960 15948613 13123987 9054330 3723555 -2807897
5508 -2807897 -7246168 -6429760 -3047119 -3341899 -8667494 -13770709 -14585047 -13249728 -13271090
5499 -13271090 -13631667 -10641335 -3054824 6967629 15711080 19120200 15239271 7662899
5491 7662899 3637342 6179958 10631281 11285970 8330588 5304386 3060642 546956
5483 546956 -759902 1735523 6443096 8051267 3904308 -3000474 -7838708 -8637001 -7057520
5474 -7057520 -6319253 -8223304 -10984596 -10884184 -7411240 -5124260 -8141793 -14151417 -16659263
5465 -16659263 -12491754 -4495767 2695186 6931736 8573507 8628053 7752309 6319888 5267950
5456 5267950 6503953 10868356 15565202 16241171 12564448 8726821 7075506 5172064
$$ packed form
5516c349403N260364P808197N563802O65653k824626m069657n330775o531452
5508b807897m438271Q16408L382641k94780n325595n103215q14338J335319k1362
5499a3271090l60577K990332P586511J0022453Q743451L409120l880929p576372
5491G662899m025557K542616M451323O54689k955382l026202k243744k513686
5483E46956j306858K495425M707573J608171m146959o904782m838234p98293J579481
5474g057520P38267j904051k761292J00412L472944K286980l017533o009624k507846
5465a6659263M167509P995987P190953M236550J641771N4546q75744j432421j051938
5456E267950J236003M364403M696846O75969l676723l837627j651315j903442
$$ plain form
5448 5172064 1659910 550407 5239147 11815608 13677638 10283881 5859056 1822606
5440 1822606 -3001941 -6242256 -3533637 3649130 8920172 10825848 14620070 22104162
5432 22104162 26881263 23608760 16027725 11091974 9842585 9189056 9016625 11854344
5424 11854344 17368135 22137713 24207507 24193728 22534093 18799140 13434182 7901145
5416 7901145 3438772 908975 484975 240249 -2794335 -8304352 -11616337 -9167157 -3092509
5407 -3092509 1702295 2805713 508816 -4335841 -9514116 -11124786 -7957750 -4442043
5399 -4442043 -5482193 -9941811 -13025503 -13355211 -13193832 -13070811 -11537594 -10011651 -12409621
5390 -12409621 -18911354 -24609130 -25599131 -22534385 -17471496 -11719592 -7691851 -7387128
$$ packed form
5448E172064l512154j109503M688740O576461J862030l393757m424825m036450
5440A822606m824547l240315K708619P182767N271042J905676L794222P484092
5432B2104162M777101l272503p581035m935751j249389o53529j72431K837719
5424A1854344N513791M769578K069794j3779j659635l734953n364958n533037
5416G901145m462373k529797m24000k44726l034584n510017l311985K449180O074648
5407c092509M794804J103418k296897m844657n178275j610670L167036L515707
5399d442043j040150m459618l083692l29708J61379J23021J533217J525943k397970
5390a2409621o501733n697776r90001L064746N062889N751904M027741L04723
$$ plain form
5382 -7387128 -6885788 1755306 19103934 33969018 35876509 28157194 22377599 22517596
5374 22517596 22264448 17397759 12537972 12892139 16055155 16804296 15620269 16869849 20677462
5365 20677462 22077076 18151572 11700539 7019480 5362973 5639678 6665452 7188174
5357 7188174 6107368 4552340 5749459 10656395 15467405 16180223 14243869 13966165 14756758
5348 14756758 10868805 840535 -7516432 -6277511 1106007 3694237 -1635776 -5509365
5340 -5509365 442761 11468930 16915155 15679145 16614140 24109929 31425505 31059133
5332 31059133 24975764 19838773 17130077 13772273 9078163 4672781 -435392 -7866883
5324 -7866883 -13608304 -10872670 -401085 8567332 9861984 7064928 5869927 5874313 4511434
$$ packed form
5382g387128N01340Q641094J7348628J4865084J907491p719315n779595J39997
5374B2517596k53148m866689m859787L54167L163016P49141j184027J249580L807613
5365B0677462J399614l925504o451033m681059j656507K76705J025774N22722
5357G188174j080806j555028J197119M906936M811010P12818j936354k77704P90593
5348A4756758l887953j0028270q356967J238921P383518K588230n330013l873589
5340e509365N952126J1026169N446225j236010R34995P495789P315576l66372
5332C1059133o083369n136991k708696l357804m694110m405382n108173p431491
5324g866883n741421K735634J0471585Q968417J294652k797056j195001M386j362879
$$ plain form
5315 4511434 3920209 7658500 13506169 15601054 12329598 6960531 1746286 -3263370
5307 -3263370 -6225097 -3908697 3317640 11544791 18991191 27160800 35575625 40128756
5299 40128756 38531485 33400396 27861286 21677644 14003666 6591981 1495730 -1699222
5291 -1699222 -3614931 -2624518 2152705 7407729 8821977 6703934 4967643 4751943 2637296
5282 2637296 -3625490 -10353967 -11351663 -5465261 1269217 1778762 -4673401 -12325341 -15660803
5273 -15660803 -14672365 -13045982 -13073785 -13898149 -13469957 -10404990 -4736693 1517905 5389996
5264 5389996 6009813 5406172 5076934 4379375 4531027 10160937 21761125 29897376 24755519
5255 24755519 10824462 3493347 9221717 17656491 17491100 11845832 10965702 16057043
$$ packed form
5315D511434n91225L738291N847669K094885l271456n369067n214245n009656
5307c263370k961727K316400P226337Q227151P446400Q169609Q414825M553131
5299D0128756j597271n131089n539110o183642p673978p411685n096251l194952
5291a699222j915709R90413M777223N255024J414248k118043j736291k15700k114647
5282B637296o262786o728477r97696N886402O734478N09545o452163p651940l335462
5273a5660803R88438J626383k7803q24364M28192L064967N668297O254598L872091
5264E389996O19817o03641l29238o97559J51652N629910J1600188Q136251n141857
5255B4755519j3931057p331115N728370Q434774j65391n645268q80130N091341
$$ plain form
5247 16057043 19457258 17632405 14635795 12952976 9322745 1595606 -6762176 -11773242
5239 -11773242 -13661065 -13690107 -10561413 -3582181 3346419 4855574 464443 -5011190
5231 -5011190 -7420256 -7536123 -8523207 -10435637 -9297557 -2703379 5177072 7158864 2007933
5222 2007933 -3440049 -3053076 759931 1245319 -2997522 -6946403 -7001029 -5350899 -5820916
5213 -5820916 -9133778 -13726460 -18370398 -22260263 -24486311 -24949547 -24579188 -23835469 -22170448
5204 -22170448 -19278759 -15457800 -10624730 -4715668 755711 3426754 2774525 526864
5196 526864 -1470679 -1840592 1313598 8749585 16988061 20360932 17592080 13209374 10709194
5187 10709194 7925611 2250932 -2855754 -1537667 5407084 10250989 8033641 2468193
$$ packed form
5247A6057043L400215j824853k996610j682819l630231p727139q357782n011066
5239a1773242j887823k9042L128694O979232O928600J509155m391131n475633
5231e011190k409066j15867r87084j912430J138080O594178P880451J981792n150931
5222B007933n447982L86973L813007M85388m242841l948881n4626J650130m70017
5213e820916l312862m592682m643938l889865k226048m63236L70359P43719J665021
5204b2170448K891689L820959M833070N909062N471379K671043o52229k247661
5196E26864j997543l69913L154190P435987Q238476L372871k768852m382706k500180
5187A0709194k783583n674679n106686J318087O944751M843905k217348n565448
$$ plain form
5179 2468193 292214 2948543 6559944 7861440 6653255 3195312 -3075889 -11213055
5171 -11213055 -17878935 -20687811 -20881585 -20841907 -20114352 -16147000 -8546905 -282693 5698859
5162 5698859 9145592 11197500 12167094 11609850 9352736 5528350 527533 -4510822 -8268056
5153 -8268056 -10764907 -12990302 -14610913 -13835152 -10375721 -6693297 -5174797 -5833389 -7807104
5144 -7807104 -10795856 -13423618 -12841759 -8577339 -4565993 -4208381 -5214510 -3030469 1928369
5135 1928369 4768535 3564910 1984983 3694561 7937469 12016541 14870833 16475287
5127 16475287 16493063 15521504 15512775 17071948 18142340 17052984 15053093 13993630 13213040
5118 13213040 10856620 6931991 2810323 -1183569 -5088282 -6835208 -3548678 3899329
$$ packed form
5179B468193k175979K656329L611401J301496j208185l457943o271201q137166
5171a1213055o665880k808876j93774L9678P27555L967352P600095Q264212N981552
5162E698859L446733K051908R69594n57244k257114l824386n000817n038355l757234
5153h268056k496851k225395j620611P75761L459431L682424J518500o58592j973715
5144g807104k988752k627762N81859M264420M011346L57612j006129K184041M958838
5135A928369K840166j203625j579927J709578M242908M079072K854292J604454
5127A6475287J7776r71559q729J559173J070392j089356j999891j059463p80590
5118A3213040k356420l924629m121668l993892l904713j746926L286530P448007
$$ plain form
5110 3899329 10053047 10308188 6041296 2717193 3425160 5961109 6442876 4027221 794659
5101 794659 -1844488 -4433248 -7048716 -7820547 -5248927 -634006 3555989 6938932 10775913
5092 10775913 14430136 14711158 10016108 3520684 209476 1064357 2182957 252897
5084 252897 -2979362 -3383499 -233594 3439345 5913646 8479909 10927581 9725108 4269632
5075 4269632 1181938 6473699 15214737 16042808 6404983 -3934564 -6872165 -6070348
5067 -6070348 -8446176 -12190772 -10640983 -4168212 82200 -730278 -1884590 342832
5059 342832 3516717 4650517 5554926 9091682 13439326 13756199 8350704 716158 -4343872
5050 -4343872 -5332581 -4715355 -5401870 -7165632 -7595494 -6386580 -6366626 -9233416 -12733608
$$ packed form
5110C899329O153718K55141m266892l324103P07967K535949M81767k415655l232562
5101G94659k639147k588760k615468p71831K571620M614921M189995L382943L836981
5092A0775913L654223K81022m695050o495424l311208Q54881J118600j930060
5084B52897l232259m04137L149905L672939K474301K566263K447672j202473n455476
5075D269632l087694N291761Q741038Q28071r637825j0339547k937601Q01817
5067f070348k375828l744596J549789O472771M250412q12478j154312K227422
5059C42832L173885J133800R04409L536756M347644L16873n405495p634546n060030
5050d343872r88709O17226o86515j763762m29862J208914J9954k866790l500192
$$ plain form
5041 -12733608 -13868793 -12584438 -10260196 -7195676 -4201519 -3818612 -6463079 -7837629
5033 -7837629 -4075088 2666825 7612359 9868902 10998307 9811069 4534271 -1476518
5025 -1476518 -2695378 361226 2151013 1371896 2720449 8383029 14035472 15401959
5017 15401959 13534113 11253778 8856687 5768363 2907234 1404662 1588696 3775408
5009 3775408 7057454 7808826 3586027 -1980854 -3166884 -708968 -747022 -5160666 -9173204
5000 -9173204 -9231287 -6785112 -3160068 2403123 7739337 7754201 2067014 -3668243 -6440839
4991 -6440839 -9240037 -13363860 -14834093 -11795232 -7928832 -4634390 2067647 11736561
4983 11736561 15067653 6586792 -5015841 -7358573 -11875 8127508 12365690 14596031
$$ packed form
5041a2733608j135185J284355K324242L064520K994157L82907k644467j374550
5033g837629L762541O741913M945534K256543J129405j187238n276798o010789
5025a476518j218860L056604J789787p79117J348553N662580N652443J366487
5017A5401959j867846k280335k397091l088324k861129j502572J84034K186712
5009C775408L282046P51372m222799n566881j186030K457916l8054m413644m012538
5000i173204n8083K446175L625044N563191N336214J4864n687187n735257k772596
4991f440839k799198m123823j470233L038861L866400L294442O702037R668914
4983A1736561L331092q480861j1602633k342732P346698Q139383M238182K230341
$$ plain form
4975 14596031 15468286 12883388 7293192 1838464 -2022161 -4178426 -3292156 644216
4967 644216 3915116 4128991 4378571 7268519 8929695 5344445 618028 1263957 5160661
4958 5160661 4432002 -2252925 -8256895 -9222620 -7319477 -5311793 -3286442 -1742545 -1811480
4949 -1811480 -1837420 905849 4951327 6224221 4663686 3960090 4881905 4374198 1511115
4940 1511115 -1125943 -2816885 -6403794 -13111019 -19499183 -21142194 -17035264 -9942228
4932 -9942228 -4189973 -2613982 -4083974 -5137244 -4843689 -5300153 -6408586 -4753834 79015
4923 79015 3244319 1882727 -784245 -2194056 -5006434 -10291669 -12927460 -9750073 -5759178
4914 -5759178 -5662689 -6075413 -3550725 -3169412 -10196067 -19697323 -23945656 -23957912 -24043790
$$ packed form
4975A4596031Q72255k584898n590196n454728l860625k156265Q86270L936372
4967F44216L270900K13875K49580K889948J661176l585250m726417O45929L896704
4958E160661p28659o684927o003970r65725J903143K007684K025351J543897o8935
4949a811480k5940K743269M045478J272894j560535p03596R21815n07707k863083
4940A511115k637058j690942l586909o707225o388164j643011M106930P093036
4932i942228N752255J575991j469992j053270K93555m56464j108433J654752M832849
4923G9015L165304j361592k666972j409811k812378n285235k635791L177387L990895
4914e759178R6489m12724K524688L81313p026655r501256m248333j2256q5878
$$ plain form
4905 -24043790 -21820654 -14688297 -9359684 -12446943 -17646812 -15455317 -9875543 -11484333
4897 -11484333 -19259201 -24044496 -25148851 -28286253 -31853311 -30801449 -28839551 -30887447
4889 -30887447 -30516353 -22721293 -19998244 -33807787 -49730142 -47606646 -37244191 -42549798
4881 -42549798 -58328701 -60737493 -54932017 -66869941 -89264883 -90507905 -82468751 -109262854
4873 -109262854 -142671311 -68637036 157860923 402953495 483551855 379834599 237270073
4866 237270073 171613479 161045217 140173024 108401255 99238672 106394164 99270633
4859 99270633 79042366 69949747 73599474 71991312 63460581 61398039 65202115 61657741
4851 61657741 50388982 43693859 44671974 45988170 46741905 52059994 59038859 59823114
$$ packed form
4905b4043790K223136P132357N328613l087259n199869K191495N579774j608790
4897a1484333p774868m785295j104355l137402l567058J051862J961898k047896
4889c0887447L71094P795060K723049j3809543j5922355K123496J0362455n305607
4881d2549798j5778903k408792N805476j1937924k2394942j243022Q039154k6794103
4873a09262854l3408457P4034275K26497959K45092572Q0598360j03717256j42564526
4866B37270073o5656594j0568262k0872193l1771769r162583P155492p123531
4859I9270633k0228267r092619L649727j608162q530731k062542L804076l544374
4851F1657741j1268759o695123R78115J316196P53735N318089O978865P84255
$$ plain form
4843 59823114 56023616 55198457 55947086 50534324 39474734 30215678 24115654 17484719
4835 17484719 12671247 15108878 21300822 22275417 17901794 16258470 19782830 23094214
4827 23094214 23716789 24146372 23790457 19484705 13995999 13665362 17034520 15729225 7793335
4818 7793335 845777 445560 4015961 8095000 13191547 18845288 21266598 18988836
4810 18988836 15242152 12660995 10694766 9257793 9529657 10414382 9746246 9317934 12586327
4801 12586327 17114505 16406895 10564397 7800505 12818599 20400726 23819837 23504142
4793 23504142 23352487 23711645 22772852 21418732 22339168 26256724 31536643 35360043 34017055
4784 34017055 25649848 14526922 8522195 9806435 11996467 9380997 4598787 3110881
$$ packed form
4843E9823114l799498q25159P48629n412762j1059590r259056o100024o630935
4835A7484719m813472K437631O191944R74595m373623j643324L524360L311384
4827B3094214O22575M29583l55915m305752n488706l30637L369158j305295p935890
4818G793335o947558m00217L570401M079039N096547N653741K421310k277762
4810A8988836l746684k581157j966229j436973K71864Q84725o68136m28312L268393
4801A2586327M528178p07610n842498k763892N018094P582127L419111l15695
4793B3504142j51655L59158r38793j354120R20436L917556N279919L823400j342988
4784C4017055q367207j1122926o004727J284240K190032k615470m782210j487906
$$ plain form
4776 3110881 4166735 3039684 -35522 482851 6802366 14162320 17296510 16638401 16237712
4767 16237712 18380422 22316500 26217891 28121575 26182667 20445775 14364544 12751279
4759 12751279 17438132 25588186 32534775 35674902 35521740 34049791 32821174 32050784
4751 32050784 30527357 26859511 21742296 18424012 19473430 23331518 25827341 25217050
4743 25217050 23639449 22974106 21785435 18219472 13863229 11759931 11321123 8438190
4735 8438190 1465204 -5410351 -6618428 -1870355 3505376 4628828 1685360 -1996343
4727 -1996343 -4602284 -6629221 -7829084 -6214709 -1262300 3983315 6064312 5397663
4719 5397663 5544647 8864304 14669418 21001723 26048410 27990188 25645944 19752812
$$ packed form
4776C110881J055854j127051l075206N18373O319515P359954L134190o58109m00689
4767A6237712K142710L936078L901391J903684j938908n736892o081231j613265
4759A2751279M686853Q150054O946589L140127j53162j471949j228617p70390
4751C2050784j523427l667846n117215l318284J049418L858088K495823o10291
4743B5217050j577601o65343j188671l565963m356243k103298m38808k882933
4735H438190o972986o875555j208077M748073N375731J123452k943468l681703
4727a996343k605941k026937j199863J614375M952409N245615K080997o66649
4719E397663J46984L319657N805114O332305N046687J941778k344244n893132
$$ plain form
4711 19752812 12409450 5607155 1607514 3375680 11639063 21853043 27477215 27103285
4703 27103285 25585302 27073126 29616879 28473231 22907864 17510335 16976969 20679170
4695 20679170 22954919 19310658 11994521 7458395 7880396 8512585 5324947 1073117
4687 1073117 -241995 -721540 -3962180 -6134485 -83611 12250985 20372496 19725684
4679 19725684 17251520 19490063 23160781 22185151 17270199 13039822 10981709 10497068
4671 10497068 12203317 15051420 14624566 9418794 4421298 3236952 1399430 -6232691
4663 -6232691 -15553464 -17679618 -10505499 657129 11152891 18876723 20633239 14419744
4655 14419744 4824164 -460305 424437 3090658 4229897 3822135 1494010 -2938056
$$ packed form
4711A9752812p343362o802295l999641J768166Q263383J0213980N624172l73930
4703B7103285j517983J487824K543753j143648n565367n397529n33366L702201
4695B0679170K275749l644261p316137m536126M22001O32189l187638m251830
4687A073117j315112m79545l240640k172305O050874J2334596Q121511o46812
4679A9725684k474164K238543L670718r75630m914952m230377k058113m84641
4671A0497068J706249K848103m26854n205772m997496j184346j837522p632121
4663f232691r320773k126154P174119J1162628J0495762P723832J756516o213495
4655A4419744r595580n284469Q84742K666221J139239m07762k328125m432066
$$ plain form
4647 -2938056 -5773500 -2220973 7253562 18308845 28997227 38882404 44018856 40543908
4639 40543908 32556449 28261713 28019211 24683317 16865299 12464394 15778748 20023491
4631 20023491 17929653 12346906 9808946 9387355 5621333 -667389 -2077625 5147586
4623 5147586 16063534 22986228 23084446 19297134 16053375 15193215 15382924 14697901 12790187
4614 12790187 10112323 6926076 4931835 7549993 15013288 20982570 18909011 11112380
4606 11112380 6322342 8172114 11796639 12653109 12440218 13852597 15285568 14532835 13233303
4597 13233303 13463268 13229837 9485875 3452518 -580938 -370736 2785296 6105207 6967807
4588 6967807 4255597 -171206 -2790998 -2235728 -186824 1638089 2829127 2762941 1334165
$$ packed form
4647b938056k835444L552527R474535J1055283J0688382R885177N136452l474948
4639D0543908p987459m294736k42502l335894p818018m400905L314354M244743
4631B0023491k093838n582747k537960m21591l766022o288722j410236P225211
4623E147586J0915948O922694R8218l787312l243759q60160J89709o85023j907714
4614A2790187k677864l186247j994241K618158P463295N969282k073559p796631
4606A1112380m790038J849772L624525Q56470k12891J412379J432971p52733j299532
4597A3233303K29965k33431l743962o033357m033456K10202L156032L319911Q62600
4588F967807k712210m426803k619792N55270K048904J824913J191038o6186j428776
$$ plain form
4579 1334165 1357149 5842862 12156989 13827016 9547212 5024086 3730727 1737437 -4579878
4570 -4579878 -11202337 -12066391 -8138100 -5449127 -6451358 -8136027 -7140195 -2683573 4128067
4561 4128067 10348306 11893012 7448218 635789 -4100747 -6244096 -7776173 -9056159
4553 -9056159 -8420735 -4267170 3671568 12585596 15676679 7812987 -5881934 -12562199
4545 -12562199 -6386353 4363003 9015174 7723670 7098557 7940564 5479898 -903733
4537 -903733 -6411135 -8554900 -9192617 -9067561 -6724631 -3102888 -1359919 -1566846 -735940
4528 -735940 1526055 2372574 942783 -754499 -2357586 -5281203 -7817636 -5655350 1255642
4519 1255642 7249141 8082302 5325223 2247267 -278789 -1953054 -1261675 2098264 5943163
$$ packed form
4579A334165K2984M485713O314127J670027m279804m523126j293359j993290o317315
4570d579878o622459q64054L928291K688973j002231j684669R95832M456622O811640
4561D128067O220239J544706m444794o812429m736536k143349j532077j279986
4553i056159O35424M153565P938738Q914028L091083p863692j3694921o680265
4545a2562199O175846J0749356M652171j291504o25113Q42007k460666o383631
4537i03733n507402k143765o37717J25056K342930L621743J742969k06927Q30906
4528g35940K261995Q46519j429791j697282j603087k923617k536433K162286O910992
4519A255642N993499Q33161k757079l077956k526056j674265O91379L359939L844899
$$ plain form
4510 5943163 8363509 9086046 7468480 2830797 -2196843 -2819553 1542833 5774470 6158282
4501 6158282 5479236 8474812 15183333 21628233 24792017 24242512 20770897 16153303 13097462
4492 13097462 13201826 15557779 18423483 20952552 22267606 20724546 15923634 10337181
4484 10337181 7307020 7880432 10363794 12232551 11978067 9991390 8075113 7422329 7297683
4475 7297683 6735023 6879677 9905609 15952364 22832368 28222715 30380432 27934925 21815582
4466 21815582 16385471 15014639 14938596 10638718 2477493 -2809548 -1587878 1490484
4458 1490484 460043 -3841952 -6277224 -5111937 -3038462 -1934409 -635111 1964189
4450 1964189 4501493 4705313 1957738 -2124289 -4903187 -4530350 -1264910 2769755 5232881
$$ packed form
4510E943163K420346P22537j617566m637683n027640o22710M362386M231637L83812
4501F158282o79046K995576O708521O444900L163784n49505l471615m617594l055841
4492A3097462J04364K355953K865704K529069J315054j543060m800912n586453
4484A0337181l030161N73412K483362J868757k54484j986677j916277o52784j24646
4475G297683n62660J44654L025932O046755O880004N390347K157717k445507o119343
4466B1815582n430111j370832p6043m299878q161225n287041J221670L078362
4458A490484j030441m301995k435272J165287K073475J104053J299298K599300
4450A964189K537304K03820k747575m082027k778898L72837L265440M034665K463126
$$ plain form
4441 5232881 5139758 3433328 2343025 3295787 4939970 4648780 2798886 3241003 7565831
4432 7565831 11509384 10401565 6120108 4458327 7065785 10735054 13602267 16453847
4424 16453847 18075269 15574295 10545761 8885890 12355474 15921686 15901312 14885421
4416 14885421 15284276 14022582 8552240 3101244 3042406 6528355 7490909 4356009 312158
4407 312158 -2757817 -4897345 -4424603 308196 6266181 8571827 7883854 9469085 14449101
4398 14449101 17375725 14081999 7407538 2973896 2783707 5271622 8947054 13340339
4390 13340339 17512880 19553746 17752026 12345120 6279348 2838814 1383401 -2479235
4382 -2479235 -10215130 -16229912 -14210366 -6028266 339558 1187389 261510 1204877 2488046
$$ packed form
4441E232881r3123j706430j090303R52762J644183k91190j849894M42117M324828
4432G565831L943553j107819m281457j661781K607458L669269K867213K851580
4424A6453847J621422k500974n028534j659871L469584L566212k0374j015891
4416A4885421L98855j261694n470342n450996n8838L485949R62554l134900m043851
4407C12158l069975k139528M72742M732799N957985K305646o87973J585231M980016
4398A4449101K926624l293726o674461m433642j90189K487915L675432M393285
4390A3340339M172541K040866j801720n406906o065772l440534j455413l862636
4382b479235p735895o014782K019546Q182100O367824Q47831r25879R43367J283169
$$ plain form
4373 2488046 2058582 1993699 4790265 8457520 9357887 7766662 6640689 6110583 3203283
4364 3203283 -2902090 -8667116 -10247994 -7620831 -3528003 263291 4197209 8728939
4356 8728939 12196211 12111969 8935552 7294981 11477133 19587728 24402318 21373574 14197944
4347 14197944 10515767 13094832 17638297 19051326 17050680 14439303 12276268 9353203
4339 9353203 5546945 2761503 1909521 1340133 -131362 -229731 4497353 13744235 22598262
4330 22598262 25827311 22013043 13871156 5988798 1973518 1962833 2570326 574173 -3419249
4321 -3419249 -6365708 -7071377 -6507172 -4152424 2228232 11763482 18824895 18895251 14110545
4312 14110545 10514073 11303996 15013280 18808015 20818501 19896582 15691411 9442935
$$ packed form
4373B488046m29464o4883K796566L667255R00367j591225j125973n30106k907300
4364C203283o105373n765026j580878K627163M092828L791294L933918M531730
4356H728939L467272q4242l176417j640571M182152Q110595M814590l028744p175630
4347A4197944l682177K579065M543465J413029k000646k611377k163035k923065
4339I353203l806258k785442q51982n69388j471495r8369M727084R246882Q854027
4330B2598262L229049l814268q141887p882358m015280j0685O07493j996153l993422
4321c419249k946459p05669N64205K354748O380656R535250P061413P0356m784706
4312A4110545l596472P89923L709284L794735K010486r21919m205171o248476
$$ plain form
4304 9442935 3686272 1158633 3740536 10678723 17496648 19284555 16283730 13540715
4296 13540715 13719541 13805887 11170859 8628382 9335293 10294900 6554466 -212402 -3274276
4287 -3274276 -249781 4589793 7180961 7301978 5081751 -299130 -6873466 -9850289
4279 -9850289 -7309055 -1960678 3926837 10671664 16786735 18004592 13884131 10690859
4271 10690859 13621449 19636237 22042344 19285706 15009975 11718477 8920085 6440174
4263 6440174 5407722 5927595 6651789 6778411 6644371 6703509 7239447 8255931 8719337
4254 8719337 7371271 5005544 3640370 2670765 -671051 -5406336 -5786517 462499 7019768
4245 7019768 6876010 2150426 483849 4004985 8058547 9529566 9735395 9112148 5749928
$$ packed form
4304I442935n756663k527639K581903O938187O817925J787907l000825k743015
4296A3540715J78826Q6346k635028k542477P06911R59607l740434o766868l061874
4287c274276L024495M839574K591168J21017k220227n380881o574336k976823
4279i850289K541234N348377N887515O744827O115071J217857m120461l193272
4271A0690859K930590O014788K406107k756638m275731l291498k798392k479911
4263F440174j032452N19873P24194J26622j34040N9138N35938J016484M63406
4254H719337j348066k365727j365174r69605l341816m735285l80181O249016O557269
4245G019768j43758m725584j666577L521136M053562J471019K05829o23247l362220
$$ plain form
4236 5749928 508368 -2400781 -1754850 -761057 -358521 2874429 9249362 12647328 9332231
4227 9332231 4906917 6662291 12698809 14882566 10162471 2670947 -3742301 -8289585
4219 -8289585 -9092901 -3584666 5295899 9738771 6944531 3237826 4786176 8806514
4211 8806514 8604622 3794947 -185584 -977606 -1732078 -4507668 -6737615 -6053516 -4127729
4202 -4127729 -2872169 -365570 5543998 11853204 13413717 10932720 10955092 16161053 20218093
4193 20218093 16275980 7740338 5033011 11937964 20972293 24268792 23404057 23877462
4185 23877462 24305741 18368316 6261605 -3540845 -5705767 -4484597 -5338033 -6161302
4177 -6161302 -2276495 4189130 6625598 3635467 -10715 -1463723 -2742283 -5188756
$$ packed form
4236E749928n241560k909149O45931R93793M02536L232950O374933L397966l315097
4227I332231m425314J755374O036518K183757m720095p491524o413248m547284
4219h289585q03316N508235Q880565M442872k794240l706705J548350M020338
4211H806514k01892m809675l980531p92022p54472k775590k229947O84099J925787
4202d127729J255560K506599N909568O309206J560513k480997K2372N205961M057040
4193B0218093l942113q535642k707327O904953R034329L296499q64735M73405
4185B3877462M28279n937425j2106711r802450k164922J221170q53436q23269
4177f161302L884807O465625K436468k990131l646182j453008j278560k446473
$$ plain form
4169 -5188756 -6742277 -6233806 -5481745 -5220900 -3332851 635445 3078567 1053279 -3572224
4160 -3572224 -6876984 -7300526 -5857088 -4680326 -6392241 -11826800 -17688385 -19969889
4152 -19969889 -19585725 -19753426 -18478231 -11287794 -2129669 -1641770 -11486934 -21890701
4144 -21890701 -30463495 -49234225 -80617843 -99534913 -79708786 -32422010 2447093
4137 2447093 4878162 -5986433 -5159859 6393937 13787522 14262972 15329717 17860082
4129 17860082 17245494 15603885 18790299 24683612 26409806 24271482 23339826 22186452
4121 22186452 15828969 7997195 8055720 15531898 19412216 14389440 7045454 3707130
4113 3707130 2680799 1762713 3233527 6693791 6078805 -530846 -5948050 -4621061 -1232710
$$ packed form
4169e188756j553521N08471P52061K60845J888049L968296K443122k025288m625503
4160c572224l304760m23542J443438J176762j711915n434559n861585k281504
4152a9969889L84164j67701J275195P190437R158125M87899r845164j0403767
4144b1890701q572794j8770730l1383618j8917070J9826127M7286776L4869103
4137B447093K431069j0864595Q26574J1553796P393585M75450J066745K530365
4129A7860082o14588j641609L186414N893313J726194k138324r31656j153374
4121B2186452o357483p831774N8525P476178L880318n022776p343986l338324
4113C707130j026331r18086J470814L460264o14986o609651n417204J326989L388351
$$ plain form
4104 -1232710 -2140442 -4621843 -2048281 5021207 10402475 11585684 10623313 8549998 5672326
4095 5672326 5203204 9743162 15389568 15792311 11254579 7490654 5991163 2750415 -2761050
4086 -2761050 -4972111 -1581155 971855 -3627123 -11626790 -13969167 -8795536 -3165077
4078 -3165077 -2228830 -2381033 2253016 10708738 16982029 18996420 20446793 23153900 23070772
4069 23070772 17269017 10688732 10502573 15749624 18551142 15280328 10279187 7419458
4061 7419458 4624583 -41679 -2878162 -317187 3994337 3758852 -702773 -3363701
4053 -3363701 -1443486 1761920 2625665 1120114 -1182301 -3048886 -3059808 -367916 3708768
4044 3708768 7366552 10969849 15230992 18000814 16620731 12499276 9150585 6458513
$$ packed form
4104a232710r07732k481401K573562P069488N381268J183209r62371k073315k877672
4095E672326m69122M539958N646406M02743m537732l763925j499491l240748n511465
4086b761050k211061L390956K553010m598978p999667k342377N173631N630459
4078c165077R36247j52203M634049Q455722O273291K014391J450373K707107q3128
4069B3070772n801755o580285j86159N247051K801518l270814n001141k859729
4061G419458k794875m666262k836483K560975M311524k35485m461625k660928
4053c363701J920215L205406Q63745j505551k302415j866585j0922K691892M076684
4044C708768L657784L603297M261143K769822j380083m121455l348691k692072
$$ plain form
4036 6458513 1600846 -4835460 -9030106 -10235130 -10955321 -10199902 -3517297 7918446
4028 7918446 15382142 14002944 9874555 10416937 13302823 11988459 7953955 8762190 15378224
4019 15378224 19844312 16493351 8490138 1412841 -3491299 -6936315 -7821026 -5554858
4011 -5554858 -2519077 -730323 1160044 4441378 6700237 5289573 2371112 2274971 4602164
4002 4602164 4082554 -2065868 -9844525 -12973845 -9795295 -4385559 -1932599 -4093598
3994 -4093598 -8352919 -11052313 -10796221 -8804999 -6334253 -3182480 517110 2895680
3986 2895680 3068481 4244882 10831603 21886001 30461649 30910053 24342552 15310683
3978 15310683 6255580 -1651022 -5122983 -1573575 5235644 7822081 4478439 1199704
$$ packed form
4036F458513m857667o436306m194646j205024p20191P55419O682605J1435743
4028G918446P463696j379198m128389N42382K885886j314364m034504Q08235O616034
4019A5378224M466088l350961q003213p077297m904140l445016q84711K266168
4011e554858L035781J788754J890367L281334K258859j410664k918461r6141K327193
4002D602164n19610o148422p778657l129320L178550N409736K452960k160999
3994d093598m259321k699394K56092J991222K470746L151773L699590K378570
3986B895680J72801J176401O586721J1054398Q575648M48404o567501r031869
3978A5310683r055103p906602l471961L549408O809219K586437l343642l278735
$$ plain form
3970 1199704 2036681 2842278 -1194422 -6368613 -5223512 1738759 6211376 4077458 572474
3961 572474 1667214 6342907 10656706 14275445 18385484 20867787 18862755 14130638
3953 14130638 10893272 9433482 6635426 2580979 1757483 6554389 13266941 16264427
3945 16264427 13805432 8692327 5307171 6831582 13268203 21076614 26097025 27311028
3937 27311028 26643720 25744773 25126881 25734109 28093468 29791011 27305609 21236110 16414581
3928 16414581 15660973 16694567 16576076 15557556 14467251 12007167 7712282 4488070
3920 4488070 4677826 6121864 5832606 5342250 8169063 13532374 17071305 17085221 15815932
3911 15815932 14844633 13298271 10547386 6653189 220894 -9597874 -18466403 -19397174
$$ packed form
3970A199704Q36977Q05597m036700n174191J145101O962271M472617k133918l504984
3961E72474J094740M675693M313799L618739M110039K482303k005032m732117
3953A4130638l237366j459790k798056m054447q23496M796906O712552K997486
3945A6264427k458995n113105l385156J524411O436621P808411N020411J214003
3937B7311028o67308q98947o17892O07228K359359J697543k485402o069499m821529
3928A6414581p53608J033594j18491j018520j090305k460084m294885l224212
3920D488070J89756J444038k89258m90356K826813N363311L538931J3916j269289
3911A5815932r71299j546362k750885l894197o432295r818768q868529r30771
$$ plain form
3903 -19397174 -11842137 -3596572 -884707 -760073 3002535 10160595 15116163 15724631
3895 15724631 15497169 16848081 16874516 11825320 2918931 -4642661 -7222372 -5384475 -1440870
3886 -1440870 3583044 9343454 13625845 13058164 7725196 2909033 3136283 5412962 2610181
3877 2610181 -5557452 -9596066 -1623631 13403974 22284679 18147445 6251200 -4364374
3869 -4364374 -10384115 -13960267 -16958216 -18923865 -19463917 -19502651 -19524395 -18265140 -14498049
3860 -14498049 -9789776 -8020630 -11098678 -15900219 -17255971 -14018443 -10063542 -8631814
3852 -8631814 -8286248 -6326821 -3781820 -3912172 -7060632 -10253946 -11328235 -10281259 -7020113
3843 -7020113 -1638331 2578160 567936 -7984773 -16423953 -17752844 -11620382 -3017851
$$ packed form
3903a9397174P555037Q245565K711865J24634L762608P158060M955568O08468
3895A5724631k27462J350912K6435n049196q906389p561592k579711J837897L943605
3886a440870N023914N760410M282391n67681n332968m816163K27250K276679k802781
3877B610181q167633m038614P972435J5027605Q880705m137234j1896245j0615574
3869d364374o019741l576152k997949j965649n40052l8734k1744J259255L767091
3860a4498049M708273J769146l078048m801541j355752L237528L954901J431728
3852h631814L45566J959427K545001j30352l148460l193314j074289J046976L261146
3843g020113N381782M216491k010224q552709q439180j328891O132462Q602531
$$ plain form
3835 -3017851 3734326 7488057 8773001 8642756 8109061 6567863 1786172 -6483754 -14146537
3826 -14146537 -16608407 -14050998 -10089214 -6114118 -748309 4976667 6355903 1154307
3818 1154307 -6139461 -9218796 -7264520 -4347928 -2864762 -1255582 1607007 3464958
3810 3464958 2124496 -295705 870522 7382458 16294330 23394352 26639831 26033454
3802 26033454 22205945 16505791 11236280 7935115 5655404 2539669 -803052 -1203802
3794 -1203802 2954214 8936590 12463184 12619193 12238084 13380167 14282236 11895372 6332661
3785 6332661 1165893 -637478 281731 1241167 1069598 1048581 2585851 5016675 6245506
3776 6245506 5289314 3763032 4538212 8535953 12736317 12154050 4877351 -4924841 -10267048
$$ packed form
3835c017851O752177L753731J284944j30245n33695j541198m781691q269926p662783
3826a4146537k461870K557409L961784L975096N365809N724976J379236n201596
3818A154307p293768l079335J954276K916592J483166J609180K862589J857951
3810C464958j340462k420201J166227O511936Q911872P100022L245479o06377
3802B6033454l827509n700154n269511l301165k279711l115735l342721m00750
3794a203802M158016N982376L526594J56009l81109J142083R02069k386864n562711
3785F332661n166768j803371R19209R59436j71569k1017J537270K430824J228831
3776F245506r56192j526282P75180L997741M200364n82267p276699r802192n342207
$$ plain form
3767 -10267048 -8290496 -3182208 -1415576 -4744243 -8980489 -9381604 -5883835 -2549440
3759 -2549440 -2774786 -5936205 -8569704 -8105220 -5083949 -2027304 -765235 -1110765 -1564100
3750 -1564100 -629582 2159127 5474371 6593865 3907030 -787673 -4059855 -5369591
3742 -5369591 -7655404 -12026836 -14320985 -10043096 -1498413 3858039 2499176 -1374696
3734 -1374696 -2419256 -1092617 -1461783 -4670447 -8146063 -10175392 -11577147 -12621631
3726 -12621631 -11562863 -7502941 -2396947 1263764 2963819 2939990 520507 -3875029
3718 -3875029 -6613507 -4270035 844357 2260036 -2164006 -6724309 -5508579 -708883
3710 -708883 741985 -2805773 -6202951 -6202556 -6181336 -9748456 -14191508 -14196295 -9122382 -2511538
$$ packed form
3767a0267048J976552N108288J766632l328667m236246m01115L497769L334395
3759b549440k25346l161419k633499M64484L021271L056645J262069l45530m53335
3750a564100R34518K788709L315244J119494k686835m694703l272182j309736
3742e369591k285813m371432k294149M277889Q544683N356452j358863l873872
3734a374696j044560J326639l69166l208664l475616k029329j401755j044484
3726a2621631J058768M059922N105994L660711J700055k3829k419483m395536
3718c875029k738478K343472N114392J415679m424042m560303J215730M799696
3710g08883J450868l547758l397178L95K1220l567120m443052m787N073913O610844
$$ plain form
3700 -2511538 3333104 7810556 8893561 4941541 -690460 -2220513 515649 1467301
3692 1467301 -2760484 -8302774 -10609237 -10834458 -11953213 -12404245 -8631332 -2057640 1418204
3683 1418204 -1236011 -7039196 -11461052 -12970717 -12409763 -10310606 -6419749 -1232556
3675 -1232556 2928892 3161349 -670918 -4236393 -2566967 3872074 9261362 9373333 5717518
3666 5717518 1800706 -970988 -1570814 2069518 8846282 12596952 9498469 4519386
3658 4519386 4822000 9014141 9577890 4707366 320225 122549 1270464 1359530 2019604
3649 2019604 2681727 -1580614 -11226908 -17864434 -14832757 -7181994 -4435696 -7178842
3641 -7178842 -8048671 -3771735 1221198 2711961 1580536 65507 -1379908 -2290520 -1572295
$$ packed form
3700b511538N844642M477452J083005l952020n632001j530053K736162R51652
3692A467301m227785n542290k306463k25221j118755m51032L772913O573692L475844
3683A418204k654215n803185m421856j509665N60954K099157L890857N187193
3675a232556M161448K32457l832267l565475J669426O439041N389288J11971l655815
3666E717518l916812k771694n99826L640332O776764L750670l098483m979083
3658D519386L02614M192141N63749m870524m387141j97676J147915Q9066O60074
3649B019604O62123m262341r646294o637526L031677P650763K746298k743146
3641g178842q69829M276936M992933J490763j131425j515029j445415r10612P18225
$$ plain form
3632 -1572295 302334 1970608 4159986 8147531 11525184 10343603 5931804 4358026
3624 4358026 7713147 11050202 10095778 6984588 5389380 4671725 2742112 741722 418793
3615 418793 58120 -2173855 -3426984 27865 6031860 9287450 9926232 13001206 18867249
3606 18867249 20741474 14812961 7268686 6369808 10784693 11379138 3855107 -5414808
3598 -5414808 -7403551 -730520 8189951 13029825 12751923 9669821 5473221 757581
3590 757581 -3130641 -4325489 -2901972 -1364676 -1621305 -2530742 -1669527 1173871 3625208
3581 3625208 3573234 1256131 -1287927 -1846578 462975 3986534 5136622 1815446 -3729376
3572 -3729376 -7075724 -6814390 -5825373 -7043926 -10021913 -12600511 -13842347 -13572092 -10697347
$$ packed form
3632a572295J874629J668274K189378L987545L377653j181581m411799j573778
3624D358026L355121L337055r54424l111190j595208p17655j929613k000390l22929
3615D18793l60673k231975j253129L454849O003995L255590O38782L074974N866043
3606A8867249J874225n928513p544275q98878M414885N94445p524031r269915
3598e414808j988743O673031Q920471M839874k77902l082102m196600m715640
3590G57581l888222j194848J423517J537296k56629r09437Q61215K843398K451337
3581C625208n1974k317103k544058n58651K309553L523559J150088l321176n544822
3572c729376l346348K61334R89017j218553k977987k578598j241836K70255K874745
$$ plain form
3563 -10697347 -4375744 3770743 10672302 14903446 17206804 18285138 17886497 16042282
3555 16042282 13294226 9264710 2793363 -5615498 -12891318 -16083354 -15097858 -11961024
3547 -11961024 -8499522 -5975716 -5794228 -8172706 -10015054 -6656842 2574407 11992799
3539 11992799 15056058 11895732 8986783 10933677 15262623 16880344 14997672 12593323
3531 12593323 10939367 9043298 8041349 10845150 15786186 15864046 8269386 732069
3523 732069 2839155 12841997 19038492 14457488 4713885 -314351 2206090 7942818
3515 7942818 12778856 16110536 18194911 17984520 14281901 7516654 -12155 -5357795
3507 -5357795 -6962973 -5734592 -3315594 394757 6271342 12696059 15982080 14981581
$$ packed form
3563a0697347O321603Q146487O901559M231144K303358J078334l98641j844215
3555A6042282k748056m029516o471347q408861p275820l192036R85496L136834
3547a1961024L461502K523806J81488k378478j842348L358212R231249R418392
3539A1992799L063259l160326k908949J946894M328946J617721j882672k404349
3531A2593323j653956j896069j001949K803801M941036P7860p594660p537317
3523G32069K107086J0002842O196495m581004r743603n028236K520441N736728
3515G942818M836038L331680K084375k10391l702619o765247p528809n345640
3507e357795j605178J228381K418998L710351N876585O424717L286021j000499
$$ plain form
3499 14981581 12690258 11797492 11064151 8107962 3770996 1367824 2693700 6351371
3491 6351371 8865568 6695382 -504033 -7437267 -7180072 160962 6179756 4695134
3483 4695134 114759 927738 7739812 13273863 12574107 7354133 948942 -4932747 -8092257
3474 -8092257 -6507374 -2556160 -1445563 -3980610 -5763527 -4674740 -3432566 -3025484
3466 -3025484 -214017 5151299 6952805 1955088 -3593254 -2664423 1928010 2660088 -520943
3457 -520943 -1099550 2767937 6014885 5488547 3443927 1356781 -2548050 -7596414 -8973989
3448 -8973989 -4574117 1782901 6483989 10038867 12214186 9690817 3247918 1357276
3440 1357276 9787564 21496223 24495405 17841369 11863375 12583976 14197481 9746753
$$ packed form
3499A4981581k291323q92766p33341k956189m336966k403172J325876L657671
3491F351371K514197k170186p199415o933234K57195P341034O018794j484622
3483D695134m580375Q12979O812074N534051o99756n219974o405191n881689l159510
3474h092257J584883L951214J110597k535047j782917J088787J242174M07082
3466c025484K811467N365316J801506m997717n548342R28831M592433P32078l181031
3457e20943n78607L867487L246948n26338k044620k087146l904831n048364j377575
3448h973989M399872O357018M701088L554878K175319k523369o442899j890642
3440A357276Q430288J1708659K999182o654036n977994P20601J613505m450728
$$ plain form
3432 9746753 2044840 -1470292 -328078 -924686 -5984504 -9993885 -6734307 2338525
3424 2338525 9805440 10728114 6985296 3471704 2120721 960945 -1757154 -4524912
3416 -4524912 -4786097 -3171456 -3460075 -7642025 -12525478 -12926006 -7924698 -2265450 -789554
3407 -789554 -2586815 -2128193 3784033 11541136 14195679 9004739 537154 -3852430 -919503
3398 -919503 6217491 11719325 12187680 8836272 5602638 5244575 6847579 7147996 4322187
3389 4322187 -202833 -3984619 -6253021 -6996859 -4674482 2240460 11078995 15409482
3381 15409482 11736861 4001228 -915789 -995824 164506 -347126 -996988 890657 4772353
3372 4772353 7583557 7441400 5308730 3833609 5257628 9301409 12458290 10901050
$$ packed form
3432I746753p701913l515132J142214n96608n059818m009381L259578R072832
3424B338525P466915R22674l742818l513592j350983j159776k718099k767758
3416d524912k61185J614641k88619m181950m883453m00528N001308N659248J475896
3407g89554j797261M58622N912226P757103K654543n190940q467585m389584K932927
3398i19503P136994N501834M68355l351408l233634l58063J603004L00417k825809
3389D322187m525020l781786k268402p43838K322377O914942Q838535M330487
3381A5409482l672621p735633m917017q0035J160330n11632o49862J887645L881696
3372D772353K811204j42157k132670j475121J424019M043781L156881j557240
$$ plain form
3364 10901050 5041417 -385867 -1833971 -591872 523839 1605965 3987641 6185987
3356 6185987 5544032 3347052 4194161 9602008 15633666 17818195 15314787 9358379 1332112
3347 1332112 -5787615 -7848334 -4484274 -881955 -1251611 -2933775 -881192 3972606
3339 3972606 5700367 2207387 -1823989 -1584312 2597765 8033000 13516129 17932363
3331 17932363 18607360 14596234 9484543 7419699 7685949 6599113 3772263 2520095
3323 2520095 3901732 4453118 1570967 -1882843 -806686 6009212 14975367 21407844
3315 21407844 22133496 16162594 5981540 -2243811 -2979916 3217537 10373340 13462978
3307 13462978 12174341 8587200 4366875 1236858 862790 2088512 930012 -4255760
$$ packed form
3364A0901050n859633n427284j448104J242099J115711J082126K381676K198346
3356F185987o41955k196980Q47109N407847O031658K184529k503408n956408q026267
3347A332112p119727k060719L364060L602319l69656j682164K052583M853798
3339C972606J727761l492980m031376K39677M182077N435235N483129M416234
3331A7932363O74997m011126n111691k064844K66250j086836k826850j252168
3323B520095J381637N51386k882151l453810J076157O815898Q966155O432477
3315B1407844P25652n970902j0181054q225351p36105O197453P155803L089638
3307A3462978j288637l587141m220325l130017l74068J225722j158500n185772
$$ plain form
3299 -4255760 -9999944 -12671003 -13396089 -14477721 -13690131 -7444703 1573351 5770913 2204435
3290 2204435 -4247767 -8174944 -9124818 -8449572 -5945570 -2236084 36184 368318 1712376
3281 1712376 4725740 4998916 -425162 -7885411 -12410988 -14020615 -14227853 -10916705 -2958890
3272 -2958890 3839271 2946920 -2955727 -5959841 -5326684 -7322839 -12808886 -14416437 -8526329
3263 -8526329 -1523711 30156 -1620477 -1067632 1805954 4590841 8462613 15126031
3255 15126031 21027987 20962501 15641003 10190723 6371323 1510325 -5188142 -10013246
3247 -10013246 -9268393 -3483892 3444532 7708962 8676424 9668366 14084322 19697291 19841535
3238 19841535 12359468 3518139 -594303 -2654533 -8731938 -17343232 -20693520 -15804640
$$ packed form
3299d255760n744184k671059p25086j081632P87590O245428R018054M197562l566478
3290B204435o452202l927177r49874O75246K504002L709486K272268L32134J344058
3281A712376L013364K73176n424078p460249m525577j609627k07238L311148P957815
3272b958890O798161q92351n902647l004114O33157j996155n486047j607551N890108
3263h526329P002618J553867j650633N52845K873586K784887L871772O663418
3255A5126031N901956o5486n321498n450280l819400m860998o698467m825104
3247a0013246P44853N784501O928424M264430R67462R91942M415956N612969J44244
3238A9841535p482067q841329m112442k060230o077405q611294l350288M888880
$$ plain form
3230 -15804640 -7529868 -102894 7520893 15937639 21021586 18986994 11868861 4895842
3222 4895842 1285360 1807296 6244240 12665612 17923838 21164998 24196766 26470754
3214 26470754 23501537 13791647 4063186 2613721 8761229 13579302 10917204 3355614
3206 3355614 -3353252 -7365374 -10062779 -11671167 -11284350 -10319852 -12392771 -18422772 -23718062
3197 -23718062 -22049651 -12663982 -1789582 3595770 2704135 842327 3094684 9322849
3189 9322849 15184363 16667026 13113526 6757796 332537 -4586207 -7229337 -6866196
3181 -6866196 -3934599 -1557419 -3225196 -7758194 -9271903 -4523491 2134423 4441934
3173 4441934 2725574 2207626 4181051 4549027 1424183 -1787096 -2650148 -3295277 -4779375
$$ packed form
3230a5804640Q274772P426974P623787Q416746N083947k034592p118133o973019
3222D895842l610482N21936M436944O421372N258226L241160L031768K273988
3214B6470754k969217r709890r728461j449465O147508M818073k662098p561590
3206C355614o708866m012122k697405j608388L86817R64498k072919o030001n295290
3197b3718062J668411R385669J0874400N385352q91635j861808K252357O228165
3189I322849N861514J482663l553500o355730o425259m918744k643130L63141
3181f866196K931597K377180j667777m532998j513709M748412O657914K307511
3173D441934j716360n17948J973425L67976l124844l211279q63052o45129j484098
$$ plain form
3164 -4779375 -3325514 3451408 11118510 14405834 14940590 17281757 20357123 19672613 16247064
3155 16247064 15836428 19318491 21213844 19066475 17228846 18871195 21053326 21483075
3147 21483075 23621207 29417949 32288102 24821028 10893407 2579617 5369320 12977037
3139 12977037 17311700 17105166 14664884 10234135 3816545 -1385745 -2184951 -124135
3131 -124135 1161967 1992931 5663319 11600539 14086590 9554492 1786231 -2830910 -3086699
3122 -3086699 -2884134 -4480435 -5434317 -3034335 1214093 3508417 2400516 -691080 -4520953
3113 -4520953 -8885006 -12533910 -13014445 -9830274 -5894821 -4287774 -4784485 -5125619 -4703334
3104 -4703334 -5101820 -7321975 -10156578 -11387393 -9389690 -3810080 3776309 9870580
$$ packed form
3164d779375J453861O776922P667102L287324N34756K341167L075366o84510l425549
3155A6247064m10636L482063J895353k147369j837629J642349K182131M29749
3147B1483075K138132N796742K870153p467074j3927621q313790K789703P607717
3139A2977037M334663k06534k440282m430749o417590n202290p99206K060816
3131a24135J286102Q30964L670388N937220K486051m532098p768261m617141k55789
3122c086699K02565j596301r53882K399982M248428K294324j107901l091596l829873
3113d520953m364053l648904m80535L184171L935453J607047m96711l41134M22285
3104d703334l98486k220155k834603j230815J997703N579610P586389O094271
$$ plain form
3096 9870580 11559648 9804231 8914046 11819860 16764323 19524922 18173613 14711952
3088 14711952 12372446 12082993 11663787 8430392 2764274 -1286704 178378 6616034
3080 6616034 13486153 16730412 15491209 10876068 4624803 -246241 -353478 4136771
3072 4136771 8167856 6986850 1902504 -1457554 4476 4322715 8553184 12321997
3064 12321997 16074775 18035746 15207752 7286950 -1638068 -6083547 -4252356 181390
3056 181390 2429919 2625588 5316331 12040550 17485952 16066933 10084435 7041700 9717555
3047 9717555 13533714 13867165 11023443 6807399 1402103 -3615988 -3911486 1707382 7290770
3038 7290770 6349132 460430 -3364282 -2731865 -2372649 -6375521 -12389985 -15307540 -13851192
$$ packed form
3096I870580J689068j755417q90185K905814M944463K760599j351309l461661
3088A4711952k339506k89453m19206l233395n666118m050978J465082O437656
3080F616034O870119L244259j239203m615141o251265m871044j07237M490249
3072D136771M031085j181006n084346l360058J462030M318239M230469L768813
3064A2321997L752778J960971k827994p920802q925018m445479J831191M433746
3056A81390K248529J95669K690743O724219N445402j419019n982498l042735K675855
3047I717555L816159L33451k843722m216044n405296n018091k95498N618868N583388
3038G290770r41638n888702l824712O32417L59216m002872o014464k917555J456348
$$ plain form
3029 -13851192 -11376395 -11258154 -12957571 -12786334 -8440626 -2218534 1648844 2649286
3021 2649286 4243481 7701653 9424519 6900151 3644558 4251369 7569552 9705150
3013 9705150 11309992 15859743 22006835 24225622 21021381 16082675 10932442 3586829
3005 3586829 -4044535 -5354442 746687 5990571 4189680 315089 2045640 7568194
2997 7568194 9211279 5672667 2765436 3726497 6225674 8449328 11170653 13358843
2989 13358843 12063311 7761377 4399917 3181575 1609117 -407793 662517 5301525
2981 5301525 8754374 8176889 6844633 8161585 10325122 10639881 10659452 12539212 13866459
2972 13866459 11026652 5189541 300589 -2804428 -5735446 -7947349 -7758285 -6657561
$$ packed form
3029a3851192K474797J18241j699417J71237M345708O222092L867378J000442
3021B649286J594195L458172J722866k524368l255593O06811L318183K135598
3013I705150J604842M549751O147092K218787l204241m938706n150233p345613
3005C586829p631364j309907O101129N243884j800891l874591J730551N522554
2997G568194J643085l538612k907231R61061K499177K223654K721325K188190
2989A3358843j295532m301934l361460j218342j572458k016910J070310M639008
2981E301525L452849n77485j332256J316952K163537L14759J9571J879760J327247
2972A3866459k839807n837111m888952l105017k931018k211903J89064J100724
$$ plain form
2964 -6657561 -7496025 -9086447 -7823779 -4533713 -4149621 -7682487 -10038916 -7928727 -4957904
2955 -4957904 -5702900 -8760578 -9556965 -7234829 -4668644 -3259331 -1554018 1503293 4935474
2946 4935474 7112341 6568968 2093205 -5632575 -12875722 -15623819 -13462687 -9027627
2938 -9027627 -4269571 586569 5030532 8011565 9829678 11691050 12904463 11064616
2930 11064616 5987880 1191720 41001 2077045 4535306 6139414 7935757 11191181
2922 11191181 15612341 19281408 20147639 18523783 17907315 21357230 26758075 28324137
2914 28324137 24049005 18827111 17778185 18950011 16308223 8777464 2099234 1144369
2906 1144369 3946759 5101256 2670125 -462437 -862109 1904542 5740992 8483831
$$ packed form
2964f657561q38464j590422J262668L290066L84092l532866k356429K110189K970823
2955d957904p44996l057678p96387K322136K566185J409313J705313L057311L432181
2946D935474K176867n43373m475763p725780p243147k748097K161132M435060
2938i027627M758056M856140M443963K981033J818113J861372J213413j839847
2930A1064616n076736m796160j150719K036044K458261J604108J796343L255424
2922A1191181M421160L669067Q66231j623856o16468L449915N400845J566062
2914B8324137m275132n221894j048926J171826k641788p530759o678230r54865
2906A144369K802390J154497k431131l132562l99672K766651L836450K742839
$$ plain form
2898 8483831 9393800 8888668 7667733 6670952 7685108 12700451 21517254 30430950 34535853
2889 34535853 31590781 23235486 12983160 4023589 -1491538 -2664329 -91951 4506776
2881 4506776 8968583 10931883 8532644 2211912 -4656654 -8470331 -8756150 -7749077
2873 -7749077 -7011790 -6080562 -4411864 -2766383 -1960111 -1687926 -1505841 -1874664 -3077586
2864 -3077586 -3722080 -1711595 2893571 6869533 6887813 3705053 1764995 3433006 5389682
2855 5389682 3541012 190052 1620914 8113646 12154483 9362357 5305210 6243332
2847 6243332 8292842 3551450 -6152276 -11002303 -8254639 -5859253 -8902157 -11790965
2839 -11790965 -8727558 -4005469 -4942326 -9962799 -11234132 -6092826 1178696 7315794
$$ packed form
2898H483831R09969n05132j220935r96781J014156N015343Q816803Q913696M104903
2889C4535853k945072q355295j0252326q959571n515127j172791K572378M598727
2881D506776M461807J963300k399239o320732o868566l813677k85819J007073
2873g749077P37287R31228J668698J645481Q06272K72185J82085l68823j202922
2864c077586o44494K010485M605166L975962J8280l182760j940058J668011J956676
2855E389682j848670l350960J430862O492732M040837k792126m057147R38122
2847F243332K049510m741392r703726m850027K747664K395386l042904k888808
2839a1790965L063407M722089r36857n020473j271333N141306P271522O137098
$$ plain form
2831 7315794 13169126 18983886 22302621 21832261 19619102 18151472 17597816 16423254 13257918
2822 13257918 8461855 4789897 5059308 8058036 9105561 6214808 2664408 1321861
2814 1321861 148422 -3417826 -7495584 -9478051 -10959921 -13593538 -13532209 -6918545 1245763
2805 1245763 1580222 -6343364 -12353904 -8566729 2219908 12357708 17669916 18015782
2797 18015782 14953324 11454187 9957607 8986489 5474733 1065370 937164 5112981
2789 5112981 6815766 2046688 -4691329 -7494575 -6744012 -5773517 -4601367 -1912930 197545
2780 197545 -1267478 -4883783 -6437213 -4648524 -1691504 793515 2920543 4705166
2772 4705166 5774635 6218349 5692452 2778769 -2887424 -8996320 -12585797 -12434463 -8611452
$$ packed form
2831G315794N853332N814760L318735m70360k213159j467630n53656j174562l165336
2822A3257918m796063l671958K69411K998728J047525k890753l550400j342547
2814A321861j173439l566248m077758j982467j481870k633617O1329O613664Q164308
2805A245763L34459p923586o010540L787175J0786637J0137800N312208L45866
2797A8015782l062458l499137j496580r71118l511756m409363j28206M175817
2789E112981J702785m769078o738017k803246P50563R70495J172150K688437K110475
2780A97545j465023l616305j553430J788689K957020K485019K127028J784623
2772D705166J069469M43714n25897k913683n666193o108896l589477J51334L823011
$$ plain form
2763 -8611452 -1861038 5383593 9937200 11377156 12224636 13361574 12219391 7149057
2755 7149057 631239 -3510254 -3277715 1800919 9871679 14728487 10497924 827844
2747 827844 -3050495 2710501 8432759 5256940 -1612264 -2271253 1344576 -760129 -9382560
2738 -9382560 -14565309 -11656068 -7856248 -9858220 -14394537 -15573158 -14011834 -13281408
2730 -13281408 -12864491 -10160939 -5764065 -1984088 1183758 4658856 7054469 6329313
2722 6329313 3067799 -500594 -3194640 -4605510 -4062504 -1939074 -242833 -37359 66173
2713 66173 1210959 1810856 -564514 -6172277 -13077572 -18605926 -20125986 -16702003 -11335041
2704 -11335041 -9462257 -13384647 -19262794 -20707565 -14644226 -3974224 3790854 1439017
$$ packed form
2763h611452O750414P244631M553607J439956Q47480J136938j142183n070334
2755G149057o517818m141493K32539N078634Q070760M856808m230563r670080
2747H27844l878339N760996N722258l175819o869204o58989L615829k104705q622431
2738i382560n182749K909241L799820k001972m536317j178621J561324P30426
2730a3281408M16917K703552M396874L779977L167846L475098K395613p25156
2722F329313l261514l568393k694046j410870N43006K123430J696241K05474J03532
2713F6173J144786N99897k375370n607763o905295n528354j520060L423983N366962
2704a1335041J872784l922390n878147j444771O063339J0670002P765078k351837
$$ plain form
2696 1439017 -10880552 -23233197 -24346728 -13667890 -1625418 3055204 2092194 1983585
2688 1983585 4474091 6487022 6170235 4554563 2829834 1561838 1471202 2133233 1216429
2679 1216429 -2313521 -5723479 -6076306 -4833453 -5765479 -9193861 -11338871 -8952533 -2169673
2670 -2169673 6479560 13335681 14646528 9199425 -70551 -8918925 -15371641 -18562164
2662 -18562164 -16176407 -7406350 1969793 2577834 -8131598 -21485449 -26228705 -19856609
2654 -19856609 -9132360 -918255 4243288 9210869 14170204 16259757 14541346 12235658
2646 12235658 12408761 13412863 11317008 6105385 2256468 2677134 5171858 6394183
2638 6394183 6542725 7810526 10094144 10858565 8333115 2901919 -3624814 -8280123 -7838930
$$ packed form
2696A439017j2319569j2352645j113531J0678838J2042472M680622r63010j08609
2688A983585K490506K012931l16787j615672j724729j267996r0636O62031r16804
2679A216429l529950l409958l52827J242853r32026l428382k145010K386338O782860
2670b169673Q649233O856121J310847n447103r269976q848374o452716l190523
2662a8562164K385757Q770057R376143O08041j0709432j3353851m743256O372096
2654a9856609J0724249Q214105N161543M967581M959335K089553j718411k305688
2646A2235658J73103J004102k095855n211623l848917M20666K494724J222325
2638F394183J48542J267801K283618P64421k525450n431196o526733m655309M41193
$$ plain form
2629 -7838930 -1943096 5295262 9010220 8499899 6696367 5736696 5556397 6324064 9277475
2620 9277475 14488095 19936692 23620177 25102060 24546595 21794319 17123095 11803937
2612 11803937 7231569 4098670 2466329 1779595 828827 -1290243 -4042017 -6111762
2604 -6111762 -7161628 -7903219 -8280898 -6745221 -2201117 3598405 6403353 3017848 -5002459
2595 -5002459 -11668035 -11713936 -5767906 330257 1432066 -2501877 -7592646 -10101541 -9058830
2586 -9058830 -6434621 -5341067 -6979158 -9190946 -9149888 -6888234 -4204597 -1103205 3232684
2577 3232684 6466177 5068235 1279382 2531015 10990277 18875064 18560022 12900839
2569 12900839 10042533 11577312 12448208 10427861 8489898 8084321 6783627 3657650
$$ packed form
2629g838930N895834P238358L714958n10321j803532r59671j80299P67667K953411
2620I277475N210620N448597L683485J481883n55465k752276m671224n319158
2612A1803937m572368l132899j632341o86734r50768k119070k751774k069745
2604f111762j049866p41591l77679J535677M544104N799522K804948l385505q020307
2595e002459o665576m5901N946030O098163J101809l933943n090769k508895J042711
2586i058830K624209J093554j638091k211788M1058K261654K683637L101392M335889
2577C232684L233493j397942l788853J251633Q459262P884787l15042n659183
2569A2900839k858306J534779Q70896k020347j937963m05577j300694l125977
$$ plain form
2561 3657650 1382475 1558284 2579928 3300129 4429784 5545127 5417007 5946295 10196079
2552 10196079 15253340 13547318 4232658 -3107113 -808628 6215631 8221154 5061091
2544 5061091 5552295 13768527 23012494 24660773 17885874 8501474 1677111 -1702184
2536 -1702184 -3277043 -4164186 -3808239 -1451938 1525861 1970978 -1244799 -4884537 -4700918
2527 -4700918 -795808 2260230 1011956 -2588141 -3238555 1952802 10395635 16685896
2519 16685896 17918245 15739537 13238647 11396365 9827013 9264622 10446575 11215740
2511 11215740 8339224 2845824 22495 2496306 6528308 7566435 6730514 8547681
2503 8547681 13853188 18268979 17364057 10961945 2634772 -3199368 -4156826 -1706898 186289
$$ packed form
2561C657650k275175J75809J021644P20201J129655J115343j28120N29288M249784
2552A0196079N057261j706022r314660p339771K298485P024259K005523l160063
2544E061091M91204Q216232R243967J648279o774899r384400o824363l379295
2536a702184j574859q87143L55947K356301K977799M45117l215777l639738J83619
2527d700918L905110L056038j248274l600097o50414N191357Q442833O290261
2519A6685896J232349k178708k500890j842282j569352n62391J181953P69165
2511A1215740k876516n493400k823329K473811M032002J038127q35921J817167
2503H547681N305507M415791r04922o402112q327173n834140r57458K449928J893187
$$ plain form
2494 186289 -403512 -949581 1881837 7198689 10718616 10278316 8224184 7800253 8792709
2485 8792709 7845793 2765344 -4158225 -7873727 -6188452 -2662805 -2034245 -3498871 -1867617
2476 -1867617 4102911 8781726 7612207 4222433 5290669 10569382 13133103 9119785
2468 9119785 2323564 -1873508 -2825945 -2743207 -1896986 936525 4684413 5922351 3052223
2459 3052223 -1474241 -4157011 -4596096 -5206019 -7000929 -7482765 -3871263 2804551 8579660
2450 8579660 10762102 9363113 5275025 23930 -2835943 254513 8245892 15731998
2442 15731998 18747865 17345524 12073866 2765212 -7164231 -10653827 -5522223 1077059
2434 1077059 1643445 -1615525 -1192123 4059723 8043042 6818564 2558407 -1668668 -5247460
$$ packed form
2494A86289n89801n46069K831418N316852L519927m40300k054132m23931R92456
2485H792709r46916n080449o923569l715502J685275L525647O28560j464626J631254
2476a867617N970528M678815j169519l389774J068236N278713K563721m013318
2468I119785o796221m197072r52437Q2738Q46221K833511L747888J237938k870128
2459C052223m526464k682770m39085o09923j794910m81836L611502O675814N775109
2450H579660K182442j398989m088088n251095k859873L090456P991379P486106
2442A5731998L015867j402341n271658r308654r929443l489596N131604O599282
2434A077059N66386l258970M23402N251846L983319j224478m260157m227075l578792
$$ plain form
2425 -5247460 -7624817 -7581292 -5703616 -3724734 -1599098 924329 1202539 -2774867 -7373510
2416 -7373510 -8109971 -7864605 -12245354 -17448514 -12865337 2235855 15123773 17171417
2408 17171417 15113452 18324668 24175125 25031858 22449296 23533002 27575588 27327584
2400 27327584 21719973 17154160 16328515 14857305 9790290 3570499 -1481600 -5372763
2392 -5372763 -6381758 -2343458 2830381 1797522 -4911994 -8026799 -2904543 4050564
2384 4050564 6333554 6841073 10741985 15896574 17561160 16937131 16915053 13950239 3792646
2375 3792646 -7294675 -7796219 2001665 8370138 2736976 -6912456 -8393278 -1631269
2367 -1631269 4713254 7829197 12765935 20954351 25491131 20661314 10362740 3139679
$$ packed form
2425e247460k377357M3525J877676J978882K125636K523427K78210l977406m598643
2416g373510p36461K45366m380749n203160M583177J5101192J2887918K047644
2408A7171417k057965L211216N850457Q56733k582562J083706M042586k48004
2400B7327584n607611m565813q25645j471210n067015o219791n052099l891163
2392e372763j008995M038300N173839j032859o709516l114805N122256O955107
2384D050564K282990N07519L900912N154589J664586o24029k2078k964814j0157593
2375C792646j1087321n01544R797884O368473n633162r649432j480822O762009
2367a631269O344523L115943M936738Q188416M536780m829817j0298574p223061
$$ plain form
2359 3139679 2182688 3926162 4338953 2682752 -155962 -3332019 -5416731 -4813864 -2024391
2350 -2024391 92019 -698648 -3832275 -7271781 -9727214 -10939966 -11102717 -10929270 -11278820
2341 -11278820 -11882115 -11400219 -9453837 -7475785 -6741394 -6698913 -6074895 -4426264 -1946299
$$ packed form
2359C139679r56991J743474M12791j656201k838714l176057k084712O02867K789473
2350b024391K116410p90667l133627l439506k455433j212752j62751J73447l49550
2341a1278820o03295M81896J946382J978052P34391M2481O24018J648631K479965
$$ [...]
##END NTUPLES=NMR SPECTRUM
##END=
