##TITLE=31Pdec_DE-106_EXT_EtOH_TFA
CDCl3, 64 sc
 20.8.2025
##JCAMPDX= 6.0         $$ Bruker NMR JCAMP-DX V2.0
##DATA TYPE= NMR SPECTRUM
##DATA CLASS= NTUPLES
##ORIGIN= UXNMR, Bruker Analytische Messtechnik GmbH
##OWNER= root
$$ XWIN-NMR		Version 3.5
$$ Wed Aug 20 15:17:50 2025 Russian Standard Time (UT+4h)  she@DPX200
##.OBSERVE FREQUENCY= 81.013821
##.OBSERVE NUCLEUS= ^31P
##.ACQUISITION MODE= SIMULTANEOUS
##.ACQUISITION SCHEME= undefined
##.AVERAGES= 64
##.DIGITISER RES= 17
##SPECTROMETER/DATA SYSTEM= spect
##.PULSE SEQUENCE= zgpg30
##.SOLVENT NAME= CDCl3
##.SHIFT REFERENCE= (INTERNAL, CDCl3, 0, 198.062)
##AUDIT TRAIL= $$ (NUMBER, WHEN, WHO, WHERE, WHAT)
$$ ##TITLE= Audit trail, XWIN-NMR		Version 3.5
$$ ##JCAMPDX= 5.01
$$ ##ORIGIN= Bruker BioSpin GmbH
$$ ##OWNER= she
$$ F:/spectra/data/she/nmr/P31/2/pdata/1/auditp.txt
$$ ##AUDIT TRAIL=  $$ (NUMBER, WHEN, WHO, WHERE, WHAT)
(   1,<2025-08-20 15:16:46.31 +0400>,<she>,<DPX200>,
      <created by zg, POWCHK disabled, PULCHK disabled
       configuration hash MD5:
       00 E9 B6 7A A2 85 ED C7 34 08 36 98 17 FE 4E 26
       data hash MD5: 32K
       71 1D F9 75 ED AF F4 D5 9D A1 E2 72 BC 97 49 4D>)
(   2,<2025-08-20 15:16:48.68 +0400>,<she>,<DPX200>,
      <Start of raw data processing
       efp BC_mod = 2 LB = 1.5 FT_mod = 6 PKNL = 1 PHC0 = 1587.714 PHC1 = -437.5005 SI = 64K 
       data hash MD5: 64K
       11 24 61 3E E0 14 35 32 B6 26 AE F6 B7 A2 1B 51>)
(   3,<2025-08-20 15:17:02.54 +0400>,<she>,<DPX200>,
      <pk PHC0 = 8.131911 PHC1 = 0 
       data hash MD5: 64K
       3D A4 F0 C3 E8 12 62 D4 7B 1F E1 5A AB A6 D2 C4>)
(   4,<2025-08-20 15:17:06.56 +0400>,<she>,<DPX200>,
      <abs ABSG = 5 
       data hash MD5: 64K
       CA 43 EF A6 87 09 BA CA 37 2F 81 2D 72 96 85 6D>)
$$ ##END=
$$ 
$$ hash MD5
$$ 56 CC 12 A3 DF 2C 8A DE D2 4A D6 4E 52 E7 F1 74
##$RELAX= 
##$RELAX= 
##$RELAX= 
##$RELAX= 
##$RELAX= 
##$RELAX= 
##$RELAX= 
##$RELAX= 
$$ Bruker specific parameters
$$ --------------------------
##$DU= <F:/spectra>
##$EXPNO= 2
##$NAME= <P31>
##$PROCNO= 1
##$TYPE= <nmr>
##$USER= <she>
##$AMP= (0..31)
100 100 100 100 100 100 100 100 100 100 100 100 100 100 100 100 100 100 
100 100 100 100 100 100 100 100 100 100 100 100 100 100 
##$AQSEQ= 0
##$AQ_mod= 1
##$AUNM= <au_zg>
##$AUTOPOS= <>
##$BF1= 81.014009
##$BF2= 200.13
##$BF3= 200.13
##$BF4= 200.13
##$BF5= 200.13
##$BF6= 200.13
##$BF7= 200.13
##$BF8= 200.13
##$BYTORDA= 1
##$CFDGTYP= 0
##$CFRGTYP= 5
##$CHEMSTR= <none>
##$CNST= (0..31)
1 1 145 1 1 1 1 1 1 1 1 1 1 1 1 1 1 1 1 1 1 1 1 1 1 1 1 1 1 1 1 1 
##$CPDPRG= <waltz16>
##$CPDPRG1= <>
##$CPDPRG2= <waltz16>
##$CPDPRG3= <>
##$CPDPRG4= <mlev>
##$CPDPRG5= <mlev>
##$CPDPRG6= <mlev>
##$CPDPRG7= <mlev>
##$CPDPRG8= <mlev>
##$CPDPRGB= <>
##$CPDPRGT= <>
##$D= (0..31)
0 1 0 0 0 0 0 0 0 0.06 0 0.03 2e-05 3e-06 0 0 0.0002 0 0 0 0 0 0 0 0 0 
0 0 0 0 0 0 
##$DATE= 1755688605
##$DBL= (0..7)
120 120 120 11 120 120 24 19 
##$DBP= (0..7)
150 150 150 150 150 150 150 150 
##$DBP07= 0
##$DBPNAM0= <>
##$DBPNAM1= <>
$$ [...]
##$SUBNAM3= <"">
##$SUBNAM4= <"">
##$SUBNAM5= <"">
##$SUBNAM6= <"">
##$SUBNAM7= <"">
##$SUBNAM8= <"">
##$SUBNAM9= <"">
##$SW= 400.765351723535
##$SWIBOX= (0..15)
0 1 3 0 0 0 0 0 0 0 0 0 0 0 0 0 
##$SW_h= 32467.5324675325
##$TD= 32768
##$TD0= 1
##$TE= 0
##$TE2= 300
##$TE3= 300
##$TEG= 300
##$TL= (0..7)
0 120 53 12 22 120 120 120 
##$TP= (0..7)
150 150 150 150 150 150 150 150 
##$TP07= 0
##$TPNAME0= <>
##$TPNAME1= <>
##$TPNAME2= <>
##$TPNAME3= <>
##$TPNAME4= <>
##$TPNAME5= <>
##$TPNAME6= <>
##$TPNAME7= <>
##$TPOAL= (0..7)
0.5 0.5 0.5 0.5 0.5 0.5 0.5 0.5 
##$TPOFFS= (0..7)
0 0 0 0 0 0 0 0 
##$TUNHIN= 0
##$TUNHOUT= 0
##$TUNXOUT= 0
##$USERA1= <user>
##$USERA2= <user>
##$USERA3= <user>
##$USERA4= <user>
##$USERA5= <user>
##$V9= 5
##$VALIST= <valist>
##$VCLIST= <CCCCCCCCCCCCCCC>
##$VD= 0
##$VDLIST= <DDDDDDDDDDDDDDD>
##$VPLIST= <PPPPPPPPPPPPPPP>
##$VTLIST= <TTTTTTTTTTTTTTT>
##$WBST= 1024
##$WBSW= 4
##$XGAIN= (0..3)
0 0 0 0 
##$XL= 0
##$YL= 0
##$YMAX_a= 4962
##$YMIN_a= -16173
##$ZGOPTNS= <>
##$ZL1= 120
##$ZL2= 120
##$ZL3= 120
##$ZL4= 120
##$ABSF1= 198.0616
##$ABSF2= -202.7028
##$ABSG= 5
##$ABSL= 3
##$ALPHA= 0
##$AQORDER= 0
##$ASSFAC= 0
##$ASSFACI= 0
##$ASSFACX= 0
##$ASSWID= 0
##$AUNMP= <proc_1d>
##$AZFE= 0.1
##$AZFW= 0.5
##$BCFW= 0
##$BC_mod= 2
##$BYTORDP= 0
##$COROFFS= 0
##$CY= -3
##$DATMOD= 1
##$DC= 0
##$DFILT= <>
##$DTYPP= 0
##$F1P= 0
##$F2P= 0
##$FCOR= 1
##$FTSIZE= 65536
##$FT_mod= 6
##$GAMMA= 0
##$GB= 0
##$INTBC= 1
##$INTSCL= 9.790993e-09
##$ISEN= 30
##$LB= 1.5
##$LEV0= 0
##$LPBIN= 0
##$MAXI= 10000
##$MC2= 0
##$MEAN= 0
##$ME_mod= 0
##$MI= 50
##$NCOEF= 0
##$NC_proc= -8
##$NLEV= 6
##$NOISF1= 182.463
##$NOISF2= 159.3651
##$NSP= 0
##$NTH_PI= 0
##$NZP= 0
##$OFFSET= 198.0616
##$PC= 4
##$PHC0= 1595.846
##$PHC1= -437.5005
##$PH_mod= 1
##$PKNL= yes
##$PPARMOD= 0
##$PSCAL= 0
##$PSIGN= 0
##$REVERSE= no
##$SF= 81.0140089999434
##$SI= 65536
##$SIGF1= 159.3651
##$SIGF2= -187.1042
##$SINO= 113.3802
##$SIOLD= 16384
##$SREGLST= <1H.CDCl3>
##$SSB= 0
##$STSI= 65536
##$STSR= 0
##$SW_p= 32467.5324675325
##$SYMM= 0
##$S_DEV= 0
##$TDeff= 32768
##$TDoff= 0
##$TI= <>
##$TILT= no
##$TM1= 0
##$TM2= 0
##$TOPLEV= 0
##$USERP1= <user>
##$USERP2= <user>
##$USERP3= <user>
##$USERP4= <user>
##$USERP5= <user>
##$WDW= 1
##$XDIM= 65536
##$YMAX_p= 110998937
##$YMIN_p= -208828628
$$ End of Bruker specific parameters
$$ ---------------------------------
##NTUPLES= NMR SPECTRUM
##VAR_NAME=  FREQUENCY,     SPECTRUM/REAL,   SPECTRUM/IMAG
##SYMBOL=    X,             R,               I
##VAR_TYPE=  INDEPENDENT,   DEPENDENT,       DEPENDENT
##VAR_FORM=  AFFN,          ASDF,            ASDF
##VAR_DIM=   65536,         65536,           65536
##UNITS=     HZ,            ARBITRARY UNITS, ARBITRARY UNITS
##FACTOR=    0.49542278885378, 1,            1
##FIRST=     16045.7642231865, 0,            0
##LAST=      -16421.768244346, 0,            0
##MIN=       -16421.768244346, -208828628,   0
##MAX=       16045.7642231865, 110998937,    0
$$ Real data points
##PAGE= N=1
##DATA TABLE= (X++(R..R)), XYDATA
$$ [...]
7498B566989k939655r48162P14737K74341r25910q66961N3584J81423o19115j237339
7488c746068j222491o75198O72250K514939L182831J655973n46132j327631r31625
7479d23152r64291j506921j463665j006681j168105j395941m8024K698162M715545
7470e63073M768867L447011J481731n79940j324798J50451J786030N01882k981210
7461F686951m472265k358686O2367r0208r75691L72585K870986L137448Q55149
7452F088636r92641p59687p5336q37580k437871k765269q88179J794196K785173
7443A911442J052341j551160k183292m53330J266937J238374L41167k0612k7577
7434A574290k50237k66749L743n10919j721882j273966J881884M647728L451675
$$ y = [2566989, -372666, -1320828, -606091, -331750, -1257660, -2124621, -2071037, -1889614, -2508729, -3746068, -4968559, -5643757, -4971507, -2456568, 726263, 2382236, 1836104, 508473, -423152, -1387443, -2894364, -4358029, -5364710, -6532815, -7928756, -7976780, -5278618, -563073, 4205794, 7652805, 9134536, 8554596, 7229798, 7380249, 9166279, 9668161, 6686951, 2214686, -144000, -81633, -171841, -1147532, -774947, 2096039, 5233487, 6088636, 5095995, 4336308, 4260972, 3423392, 985521, -1779748, -2667927, -873731, 1911442, 2963783, 1412623, -770669, -1223999, 42938, 1281312, 1622479, 1601867, 1574290, 1324053, 1057304, 1061047, 550128, -1171754, -2445720, -563836, 4083892, 7535567]
7425G535567n41450l043032k562380j370508j054207p60292j23367l93711j710716
7416d024096k333162j724938j523117k105296j157728K324408N185218L925063
7408a433648k55133k870355j707458J362146L518037L658569K091441k58283j830656
7399B274660j269331Q58062K131242Q86288j730191l000747j750905M11945J141894
7390d7083N3815j284213j734640j749020j802304j128797P34944K247250J529027
7381c181021p38969j994136j258925L3253Q15435J767556L163228L473973J588750
7372C669144j067633k266855j903847j669240k340347k827937j894108J68237
7364a0132586J841655K056984J402059J365551K135406J947085l47616k888285
$$ y = [7535567, 6994117, 3951085, 1388705, 18197, -1036010, -1796302, -1919669, -2313380, -4024096, -6357258, -8082196, -9605313, -11710609, -12868337, -10543929, -5358711, -1433648, -1688781, -4559136, -6266594, -4904448, -1386411, 2272158, 4363599, 4105316, 2274660, 1005329, 1863391, 3994633, 4880921, 3150730, 149983, -1600922, -1188977, -47083, 6732, -1277481, -3012121, -4761141, -6563445, -7692242, -6957298, -4710048, -3181021, -3919990, -5914126, -7173051, -7139798, -6324363, -4556807, -1393579, 2080394, 3669144, 2601511, 334656, -1569191, -3238431, -5578778, -8406715, -10300823, -10132586, -8290931, -6233947, -4831888, -3466337, -1330931, 616154, 268538, -2619747]
7356b619747k830552m16698J265056P70512l6932L59934N43406j010340k744260
7347f719621k059648P32754K766833K341902N73126k98870Q84433L125460L759524
7338E105893J153355k529615l094568K21696L353769K942039N88267o71190j227323
7329E842323k704893l308128j32990M775685N684821J113021l767153m030490
7321C472196p70796J732781J652162L14112o48485p71771m75595o20956j620376
7312B263272k549373k153105o97475N63330J392579K162242J988634j44630k700070
7303A25404l067420j730259j509398k383198j203899K325738L941860J399013
7295b102159j489787o75697J942641K216108O91367J077854L444592L857206N59940
$$ y = [-2619747, -5450299, -5866997, -4601941, -3831429, -3868361, -3508427, -2965021, -3975361, -6719621, -8779269, -8046515, -5279682, -2937780, -2364654, -2663524, -1779091, 1346369, 5105893, 6259248, 3729633, 635065, 856761, 4210530, 7152569, 7740836, 7069646, 5842323, 3137430, -170698, -303688, 4471997, 10156818, 11269839, 7502686, 3472196, 2701400, 4434181, 6086343, 6400455, 5751970, 4980199, 4504604, 3883648, 2263272, -286101, -2439206, -3136681, -2573351, -1180772, 981470, 2970104, 2825474, 125404, -2942016, -4672275, -6181673, -8564871, -9768770, -7443032, -3501172, -2102159, -3591946, -4267643, -2325002, -108894, 582473, 1660327, 5104919, 8962125, 9522065]
7286I522065l596549n348940m472313k549403q72057p2091P1310O02305J765379
7277d950294K118382Q97595r5555O51970J131650j284582m752955m722106o77060
7268a1682955K870678K804329J069663O65810J389984J469394P44917J26487k49586
7259g91279n48129l94651J38159J03183o86997j050553l67652M45657P18381J030355
7249a403526J558857J345612K93089j14125N86189N43748j384945l208106k519097
7240d302304k37044O80701n59621j870410j444323K69953J825716K517251K454428
7231f65653J770666L27417j723202l211217k610465k44683J166320j03543j726689
7222g021049l16013K939047L260973m21869l262046j627927J423703J148204j498706
$$ y = [9522065, 5925516, 576576, -3895737, -6445140, -7317197, -7389288, -7317978, -6715673, -4950294, -2831912, -1934317, -2029872, -1377902, -246252, -1530834, -6283789, -11005895, -11682955, -8812277, -6007948, -4938285, -4272475, -2882491, -1413097, -668180, -541693, -791279, -1339408, -1734059, -1595900, -1492717, -2179714, -3230267, -3597919, -3152262, -2433881, -1403526, 155331, 1500943, 1794032, 1679907, 2266096, 2809844, 1424899, -1783207, -4302304, -4539348, -3858647, -4418268, -6288678, -7733001, -7463048, -5637332, -3120081, -665653, 1105013, 1432430, -290772, -3501989, -6112454, -6357137, -5190817, -5294360, -7021049, -7337062, -4398015, -1137042, -1558911, -4820957, -6448884, -5025181, -3876977, -5375683]
7213e375683j775581J313388L934878L444162J458558M82248O85607Q67624L21981
7204E357182q64071j762181r96376J213793K263584O02819j205013O7720K743027
7195G420484K105511k193611n014438l170346J82327P36744r75912j688806p59888
7186c357935p8807k25504L6443J015311J425360M11363j471223l102887l412902
7177h760781j739901J175815L214608L093978J879608J240994J221249J042283
7169B367853R57762J506962J787055N17442j582885k468056j691399p77107o30210
7160a2583n03314Q8795L31207j71613k52883R90252K339051J902397m6168j132408
7150C532733K2637J891809J933587j93609k291848k506764j474843r14388j008053
$$ y = [-5375683, -7151264, -5837876, -1902998, 1541164, 2999722, 3481970, 4167577, 5035201, 5357182, 4493111, 2730930, 1734554, 2948347, 5211931, 5814750, 4609737, 4677457, 7420484, 9525995, 7332384, 2317946, -852400, -670073, 66671, -909241, -2598047, -3357935, -3436742, -3662246, -3625803, -2610492, -1185132, -773769, -2244992, -5347879, -8760781, -10500682, -9324867, -6110259, -3016281, -1136673, 104321, 1325570, 2367853, 3325615, 4832577, 6619632, 7137074, 5554189, 3086133, 1394734, 617627, -12583, -515897, -427102, -95895, -267508, -520391, 469861, 2808912, 4711309, 4665141, 3532733, 3555370, 5447179, 7380766, 7187157, 4895309, 2388545, 913702, -686, -1008739]
7141a008739o04824L14340K45102j200756j993544l37280K543368L855207K803934
7132D616808J063886K0611o32396j277339j083899O25776K677857K914418O67165
7123I592887k320608l612368k486474m86304M23038K3320k13339P15857J981790
7114C617799K116163Q57970q97713k398801l318063l156602j623969L34231J066210
7105c402775J72860r38281q64724K20041J240100J612166J306687K90762j134478
7096a497642j936449j401360l90297l50040r71057k04441K713651N519272N467028
7087F948665K768663j12845k039500l879186n484897m717420r97551K442577K364000
7078b707494J61869k17235J766144K772720J230877k22842O43538J921367R07823
$$ y = [-1008739, -1613563, -1299223, -1054121, -2254877, -4248421, -4585701, -2042333, 1812874, 4616808, 5680694, 5701305, 5068909, 3791570, 2707671, 3333447, 6011304, 8925722, 9592887, 7272279, 3659911, 1173437, 687133, 1110171, 1133491, 920152, 1636009, 3617799, 5733962, 6591932, 5694219, 3295418, -22645, -3179247, -4803216, -4468985, -3402775, -3229915, -4168196, -5032920, -4812879, -3572779, -1960613, -653926, -363164, -1497642, -3434091, -4835451, -5225748, -5575788, -6546845, -6751286, -4037635, 1481637, 6948665, 9717328, 9604483, 7564983, 3685797, -1799100, -6516520, -7514071, -5071494, -2707494, -2545625, -2762860, -996716, 1776004, 3006881, 2784039, 3427577, 5348944, 6256767]
7069F256767j288298j547459L46767J754750J451950Q16493Q06083N80352l10555
7060H866850p39979Q6942J326041J936457J946560J554060L75207j570068l246653
7051A0535417l728596l112176j987109r77675q59082j739046k045851j65465K565085
7042a514498K778858k3700j955830K613L385402L577950L81172j980211j052964
7033C598792R21561J012314l43842r81757p07752j083198k287117k391263j56488
7024b418750K860567L935490K446788O13474O83455J982463J684091j349858m608950
7015E828770m859834k410829q12912k019300l542873j810492K612734N169704
7007a845032K967721j485779l454158j767199M13379L56858r42790j138470j96752
$$ y = [6256767, 4968469, 3421010, 3767777, 5522527, 6974477, 7790970, 8597053, 9177405, 8866850, 8126871, 8213813, 9539854, 11476311, 13422871, 14976931, 15352138, 13782070, 10535417, 6806821, 3694645, 1707536, 729861, -129221, -1868267, -3914118, -4079583, -1514498, 1264360, 1240660, -715170, -712557, 2672845, 6250795, 6631967, 4651756, 3598792, 4520353, 5532667, 5188825, 4207068, 3499316, 2416118, 129001, -2262262, -2418750, 441817, 4377307, 6824095, 7437569, 8121024, 10103487, 11787578, 10437720, 5828770, 968936, -1441893, -2254805, -4274105, -7816978, -9627470, -7014736, -1845032, 1122689, -363090, -3817248, -5584447, -5171068, -4814210, -5757000, -6895470, -7092222]
6998g092222K78081J77494P84011J820321J382082n38994j145719J048430L448813
6989A62297K833037j06593k058884j673096k29125J318188K914219L366639J095467
6980G622149k490465l495593o94980K444628K455578K44852j050317n37750K46119
6971D744221J31782p70641j835582j926585M4252K965730L670952J193045j137482
6962G079692m34574J063179l62846l373569l340019M1348K070040N73681j009481
6953B307451J70903J862995J184960m21424j97067J081415R93608o0926K0146
6944F942061J106906J448234R02208M12570m29211k185899l288579k179511l73148
6935B355631K6599L09011K631606M941076L291394j413877m207302l604615k893017
$$ y = [-7092222, -6814141, -6636647, -5852636, -4032315, -2650233, -3189227, -4334946, -3286516, 162297, 2995334, 2888741, 829857, -843239, -1072364, 245824, 3160043, 6526682, 7622149, 5131684, 1636091, 941111, 3385739, 5841317, 6086169, 5035852, 4498102, 4744221, 4876003, 4105362, 2269780, 343195, 387447, 3353177, 7024129, 8217174, 7079692, 6645118, 7708297, 7345451, 3971882, 631863, 673211, 2743251, 3316932, 2307451, 2478354, 4341349, 5526309, 5104885, 4907818, 5989233, 6982841, 6921915, 6942061, 8048967, 9497201, 10399409, 10811979, 10382768, 8196869, 4908290, 2728779, 2355631, 2382230, 2691241, 5322847, 10263923, 13555317, 12141440, 7934138, 4329523, 1436506]
6926A436506l241426j554629K820656N160016K495225j309213j602176J86871
6918D391830J38006j393489j579324q45445j522663k705492j720893M91002O58544
6909d087924q09299l06759K447808L573789J600990j7913J269572L029490K021815
6900H721569q22079k288763j461001M6766Q41689O76325k59545j355697j682008
6891B417256j070995l02610J72731M58450O7486j543088k973789j831454J403385
6882c202628K984405R49499j769035j460849J027360J799299l23230k475813k151999
6873d622991l11253P73121Q69693J471523K938919L648784K418300N83348L42031
6864H111475J399867J094948j549540l869893l224197r08977o4659q77461p95791
$$ y = [1436506, -1804920, -3359549, -538893, 4621123, 7116348, 5807135, 4204959, 4391830, 4529836, 3136347, 1557023, 711578, -811085, -3516577, -5237470, -4746468, -4087924, -4897223, -5203982, -2756174, 817615, 2418605, 2400692, 3670264, 6699754, 8721569, 7899490, 5610727, 4149726, 4196492, 5038181, 5714506, 5454961, 4099264, 2417256, 1346261, 1043651, 1216382, 1674832, 1742318, 199230, -2774559, -4606013, -3202628, -218223, 731276, -1037759, -2498608, -1471248, 328051, 4821, -2470992, -4622991, -4934244, -4161123, -3291430, -1819907, 1119012, 4767796, 7186096, 7769444, 8111475, 9511342, 10606290, 9056750, 5186857, 1962660, 1053683, 989024, 111563, -684228]
6855f84228J037471K779726L295710L187003K017080j677444o326843p212219
6847c583744k819279K057154K600769M67945L01257K096771J705035j924942m780504
6838c879538l785971q39811P40285P95897J207327K196164K189779O46792j021806
6829a750882j490328j088669p64371l76170Q99601K619280K925339J210983k49254
6820A935529R33583L473952L706934Q18279j819665j515810J17687J97822j062719
6811F785592j569237j282050j876119l184082l116481j357942l53357j617853
6803g571529l201328k314051Q00268L215454L120977J818825J506136K122547
6795e02701J748992L7056o84677R71945K460998N28492l436524m641632j673107
$$ y = [-684228, 353243, 3132969, 6428679, 9615682, 11632762, 9955318, 3628475, -3583744, -6403023, -4345869, -1745100, -1277155, -975898, 1120873, 2825908, 900966, -3879538, -7665509, -8505320, -7765035, -6969138, -5761811, -3565647, -1375868, -729076, -1750882, -3241210, -4329879, -5094250, -5470420, -4570819, -1951539, 973800, 2184783, 1935529, 2869112, 6343064, 10049998, 10868277, 9048612, 7532802, 7650489, 7848311, 6785592, 5216355, 3934305, 2058186, -1125896, -4242377, -5600319, -5953676, -7571529, -10772857, -13086908, -12286640, -9071186, -5950209, -4131384, -2625248, -502701, 1246291, 1283347, 598670, 1570615, 4031613, 4560105, 1123581, -3518051, -5191158]
6786e191158J568306J805422N71022M57400P58517j32674r38772K49778K087625
6777A235466K056397P52225L84062N40564m83068j368032O46912M294140N001614
6768A3060280J474969k636516m327040m421917m131307k455748J063665M177160
6760A803546M602284K704962J36588k083565l079266j985879N12651K356124K496356
6751G463801J361023q79538l893527n346084l029473R40036K028790L4280n18497
6742a839189K053885L671137J563957p67633N19213K977138J937084j818511l557357
6733D739724j994460l11218n65193j396455j219232k14140R53807J708498J082437
6724B783768j018058k688979k368128j229796q73812j72793K440545M933718L842837
$$ y = [-5191158, -3622852, -1817430, -1246408, -789008, -30491, -163165, -1101937, -852159, 1235466, 3291863, 4044088, 4428150, 4968714, 4485646, 3117614, 3764526, 8058666, 13060280, 14535249, 11898733, 7571693, 3149776, -981531, -3437279, -2373614, 1803546, 6405830, 9110792, 9247380, 7163815, 4084549, 2098670, 2611321, 4967445, 7463801, 8824824, 7945286, 4051759, -1294325, -4323798, -3383762, -1354972, -1320692, -1839189, 214696, 3885833, 5449790, 4682157, 5201370, 8178508, 10115592, 8297081, 4739724, 2745264, 2434046, 1868853, 472398, -746834, -960974, -7167, 1701331, 2783768, 1765710, -923269, -3291397, -4521193, -5395005, -5567798, -3127253, 1806465, 5649302]
6715E649302l7134k116840m40370J981886J979794O4242j639222k421268k493688
6706E26702j673372j17109J012738P61645n49768j844155k045588n33594J991095
6697b471406L477470K695831Q99782r4593n52707j631070k573152j681591M37329
6688a494107J338473L63293p32154p51352j88144N56254J511005J707171J30120
6679B440559j803105j577712L40211P48060j436498l561511l263040j201957J079701
6670h235292L088364M140333L204302J289235J100723K906026L646217J696611
6662A2836519n84522r86849r59379k425803l936542l153410j058153l91876j304850
6653a964865j665961q17416k00340o37909j223913p17192J332828M113655N221400
$$ y = [5649302, 5612168, 3495328, 3054958, 5036844, 7016638, 7080880, 5441658, 3020390, 526702, -1146670, -1263779, -251041, 510604, -39164, -1883319, -3928907, -4462501, -2471406, 1006064, 3701895, 4601677, 4507084, 3954377, 2323307, -249845, -1931436, -1494107, -155634, 207659, -524495, -1275847, -1463991, -907737, 603268, 2310439, 2440559, 637454, -940258, -600047, 148013, -1288485, -4849996, -8113036, -9314993, -8235292, -5146928, -1006595, 2197707, 3486942, 4587665, 7493691, 11139908, 12836519, 12251997, 11265148, 10305769, 7879966, 3943424, 790014, -268139, -660015, -1964865, -3630826, -4448242, -4648582, -5286491, -6510404, -7227596, -5894768, -1781113, 3440287]
6644C440287K443302k701790n221548k488998K083941L508275J370422j185155
6636A248736k552732l193070k584676J60799L046941K584162j122035m050398
6628f462273l666496j642148m92143m12429m83831m37465K2126J561361L709105
6619h304193M686512L649077J635241k21740j787564k837709k694306j506237
6611g380919k95158N54508J219903J058462m12962j335274O52502L992563M130747
6602B184372J09009l314067k244733R34127J647187j38243r29933L15234J229278
6593b07769M92842l50751J03607J075309J189808J71797j412601k545303j960075
6584c443136L91836K315930J624891q64861k554162k852961l207341l451991j375865
$$ y = [3440287, 5883589, 3181799, -2039749, -4528747, -2444806, 1063469, 2433891, 1248736, -1303996, -4497066, -7081742, -6920943, -3874002, -1289840, -2411875, -6462273, -10128769, -11770917, -12263060, -12675489, -13159320, -13596785, -13574659, -12013298, -8304193, -3617681, 31396, 1666637, 1444897, -342667, -3180376, -5874682, -7380919, -7676077, -7121569, -5901666, -4843204, -5256166, -6591440, -5938938, -1946375, 2184372, 2293381, -1020686, -3265419, -2331292, -684105, -822348, -1752281, -1437047, -207769, 285073, -65678, 37929, 1113238, 2303046, 2474843, 1062242, -1483061, -3443136, -3051300, -735370, 889521, 24660, -2529502, -5382463, -8589804, -12041795, -13417660]
6575a3417660L020188N859708M094943j48401k226538p25212J606378J896911
6567c9683J02490j790656j865144L05659L065773L796787J852260j13064P32282
6558F046704L356121L919939J007394k345977k762596q29646K70051p31615j964814
6549E965561j460617L08135J445533J123532K48165k0632K29978j15357j541637
6540F182661k822435k246316r3687J023365p56715l680930m083808j115443J839543
6531e753765J460905j082274j734262R58157M053079M335956K250309L70444n62695
6522D295854j943829m095944n048792l194670M12319L314416M091445K821035
6514F51834M06452j507197j279093N62152J081157j211880l332199j318914L660020
$$ y = [-13417660, -10397472, -4537764, -442821, -591222, -2817760, -3542972, -1936594, -39683, 62807, -1727849, -3592993, -3287334, -221561, 3575226, 5427486, 5314422, 6046704, 9402825, 13322764, 14330158, 11984181, 9221585, 8391939, 8661990, 7930375, 5965561, 4504944, 4813079, 6258612, 7382144, 7630309, 7609677, 7839655, 7724298, 6182661, 3360226, 1113910, 1020223, 2043588, 1286873, -2394057, -6477865, -7593308, -5753765, -4292860, -5375134, -7109396, -6151239, -2098160, 2237796, 4488105, 4858549, 4295854, 2352025, -1743919, -6792711, -9987381, -9575062, -6260646, -2169201, 651834, 1058286, -448911, -1728004, -1165852, -84695, -1296575, -4628774, -5947688, -2287668]
6505b287668N975379K995419j416899k595709j226722r64226k171773j875275
6497c567474P99687K980396K419747M66565m65368k6738P91474J615820K443556
6488G457665K762095K209003J130439l79224k730605n167171n339871k125471
6480b183140K115344L735745J755846j648468l974633m307823k939295p35979
6472h182403J055617J664494J666811K132102K948543K932319J576331k45681
6464E548133j366298j283027p4973J663603K673670J801623o38127k906504l605614
6455A812486k889579j657520k22068J527977K938248K573608P3744k388014j767388
6446A494K029464M984225L147430k285400n872905m330357k74598J439586m26437
$$ y = [-2287668, 3687711, 6683130, 5266231, 2670522, 1443800, 479574, -1692199, -3567474, -2767787, 212609, 2632356, 3098921, 2633553, 2606815, 3398289, 5014109, 7457665, 10219760, 12428763, 13559202, 13179978, 10449373, 5282202, -57669, -2183140, -67796, 3667949, 5423795, 3775327, -199306, -4507129, -7446424, -8182403, -7126786, -5462292, -3795481, -1663379, 1285164, 4217483, 5793814, 5548133, 4181835, 2898808, 2823835, 4487438, 7161108, 8962731, 8324604, 5418100, 1812486, -1077093, -2734613, -2956681, -1428704, 1509544, 4083152, 4156896, 1768882, 1494, 2030958, 7015183, 10162613, 7877213, 2004308, -2326049, -2600647, -1161061, -1587498]
6437a587498k862599k822928l01490K478732L486041K424453P52831J47980N87812
6428B303334N62129m80914j142680l65284P07286N12860n54727j121158r51563
6419e30717l75705J018927K984746L338777Q19224j972409j710632M41967N01990
6410D516168j873047k928266j230579J57798n80307q12750J302740K622337q7378
6401A086716m232927m771868j467322J628004K608304L077055L565320K317649
6393C810931m97795j510112R62230L678488K521621j868547m702846k742414K081623
6384A733179M812635K670926k018555m300460k095186J576684K491514K02415
6376E073152k184516k170277L5332K827144M435442L216324q42218m715497m791406
$$ y = [-1587498, -4450097, -7273025, -7574515, -5095783, -1609742, 814711, 1567542, 1715522, 2303334, 2865463, 2384549, 1241869, 876585, 1583871, 2096731, 1542004, 420846, -530717, -906422, 112505, 3097251, 6436028, 7255252, 5282843, 3572211, 4014178, 4516168, 2643121, -285145, -1515724, -1357926, -1938233, -2750983, -1448243, 1174094, 1086716, -3146211, -7918079, -9385401, -7757397, -5149093, -2072038, 1493282, 3810931, 3313136, 1803024, 2765254, 6443742, 8965363, 7096816, 2393970, -348444, 1733179, 6545814, 9216740, 7198185, 2897725, 802539, 2379223, 4870737, 5073152, 2888636, 718359, 753691, 3580835, 8016277, 11232601, 10390383, 5674886, 883480]
6367H83480j293577J831339J995001O36187n2287m56688j758207k905461j953635
6358c073848N50149K029111J576419J023348J843372K765599J641066j236432
6350G118784l165526k559810j174905j655153l472471l320193j35585K560955
6342e803904J388857j570017j389220K368899M784122K849580k38586l07562J499916
6333C582085J125512j681582l112407j358223Q87209P86113q63703j696488j298585
6324c630069p51545k13210Q93154J945408J416117p63959k658945k650435j258216
6315g671700n0163M12717P13035J210018J562204J523471J312251J083444Q16174
6306I11451P71563J083193Q05272j212964l983276m619007k116017P82172J281100
$$ y = [883480, -410097, 1421242, 3416243, 4052430, 4000143, 3543455, 1785248, -1120213, -3073848, -2523699, -494588, 1081831, 2105179, 3948551, 6714150, 8355216, 7118784, 3953258, 1393448, 218543, -1436610, -4909081, -8229274, -8364859, -5803904, -4415047, -5985064, -7374284, -5005385, -221263, 2628317, 2389731, 2082169, 3582085, 4707597, 3026015, -86392, -1444615, -557406, 228707, -634996, -2331484, -3630069, -4381614, -4594824, -3701670, -1756262, -340145, -1104104, -3763049, -6413484, -7671700, -7721863, -7309146, -6596111, -5386093, -3823889, -2300418, -988167, 95277, 911451, 1683014, 2766207, 3571479, 2358515, -1624761, -6243768, -8359785, -7577613, -6296513]
6297f296513M66360R89490K201807J190053j706378k573858q3802K033484P40370
6288c038987j606639j233645J211049K357647J670551J378318J882628J222076
6280C842998q81502j976904o23222J489249J932610P3776l031999n251970l989382
6271h416346J240422O616285P151379K702380j729610k374584n39005Q67348J359851
6262F878120J466177K30214l003669o165350o583690m341885j285223J835112
6254a0970194M692026N399098K562263j329329k043502O58750K588238J060110
6246B617460j793029k825487k102531j393591q31837L29343J170865K69589j148971
6237e708189j69181L260547N329754L242363q01407k340714k76510K281806K413749
$$ y = [-6296513, -5830153, -4840663, -2638856, -1448803, -3155181, -5729039, -5812841, -3779357, -3038987, -4645626, -5879271, -4668222, -2310575, -640024, 738294, 2620922, 3842998, 2961496, 984592, 361370, 1850619, 3783229, 3857005, 825006, -4426964, -8416346, -7175924, -559639, 6591740, 9294120, 7564510, 5189926, 4650921, 5518269, 6878120, 8344297, 8574511, 5570842, -594508, -7178198, -11520083, -12805306, -10970194, -6278168, -879070, 1683193, 353864, -1689638, -1030888, 1557350, 2617460, 824431, -2001056, -4103587, -5497178, -6329015, -5999672, -4828807, -4559218, -5708189, -5877370, -2616823, 2712931, 5955294, 5153887, 2813173, 2536663, 4818469, 7232218]
6228G232218N30954j245430j930707j837660j305556o81379p21713j629388k247827
6219c836488j501100j09015M74456K52060K11784K13356o26236j674729j269664
6210g865576L24333R56732K14253K93131K059219L067491J510339m53837n9273
6201D6812J481554J102389q22332j147439N41110J111523p67189k192131o62371
6192a308074J798382J600835j156706l025450k109216k87427j93905j552900j615202
6183g849663J044943M199599M354698J225957j737941k031435j444963k803116
6175e041921m858898l622839J405341N745586N746966K998533J190601R76221
6167D539590L90140j120485j833384o92423R65378J114722n07118k023076j341688
$$ y = [7232218, 7763172, 6517742, 4587035, 2749375, 1443819, 762440, 40727, -1588661, -3836488, -5337588, -5446603, -4972147, -4720087, -4508303, -4294947, -4921183, -6595912, -7865576, -7541243, -6584511, -6370258, -6077127, -4017908, -950417, 559922, 106085, 46812, 1528366, 2630755, 1808423, 660984, 1202094, 2313617, 1546428, -645703, -1308074, 490308, 2091143, 934437, -2091013, -4200229, -4487656, -4681561, -6234461, -7849663, -6804720, -2605121, 1749577, 2975534, 1237593, -793842, -2238805, -5041921, -9900819, -13523658, -12118317, -6372731, -625765, 2372768, 3563369, 4539590, 4929730, 3809245, 1975861, 1283438, 2248816, 3363538, 2856420, 833344, -508344]
6158e08344J319495L084513J577438j755446l136548j449988M36376J41815r41371
6149a232060n57376N34215J90393j184537j303787J78888J359533J314191R51757
6140B51217N89739p19336k940023m371326l907427k194128q9544K169937L839227
6131g371664L760014K341576J520526J883744J785203L89025n06461O47737K206595
6122F656295J431918j493097l688530l354066j441969K66780J033380R59894L79205
6113G49810j15656l329M63157N77663L12573L77705R98373J379555P27933o65423
6103D802361j680225j511211m65566L01957K115p92890q37363p5016L5226j263848
6093a484460k404420j422420R94543K109981R12618m73337J25187J989676K880644
$$ y = [-508344, 811151, 3895664, 5473102, 3717656, 581108, -868880, -432504, -290689, -1232060, -1789436, -1255221, -1064828, -2249365, -3553152, -3374264, -2014731, -700540, 251217, 840956, 121620, -2818403, -7189729, -11097156, -13291284, -13380828, -11210891, -7371664, -3611650, -1270074, 250452, 2134196, 3919399, 4308424, 3801963, 4449700, 6656295, 8088213, 6595116, 2906586, -447480, -1889449, -1622669, -589289, 370605, 749810, 634154, 630825, 1093982, 1671645, 1984218, 2361923, 3360296, 4739851, 5467784, 4802361, 3122136, 1610925, 1145359, 1447316, 1449431, 656541, -180822, -255838, -220612, -1484460, -3888880, -5311300, -4316757, -2206776, -1294158, -1767495, -1642308, 347368, 3228012]
6084C228012K193442J188721O72619M3046j395107l371525m925302m867095k405604
6075i638793J444250L653843K273711m74806n15334K454906M414265K941696M35051
6066F988789n26656j555498m651031o877673l934145K162224M578990J289618
6058b525382k236972j564204P47485N82716j015845o93432J165962J900015J746280
6049a893377K855603M566978M207758J856357J18280l76817j244596k461835k274623
6040E353728r23678m90357j029967q91652p28758k510603m414846k236313L011850
6031d860596M862601J062756k488235r92360J817791N06190k741730k001144K440090
6022b394637M807723K887905r0693j919756l533708m551517k781010O90971J472636
$$ y = [3228012, 5421454, 6610175, 7282794, 7325840, 5930733, 2559208, -2366094, -7233189, -9638793, -8194543, -4540700, -2266989, -2741795, -3257129, -802223, 3612042, 6553738, 6988789, 6462133, 4906635, 255604, -6622069, -10556214, -8393990, -3815000, -2525382, -4762354, -6326558, -5579073, -4996357, -6012202, -6705634, -5539672, -3639657, -1893377, 962226, 5529204, 9736962, 11593319, 11711599, 11334782, 10090186, 7628351, 5353728, 4430050, 3939693, 2909726, 2018074, 1289316, -1221287, -5636133, -7872446, -4860596, 2005, 1064761, -1423474, -2415834, -598043, -91853, -2833583, -4834727, -2394637, 2413086, 5300991, 5210298, 3290542, -243166, -4794683, -7575693, -6884722, -5412086]
6013e412086j230853k719181j92677K612021J420494j823347k194238Q37777L451767
6004e250323L533364K700533K450515J722307p15093l658449m682439l092213
5996f991798n84532R47344J508190K301746L271565K736294K16749j857660j036315
5987E11583J485407K277391L26544k036029k693057j729360K07740K733691M351127
5978E435037L134715j02584j969785j116183j06715j227102l132597l569468k745061
5969e399743j613669N91175M055728N767249K905044k255283m421950j938391
5961b309840J734541L038825J902003J94036o38832N5387J811137K654355J049461
5952I491073j559565k213048n34584R02814M80862p54766j803389l316676n229538
$$ y = [-5412086, -6642939, -9362120, -9554797, -6942776, -5522282, -7345629, -9539867, -8702090, -5250323, -1716959, 983574, 3434089, 5156396, 4441303, 782854, -3899585, -6991798, -7576330, -6628986, -5120796, -2819050, 452515, 3188809, 3405558, 1547898, 511583, 1996990, 4274381, 4600925, 2564896, -128161, -1857521, -1649781, 1083910, 5435037, 8569752, 8467168, 6497383, 5381200, 5274485, 4047383, 914786, -2654682, -5399743, -7013412, -6422237, -2366509, 3400740, 6305784, 4050501, -371449, -2309840, -575299, 2463526, 4365529, 4559565, 3920733, 3976120, 5787257, 8441612, 9491073, 7931508, 5718460, 5183876, 6086690, 6567552, 5812786, 4009397, 692721, -4536817]
5943d536817n318733k127599K283203M476216L615080J733877P15141M67231n2394
5934A255205j023265j312954P7924K097151K160428l47331k292654o59309K734298
5925B689493L503605J346882L05376J551729Q38355l998305p606678m181306L004266
5916b546583N201314L65051m464974l717054k56255P12733m02933J22321K420065
5907b566315L193196J431824l21524l18364K03669l74049j893449l378882l973714
5898g997608k618785R16309M273135M300290J435258l45708P27325J406536j293118
5889H03634m664290l847061O72487L477394K116037J31253Q37744K277603J241908
5880C046709r37928n81046K156883L510229J985560L591o34520j054197k008381
$$ y = [-4536817, -9855550, -11983149, -9699946, -5223730, -1608650, 125227, 840368, 1307599, 1255205, 231940, -1081014, -1003090, 1094061, 3254489, 2907158, 614504, -44805, 2689493, 6193098, 7539980, 7845356, 9397085, 10235440, 6237135, -1369543, -5550849, -2546583, 2654731, 3019782, -1445192, -5162246, -5418501, -4705768, -5108701, -4986380, -2566315, 626881, 2058705, 1737181, 1418817, 1622486, 1248437, -645012, -4023894, -7997608, -10616393, -9700084, -5426949, -1126659, 308599, -37109, 690216, 2096752, 803634, -3860656, -7707717, -7035230, -3557836, -1441799, -1310546, -472802, 1804801, 3046709, 2108781, 1527735, 3684618, 7194847, 9180407, 9183998, 8549478, 7495281, 5486900]
5871E486900j959040l89069K09740j694737l376193j734612J493508K068180l66416
5862b61739k101426j249699Q7328N5457k60334L24198Q21051M42041M47820J523692
5852a71611J802686q435j697575o91820J512094J405328r98868k281357j154411
5843b283969k40998j383629k373789k87415L980904O626573N415306J706617j442787
5834I716813k115335q83141k9146j075234k901792l070241j053603J084406J523242
5825A195969P17975m7781n85660j177252j347387o59075J53916J51979m07838
5816b005154p93771j204574k202781l275149l147151j260381J752951M431376
5808g704634M831825J904534k371982l782967o13110L592186M049010N67817k855315
$$ y = [5486900, 3527860, 3138791, 3348531, 1653794, -1722399, -3457011, -1963503, 104677, -261739, -2363165, -3612864, -3525536, -3470079, -3730413, -3406215, -2585164, -2143123, -1695303, -171611, 1631075, 1622640, -74935, -766755, 745339, 2150667, 1151799, -1129558, -2283969, -2524967, -3908596, -6282385, -6569800, -2588896, 4037677, 9452983, 11159600, 9716813, 7601478, 6718337, 6689191, 5613957, 2712165, -358076, -1411679, -327273, 1195969, 1913944, 1866163, 1280503, 103251, -1244136, -1903211, -1749295, -1597316, -2005154, -2798925, -4003499, -6206280, -9481429, -12628580, -13888961, -12136010, -7704634, -2872809, -968275, -3340257, -7123224, -7736334, -4144148, -95138, 472679, -2382636]
5799b382636l430645j950452k36852R34491J241921P90771R73551K859787M592063
5790C391999L287349j44625j533331K44629J281702j132641m071634l762707j594330
5781d033589j405634l019693k912010k63415K030624K305717K082606K479467
5773b735927K216361L86129j598519k133819j331740J52233K041014L275554K197546
5764B468832q77671l255693l264759k165760j435268k67792K369361M898724M593864
5755C063838J112991l060052n088712l650461N03714M542436N309251K586616
5747E319621m37898j232299q85979j326341j579265K72702K746156K293871j093683
5738D076885l206731j376441K142154L774785K861946P17286j955190m480721
$$ y = [-2382636, -5813281, -7763733, -8000585, -7066094, -5824173, -5033402, -4059851, -1200064, 3391999, 6679348, 6534723, 5001392, 5246021, 6527723, 5395082, 1323448, -2439259, -4033589, -5439223, -8458916, -11370926, -11634341, -9603717, -7298000, -5215394, -2735927, -519566, -133437, -1731956, -3865775, -5197515, -5045282, -3004268, 271286, 2468832, 1591161, -1664532, -4929291, -7095051, -8530319, -8798111, -6428750, -1530026, 3063838, 4176829, 1116777, -3971935, -7622396, -7118682, -2576246, 2733005, 5319621, 4881723, 3649424, 2763445, 1437104, -142161, 130541, 2876697, 5170568, 4076885, 870154, -506287, 1635867, 5410652, 8272598, 8989884, 7034694, 2553973]
5730B553973n027606k640637N62629J578749L57527n28993L96476K045461K749999
5721B047578J923379j12015k229569k555111k47891K733645L536416K231995J561427
5712H889854K346562J738119k320041o968207p312524k613925K754382M489870
5704A004090K575995P774j006023p12940o48580j644079k769019k164027O17774
5695d739035L332687L154703K18408k168386j522857P03541J203131o93228k265242
5686b776278j331762P12403J002391n62515j043695J283839M134702M060156J098292
5677F577533j414276j572966j165093k233314l488966k253495J229752M003659
5669c17166M636443M583609M791360L650291J470l841012m502354k131798k45800
$$ y = [2553973, -2473633, -5114270, -4551641, -2972892, -2615365, -3144358, -2747882, -702421, 2047578, 3970957, 3858942, 1629373, -925738, -1173629, 1560016, 5096432, 7328427, 8889854, 11236416, 12974535, 10654494, 3686287, -3626237, -6240162, -3485780, 1004090, 3580085, 3587859, 2581836, 1868896, 1220316, -423763, -3192782, -5356809, -4739035, -1406348, 1748355, 1966763, -201623, -1724480, -1020939, 182192, -511036, -2776278, -4108040, -3395637, -2393246, -2955761, -3999456, -2715617, 1419085, 5479241, 6577533, 5163257, 3590291, 2425198, 191884, -3297082, -5550577, -4320825, -317166, 4319277, 8902886, 13694246, 17344537, 17346007, 13504995, 9002641, 6870843, 6625043]
5660F625043j063196l012683l310301j333658J355841L038141K860262Q09781
5652E969230k053171l742073k973759p66408N32222P7986n05782M23216J967929
5643a070610J819153k72864j709227m45662K079017K823638J244274l19915l27205
5634C820599j9081q54234j845814j230225L57557N81032r90010k129343j278810
5625c588329K48728M27249n25258p71716L24764J486740J472144N21074l26191
5616g30795m65350o626N15543M55635l15935q28273K59634K786349M485853L136476
5606I292511p09501l876368l752530r61494J414896J079924j200299k483373q03074
5597a999308K485676L777744J060387l525829n705817l699615M6726K073426J784521
$$ y = [6625043, 5561847, 2549164, -761137, -2094795, -738954, 2299187, 5159449, 5969230, 3916059, 173986, -2799773, -3566181, -3033959, -2955973, -3461755, -3038539, -1070610, 748543, 475679, -1233548, -1679210, 399807, 3223445, 4467719, 4147804, 3820599, 3801518, 2947284, 1101470, -128755, 228802, 809834, -180176, -2309519, -3588329, -3339601, -2912352, -3437610, -4209326, -3884562, -2397822, -925678, -404604, -730795, -1196145, -1202771, -687228, -231593, -547528, -1375801, -1116167, 1670182, 6156035, 9292511, 8583010, 4706642, 954112, -7382, 1407514, 2487438, 1287139, -1196234, -1999308, 486368, 4264112, 5324499, 1798670, -3907147, -7606762, -7560036, -5486610, -3702089]
5588c702089J205278J670617K223259J400948n43449j851349j313330L12112J053388
5579D55385J1945j348165r64939P30907Q83146j774096m448372l632280O422K359961
5569g720086J299295r97827j508718J10326K316099L920169M237075K676037k37430
5560D094940k524873k794070j779836q89674l41731J71579K42514m11983r10434
5551e143568m47507L39409N91964P57305J384257J576794N51415l29949N80202
5542a39678K028079J223368j683406l259228j602763R62518J304932k97989j087541
5533b551708P7972J335158M75721k178468m074002l316406p99587R06022N97587
5524i527711l89642j97898J365237L146220M082485L588795J651656m96888r80824
$$ y = [-3702089, -2496811, -826194, 1397065, 2798013, 2254564, 403215, -910115, -598003, 455385, 467330, -880835, -1845774, -1114867, -231721, -2005817, -6454189, -10086469, -10080047, -7720086, -6420791, -7418618, -8927336, -8817010, -6500911, -2580742, 1656333, 4332370, 4094940, 1570067, -1224003, -3003839, -3893513, -4235244, -4063665, -3821151, -4233134, -5143568, -5591075, -5251666, -4659702, -3902397, -2518140, -941346, -389931, -719880, -139678, 1888401, 3111769, 1428363, -1830865, -3433628, -2471110, -1166178, -1464167, -2551708, -2473736, -1138578, -662857, -2841325, -6915327, -10231733, -11031320, -10125298, -9527711, -9917353, -10115251, -8750014, -5603794, -1521309, 2067486, 3719142, 3222254, 2241430]
5515B241430K96918J090444j1352j316004o79171J091937J724486J005666J78851
5506E623205r85250l334028n280032m155304o18823J686234J221509K5579l25495
5497f142405o68079j222889k42418K639511M806425M298249K436606J128840J80565
5488G214405r83143j613255j526300j998585k864588j746875J495243K896638
5480H73540K06948k563634o57909L738198M282433j99078m273148l898085j196973
5471c687708j18247j171851k233418j850247o9571K120777L038807J713058k04697
5462b463097J61941K812964M254499K179547j156602j905780L89400K595125K036606
5453H904603r16500m017178n363431m309651j526838J130679J726830K75348p71062
$$ y = [2241430, 2538348, 3628792, 3617440, 2301436, 1622265, 2714202, 4438688, 5444354, 5623205, 4637955, 1303927, -3976105, -8131409, -8750232, -7063998, -5842489, -5816910, -6142405, -6810484, -8033373, -8275791, -5636280, -829855, 3468394, 5905000, 7033840, 7214405, 6231262, 4618007, 3091707, 1093122, -1771466, -3518341, -2023098, 873540, 1080488, -1483146, -2141055, 1597143, 5879576, 5680498, 1407350, -2490735, -3687708, -3805955, -4977806, -7211224, -9061471, -9131042, -7010265, -3971458, -2258400, -2463097, -2301156, 511808, 4766307, 6945854, 5789252, 3883472, 4272872, 6867997, 8904603, 7988103, 3970925, -1392506, -5702157, -7228995, -6098316, -4371486, -4096138, -4867200]
5444d867200O61952L137678L239259O92921n84172J617610L550440P89642m082772
5435D155358m267033Q79102M109870Q24058m275609m607575r66711J447283J454813
5426a246444J613079K021110O40771j278942k37543K994641L617408L92131k366396
5417F149815j832879n84872j218487j726233M81077L451705L317302K5128k805562
5408E256994k764729r73133R073r09185k282901j619200J318873L227675J178175
5399B441642k749123l692613q73915J364223J93164j919842j831974l98242R2590
5390g374090n4635L45382K18806j609024k978733r53272L088221M541478J737388
5381c038479k004055k925844j036980R81722J279793K06255r20552j400874j331886
$$ y = [-4867200, -4205248, -1067570, 2171689, 2864610, 2280438, 3898048, 7448488, 8238130, 4155358, -111675, 767427, 4877297, 5701355, 1425746, -3181829, -4148540, -2701257, -1246444, 366635, 2387745, 3028516, 1749574, 1512031, 4506672, 8124080, 8516211, 6149815, 4316936, 3732064, 2513577, 787344, 1268421, 4720126, 8037428, 8062556, 5256994, 2492265, 1519132, 1528205, 619020, -1663881, -3283081, -1964208, 1263467, 2441642, -307481, -4000094, -4874009, -3509786, -3316622, -5236464, -7068438, -7466680, -7374090, -7428725, -7083343, -6864537, -8473561, -11452294, -12405566, -9317345, -4775867, -3038479, -5042534, -7968378, -9005358, -8023636, -6743843, -6537588, -7458140, -8859014, -10190900]
5372a0190900n75059J413337L896815M236643J077778k529991k165219J707843
5364c128753L910039J798804j392296k148685j651115k276198k721030o69338
5356h278572K192820K316062L9057j099453m3951Q88882N11508J66173M04709
5347b902765Q578j020258q81142O81139J499894N40741m58390j36554L01346m60611
5337b828022j484074j379603o33299l37211j7366J405524L344044L966073K667865
5328D703931R26223N81319J811778K861621J747244j518766m586029n119298l222033
5319a814010r29592K44201L73123J84062J75284M68117O21824m6834j139096j004593
5309b867514Q54770K254172J106844j091092j031413J449524K991676J717927
$$ y = [-10190900, -10765959, -9352622, -5455807, -1219164, -141386, -2671377, -4836596, -3128753, 781286, 2580090, 1187794, -960891, -2612006, -4888204, -7609234, -8278572, -6085752, -3769690, -3730633, -4830086, -4874037, -3985155, -3473647, -3307474, -2902765, -2894187, -3914445, -4795587, -4114448, -2614554, -2073813, -2532203, -2668757, -2367411, -2828022, -4312096, -5691699, -6324998, -6662209, -6679575, -5274051, -1930007, 2036066, 4703931, 5630154, 6211473, 8023251, 10884872, 12632116, 11113350, 6527321, 1408023, -1814010, -2743602, -2499401, -2126278, -1942216, -1766932, -1298815, -676991, -723825, -1862921, -2867514, -2012744, 241428, 1348272, 257180, -774233, 675291, 3666967, 5384894]
5301E384894j70928L231J570472K021388P03274q06174j101311l08930L54303
5292G650219m58028k846127m626352l058991J364741M454434L286075K03460m44068
5283E525363J456597J926390o31879k670515j032908J717887Q66227l097325m865105
5274h05268k242763O28409j49283k383685k019160j37006p87046l382177l081767
5265a4359746R32218L485780J707700k33044J855151N193648M741159J274931
5257D597797o52307m04967j093060k933306k721486r404J680743P58267j85504
5248i63227O12505J302982M33071l14723M73088J342858J026008Q75785J891472
5239F679819K276233N54073j466072j533415n20139m00527o37057M40922K018403
$$ y = [5384894, 5213966, 5217197, 6787669, 8809057, 9512331, 8706157, 7604846, 7295916, 7650219, 7192191, 4346064, -280288, -3339279, -1974538, 2479896, 5765971, 5969431, 5525363, 6981960, 8908350, 8276471, 5605956, 4573048, 6290935, 7157162, 4059837, -805268, -3048031, -2419622, -2568905, -4952590, -6971750, -7108756, -7895802, -11277979, -14359746, -13427528, -9941748, -8234048, -8467092, -6611941, -1418293, 3322866, 4597797, 3945490, 3540523, 2447463, -485843, -3207329, -3216733, -1535990, -777723, -963227, -350722, 952260, 1385331, 1070608, 1543696, 2886554, 3912562, 4788347, 6679819, 8956052, 9510125, 8044053, 6510638, 5990499, 5589972, 4952915, 5393837, 7412240]
5230G412240J523682j529704m648772n094545k240630K091047M723411L747693
5222E984422R13160j71809J028946J131085j877050n222961n283757k466561K44313
5213e720212J346875Q73699j228218l721038l368633P84045M391416L128090o11530
5204d125506r68670K513802M546637K533195k08552q23996j097857k755239l323283
5195c709469l91163L366310L598980P87038o53360J024611K742419J283491k505397
5186E543460n009090l913634m19064K015197J196740j297755j975804q6527J274072
5177b672405j41027j947004m76703L373327M880561K071280j629753k385200q21260
5168B51816n30o36555j019659o53229r14558j900695j474045J204023L369287
$$ y = [7412240, 8935922, 7406218, 2757446, -2337099, -4577729, -2486682, 2236729, 5984422, 6897582, 6725773, 7754719, 8885804, 7008754, 1785793, -3497964, -5964525, -5720212, -4373337, -3499638, -4727856, -8448894, -11817527, -11033482, -6642066, -3513976, -4125506, -5094176, -2580374, 1966263, 4499458, 4290906, 3466910, 2369053, -386186, -3709469, -4100632, -734322, 2864658, 3651696, 2998336, 4022947, 6765366, 8048857, 5543460, 534370, -3379264, -3798328, -1783131, -586391, -1884146, -3859950, -3946477, -2672405, -2813432, -4760436, -5237139, -1863812, 3016749, 5088029, 3458276, 1073076, 251816, 251286, -385269, -1404928, -2058157, -2972715, -4873410, -6347455, -5143432, -1774145]
5159a774145K040337j474963k906373o20570K479890L158810J738059N50969L17024
5150C509038k2954q47000j312219j075989p92813p31767l69698L27976N10127
5141h05299k49093j286549j796463j417647J69014K701485M096164J855025l005958
5132B60679n405590j866655M379365O648813K932624j972770k967424n08497J526999
5123C027544J445677O47937K09563m86202j622802j950325q30035M06924K75632
5114A123913p46462r99059N6411J190241Q45241j189156l331237l464116j173773
5105g687997J480333K313375J767492J846205K581360J905287m12654j468351
5097B325050M21913K508416J362264j903596l271955j686114L9801r0656r90983
$$ y = [-1774145, 266192, -1208771, -4115144, -4735714, -2255824, 902986, 2641045, 3192014, 3509038, 3486084, 2639084, 1326865, 250876, -541937, -1273704, -1643402, -1315426, -805299, -1054392, -2340941, -4137404, -5555051, -5386037, -2684552, 1411612, 3266637, 260679, -5144911, -7011566, -2632201, 4016612, 6949236, 4976466, 2009042, 1500545, 3027544, 4473221, 5121158, 5330721, 4844519, 3221717, 1271392, 441357, 848281, 1123913, 377451, -621608, -565197, 625044, 1470285, 281129, -3050108, -6514224, -7687997, -6207664, -3894289, -2126797, -280592, 2300768, 4206055, 3793401, 2325050, 2746963, 5255379, 6617643, 4714047, 1442092, -244022, -204221, -294877, -1285860]
5088a285860j349526j597397j944589j202021R07365K474523K123717J211223
5080f62565J537932K315064J374771j381405l509621k855846J66649L013173L291825
5071C289977J044356j113713q65675R09106J362405k88128j785875j282764K36788
5062A506477Q03013j47996k163075m537224n499165k867336K585523O268729M565511
5053E14457o64929m346212l835254m76947L079985M746964L288526m77700l179412
5044a350522k103109J226002K911413J840487M38323L26144J77016j293903k918564
5035g46713l179458k644758k493712k165557n43150J470754J812535N34525Q2376
5026g873158J690905L342147K685406O90906K94765J788838K121811l31847k749024
$$ y = [-1285860, -2635386, -4232783, -6177372, -7379393, -6472028, -3997505, -1873788, -662565, 875367, 3190431, 4565202, 3183797, -325824, -3181670, -3015021, -1848, 3289977, 4334333, 3220620, 2354945, 3264051, 4626456, 4338328, 2552453, 1269689, 1506477, 2309490, 2161494, -1581, -4538805, -10037970, -12905306, -10319783, -4051054, 514457, -150472, -4496684, -8331938, -8808885, -5728900, -981936, 2306590, 1828890, -1350522, -3453631, -2227629, 683784, 2524271, 2962594, 3288738, 3465754, 2171851, -746713, -3926171, -6570929, -9064641, -11230198, -11773348, -10302594, -8490059, -7955534, -7873158, -6182253, -2840106, -154700, 536206, 830971, 2619809, 4741620, 4409773, 1660749]
5017A660749j714863J589736K932899J022200j228895j553978j171350j677527
5009a41029k059866p45103J432163K326108J242086q62483k661285k852483q95741
5000e217633J520003J620443o30521k049814j011490k3586j370733k973676j716809
4991a1853816J348927K779582K090793J463693J223233k21331k281995k204619
4983g655533L44643K349303J949688P29903N58860J018017J063060P26771J12746
4974A197458j042198j958293j313460L3556n73648l323367m740494k470408J185439
4965a3005415K707617K241362K281350K896413J620514j924659m405557l059870
4957a0648245M66867K420738J938683J529750K693727L484178J666964j495273
$$ y = [1660749, -54114, 1535622, 4468521, 5490721, 4261826, 2707848, 1536498, -141029, -2200895, -2945998, -1513835, 812273, 2054359, 1191876, -1469409, -4321892, -5217633, -3697630, -2077187, -2707708, -4757522, -5769012, -5792598, -7163331, -10137007, -11853816, -10504889, -7725307, -5634514, -4170821, -2947588, -3168919, -5450914, -7655533, -7310890, -4961587, -3011899, -2281996, -1723136, -705119, 357941, 1084712, 1197458, 155260, -1803033, -3116493, -3082937, -3656585, -6979952, -11720446, -14190854, -13005415, -10297798, -8056436, -5775086, -2878673, -1258159, -3182818, -7588375, -10648245, -10181378, -7760640, -5821957, -4292207, -1598480, 1885698, 3552662, 2057389]
4949B057389k680420q86908J699570K787804J867289n97798l438218m360382j985960
4940e537634J412909J998146m39145k391287k125990j573520j827994j002383
4932a1486898J579514L201221K248700J028135J400828J496392k07450j484985
4924b224543m65004P11498j00166j314205j467897k294342l922491k286624L490112
4915i873662O668286K404864l521885l170017J157435J768850j206806j444704
4907g217639J414782J683865j449587k946811j538528r40926j695705q73883N37732
4898a3026700q85386k948945q20271L098356K514414j108960j568709n97512m400581
4889a9744294r279714n925916K626909M120432j655619l186730K74176k334457
$$ y = [2057389, -623031, -1509939, 189631, 2977435, 4844724, 4246926, 808708, -3551674, -5537634, -4124725, -2126579, -2565724, -4957011, -7083001, -8656521, -10484515, -11486898, -9907384, -6706163, -4457463, -3429328, -2028500, -532108, -739558, -2224543, -2689547, -1978049, -2078215, -3392420, -4860317, -7154659, -11077150, -13363774, -9873662, -3205376, -800512, -4322397, -7492414, -6334979, -4566129, -5772935, -7217639, -5802857, -4118992, -5568579, -8515390, -10053918, -10994844, -12690549, -13564432, -13026700, -13912086, -16861031, -17681302, -14582946, -12068532, -13177492, -14746201, -15343713, -19744294, -29024008, -34949924, -32323015, -28202583, -29858202, -33044932, -32770756, -35105213]
4881c5105213j0049762r267503j659078m780503j6895421j4556888K78978r320061
4873a01355451m9121231n8351946J1448047J08958757J33611874O5808887j2021747
4866I8977190k9850304p544365J811198p874215r733496q44844m92666r634788
4858C4813710j1153507l013899L53525l819880l818454K544469M409686q74088
4850A9441562l168849J573968N040655K048531k222653l374283l663472m183713
4842A1491746k230095J304585J783262k84552N36103M347216N075734J126808
4834B3150807k128412k022407k018519l618644l310365j39534J353927j220640
4826A0046213m043729l478897r08287J089868K188563K119118P3703k160524j372715
$$ y = [-35105213, -45154975, -54422478, -56081556, -60862059, -77757480, -92314368, -92035390, -101355451, -150476682, -208828628, -197380581, -88421824, 45190050, 110998937, 98977190, 69126886, 61582521, 63393719, 55519504, 45786008, 44941164, 44448498, 34813710, 23660203, 20646304, 20999829, 17179949, 13361495, 15905964, 20315650, 19441562, 16272713, 17846681, 22887336, 24935867, 22713214, 19338931, 15675459, 11491746, 9261651, 10566236, 12349498, 12064946, 12601049, 16948265, 22023999, 23150807, 21022395, 18999988, 16981469, 13362825, 10052460, 9912926, 11266853, 10046213, 6002484, 2523587, 1615300, 2705168, 4893731, 7012849, 7086552, 4926028, 3553313]
4817C553313J516362J990841r13012l064580j899916N48519K367351M089471M928840
4808A3117189K323173k667847m779557j924239J495978J257427j033605j717180
4800F071339n59527N35186J027256J080149K9477k018947l306841l068952k828156
4791c039016l458486l362593j257976J424975K587080K125914J314478J074687
4783b590937J588936K131354J253718j056739k051956L15740L417624K983357
4775E991097l26207j585563R38539L507347L037761J011279l74990j713200l755508
4766F730555m861762l588290j095428J004355K619199L506443K569418L91328
4758G275818n54762K10961K89728j016219r15023J892284M122091K657230q06162
$$ y = [3553313, 5069675, 7060516, 6147504, 3082924, 1183008, 1731527, 4098878, 8188349, 13117189, 15440362, 12772515, 7992958, 6068719, 7564697, 8822124, 7788519, 6071339, 5511812, 6046998, 7074254, 8154403, 8183880, 6164933, 2858092, -210860, -3039016, -6497502, -9860095, -11118071, -9693096, -7106016, -4980102, -3665624, -2590937, -1002001, 1129353, 2383071, 1326332, -725624, -409884, 3007740, 5991097, 5664890, 4079327, 5017866, 8525213, 11562974, 12574253, 12199263, 10486063, 6730555, 1868793, -1719497, -2814925, -1810570, 808629, 4315072, 6884490, 7275818, 6721056, 6932017, 7221745, 6205526, 5290503, 7182787, 11304878, 13962108, 13155946]
4749A3155946k871761l246766l218065k133709Q44850L557750L219586O72864
4741I980695j001745r39895n36218k62762M05676Q02505j03316j262110p82259
4732F300571P62894R35135q25851k472948k369509r60013N92122J587090J545630
4723E095121L93343r47113j327344p87378m25207j073218k554865l681047k847935
4714h155643J77626L004390L033316J368977J648607M157033M498375J25603n171746
4705D686538o343667l790304j373372k08767J185678K344067J474062m5429J156583
4696i14611M463626N271265K001129j392130j629091o48685j504801l288704l233164
4687h75166j303745M71579J438174K071665J695845m60496k670639k156740R11005
$$ y = [13155946, 10284185, 7037419, 3819354, 1685645, 2530495, 6088245, 9307831, 9980695, 8978950, 8039055, 7502837, 7240075, 7645751, 8448256, 8344940, 7082830, 6300571, 7063465, 7998600, 7172749, 4699801, 2330292, 1370279, 1962401, 3549491, 5095121, 5488464, 4541351, 3214007, 2426629, 2001422, 928204, -1626661, -5307708, -8155643, -7978017, -4973627, -1940311, -571334, 1077273, 5234306, 9732681, 9858284, 4686538, -1657129, -5447433, -6820805, -7029572, -5843894, -3499827, -2025765, -2071194, -914611, 3549015, 8820280, 10821409, 9429279, 7800188, 7151503, 5646702, 2357998, -875166, -2178911, -1707332, -269158, 1802507, 3498352, 3037856, 367217, -1789523, -878518]
4678h78518L335275L028505J105301m84600j359987k005113k365226k220982j905433
4669c750778j730925j414401p13118L3251M73966O35761L78229n57006j454116
4660h099137q45985J216103K402578J086206j000335j004966R32415K180757J881455
4651a250909J855442K827605K830136P83710j153308r85574k41745j180576k526028
4642I58753j322657K010079L956220K932606P48876j028026k788758m265766l495597
4633b294270L0710L625677M509540K943589J005032q9071k50224K53489N82813
4624A0317285k87723j899676k306011o31231J575749K162355L20092l348192o866132
4615i63484p092400k625363L064774M547446J425818j007390M73212K585142J410788
$$ y = [-878518, 2456757, 5485262, 6590563, 6105963, 4745976, 2740863, 375637, -1845345, -3750778, -5481703, -6896104, -7609222, -7575971, -7102005, -6466244, -6088015, -6645021, -8099137, -8945122, -7729019, -5326441, -4240235, -5240570, -6245536, -5313121, -3132364, -1250909, 604533, 3432138, 6262274, 7045984, 5892676, 4907102, 4665357, 3484781, 958753, -363904, 1646175, 5602395, 8535001, 9283877, 8255851, 5467093, 1201327, -2294270, -2263560, 1362117, 5871657, 8815246, 9820278, 9731207, 9480983, 9734472, 10317285, 10029562, 8129886, 5823875, 5192644, 6768393, 8930748, 9250840, 5902648, -963484, -8055884, -10681247, -7616473, -3069027, -1643209, -2650599, -2177387, 407755, 1818543]
4606A818543j225998j186891J112672J841849M8854j632561j661785r08333J66001
4597a627649J835864K945328K019867L30513L63532J501583R27684j270403j928807
4588E097512j90374R50407m83040k663252l295645k458708r23471J095731K302299
4579e68541Q68842j916586k127043Q67513K656610L76350k671628k178743P25062
4570c968164K102162J609937J748843K409444J011271k320839m167200k967182
4562d541728j124942r91114j706696j277112M67076K222254L016139K832863K453421
4553A350161K778250L296503J949141j736739m398983k583003J696204K723104
4545E074638r47159m015930j766240L385095N434642K606597j544470l525825
$$ y = [1818543, 592545, -594346, 518326, 2360175, 2409029, 776468, -885317, -1793650, -1627649, 208215, 3153543, 5173410, 5503923, 5867455, 7369038, 8296722, 7026319, 5097512, 4907138, 5857545, 5374505, 2711253, -584392, -3043100, -3966571, -2870840, -568541, 300301, -1616285, -3743328, -2875815, -219205, 157145, -2514483, -4693226, -3968164, -1866002, -256065, 1492778, 3902222, 4913493, 2592654, -1574546, -4541728, -5666670, -6657784, -8364480, -9641592, -9174516, -6952262, -3936123, -1103260, 1350161, 4128411, 7424914, 9374055, 7637316, 3238333, 655330, 2351534, 5074638, 4127479, 111549, -1654691, 1730404, 7165046, 9771643, 8227173, 4701348]
4537D701348l170113j842639l16219R45983J375671J024214O47707O45076O30054
4528D641082J05533j052706k521715l346705k481035l51279R82878L87931o21802
4519d257818k55003O05107P2063r92446O4332K968451M050136J487968j977016
4510A765774l156081k473098j760146n91799K079532M392591L417763P6938j336592
4501B414882Q72946L356307K509914p05820k549641j498066O02649J674127J649369
4492H326667J299722M23186j570820l772929l957240j352553J749349K469412
4484C614794R63086q2104N54578J291375R05351M72478P35686J31573k150067
4475F436750l405298j078745K289701J757892k796787o194174n144857k028059
$$ y = [4701348, 1531235, -311404, -627623, 318360, 1694031, 2718245, 3365952, 4011028, 4641082, 4746615, 3693909, 1172194, -2174511, -4655546, -5006825, -4023947, -3636016, -4257818, -4512821, -3907714, -3835651, -4828097, -4763765, -1795314, 2254822, 3742790, 1765774, -1390307, -3863405, -5623551, -6215350, -4135818, 256773, 3674536, 3751474, 2414882, 3287828, 6644135, 9154049, 8448229, 5898588, 4400522, 5003171, 6677298, 8326667, 9626389, 10049575, 8478755, 4705826, 748586, -603967, 1145382, 3614794, 4577880, 4495776, 5050354, 6341729, 7247080, 7719558, 8455244, 8586817, 6436750, 3031452, 1952707, 4242408, 6000300, 3203513, -2990661, -8135518, -10163577]
4467a0163577l11974P4950P88479J635098J690952J579005K025088J856279l7960
4458h63660k089841j897274K29116J860577J925314J451471J331158J411634J600744
4449D959239K011737K033268Q73376r29712j967270j971352k000686k474712k391580
4440a857692j037925N73014Q88906J16902L81710K983525N936065N623676J528101
4431A5136282k264181j969466P72826J308001j257230l161822k090811k07026
4423F266573L45343J006300L179358M434922K026474k098010l744325k475207
4415H941428j257040j082177j17715J883355K435562N07557j517299j439169j84222
4406H170280K66148k49081p40888r61697j178991j222007r97611j106349j855596
$$ y = [-10163577, -10475551, -10400601, -9612122, -7977024, -6286072, -4707067, -2681979, -825700, -863660, -2953501, -4850775, -4621659, -2761082, -835768, 615703, 1946861, 3358495, 4959239, 6970976, 9004244, 9877620, 8947908, 6980638, 5009286, 3008600, 533888, -1857692, -2895617, -2322603, -1433697, -1316795, -935085, 2048440, 7984505, 13608181, 15136282, 12872101, 10902635, 11675461, 12983462, 11726232, 8564410, 6473599, 6266573, 6611916, 7618216, 10797574, 15232496, 17258970, 15160960, 11416635, 8941428, 7684388, 6602211, 6484496, 8367851, 10803413, 11310970, 9793671, 8354502, 8170280, 8436428, 8187347, 7446459, 6484762, 5305771, 4083764, 3086153, 1979804, 124208]
4397A24208k238364r48809J635424L251092K093634o78287j677251N71693L088461
4388E221801J989823j776274l146228p5341L345024K764260n71337k595711k274389
4379B881628j213974K41000K409727L417899J365351j607693j831878l3899j40468
4370E487693k504478l389354j597836l63741j407931k236849j288567q11365j979750
4361a0092178j848265J360846M052236K480788j083541j885646Q3890J084789
4353e847081K18533J41884J731756K698459K049704J869051L269580L846469J244298
4344A1222653k842179m510863k565206M17118J825408K011637K597985L053214
4336A1209767J123650l045696n619968l729890L16518K107331J226426R02593
$$ y = [124208, -2114156, -3062965, -1427541, 1823551, 3917185, 3238898, 1561647, 2133340, 5221801, 7211624, 5435350, 2289122, 2213781, 5558805, 8323065, 7751728, 5156017, 2881628, 1667654, 1908654, 4318381, 7736280, 9101631, 7493938, 5662060, 5628161, 5487693, 2983215, -406139, -2003975, -2367716, -3775647, -6012496, -7301063, -8112428, -10092178, -11940443, -10579597, -6527361, -4046573, -5130114, -7015760, -6931870, -5847081, -5628548, -5486664, -3754908, -1056449, 993255, 2862306, 6131886, 9978355, 11222653, 8380474, 3869611, 1304405, 1721523, 3546931, 5558568, 8156553, 11209767, 12333417, 9287721, 3667753, -62137, 254381, 2361712, 3588138, 4490731]
4328D490731K032823J714468j327672l917820l202302r68219m85366j570279j711615
4319d945251k47980J410576K344942K372185J015310j339677k499703j115907
4311c005505Q91021R71920k41790m02661N43232Q80908O95681J425530K206060
4302C964396M16516l525261n359916k435587K581891N035959L464933Q0586k319273
4293A904244k449852p49239J085585J451705O70730P29877K445762L935313L112583
4284A2136708Q72828J07921J649072K925687J449041j665628l134671j936457
4276A2404501m71306r10541k243449k315843j367589j379912k479885k431368
4268a195392q4239K717017L487207J844630p81727k729989k754971p20217J467265
$$ y = [4490731, 6523554, 8238022, 6910350, 2992530, -209772, -1177991, -1663357, -3233636, -4945251, -5193231, -3782655, -1437713, 934472, 1949782, 610105, -1889598, -3005505, -2114484, -1142564, -1384354, -1787015, -1243783, -362875, 332806, 1758336, 3964396, 4380912, 855651, -4504265, -6939852, -4357961, 677998, 4142931, 4223517, 1904244, -545608, -1294847, -209262, 1242443, 1913173, 2643050, 5088812, 9024125, 12136708, 13009536, 13117457, 14766529, 17692216, 19141257, 17475629, 14340958, 12404501, 11933195, 11022654, 8779205, 6463362, 5095773, 3715861, 1235976, -1195392, -1279631, 1437386, 4924593, 6769223, 5987496, 3257507, 502536, -217681, 1249584]
4259A249584J181302j565458l545497k355158L62038J292760n6384j113981k3356
4250d574150K112612L025036K136010R54912R45117J668691J662124Q94902Q73521
4241I698775J675722R56067k133869m054941j285845L566792M362397R6056l705436
4232I175718l300407j540555k005576l029742j465967J161535J066381j221453
4224a160066j488426J513729M202364L332293j15185k901813l122921j191310
4216i31335J126017K099769J438958M94510N89550J519485K079339J365719o80199
4207I101813k999591l652374j790682O87980J363701Q54438J443731K441882Q25249
4198H276147k870611l889048m30634K949740K095798n47450k34387K710408M003427
$$ y = [1249584, 2430886, 865428, -2680069, -5035227, -4673189, -3380429, -3436813, -4550794, -4574150, -2461538, 563498, 2699508, 3654420, 4599537, 6268228, 7930352, 8825254, 9698775, 11374497, 12330564, 10196695, 6141754, 4855909, 8422701, 12785098, 12881154, 9175718, 5875311, 4334756, 2329180, -700562, -2166529, -1004994, 61387, -1160066, -2648492, -1134763, 3067601, 6399894, 6284709, 3382896, 259975, -931335, 194682, 2294451, 3733409, 4227919, 4817469, 6336954, 8416293, 9782012, 9101813, 6102222, 2449848, 659166, 1347146, 2710847, 3565285, 5009016, 7450898, 8276147, 5405536, 1516488, 1085854, 4035594, 6131392, 5583942, 5349555, 8059963, 12063390]
4189A2063390J918644j111954k348945j399186J60143K63267j211578j176968
4181G156813K631432O417029M023233l163875o225579j197532M960323M734002
4173A9335846o6640l630207m928958n342839l600456K68840J522733j876726m032065
4164b350472l93058L975900L441308K187464N719489Q812186L873573m288312
4156B0978078n224948J9082K241329O78903J646813M071944K297389K09390M956335
4147C1874315R662669L242872m893544L582613J7487689J477493m7483364q0600345
4139f5649602n7762809l273471K7560448J9931847N401264O798565J2928963R348586
4131d4716209K362020K100561M707209L430893J326051K395123K720414n74492
$$ y = [12063390, 13982034, 12870080, 10521135, 9121949, 9282092, 9545359, 8333781, 7156813, 9788245, 16205274, 20228507, 17064632, 10839053, 9641521, 14601844, 19335846, 19269206, 15638999, 10710041, 5367202, 1766746, 2035586, 3558319, 1681593, -2350472, -2743530, 1232370, 4673678, 6861142, 12580631, 21392817, 25266390, 20978078, 15753130, 15772212, 18013541, 18692444, 20339257, 24411201, 26708590, 26917980, 31874315, 41536984, 44779856, 39886312, 43468925, 60956614, 62434107, 14950743, -65649602, -123412411, -126685882, -99125434, -79193587, -73792323, -66993758, -54064795, -44716209, -42354189, -40253628, -35546419, -32115526, -30789475, -28394352, -25673938, -26248430]
4123b6248430k246811J258080M481313K698840K06601J799564M034354K222251
4115a1794238q49214m21161J756216J315554r89267j684488r38071j008697j500994
4106a6114360q71372J65414O16849J689466L917355M900238L074574O54513j03461
4097b070784l52112j546002k238121r79189P13255J174856J331861J860430Q42204
4088a263602k626643n430009m402137j017210R45207M65950o85482j139263n91166
4079a5744355J150803L526807M872146M353982L029275J971133R75618j19783
4071D015626p74820j036910j478539j620225p38186J3948o73619r20903J902673
4062a310955N558391M775839n32053m257675k943867k58218k72658j642835j682555
$$ y = [-26248430, -28495241, -27237161, -22755848, -20057008, -19850407, -18050843, -14016489, -11794238, -12643452, -13064613, -11308397, -9992843, -10982110, -12666598, -13604669, -14613366, -16114360, -16985732, -16820318, -16203469, -14514003, -10596648, -5696410, -2621836, -1967323, -2070784, -2422896, -3968898, -6207019, -7186208, -6472953, -5298097, -3966236, -2105806, -1263602, -3890245, -9320254, -13722391, -14739601, -13794394, -13328444, -14013926, -15153189, -15744355, -14593552, -11066745, -6194599, -1840617, 1188658, 3159791, 4135409, 4015626, 3240806, 2203896, 725357, -894868, -1633054, -1619106, -2292725, -3213628, -1310955, 4247436, 9023275, 8491222, 4233547, 1289680, 1031462, 758804, -884031, -2566586]
4053b566586j172832j182488L09756M034791N592149J164208n654773p797087
4045g272862l782690J529417L845761L044197R02164j044727j741385j372778
4037e892903j369836k020934j613167M37622J906006J246726J96160N41597J085754
4028e482975N35045M04084J768538K116137o23460l508460k447918J342814L224484
4019b671711J956118J95360n98863j215748j393348N1822K034402K205627R71264
4010A534923O32044Q37252q72535l935039m663382k073160M33000N68271L87488
4001g151138K026472L707681K720936n7651j532322q81673l5924k73218p03594
3992b180431l35143K24260N1575k23596P22895K351836K227888n44371l264157
$$ y = [-2566586, -3739418, -4921906, -4612150, -577359, 5014790, 6178998, 524225, -7272862, -11055552, -9526135, -5680374, -2636177, -1734013, -2778740, -4520125, -5892903, -7262739, -9283673, -10896840, -10459218, -8553212, -7306486, -7110326, -6568729, -5482975, -4947930, -4543846, -2775308, -659171, -1282631, -4791091, -7239009, -5896195, -2671711, -715593, -520233, -1119096, -2334844, -3728192, -3676370, -1641968, 563659, 1534923, 2166967, 3004219, 2131684, -1803355, -6466737, -8539897, -8106897, -7538626, -7151138, -5124666, -1416985, 1303951, 1246300, -286022, -1167695, -1203619, -1476837, -2180431, -2515574, -2291314, -2239739, -2463335, -1740440, 611396, 2839284, 2294913, -969244]
3983i69244k768011K58814K258823J546620m19908k119684l180427k445378J362367
3974f476028N996944O575078K008797k877734l745315j817027k70747O15664J531738
3965A541370R60773k038321m645136l888855j096610R60532K609501M836191N359575
3956D599020K302549q20384K68788K941866J269914l740307m860725j20324L735598
3947E575995J459689l424099m842283k439174K32552J713886K644332K525178
3939C446076N40241j820429k200293o91660O25248P91327O97237J149804J769571
3930D307122J778641J005992j6271q10886j700714l129799m059824k561231J009029
3921d177941L274014K064715m22878r54980J47478N82593L22371O98366Q19703
$$ y = [-969244, -3737255, -3478441, -1219618, 327002, -92906, -2212590, -5393017, -7838395, -6476028, -479084, 6095994, 8104791, 5227057, 1481742, -335285, -606032, 9632, 1541370, 2502143, 463822, -4181314, -8070169, -9166779, -8206247, -5596746, -760555, 4599020, 6901569, 6081185, 6349973, 9291839, 10561753, 6821446, 1960721, 1840397, 5575995, 7035684, 3611585, -1230698, -3669872, -3437320, -1723434, 920898, 3446076, 3986317, 2165888, -34405, -726065, -100817, 690510, 1387747, 2537551, 4307122, 6085763, 7091755, 7075484, 6264598, 4563884, 1434085, -2625739, -5186970, -4177941, -903927, 1160788, 737910, -217070, -69592, 513001, 835372, 1533738, 2353441]
3912B353441q84348k605677j254827J858647K273567n67723k379593q32627J453709
3903e85431J830419R64424j57441k145205m352030m215279j406135J049126J485740
3894g531812J722017K970974L704045L263570L270748L524850J200789l427785
3886H697396n399387k403737J061704O78235j172814m21000J427146M89355k278960
3877F77938k854865r63912L83954O16390J584942K916311K410356M31832o92343
3868D510603j026220k300703l525680k078189J102162K198859N84494m30762O10487
3859c54949J374681M87015k62239J39154n5378j578205k150201l68328J681961
3850a086489J915531J408838J713476J672264l48466l023414l642626j937836
$$ y = [2353441, 1469093, -1136584, -2391411, -532764, 1740803, 1173080, -1206513, -2039140, -585431, 1244988, 2209412, 2051971, -93234, -4445264, -8660543, -10066678, -9017552, -7531812, -5809795, -2838821, 865224, 4128794, 7399542, 10924392, 12125181, 8697396, 3298009, 894272, 1955976, 2634211, 1461397, 1040397, 2467543, 2956898, 677938, -2176927, -3140839, -2756885, -2140495, -555553, 2360758, 4771114, 5202946, 4510603, 3484383, 1183680, -2342000, -4420189, -3318027, -1119168, -534674, -965436, -354949, 1019732, 1506747, 1244508, 1383662, 1328284, -249921, -2400122, -2768450, -1086489, 829042, 2237880, 3951356, 5623620, 5275154, 2251740, -1390886, -3328722]
3842c328722m0162N10198j60182j307603j966024j077550J116707K478414J362386
3833b412538r11005j544616P2551J711484J326719o05461k108500k067863r95493
3824g534722O8034P72378J420369J983595J757303M32204r75975j185409m76716
3815c738939k88890q06188l88947J738491L555343K590134m38712k190202j023174
3806i91084J022991J282120r0790j025006o76739J24433Q98853J873908K363747
3797D782433J026032j658187l238284k605086j456195j242566q87412N96138J509711
3788c173416K61040j107463L18600L180985L436421P78812p21919R62747K831045
3779F766852J802077q93836k351555k112596j361860l53568R85091J608489O66558
$$ y = [-3328722, -3368884, -2858686, -3018868, -4326471, -6292495, -7370045, -6253338, -3774924, -2412538, -3323543, -4868159, -4795608, -3084124, -1757405, -2362866, -4471366, -6539229, -7534722, -7466688, -6694310, -5273941, -3290346, -1533043, -1100839, -2076814, -3262223, -3738939, -4027829, -4834017, -5222964, -3484473, 70870, 2661004, 2222292, 32090, -991084, 31907, 1314027, 1223237, 198231, -478508, -354075, 544778, 2418686, 4782433, 5808465, 4150278, 911994, -1693092, -3149287, -4391853, -5279265, -4683127, -3173416, -2912376, -4019839, -3701239, -520254, 2916167, 3694979, 2973060, 3935807, 6766852, 8568929, 7675093, 5323538, 3210942, 1849082, 1495514, 2480605, 4089094, 4755652]
3770D755652r37800j834643j836455j325117n34827j44789o35672n93027J708934
3761a377744M510788L855467k25571k929250k007747j320961l993092o627717
3753a0115827m829368o16550J084053M16889J154145L314323L563767K034119
3745c994449K262983M149379L294193j260763m384715k359034J643942K503452
3737A854988O3647j880030j113719J125065K414311J481921q10620k025982p28202
3728C81379J457437J818591K04779j240761j433989j064464n85390k00031j087589
3719a750038l435245m112919l29663M897449N653116J671502j195166K0156J537916
3710B957108R5090j536054O4178K661607K016996j293340l224732k393599p69924
$$ y = [4755652, 3817852, 1983209, 146754, -1178363, -1713190, -1857979, -2493651, -3086678, -1377744, 3133044, 6988511, 6762940, 3833690, 1825943, 504982, -3488110, -10115827, -14945195, -15561745, -14477692, -14060803, -12906658, -9592335, -6028568, -3994449, -1731466, 2417913, 5712106, 4451343, 66628, -2292406, -648464, 1854988, 1918635, 38605, -1075114, 49951, 2464262, 3946183, 3135563, 1109581, 381379, 1838816, 3657407, 3862186, 2621425, 1187436, 122972, -462418, -662449, -1750038, -5185283, -9298202, -9627865, -4730416, 922700, 2594202, 1399036, 1419192, 2957108, 3052198, 1516144, 1580322, 4241929, 6258925, 4965585, 1740853, -652746, -1422670]
3701a422670L49875J321106J897251J183447m72071j788007k229026j782672k19215
3692c161982J812292K455022J215110K56851J196604K305827J140829j545218
3684E675335k892783j828301K20104J506976J177082n16068j779750o74334J742752
3675B631013J899676j013344l039532j145731J978289K048866m89091k126974
3667G43172k091323k081157j814799L16357K890836K640081J2732j106526K50467
3658b40160O87673j465158l081988j398487J456508J832709j33489j346759k81646
3649c970797J698435K666685K003701M05700r11665j329468j388022j605129j162068
3640c592628P61388K757972K502379L86854o18351O50937J815866P04204j537257
$$ y = [-1422670, -1072795, 248311, 2145562, 3329009, 2856938, 1068931, -1160095, -2942767, -3161982, -1349690, 1105332, 2320442, 2577293, 3773897, 6079724, 7220553, 5675335, 2782552, 954251, 1174355, 2681331, 3858413, 3342345, 1562595, 888261, 2631013, 4530689, 3517345, 477813, -667918, 1310371, 3359237, 2870146, 743172, -1348151, -3429308, -5244107, -4927750, -2036914, 603167, 615899, -490627, -240160, 447513, -1017645, -4099633, -5498120, -4041612, -2208903, -2342392, -3689151, -3970797, -2272362, 394323, 2398024, 2803724, 1892059, 562591, -825431, -2430560, -3592628, -2831240, -73268, 2429111, 2815965, 2197614, 2848551, 4664417, 5368621, 3831364]
3631C831364k624117k330264j614995l48000J776458L230555K096707p99027k430171
3622G88510j478070J47400K71762o56064p59058K57325R09833N47572L67575J041866
3612A438651R76557j201762l450842k387582J368677L131004O96229k280009j933365
3603c642442j67801j024197l184112j443257M401163P634087L652785l410021
3595B816205o262795l655511l07640O35776R95930L236302N998256N645166J051294
3586A0152983m606155p009921n188851k281830j561850k479833j882803J181977
3578a3676283L799765L068197N2362j616851l55252J745012K028878P69020N05886
3569c679266K126755L071528P79722k922806l423025K22221L398478K310217p28721
$$ y = [3831364, 1207247, -1123017, -2738012, -3086012, -1309554, 1921001, 4017708, 3218681, 788510, -689560, -542160, -270398, -926462, -1685520, -1428195, -518362, 29210, 396785, 1438651, 2415208, 1213446, -2237396, -4624978, -3256301, -125297, 570932, -1709077, -3642442, -3810243, -4834440, -8018552, -9461809, -5060646, 2573441, 6226226, 2816205, -3446590, -7102101, -7409741, -6773965, -5778035, -2541733, 3456523, 9101689, 10152983, 5546828, -1463093, -6651944, -8933774, -10495624, -12975457, -14858260, -13676283, -9876518, -6808321, -6755959, -8372810, -8728062, -6983050, -4954172, -4185152, -3679266, -1552511, 1519017, 2298739, -624067, -4047092, -3824871, -426393, 1883824, 1155103]
3560A155103j520995q18761k202597m693737l518637J309236L429938l67493m556472
3551a1784415k673124L538957P385431O485740L773753J372768j123493l021145
3543C954472k403891j89381J2376k783456n217908m361425j225929J648233L291872
3534g275037L608666K210990j84997j182003N01275K894286L054407N80501k408730
3525A799358l944865l660828k220336m22722J263971K713830L501405K584651
3517A614464l34993l336273l736522j340115J269957K065374J535383Q13084j27381
3508a577022j267220j440289q0844J366760J468511R41865J023295J048506j36600
3499A346962j460490r81280O20792P78356p65855j480657l08646O38257j13720
$$ y = [1155103, -365892, -1184653, -3387250, -8080987, -11599624, -10290388, -6860450, -7227943, -11784415, -14457539, -10918582, -3533151, 2952589, 6726342, 8099110, 6975617, 3954472, 1550581, 1361200, 1373576, -1409880, -6627788, -10989213, -12215142, -10566909, -7275037, -3666371, -1455381, -1640378, -2822381, -2321106, 573180, 3627587, 4208088, 1799358, -2145507, -5806335, -8026671, -8449393, -7185422, -4471592, -970187, 1614464, 1279471, -2056802, -5793324, -7133439, -5863482, -3798108, -2262725, -1449641, -1577022, -2844242, -4284531, -4365375, -2998615, -1530104, -588239, 435056, 1483562, 1346962, -113528, -1094808, -474016, 304340, -461515, -1942172, -2250818, -1612561, -1726281]
3490a726281q39978J07035J045120k13672k204896j860345L55222J092247k41636
3481d487184m46897J838672L286546R79614k628985l065925k56585J954994J771573
3472a054177J155349J452360J097225q78921k196092o23730K079171K311059k06342
3463C135902k103397j163455R36127J409688Q4715r49537m86149M04188J54273
3454A422355j012890j196338P61090L402164L870052J216949k135254k922547
3446C405581p23839J672689J552081q70449l073097k982063o81091K041292L195218
3437C536322J945327p36980k637062k139335Q8941J622110R10030r77170j884566
3428b72383j490286j464101k506845k800620o34995K563648L717310K212461M62414
$$ y = [-1726281, -2566259, -2459224, -1414104, -1627776, -3832672, -5693017, -5337795, -4245548, -4487184, -4934081, -3095409, 191137, 1170751, -1458234, -4524159, -4780744, -2825750, -1054177, 101172, 1553532, 2650757, 1771836, -424256, -1047986, 1031185, 3342244, 3135902, 1032505, -130950, 805177, 2214865, 2299580, 1350043, 863894, 1268082, 1422355, 409465, -786873, -25783, 3376381, 7246433, 8463382, 6328128, 3405581, 2681742, 4354431, 5906512, 5036063, 1962966, -1019097, -1700188, 341104, 3536322, 5481649, 4744669, 2107607, -31728, 57213, 1679323, 2589353, 1612183, -272383, -1762669, -3226770, -5733615, -8534235, -9169230, -6605582, -2888272, -675811, -213397]
3419b13397J68829K37455o53533j533396r54604K05726J7321j202909j225476
3410e153984N51608K144781K027129J127066Q93205J059614O21823k09249n28338
3401B533655m67422r16759j857398k356961k143116j820573j328121L98223L461092
3392d497380N800416N159942J808045j776543l651986l668236k181702O68634
3384b338810L632094M057516Q18194l287753m190017j498494J300971J844439
3376C38140J573399K275663K542868K08481l294025m219109j823690O71459R30217
3367g96597M30330J237410K355935J504874r69065k425596j728858n81117q29908
3358a802592k028945k294407p04526J682916K852823J764172m93617j699296r50693
$$ y = [-213397, -44568, 192887, -460646, -1994042, -2948646, -2742920, -2725599, -3928508, -5153984, -4602376, -2457595, -430466, 696600, 1589805, 2649419, 3271242, 3061993, 2533655, 2066233, 1149474, -707924, -3064885, -5208001, -7028574, -8356695, -7958472, -4497380, 1303036, 6462978, 8271023, 6494480, 2842494, -825742, -3007444, -2338810, 1293284, 5350800, 6168994, 2881241, -1308776, -2807270, -1506299, 338140, 1911539, 4187202, 6730070, 6938551, 3644526, -574583, -2398273, -1726814, -796597, -366267, 871143, 3227078, 4731952, 3762887, 1337291, -391567, -972684, -1802592, -3831537, -6125944, -6830470, -5147554, -2294731, -530559, -1024176, -2723472, -3674165]
3349c674165L89110O67853R2618p071O72384J317718J577144J671796J155657
3340C863044o24626k648507k725909n54777J522921J780580J323110J664611J856434
3331E456881J38904k685251l939636k735692p65840M30012Q85685Q55886K32121
3322b126930l15910K66968J334765J008744n44986p43557J254694K577733Q73453
3313C584974j746683j782811K35173O35900j832348m546925n014385l309271l07699
3304a4084075L394017O018498N146489J270138j679246j145063P99790R00343
3296F20891n54135q33656P95976K321873K051053K65102j783814k710269j427647
3287a254626J305811K422817l0312l370235k883876J794721N709020M918886J200633
$$ y = [-3674165, -3285055, -2617202, -2524584, -2531655, -1859271, -541553, 1035591, 2707387, 3863044, 3238418, 589911, -2135998, -2690775, -1167854, 612726, 1935836, 3600447, 5456881, 5595785, 2910534, -1029102, -3764794, -4530634, -4100622, -3214937, -2359051, -2126930, -2442840, -2175872, -841107, 167637, -377349, -1120906, 133788, 2711521, 3584974, 1838291, 55480, 290653, 926553, -905795, -5452720, -10467105, -13776376, -14084075, -10690058, -4671560, 474929, 1745067, 65821, -1079242, -279452, 620891, 66756, -766900, 29076, 2350949, 4402002, 4667104, 2883290, 173021, -1254626, 51185, 2474002, 2443690, -926545, -3810421, -2015700, 3693320, 8612206, 9812839]
3278I812839j173320j081391o84431j381286k282984k345379j752586r16805J94208
3269a611135J272139J482436N34185r75089k462637l589135l518131j406724J784724
3260h489367L409090K123999l24444j451057j053991m25933K56420J465103J941137
3251b549043j49673l279295l093152J426738N302643L853900o11981k049674P05775
3242d43762K913923J520348q06480p96057L19928l23952k200876k693754j605900
3233d116582q16621m28940J090340L037046K351878j581932m907891l869175L12223
3224h929654K917313J273316k535253m163463j378573L862286P216334N950973
3216D213279J325056k966256m258537k539406M41009K547995K369429M10920r83165
$$ y = [9812839, 8639519, 7558128, 6873697, 5492411, 3209427, 864048, -888538, -1805343, -1611135, -338996, 1143440, 1677625, 702536, -1760101, -5349236, -8867367, -10274091, -8489367, -5080277, -2956278, -3280722, -4731779, -5785770, -6211703, -5955283, -4490180, -2549043, -2698716, -5978011, -9071163, -7644425, -2341782, 1512118, 900137, -1149537, -443762, 2470161, 3990509, 3184029, 2387972, 2707900, 2383948, 183072, -2510682, -4116582, -4933203, -5362143, -4271803, -1234757, 1117121, -464811, -5372702, -9241877, -8929654, -6012341, -4739025, -7274278, -11437741, -12816314, -8954028, -1737694, 4213279, 5538335, 2572079, -1686458, -4225864, -3784855, -1236860, 1132569, 1543489, 560324]
3207E60324j70213J600053J886471M61775q09048j084986j112195o47895J653101
3198B337387M785633M948883P13780l832499l961090p00856P71132j700006m953250
3189a590886n421142l237629o03444J284997K161127J535813m04513j757763o18883
3180h652323K370613M449746L712592Q34386k013808l105046k058681K10456K009587
3171b242478J961151K26154j498382j660691n39326J45666n91664j692410j372104
3162g264084N16682K147148J902976K79738q64097n73911L28639O30717L89023
3153b507169P63539K273973L684220L155568O26619j569238j183251J086440K202663
3144H533364M82758k350244l484069k453738j097550o64319n76867j86325k3652
$$ y = [560324, 390111, 1990164, 3876635, 4338410, 3529362, 2444376, 1332181, 684286, 2337387, 7123020, 12071903, 12785683, 8953184, 4992094, 4291238, 5062370, 3362364, -1590886, -7012028, -10249657, -10853101, -9568104, -7406977, -5871164, -6275677, -8033440, -8652323, -6281710, -1831964, 1880628, 2715014, 701206, -2403840, -4462521, -4252065, -2242478, -281327, -55173, -1553555, -3214246, -3753572, -3607906, -4199570, -5891980, -7264084, -6747402, -4600254, -2697278, -2417540, -3281637, -3855548, -3526909, -2896192, -2507169, -1743630, 530343, 4214563, 7370131, 7996750, 6427512, 5244261, 6330701, 8533364, 9016122, 6665878, 3181809, 728071, -369479, -1033798, -1610665, -1796990, -1820642]
3135a820642l56501O6834K125987L945066K649734j243832l541691j795840J031516
3126A060631O73783k096064k632521K35572K084960j87562l079189j587627K880346
3117b647671M287676Q83541k489549j867096N20026O38250j251513k086423j134979
3108e147738q2444N97341J785288K818152J913750l04775q55780J210878L151140
3099E085812K446471J17145j378107j687652k173956l174955l521990k333203
3091f620435L3309K472928L648036K620587O9124j646681q44391J340930K274147
3082C347554J024923q92034j796563j527296p00237L61369J337533J528033N33534
3073C216816j170562k744634l489823k666860M9983L217533L969405J213598k222669
$$ y = [-1820642, -2177143, -2110309, 15678, 3960744, 6610478, 5366646, 1824955, 29115, 1060631, 1734414, -361650, -2994171, -2758599, -673639, -861201, -3940390, -5528017, -2647671, 1640005, 2523546, 33997, -1833099, -1313073, -674823, -1926336, -4012759, -5147738, -5230182, -4632841, -2847553, -29401, 1884349, 1579574, 723794, 1934672, 5085812, 7532283, 7649428, 6271321, 4583669, 2409713, -765242, -4287232, -6620435, -6587126, -4114198, -466162, 2154425, 2223549, 576868, -267523, 1073407, 3347554, 4372477, 3480443, 1683880, 156584, -543653, -182284, 1155249, 2683282, 3216816, 2046254, -698380, -4188203, -6855063, -6805080, -3587547, 381858, 1595456, -627213]
3064f27213k472338M93341K824658J972464k66289j008258m36258m94801r37368
3055i52062K29136K594201K943190J00552k672406k175169K8999K25323j521112
3046a199348j625325Q31509J964553j137710n448631n718506j542524K543661
3038a1332321L485303K734200K286941J345203q86104k004815M30900M036308
3030I5615L976075J39460k212029j94071K324903P74878l020764l830975j161817
3021c108725L22906j700672l905570k777357M25377K358402K391512K133307K122513
3012a738307J682730R33908N29499Q3369j024166j829989q69917J183524J926549
3003H77200L19612k220482l820018l752573k125359M30396K619344L468053L527043
$$ y = [-627213, -3099551, -2606210, 218448, 2190912, 1924623, 916365, 480107, -14694, -952062, -722926, 1871275, 4814465, 4915017, 2242611, 67442, 96441, 321764, -1199348, -2824673, -1993164, -28611, -1166321, -6614952, -12333458, -13875982, -11332321, -7847018, -5112818, -2825877, -1480674, -2366778, -4371593, -3940693, 95615, 4071690, 4211150, 1999121, 1805050, 4129953, 4904831, 1884067, -1946908, -3108725, -2785819, -4486491, -8392061, -11169418, -10744041, -8385639, -5994127, -3860820, -1738307, -55577, 878331, 1407830, 1491199, 467033, -1362956, -2232873, -1049349, 877200, 1196812, -1023670, -4843688, -8596261, -10721620, -10291224, -7671880, -4203827, -676784]
2994f76784L685331L022241m1124m141807n106899j224083L568113L989340p2736
2985C001592l670688l155161j17692J570056O11627j193762j942844j322349J71225
2976f047996J864835K656687J830619N71227R37698K545713K290485j067214m102833
2967A479221l120685K28852J232620p54950j715065J14617J364154n99329l293042
2958e063607l577042k640949k678421j947982J905617N977638N274412P28681
2950b021653j794981m84759M12618j383633k297756L38522L111836K045248r69312
2941c043870j758629o59868q06834j815313m78024K976117M345443J766971j544482
2932a018489k145690p73040k96530j566899l003660k961491j170907J440302L572341
$$ y = [-676784, 3008547, 6030788, 5989664, 1847857, -3259042, -4483125, -915012, 3074328, 3001592, -669096, -3824257, -3941949, -2371893, -1760266, -2954028, -4896872, -6219221, -6047996, -4183161, -1526474, 304145, 875372, 1813070, 4358783, 6649268, 5582054, 1479221, -1641464, -1412612, -179992, -934942, -2650007, -2535390, -1171236, -1770565, -5063607, -8640649, -11281598, -13960019, -15908001, -14002384, -8024746, -2750334, -2021653, -3816634, -4301393, -3888775, -5272408, -7570164, -7231642, -4119806, -2074558, -3043870, -4802499, -5462367, -6269201, -8084514, -8562538, -5586421, -1240978, 525993, -1018489, -3164179, -3937219, -4233749, -5800648, -8804308, -11765799, -12936706, -11496404, -7924063]
2923g924063M580961M761296M234143K341808o71723k347297n31263L038313M055832
2914A1538007R92443l094775m849265m449737l814990l093111j177714J461105
2906f488037K956834K868802K642583K863045K029911q16737l721413l805659
2898a470671j112148J303217J289482n5963p15674q25718j811640l409520l648096
2889a0456731j777419O43548J946586K001368J235073k06912j540180j362246
2881i516913K54432J290227O93554J35681J243073K713300K333841N77861l22573
2872e97517n2112k59274j271001j513407m38458M77343K29720l60292l86124J1652
2862d159470P54927K012321K716147J205259j690940k567604M0306L096100K907390
$$ y = [-7924063, -3343102, 1418194, 5652337, 7994145, 7322422, 4975125, 4443862, 7482175, 11538007, 12530450, 9435675, 4586410, 136673, -3678317, -6771428, -7949142, -6488037, -3531203, -662401, 1980182, 4843227, 6873138, 6056401, 2334988, -1470671, -2582819, -1279602, 9880, -46083, -761757, -1587475, -3399115, -6808635, -10456731, -12234150, -11590602, -9644016, -7642648, -6407575, -6614487, -8154667, -9516913, -9262481, -7972254, -7278700, -7143019, -5899946, -3186646, -852805, -274944, -597517, -649629, -908903, -2179904, -3693311, -4131769, -3654426, -3424706, -3784998, -4171122, -4159470, -3404543, -1392222, 1323925, 2529184, 838244, -1729360, -1689054, 1407046, 4314436]
2853D314436l8877k154371j586073J27769P58779o6076j038995p82912O88536
2844B22216J698044P34344j188849j402056N51729J848398N65558j155459m49195
2835A424730J511780J263088j325783k752101j366511L39133K1845j027729n47897
2826b459445R44724J387260O20760K81055J047609K005775K279890J575476m65791
2817G217313l607532n828783m700152m71703L612041M745531L294289J505189
2809E766193M97821m33088j915942l005485k143707N63093K696873J928197r84660
2800B969295k728164j527957O13675J077805O54383J942995M342251M036055o5414
2791A1314924l680331k808968M83644J159946j499648l490869k477680n59453
$$ y = [4314436, 4275559, 2121188, 535115, 662884, 1421663, 1355587, 316592, -466320, 222216, 1920260, 2654604, 1465755, 63699, 615428, 2463826, 3029384, 1873925, 1424730, 2936510, 4199598, 2873815, 121714, -1244797, -905664, -883819, -1911548, -2459445, -1514721, -127461, 493299, 774354, 1821963, 3827738, 6107628, 7683104, 7217313, 3609781, -2219002, -6919154, -7390857, -3778816, 966715, 4261004, 5766193, 6264014, 5830926, 3914984, 909499, -1234208, -671115, 2025758, 3953955, 2969295, 241131, -1286826, -673151, 404654, 1059037, 3002032, 7344283, 11380338, 11314924, 7634593, 4825625, 5309269, 6469215, 4969567, 1478698, -998982, -1558435]
2783a558435N6428L09627J410642J982357P51995l06726J316644M255954M760400
2774A2978886J938617j450135l178127l607749l440761k373280p72513m7999k05940
2765a59001N86601K613601L148375L82742l137619l553310r16606J382203J781790
2756B128776K094885L517409M044610J534088k526288m477483l076521p33492
2748B505984o7739q03431q51724N50114K006067K038281Q21197n18051j381500
2739D299198j746759j466378o17624j70035r91106k175864j765224M74982K366311
2730a792499K143698O78019j79980k79786p08208j490733j529459n35215O30275
2721c063888J444853J947131J554854l58540k374804j818748J193433K666587
$$ y = [-1558435, -1502007, -1192380, 218262, 2200619, 2952614, 2645888, 3962532, 8218486, 12978886, 14917503, 13467368, 10289241, 6681492, 3240731, 867451, 94938, 46939, -159001, 427600, 3041201, 6189576, 6572318, 3434699, -118611, -1035217, 346986, 2128776, 4223661, 7741070, 11785680, 13319768, 10793480, 6315997, 3239476, 2505984, 2438245, 1634814, 783090, 1333204, 3339271, 5377552, 6198749, 5680698, 4299198, 2552439, 1086061, 468437, 298402, -692704, -2868568, -4633792, -4158810, -1792499, 351199, 1029218, 849238, 569452, -138756, -1629489, -3158948, -3694163, -3063888, -1619035, 328096, 1882950, 1524410, -850394, -2669142, -1475709, 1190878]
2713A190878k29846m598108n089010j146423K185461J309052j151696n96762K802162
2704e324292M604307K473653j161210l196632l615092l734022l244215j442514
2696a4640017K13048k00862j442058l71745K878794M336183K082815m59378M01363
2687g201857K879870K561745n27361j927509K15950K334066J044841j970681l025511
2678e616447j671029o6144R99176K282842L278417K397667j18084k120886k584966
2669c219454k402589k019137p92776P90277R01104n34874r36720J181237L618782
2660c414150L522931J340157l30531n33433l90596o11123p79372p04389n53936
2651b454442K5474J185620J732239N50603j261454j662153o78811j5697k9729
$$ y = [1190878, 961032, -3637076, -8726086, -9872509, -7687048, -6377996, -7529692, -8126454, -5324292, -719985, 1753668, 592458, -2604174, -6219266, -9953288, -13197503, -14640017, -14426969, -14627831, -16069889, -16441634, -13562840, -9226657, -7143842, -7603220, -7201857, -4321987, -1760242, -2287603, -4215112, -3999162, -1665096, -620255, -2590936, -5616447, -7287476, -7353620, -6354444, -4071602, -793185, 1604482, 1486398, -634488, -3219454, -5622043, -7641180, -8433956, -7643679, -6742575, -7277449, -8214169, -7032932, -3414150, 108781, 1448938, 1118407, 584974, 194378, -416745, -1196117, -1900506, -2454442, -2428968, -1243348, 488891, 1039494, -221960, -1884113, -2562924, -2578621, -2608350]
2642b608350L82756R98832K89717j310498j184755J307430L248640K274882k08919
2633C189735j602050j517292p52100P16063K368328K026705j084817l951747l396383
2624d003558n52041J347390K002672L091840L572291P16339m102738n554986j750614
2615e233405K678286L049055O06746o72908k10530k88956j348224j563653m86713
2606c470302J80017l33386o16597M09564J717095J845779R65071J87145l50830
2597E33556j523980l395873m302108k459263J631639N116285N540532L215254
2589D356042M02757j194764j371397o16246K86678K47165j044999k113339j254777
2580b302880Q82868J844056O48121j048494j349590j42964J536734K603624K196963
$$ y = [-2608350, -2225594, -1226762, -937045, -2247543, -3432298, -2124868, 1123772, 3398654, 3189735, 1587685, 70393, -681707, 34356, 2402684, 4429389, 3344572, -607175, -4003558, -4555599, -3208209, -1205537, 1886303, 5458594, 6174933, 2072195, -3482791, -5233405, -2555119, 493936, 1100682, 427774, 217244, -71712, -1419936, -2983589, -3470302, -3290285, -3623671, -4240268, -3830704, -2113609, -267830, 697241, 884386, 533556, -990424, -4386297, -8688405, -11147668, -9516029, -4399744, 1140788, 4356042, 4758799, 3564035, 2192638, 1576392, 1863070, 2110235, 1065236, -1048103, -2302880, -1420012, 424044, 1072165, 23671, -1325919, -1468883, 67851, 2671475, 4868438]
2571D868438N50560m04848O23418J468513j087980n704603o895352k555635K571586
2562f565903L471526J549599J254755K731494K331245q20090l318131k660739
2554b026244k42473J460584J778550J216476L30198j04553L00385M61895q94037
2545B280781k923552l536513k336665o03331J204680L323927M414901K653161
2537D477389n88270j555625L93954J471014p28033l262301k210263J448347L331583
2528B777795J670564j051916j936944o80659J263599K549123K476076R47021j409829
2519F604830l404210l874247k410197M9165J635875J478907R55134J711523K719263
2510E466043J369211k170081m220921k561128J97352L78333j355476j247358J619746
$$ y = [4868438, 5418998, 5014150, 5637568, 7106081, 6018101, 313498, -6581854, -9137489, -6565903, -3094377, -1544778, -290023, 2441471, 4772716, 3952626, 634495, -2026244, -2268717, -808133, 970417, 2186893, 2517091, 2412538, 2712923, 3174818, 2280781, -642771, -4179284, -6515949, -7119280, -5914600, -2590673, 1824228, 4477389, 3889119, 2333494, 2727448, 4198462, 3470429, 208128, -2002135, -553788, 2777795, 4448359, 3396443, 1459499, 778840, 2042439, 4591562, 7067638, 8014659, 6604830, 3200620, -673627, -3083824, -3034659, -1398784, 80123, 1035257, 2746780, 5466043, 6835254, 4665173, 444252, -2116876, -1919524, -1541191, -2896667, -4144025, -2524279]
2501b524279L740562K165677j393328k963648j439504N25080M99233n70178j28693
2492b089078J977538K969754R87154k095989l027437j354943M97449Q10177K03099
2483a122276k99255p17536j121254j104918r69414j579439k239915p79999K943084
2474f990922N603478M324117N48484k001581k067727j362467j116561n97110P93450
2465b866839J994082J689111J76254q96788l70259J089616J610263M31433p14863
2456B142010L09505K669617L148824P45111j544375j074086M00672n24056l494434
2447B778788m725627k405097R70424K073908M83651j601864j810119N68093L754650
2438H6807M398260R08308l979426n668103k953337J004569L170047L671321L417893
$$ y = [-2524279, 1216283, 3381960, 1988632, -975016, -2414520, -1889440, -1390207, -1960385, -2089078, -111540, 2858214, 3845368, 1749379, -1278058, -2633001, -2135552, -1325375, -1122276, -1421531, -2139067, -3260321, -4365239, -5334653, -6914092, -9154007, -9934006, -6990922, -1387444, 2936673, 3485157, 1483576, -584151, -1946618, -3063179, -3660289, -2866839, -872757, 816354, 992608, 95820, -274439, 815177, 2425440, 2856873, 2142010, 2451515, 5121132, 8269956, 9015067, 7470692, 6396606, 6797278, 6273222, 2778788, -1946839, -4351936, -3381512, -1307604, -823953, -2425817, -4235936, -3667843, 86807, 4485067, 5393375, 1413949, -4254154, -7207491, -6202922, -3032875, 638446, 4056339]
2429D056339J469699k713667o134993m745828Q95141N308919M477003M31805j942562
2420A101856r14809J341476K728998L125311K488096J85804k741252l466125j371590
2411B477765L14208o81011j661131P57303M307665L739815q54402l681860j945767
2402B772585M47909j29906j552165p95698K73511j464967m283315m176308j417474
2393a0325828L90056M20175R26596K264655K420364J304484R66300J386138M52654
2384B05594j488140j507976O86879J805110M67019o48134J44258N36691j313563
2375a112262l082713k060743K95360Q43904k49189j51648K149732M579860M631254
2366E843555J673215k663579n339248m185434k07410L416571M817397M308377
$$ y = [4056339, 5526038, 2812371, -3322622, -8068450, -7173309, -1864390, 2612613, 3044418, 1101856, 187047, 1528523, 4257521, 7382832, 9870928, 10056732, 7315480, 3849355, 2477765, 2791973, 2110962, 449831, 1207134, 5514799, 9254614, 8400212, 4718352, 2772585, 3220494, 3090588, 1538423, 742725, 1016236, -448731, -4732046, -8908354, -10325828, -9935772, -9515597, -8589001, -6324346, -3903982, -2599498, -1633198, -247060, 205594, -1282546, -2790522, -2103643, -298533, 168486, -479648, -335390, 201301, -1112262, -4194975, -6255718, -5960358, -5116454, -5365643, -5517291, -3367559, 1212301, 5843555, 7516770, 4853191, -486057, -4671491, -4878901, -1462330, 3355067, 7663444]
2358G663444K159829j532642m533204l796276l39765J087720r32056j898503J336581
2349g84872M879242L513762j176109l327212j344190J090366J396938O07547j37987
2340D717485j047593j404698N0803J931740J185296j919804l323376q64808K684434
2331B009479L702331K157178L79437m34090p58604j175654j698439k003959j757541
2322D20138j215992j226008j793551j597682l61721k96423k764853m848314k682954
2313a6367360K399459N044982L401242J281254J770783K945528K094020M07930
2305B977838L97916J425768J161018l43205j197827j068840j094382j223099l75045
2296F60142J115088J648977R18205K93622N85430J093208J006319L33889o94356
$$ y = [7663444, 9823273, 8290631, 3757427, -38849, -378614, 709106, -222950, -2121453, -784872, 4094370, 7608132, 6432023, 3104811, 1760621, 2850987, 4247925, 4855472, 4717485, 3669892, 2265194, 2315997, 4247737, 5433033, 3513229, 189853, -674955, 2009479, 5711810, 7868988, 8248425, 7814335, 7055731, 5880077, 4181638, 2177679, 420138, -795854, -2021862, -3815413, -5413095, -5774816, -6071239, -8836092, -13684406, -16367360, -13967901, -8922919, -5521677, -4240423, -2469640, 475888, 2569908, 2977838, 3375754, 4801522, 5962540, 5619335, 4421508, 3352668, 2258286, 1035187, 660142, 1775230, 3424207, 4342412, 4636034, 5221464, 6314672, 7320991, 7654880, 6960524]
2287F960524j962169l037671l315062k697980j576198l05740P90437J298759J131239
2278b713861O58069P9168o79171j182690o70162M99898Q67742R4617k44203Q27980
2268b462613J821254R16262j220260k431381j948819o31327P25670J481455M67379
2259c282380k531742n069439m160624j74287L425459M307504L218434J635459
$$ y = [6960524, 4998355, 1960684, -1354378, -4052358, -5628556, -5934296, -5143859, -3845100, -2713861, -2055792, -1976624, -2655795, -3838485, -4508647, -4008749, -3141007, -3046390, -3290593, -2462613, -641359, 274903, -945357, -3376738, -5325557, -5956884, -5231214, -3749759, -3282380, -5814122, -10883561, -15044185, -15218472, -11793013, -7485509, -4267075, -2631616]
$$ [...]
##END NTUPLES=NMR SPECTRUM
##END=
