##TITLE=31Pdec_DE-106_7_8_oil_TFA2
CDCl3, 64 sc
 1.9.2025
##JCAMPDX= 6.0         $$ Bruker NMR JCAMP-DX V2.0
##DATA TYPE= NMR SPECTRUM
##DATA CLASS= NTUPLES
##ORIGIN= UXNMR, Bruker Analytische Messtechnik GmbH
##OWNER= root
$$ XWIN-NMR		Version 3.5
$$ Mon Sep  1 14:12:48 2025 Russian Standard Time (UT+4h)  she@DPX200
##.OBSERVE FREQUENCY= 81.013821
##.OBSERVE NUCLEUS= ^31P
##.ACQUISITION MODE= SIMULTANEOUS
##.ACQUISITION SCHEME= undefined
##.AVERAGES= 64
##.DIGITISER RES= 17
##SPECTROMETER/DATA SYSTEM= spect
##.PULSE SEQUENCE= zgpg30
##.SOLVENT NAME= CDCl3
##.SHIFT REFERENCE= (INTERNAL, CDCl3, 0, 198.062)
##AUDIT TRAIL= $$ (NUMBER, WHEN, WHO, WHERE, WHAT)
$$ ##TITLE= Audit trail, XWIN-NMR		Version 3.5
$$ ##JCAMPDX= 5.01
$$ ##ORIGIN= Bruker BioSpin GmbH
$$ ##OWNER= she
$$ F:/spectra/data/she/nmr/P31/2/pdata/1/auditp.txt
$$ ##AUDIT TRAIL=  $$ (NUMBER, WHEN, WHO, WHERE, WHAT)
(   1,<2025-09-01 14:11:35.46 +0400>,<she>,<DPX200>,
      <created by zg, POWCHK disabled, PULCHK disabled
       configuration hash MD5:
       00 E9 B6 7A A2 85 ED C7 34 08 36 98 17 FE 4E 26
       data hash MD5: 32K
       3D 29 CA F5 DA 7A FC 77 02 E9 24 47 DC A2 21 D9>)
(   2,<2025-09-01 14:11:37.75 +0400>,<she>,<DPX200>,
      <Start of raw data processing
       efp BC_mod = 2 LB = 1.5 FT_mod = 6 PKNL = 1 PHC0 = 1306.456 PHC1 = 309.5 SI = 64K 
       data hash MD5: 64K
       61 4A 9C E7 A3 FF C9 FB AA A8 0E 68 D0 C9 23 78>)
(   3,<2025-09-01 14:12:06.93 +0400>,<she>,<DPX200>,
      <pk PHC0 = 125.2098 PHC1 = -341 
       data hash MD5: 64K
       51 3B B2 C5 25 6B F6 03 80 BC F8 09 10 32 AC 6A>)
(   4,<2025-09-01 14:12:13.10 +0400>,<she>,<DPX200>,
      <abs ABSG = 5 
       data hash MD5: 64K
       0F 5C E4 7F 93 21 06 16 09 DF 63 A7 42 62 58 EB>)
$$ ##END=
$$ 
$$ hash MD5
$$ F5 D6 41 03 0A E8 5F E4 B3 C5 37 A7 A8 75 C4 A1
##$RELAX= 
##$RELAX= 
##$RELAX= 
##$RELAX= 
##$RELAX= 
##$RELAX= 
##$RELAX= 
##$RELAX= 
$$ Bruker specific parameters
$$ --------------------------
##$DU= <F:/spectra>
##$EXPNO= 2
##$NAME= <P31>
##$PROCNO= 1
##$TYPE= <nmr>
##$USER= <she>
##$AMP= (0..31)
100 100 100 100 100 100 100 100 100 100 100 100 100 100 100 100 100 100 
100 100 100 100 100 100 100 100 100 100 100 100 100 100 
##$AQSEQ= 0
##$AQ_mod= 1
##$AUNM= <au_zg>
##$AUTOPOS= <>
##$BF1= 81.014009
##$BF2= 200.13
##$BF3= 200.13
##$BF4= 200.13
##$BF5= 200.13
##$BF6= 200.13
##$BF7= 200.13
##$BF8= 200.13
##$BYTORDA= 1
##$CFDGTYP= 0
##$CFRGTYP= 5
##$CHEMSTR= <none>
##$CNST= (0..31)
1 1 145 1 1 1 1 1 1 1 1 1 1 1 1 1 1 1 1 1 1 1 1 1 1 1 1 1 1 1 1 1 
##$CPDPRG= <waltz16>
##$CPDPRG1= <>
##$CPDPRG2= <waltz16>
##$CPDPRG3= <>
##$CPDPRG4= <mlev>
##$CPDPRG5= <mlev>
##$CPDPRG6= <mlev>
##$CPDPRG7= <mlev>
##$CPDPRG8= <mlev>
##$CPDPRGB= <>
##$CPDPRGT= <>
##$D= (0..31)
0 1 0 0 0 0 0 0 0 0.06 0 0.03 2e-05 3e-06 0 0 0.0002 0 0 0 0 0 0 0 0 0 
0 0 0 0 0 0 
##$DATE= 1756721494
##$DBL= (0..7)
120 120 120 11 120 120 24 19 
##$DBP= (0..7)
150 150 150 150 150 150 150 150 
##$DBP07= 0
##$DBPNAM0= <>
##$DBPNAM1= <>
$$ [...]
##$SUBNAM3= <"">
##$SUBNAM4= <"">
##$SUBNAM5= <"">
##$SUBNAM6= <"">
##$SUBNAM7= <"">
##$SUBNAM8= <"">
##$SUBNAM9= <"">
##$SW= 400.765351723535
##$SWIBOX= (0..15)
0 1 3 0 0 0 0 0 0 0 0 0 0 0 0 0 
##$SW_h= 32467.5324675325
##$TD= 32768
##$TD0= 1
##$TE= 0
##$TE2= 300
##$TE3= 300
##$TEG= 300
##$TL= (0..7)
0 120 53 12 22 120 120 120 
##$TP= (0..7)
150 150 150 150 150 150 150 150 
##$TP07= 0
##$TPNAME0= <>
##$TPNAME1= <>
##$TPNAME2= <>
##$TPNAME3= <>
##$TPNAME4= <>
##$TPNAME5= <>
##$TPNAME6= <>
##$TPNAME7= <>
##$TPOAL= (0..7)
0.5 0.5 0.5 0.5 0.5 0.5 0.5 0.5 
##$TPOFFS= (0..7)
0 0 0 0 0 0 0 0 
##$TUNHIN= 0
##$TUNHOUT= 0
##$TUNXOUT= 0
##$USERA1= <user>
##$USERA2= <user>
##$USERA3= <user>
##$USERA4= <user>
##$USERA5= <user>
##$V9= 5
##$VALIST= <valist>
##$VCLIST= <CCCCCCCCCCCCCCC>
##$VD= 0
##$VDLIST= <DDDDDDDDDDDDDDD>
##$VPLIST= <PPPPPPPPPPPPPPP>
##$VTLIST= <TTTTTTTTTTTTTTT>
##$WBST= 1024
##$WBSW= 4
##$XGAIN= (0..3)
0 0 0 0 
##$XL= 0
##$YL= 0
##$YMAX_a= 17320
##$YMIN_a= -17271
##$ZGOPTNS= <>
##$ZL1= 120
##$ZL2= 120
##$ZL3= 120
##$ZL4= 120
##$ABSF1= 198.0616
##$ABSF2= -202.7028
##$ABSG= 5
##$ABSL= 3
##$ALPHA= 0
##$AQORDER= 0
##$ASSFAC= 0
##$ASSFACI= 0
##$ASSFACX= 0
##$ASSWID= 0
##$AUNMP= <proc_1d>
##$AZFE= 0.1
##$AZFW= 0.5
##$BCFW= 0
##$BC_mod= 2
##$BYTORDP= 0
##$COROFFS= 0
##$CY= -3
##$DATMOD= 1
##$DC= 0
##$DFILT= <>
##$DTYPP= 0
##$F1P= 0
##$F2P= 0
##$FCOR= 1
##$FTSIZE= 65536
##$FT_mod= 6
##$GAMMA= 0
##$GB= 0
##$INTBC= 1
##$INTSCL= 9.790993e-09
##$ISEN= 30
##$LB= 1.5
##$LEV0= 0
##$LPBIN= 0
##$MAXI= 10000
##$MC2= 0
##$MEAN= 0
##$ME_mod= 0
##$MI= 50
##$NCOEF= 0
##$NC_proc= -9
##$NLEV= 6
##$NOISF1= 182.463
##$NOISF2= 159.3651
##$NSP= 0
##$NTH_PI= 0
##$NZP= 0
##$OFFSET= 198.0616
##$PC= 4
##$PHC0= 1431.666
##$PHC1= -31.5
##$PH_mod= 1
##$PKNL= yes
##$PPARMOD= 0
##$PSCAL= 0
##$PSIGN= 0
##$REVERSE= no
##$SF= 81.0140089999434
##$SI= 65536
##$SIGF1= 159.3651
##$SIGF2= -187.1042
##$SINO= 113.3802
##$SIOLD= 16384
##$SREGLST= <1H.CDCl3>
##$SSB= 0
##$STSI= 65536
##$STSR= 0
##$SW_p= 32467.5324675325
##$SYMM= 0
##$S_DEV= 0
##$TDeff= 32768
##$TDoff= 0
##$TI= <>
##$TILT= no
##$TM1= 0
##$TM2= 0
##$TOPLEV= 0
##$USERP1= <user>
##$USERP2= <user>
##$USERP3= <user>
##$USERP4= <user>
##$USERP5= <user>
##$WDW= 1
##$XDIM= 65536
##$YMAX_p= 461957574
##$YMIN_p= -259783814
$$ End of Bruker specific parameters
$$ ---------------------------------
##NTUPLES= NMR SPECTRUM
##VAR_NAME=  FREQUENCY,     SPECTRUM/REAL,   SPECTRUM/IMAG
##SYMBOL=    X,             R,               I
##VAR_TYPE=  INDEPENDENT,   DEPENDENT,       DEPENDENT
##VAR_FORM=  AFFN,          ASDF,            ASDF
##VAR_DIM=   65536,         65536,           65536
##UNITS=     HZ,            ARBITRARY UNITS, ARBITRARY UNITS
##FACTOR=    0.49542278885378, 1,            1
##FIRST=     16045.7642231865, 0,            0
##LAST=      -16421.768244346, 0,            0
##MIN=       -16421.768244346, -259783814,   0
##MAX=       16045.7642231865, 461957574,    0
$$ Real data points
##PAGE= N=1
##DATA TABLE= (X++(R..R)), XYDATA
$$ [...]
##PAGE= N=2
##DATA TABLE= (X++(I..I)), XYDATA
9308 -8646243 -15035036 -16874055 -10921419 -4238735 -5003223 -12177385 -17962786 -17963461 -14905349
9299 -14905349 -13300259 -14276391 -16132454 -17074060 -16249047 -13945969 -11812605 -11520853 -12526789
9290 -12526789 -12701741 -11938609 -13085146 -17683954 -22836189 -25096006 -26084833 -30178605 -36383582
9281 -36383582 -37216693 -28487269 -16781253 -12834917 -18816954 -26639938 -28781622 -26102240
9273 -26102240 -23493605 -22283047 -20400722 -17244035 -14181769 -11247741 -7082100 -2066812
9265 -2066812 1711034 3861235 5882866 7294640 5058626 -1161349 -6018061 -3890760
9257 -3890760 3893990 10071566 9415974 3487981 -2477869 -5087052 -4529806 -2769122 -1393060
9248 -1393060 -500237 1196437 4701963 8781196 10546110 8694946 5298442 3382036
9240 3382036 3506442 4063775 4337201 5355712 7630654 10086964 11973743 13814571 15169621
9231 15169621 13641803 8554222 4023229 4950454 10222689 13219878 9540614 1144054
9223 1144054 -7675744 -14646293 -18526363 -18163309 -15578061 -16180468 -21677092 -25627378 -20951055
9214 -20951055 -9858490 -1059703 1397388 526266 -1451493 -6017401 -12119053 -14212732
9206 -14212732 -9818665 -3225192 1897744 7795051 15880664 20258333 14634536 2277815
9198 2277815 -7698333 -11949522 -14264511 -16750974 -16856538 -13704462 -10983875 -11612212 -14217015
9189 -14217015 -16523821 -18030635 -17832254 -14020148 -7430624 -2663926 -3138978 -7326493
9181 -7326493 -11006447 -10919440 -5871091 2411690 8759259 8589462 3779925 1074112 3427725
9172 3427725 6801488 7114641 5969286 6669197 8402382 7965994 4613051 -8418 -4437581
9163 -4437581 -7112482 -6039165 -1870569 985298 -353395 -2780502 -1320111 3913679
9155 3913679 8088525 7664534 3131734 -2853900 -7135298 -7157783 -3379270 301604 823551
9146 823551 -581293 -1079249 -159153 1524037 4445460 8045187 8970262 5461977 1056044
9137 1056044 -487845 -1429278 -5872518 -11490237 -12034128 -7495313 -4887321 -7942261 -12298543
9128 -12298543 -12855524 -10336551 -7924408 -6097133 -3844455 -1362852 1259812 5013098
9120 5013098 9155517 10163649 5894456 -1160312 -6315674 -6536733 -1479440 6225290
9112 6225290 11066243 8721865 1368376 -4515368 -6715801 -9554919 -16065616 -22610897
9104 -22610897 -24201847 -21246732 -17730989 -15877640 -15652073 -16519160 -16726948 -13852629 -8925363
9095 -8925363 -6774838 -9308490 -12091930 -11181606 -9508951 -11893338 -17067364 -20027074
9087 -20027074 -19921893 -20073139 -21641666 -22474194 -21122252 -17125585 -8628411 4785219
9079 4785219 17537736 22068815 17813813 11285848 7025735 3698975 -197269 -2535029
9071 -2535029 -1702718 109550 572800 741917 2369809 4562981 5675216 6395496 8475605
9062 8475605 11484515 12550539 9096587 1792370 -4483473 -3851073 4155150 12357417
9054 12357417 13077756 6926204 1318705 890467 3120923 3110803 -1498101 -10304002 -20115682
9045 -20115682 -24644073 -19337734 -7953339 392506 2090682 1836441 3056009 2099013
9037 2099013 -4160387 -10801517 -10648394 -3965051 2853948 5450691 3712928 -974131
9029 -974131 -5235049 -3223161 6965296 17754489 19343754 12232009 6458956 8024119
9021 8024119 12382680 13211251 11525861 12111015 14847010 14406490 7490939 -3114651 -11953443
9012 -11953443 -16334301 -17564553 -17603145 -15992107 -11476573 -6024665 -4218632 -7288964
9004 -7288964 -10731367 -10411524 -8189877 -7877306 -8399452 -6189531 -2562995 -2208403 -4447606
8995 -4447606 -3012188 3698584 8932616 7667150 4386056 5764120 10217090 10801651
8987 10801651 5713208 -286646 -3619399 -5215271 -6177652 -5414954 -2666112 131006
8979 131006 1651851 2285631 1973679 334100 -601308 2287439 7897162 10773141 8266823
8970 8266823 4361570 3978792 6773550 9602750 12044301 15297149 17566590 15285332
8962 15285332 8589233 1517580 -3470377 -7480923 -11169427 -12615769 -10788576 -7852829
8954 -7852829 -5726073 -2716717 3788206 12567871 18737647 18254509 11300787 2290601
8946 2290601 -2777269 -962643 4101345 5169392 -430731 -7570224 -10330937 -9771021
8938 -9771021 -11277485 -15957664 -19163651 -17479850 -12974516 -9416582 -7518279 -5425437
8930 -5425437 -1744815 2984675 6332715 5605431 1452088 -1121339 1294329 4492586
8922 4492586 1516469 -6472399 -10500281 -6817689 -2776421 -5566446 -11614160 -13711552
8914 -13711552 -13509901 -18191879 -27106864 -31093451 -25756233 -17257655 -12778031 -12390936
8906 -12390936 -13480328 -16433195 -21091999 -22793320 -18001074 -11049510 -9595104 -14570958
8898 -14570958 -19504348 -19427124 -16104536 -13795233 -13310653 -11832454 -6844369 983448 8312113
8889 8312113 12327275 13477326 14202171 14922172 13387723 8954207 4775414 3480374 3205780
8880 3205780 1287141 -196037 2736028 8181921 8685887 794258 -10038507 -16442349
8872 -16442349 -17405143 -16474830 -14804202 -10491960 -3741943 1829960 3758300 3278166 2187455
8863 2187455 75933 -3510913 -6594597 -7219788 -7199207 -10435321 -17398934 -23680733 -24753093
8854 -24753093 -20326564 -13124914 -5185040 2996443 10662514 15893243 16521719 11470061
8846 11470061 2050310 -7414682 -11848760 -10034054 -5967220 -3843583 -2881970 388372
8838 388372 5759027 8924968 7730959 5089042 4133621 3708589 1052572 -3489008 -7194279
8829 -7194279 -8707521 -8321865 -5808572 -838339 5066589 9571044 12142173 13457490
8821 13457490 13029087 10267057 7493398 8427219 12839239 15726281 13474242 8771237
8813 8771237 7523265 11983759 18365054 20684898 16275391 8214539 2712290 3215984
8805 3215984 6949497 8388601 5948137 3262581 3580556 5432083 5206450 1875909 -2835197
8796 -2835197 -7503011 -12000912 -16107943 -18958312 -19687020 -17638738 -12735242 -6696042
8788 -6696042 -2677779 -2106644 -2887900 -2446937 -1368327 -1825411 -3487682 -3963495 -3033363
8779 -3033363 -3210215 -5361158 -6606495 -3925331 2306075 9664072 16446734 21454151
8771 21454151 22931339 20065136 14786683 10396209 8902369 10669988 15319763 21247718
8763 21247718 25318370 25099613 20987853 14638887 6335447 -3880704 -13296114 -17780765
8755 -17780765 -16366516 -12099243 -7746414 -3213555 1637821 4194506 1484566 -5701541
8747 -5701541 -12979772 -16291054 -14708114 -10302013 -6485613 -5725098 -7594955 -9512072
8739 -9512072 -10076399 -10602835 -12403371 -14175457 -13991167 -12603448 -12232090 -12694205 -11649091
8730 -11649091 -8899851 -7503346 -9376509 -12122101 -12008784 -8641856 -4934683 -3416657
8722 -3416657 -4274466 -6567980 -9806248 -14135026 -19687123 -25665534 -29780029 -29379488 -23986991
8713 -23986991 -16160834 -9022181 -3552294 665359 2756917 414038 -7044823 -16454956
8705 -16454956 -22484296 -21746602 -15568402 -8907825 -6087443 -7206386 -9138891 -9971293
8697 -9971293 -10970242 -13445971 -15732343 -15567816 -14153903 -14654144 -16903449 -17199249 -14220911
8688 -14220911 -11446949 -11628185 -12476560 -11365243 -11236555 -16430578 -23740502 -23936929 -13853771
8679 -13853771 -1604111 3514279 2155664 1691974 4880928 7190813 4545091 -1431946
8671 -1431946 -6711963 -9449150 -10007425 -9435057 -9053096 -9063776 -7101394 -1290259 4758689
8662 4758689 4173434 -4185248 -13041761 -15691967 -13778255 -12599653 -12531408 -10209308 -5724708
8653 -5724708 -2794477 -2524376 -2216249 -283620 2258259 4885745 7241894 6205052 -540087
8644 -540087 -7425467 -4726876 7812114 17835124 15369246 5239973 -1025133 -558868
8636 -558868 788312 137112 477364 2384597 1380338 -4107395 -8817383 -8323364 -5823228
8627 -5823228 -7137068 -12099811 -15173662 -13098487 -8279011 -4959222 -4851662 -6865060
8619 -6865060 -9171308 -10642982 -10991573 -10327585 -9136787 -8828341 -11244822 -16247507 -20374489
8610 -20374489 -19927540 -15583039 -11936411 -11886093 -13500834 -13474680 -11628781 -10233992 -10482396
8601 -10482396 -12018951 -15205010 -20992409 -27727393 -30258597 -24522002 -13047503 -4182802
8593 -4182802 -4404030 -11623676 -17441841 -16380453 -11446166 -9411107 -11936546 -13763931
8585 -13763931 -9852441 -2101967 2458261 -664673 -8872394 -15575168 -16941838 -14845088
8577 -14845088 -13225949 -12871264 -11324943 -7412698 -3288046 -1155678 -563206 -778542 -3297939
8568 -3297939 -8903158 -14037436 -14070597 -9582871 -5483057 -3923040 -2345838 639193 2101994
8559 2101994 -55189 -2596851 -1150391 3368528 6079639 4773810 2112451 1565366
8551 1565366 3722556 6830360 9087848 9748676 8660681 5143699 -1985359 -12007354
8543 -12007354 -20465611 -22479524 -18688797 -14993097 -14717791 -14098651 -8415157 14715
8535 14715 4114245 1265930 -3913761 -6244467 -5812430 -6028172 -8650071 -12409375 -14984068
8526 -14984068 -14875006 -12054068 -7709847 -3357321 -349254 -288947 -4514263 -11830275 -17951149
8517 -17951149 -19294883 -16877292 -14544561 -13867400 -13026097 -10503590 -7324031 -5221907
8509 -5221907 -4886306 -6679865 -10925147 -16440439 -20545084 -21629129 -20427608 -18130433
8501 -18130433 -15009154 -11958511 -11466000 -14973652 -20045466 -22135906 -19447580 -14968687
8493 -14968687 -13248715 -15537654 -18469692 -17656344 -12304124 -5581522 -468718 3106571
8485 3106571 5839961 5624354 -391502 -10321171 -17127149 -15317212 -6706437 1650055
8477 1650055 4378214 1990321 -795178 -216723 2464714 2116479 -4051114 -12107947 -15601117
8468 -15601117 -14115795 -14313596 -20819692 -29161294 -30920490 -24220405 -15567224 -11697532
8460 -11697532 -12925834 -15088984 -14988150 -12222458 -7781116 -3237035 -644473 -1099988
8452 -1099988 -3153632 -4176004 -3834076 -4770066 -8665242 -12845742 -12963519 -8881103 -5319988
8443 -5319988 -5621445 -7341839 -6223294 -2475596 219352 806643 1681548 3072656 1279606
8434 1279606 -5087327 -10910502 -10534030 -5931801 -4711257 -10337520 -17984368 -20723679
8426 -20723679 -16974180 -10711774 -6440050 -5324400 -5075410 -2669390 2120790 5809755
8418 5809755 5091781 1624784 835416 5161289 10663693 12006757 8936131 5334053 3007729
8409 3007729 -239591 -5870901 -11004742 -11559688 -7434337 -2386046 595994 1706034
8401 1706034 2189109 2054041 1002583 112917 847782 2735374 3513478 1934416 -513129
8392 -513129 -1339434 -130287 853711 -571980 -3613320 -5109797 -3149372 885694 4480538
8383 4480538 6944244 8672502 8635234 5548827 1652412 1726732 6485027 10016646 6921763
8374 6921763 -121773 -3692695 -1381441 1992455 1894833 -526187 -1898652 -1788336 -2121751
8365 -2121751 -3989191 -7251844 -11348012 -14396019 -13405362 -7883797 -1917715 -131490
8357 -131490 -2366788 -4689102 -4995271 -5004283 -6686303 -9323180 -11111446 -11881459 -12713217
8348 -12713217 -13528997 -12481685 -8246889 -2511608 706854 -953187 -5008012 -5977641
8340 -5977641 -1108506 6070780 8402290 1624775 -11094643 -20868871 -20576450 -11929920
8332 -11929920 -4052757 -3399530 -6491022 -5300458 1577834 7416203 6862221 1921424
8324 1921424 -2972225 -6647958 -8843973 -6819320 923166 10386354 16248537 18329360
8316 18329360 19554673 19521230 15242125 7185878 -770974 -7170487 -13531807 -18777441
8308 -18777441 -18549343 -11691733 -2832250 3486190 7275114 9723148 9467281 5337630
8300 5337630 -60307 -2700496 -1473153 1949631 5802348 8766734 9474769 7557955
8292 7557955 4373627 1731803 969611 3088421 7181119 8645294 2952528 -7321552
8284 -7321552 -13359945 -10588308 -4451377 -2335828 -3501049 -1929078 3356024 6672738
8276 6672738 4000099 -2130388 -6820641 -7974160 -6251964 -3076783 -24853 1959254
8268 1959254 3652336 6289150 9105833 9903843 7812203 3520692 -2506962 -9200842
8260 -9200842 -12743807 -9138753 -38054 7170701 6932943 1134232 -4176119 -5639852
8252 -5639852 -4762312 -5021448 -8298270 -12939700 -14456568 -9604041 -507507 6976447 9676373
8243 9676373 9803518 10509494 11569380 11199074 9406746 6911335 2940501 -2673342 -6673257
8234 -6673257 -5226535 788807 6339489 7840654 5392702 -60720 -7931300 -15516244
8226 -15516244 -18206038 -14705304 -9806893 -9303522 -13168377 -15931839 -13352226 -7035939
8218 -7035939 -2528684 -3857166 -9865802 -15484991 -16946625 -15567072 -15176123 -16181184
8210 -16181184 -14887510 -9580909 -3977682 -2051658 -2290768 -1052518 310109 -3095984
8202 -3095984 -11244642 -17655632 -18108305 -16198680 -17221166 -20277141 -20335578 -15588641 -8632464
8193 -8632464 -1901661 3896483 7487574 7250741 4075063 860805 -1083471 -2357231
8185 -2357231 -2424147 153399 3924527 4689317 763300 -5052246 -10061879 -14741380 -19223552
8176 -19223552 -20384872 -15884590 -8706898 -3959342 -2536204 -1442823 642108 2005238
8168 2005238 2035971 2989228 6469270 10747268 12832161 11391864 6772062 32460 -6890485
8159 -6890485 -11750902 -14219191 -16414156 -19745877 -22074792 -19772873 -12541897 -4599723
8151 -4599723 -394958 -125314 -543884 290172 638445 -1978139 -6934630 -11306084 -13960210
8142 -13960210 -16670949 -20640661 -23961297 -24028713 -21268720 -18758002 -18583235 -19950558 -20763101
8133 -20763101 -19917788 -17813644 -15242443 -12273481 -8659249 -5522691 -5428226 -9067200 -12688989
8124 -12688989 -11787455 -7661621 -6760671 -11852843 -17504534 -17526552 -13856250 -13420625 -17771670
8115 -17771670 -21102625 -18689233 -12249127 -5395863 1584356 9204512 14248884 12309447
8107 12309447 4481712 -2135467 -2232429 1222705 622126 -6149386 -11835572 -8436003 1700841
8098 1700841 7417798 2050356 -9010120 -16116697 -16266635 -12487704 -6874464 -470849
8090 -470849 2790084 -239368 -4937919 -3453808 2890298 3762858 -5047446 -14544358 -14944384
8081 -14944384 -8179116 -2334590 195372 1897905 2305779 -721553 -4432536 -3981872
8073 -3981872 -894617 -1539375 -7495417 -14259265 -19407443 -24753672 -29532599 -29063649 -22850130
8064 -22850130 -17371617 -17193945 -18747931 -16778281 -12157700 -9094768 -8688835 -9631098 -11734324
8055 -11734324 -14193671 -13465327 -7824242 -1655638 -270112 -2442905 -3310485 -3047607 -6598358
8046 -6598358 -14916405 -22366820 -24050714 -20811576 -15575972 -9608195 -4607290 -3869404
8038 -3869404 -7872037 -12015149 -12407264 -11425841 -13848236 -19508704 -23999845 -25475697 -26083387
8029 -26083387 -26519894 -24002495 -17654430 -12035016 -11801844 -14877351 -14810938 -9609111 -4491682
8020 -4491682 -4640492 -8344190 -10096214 -8631066 -7958016 -10202147 -11405078 -6830326 2236288
8011 2236288 10345562 15068693 18377312 21075981 20218662 13647631 3656266 -6027974
8003 -6027974 -13977786 -19470275 -20595567 -17839818 -16776806 -21773059 -28062076 -26048406
7995 -26048406 -14287108 -2455595 864168 -1853584 -2893805 -499413 996899 -477779
7987 -477779 -2216646 -2204528 -2080133 -3787677 -7091030 -11381722 -16539670 -20748999 -20684036
7978 -20684036 -15845582 -10361675 -8360766 -9111234 -8667647 -5324944 -1730675 -1854364 -6599098
7969 -6599098 -12052672 -12273235 -5218755 4033234 7943306 4974160 1303822 3080519
7961 3080519 9245836 13897979 13931137 11775146 11246543 12952401 14023093 11207971 4238464
7952 4238464 -3227066 -6453559 -4041630 980782 4566390 4925225 2283242 -2390846
7944 -2390846 -7103083 -9191356 -7878765 -5383184 -4190852 -4725788 -6936550 -11729426
7936 -11729426 -18317187 -22265588 -19637811 -12102256 -4860278 -567590 1310076 359477
7928 359477 -4740083 -11679906 -14803692 -11792882 -6531202 -3539103 -3047848 -3722100 -6446026
7919 -6446026 -11683080 -15602916 -13251702 -4984429 3622664 8024642 8028033 5301873 1139995
7910 1139995 -2342119 -1837543 3960496 11722716 15536467 11513049 361766 -13271638
7902 -13271638 -23315695 -25664220 -21062159 -14704803 -11762924 -12892875 -14632514 -13909068
7894 -13909068 -10914132 -7433762 -4319562 -2214253 -3271467 -9071877 -16532510 -19047565
7886 -19047565 -13706473 -5260916 -324069 840854 3348965 9044452 12938850 9795830
7878 9795830 1119311 -6900670 -10369063 -9861613 -7043167 -2687060 1556160 2539766 -1177260
7869 -1177260 -6715637 -9280718 -7007336 -2273611 1613194 3611947 4391754 4129572 2548623
7860 2548623 641681 234295 1142712 597272 -2941821 -6606754 -5931393 -713840 3875045
7851 3875045 2723004 -3760882 -10100903 -10927516 -5553677 1727284 5690840 5232431 4325747
7842 4325747 7122868 12503992 15086712 11803231 5624058 1747144 1497954 1565146 -1255438
7833 -1255438 -6122207 -9374109 -8878144 -6270707 -4654602 -4781241 -4659912 -2985890 -1402278
7824 -1402278 -2396981 -6237202 -11324568 -16344157 -20201613 -20931168 -17356088 -11778379 -8509775
7815 -8509775 -9093749 -10831772 -10623181 -8658109 -7697704 -9870878 -14429145 -17801205 -16529123
7806 -16529123 -11612594 -8843598 -12495534 -19667611 -23823029 -22924990 -20142411 -17159999
7798 -17159999 -12203727 -5882841 -3416673 -7816095 -14868784 -18416883 -17528173 -15102070
7790 -15102070 -12314535 -8332016 -3584269 188933 1817772 233276 -5650991 -14025228
7782 -14025228 -19967451 -21315481 -21789373 -24649820 -26800586 -24223119 -19925224 -19676644
7774 -19676644 -21647759 -18002612 -7092056 3250572 6308599 3897995 792457 -2040929
7766 -2040929 -4923281 -5377607 -1404742 4177854 6711600 4920401 357761 -5558460
7758 -5558460 -10822254 -12179296 -9265462 -7148292 -10325249 -15724197 -16333222 -11003987
7750 -11003987 -5702146 -4759905 -5933592 -5769066 -5134463 -6107508 -6792724 -3714441 2048271
7741 2048271 5549587 4893274 3456285 4019487 4368646 1245054 -4096119 -7621725 -8181655
7732 -8181655 -7942598 -8177091 -8397696 -9236078 -11976090 -14883789 -14405464 -11046396 -9493706
7723 -9493706 -11292804 -12410592 -10606891 -9770805 -12881124 -15912274 -14362629 -11456520
7715 -11456520 -13034420 -17388591 -17548365 -11778301 -4493470 1733689 7144817 8769484
7707 8769484 2560428 -7509851 -11393608 -6226451 629610 4064521 7362879 11965280
7699 11965280 11324434 2312637 -5742296 -3056328 5204063 5750993 -3641201 -11799411
7691 -11799411 -10191606 -2102540 5273194 9905373 13347954 16006884 17473509 18211780
7683 18211780 18384039 17081773 14178643 11362196 10457131 11550254 12613679 10605850
7675 10605850 4515530 -2014953 -3857146 -1564708 -1650407 -7174826 -12340363 -10515439
7667 -10515439 -3651145 1381575 2199268 734401 -2776934 -8182860 -10355517 -4564438
7659 -4564438 3734970 3641074 -5476039 -11871000 -7759394 665993 3877339 2083884 1504653
7650 1504653 3124446 2321715 -2866935 -9140774 -12771511 -12982648 -11210990 -9826853 -10578788
7641 -10578788 -12373185 -12375858 -10943487 -12557359 -19292689 -26358064 -27747418 -24280267 -22306746
7632 -22306746 -25666609 -32231170 -37397671 -37839901 -32597291 -23731319 -15858220 -12347942
7624 -12347942 -11719788 -9661335 -4366784 2055848 7060473 10077906 11078555 9051835
7616 9051835 3520873 -3299737 -7584097 -7846612 -7063207 -9415184 -14736899 -18102802 -16145843
7607 -16145843 -11633565 -9314097 -9229294 -8036125 -5841483 -6689142 -11656612 -16389500 -17317591
7598 -17317591 -15993785 -14932055 -13293470 -9863207 -6790733 -6682285 -8558439 -10118014
7590 -10118014 -11588766 -13781193 -14652004 -11979123 -8022949 -7418732 -11025414 -15295602
7582 -15295602 -17233775 -16872467 -15433231 -14211629 -14953620 -18260282 -21577376 -21371884 -17353170
7573 -17353170 -12440720 -9054749 -7770292 -8917249 -12525382 -16626561 -18234075 -16414146
7565 -16414146 -12513200 -7514284 -1297865 5473056 10678696 12102306 8378509 -289093
7557 -289093 -10469987 -16032730 -13370510 -5624275 1000266 4458104 7291616 10473637
7549 10473637 11104157 7419924 2564905 1146208 3972444 7912254 9589422 7930623
7541 7930623 4210685 737144 -1097357 -1918783 -3060961 -4614373 -6017617 -7943485
7533 -7943485 -11453256 -15270866 -16324058 -13858509 -10983703 -10723203 -11856378 -10319584
7525 -10319584 -4437235 2353177 4380847 -692602 -9279359 -15175796 -15456910 -12377794
7517 -12377794 -9510124 -7651940 -5470982 -2528922 204907 2125648 3533172 4406543
7509 4406543 3600585 -518120 -8186976 -15978050 -17424834 -9003083 4120930 11870347
7501 11870347 10281746 5447754 4858848 8821834 12847617 13845655 10210804 805762
7493 805762 -10469291 -13502698 -2882208 12587415 19162130 15421681 11804758 13571059
7485 13571059 14304446 8751247 2334228 2262145 6282195 6926428 2367456 -3283358 -7498742
7476 -7498742 -11223212 -14760193 -16795054 -17054994 -16196303 -13326411 -6721594 2797279 11274025
7467 11274025 14834258 12929400 8833228 6971496 8717692 11136950 11223316 10081549
7459 10081549 10268534 10595341 7942983 3541965 2121165 4234655 4754862 354194 -6473253
7450 -6473253 -12165525 -15648049 -15855877 -11758928 -6888382 -7368214 -12645310 -14912654 -11102097
7441 -11102097 -7902972 -10159554 -12437885 -9111537 -5277411 -8383067 -14637700 -14219282
7433 -14219282 -6689332 -805507 -631894 -1967637 -2343247 -4762612 -10114049 -14410202
7425 -14410202 -15694978 -16451372 -17274543 -15200748 -10575541 -8808712 -12287915 -16330320
7417 -16330320 -16239573 -13259857 -10445227 -7327567 -2276721 3192842 5597034 2925213
7409 2925213 -4484469 -14108579 -21672722 -24248287 -23182427 -21271211 -18129785 -12326115
7401 -12326115 -6482857 -4557641 -4953665 -2912612 575146 -200518 -5180355 -7546772
7393 -7546772 -5295877 -4981953 -10062052 -13985958 -10518413 -3699611 -989097 -2512821
7385 -2512821 -4132513 -6153740 -11277620 -17226386 -18800659 -15454852 -10823289 -6614582
7377 -6614582 -2601408 -748585 -3521229 -9109133 -13193703 -14369919 -13821391 -11776302
7369 -11776302 -8815901 -8234492 -11804304 -15258379 -13539313 -8733256 -6919641 -8669470
7361 -8669470 -9119564 -6769195 -5476949 -7216668 -9079654 -8892826 -8525417 -9756021 -10982328
7352 -10982328 -9749059 -5671360 -339092 3074974 1048724 -5793020 -10681600 -7802713
7344 -7802713 -345829 3655914 2452263 1452856 3547969 5626193 5456865 4815713 4039467
7335 4039467 688655 -3780470 -3355471 2636581 5838510 139375 -9249112 -13679050
7327 -13679050 -12895998 -12626199 -14588081 -16029263 -16425833 -17325503 -16763391 -10700445 -39170
7318 -39170 9613818 15430926 19190017 21288546 18905781 12087116 6498865 6843714 10839403
7309 10839403 12827858 10976048 7820945 5255384 2356477 -1751383 -5486042 -6619067
7301 -6619067 -5535927 -5191581 -7392894 -10099880 -9675504 -5560297 -1169350 69232 -2170160
7292 -2170160 -6382208 -11171092 -14378138 -12733340 -5440314 2817380 5472549 958690
7284 958690 -5970864 -9912396 -9990311 -9180485 -10256839 -13212020 -15843937 -16349677 -15381859
7275 -15381859 -15048788 -15748256 -15461380 -13263584 -11937181 -14971919 -21650470 -27170359 -27560228
7266 -27560228 -23088877 -17296434 -14131335 -15349896 -18909023 -20362085 -17556187 -13340047
7258 -13340047 -11738965 -12308500 -10936258 -6008419 -897525 281153 -2935182 -7911002
7250 -7911002 -11858938 -13492279 -13376714 -13174650 -13264690 -11449268 -6042085 272211 2661170
7241 2661170 410270 -2317567 -2663614 -2346861 -3296999 -3922546 -2461933 -778255 -1331654
7232 -1331654 -2852343 -2840614 -2423060 -4354629 -7269008 -6745806 -2464921 116330 -3236245
7223 -3236245 -10173179 -15171353 -15699216 -13191185 -10168526 -8584448 -9490047 -12044244 -13364867
7214 -13364867 -10901543 -4775993 2762410 9207856 12463472 11222774 6344822 1079517
7206 1079517 -1614436 -1702253 -1114858 -879663 -416824 848377 2445092 3208132 1874838
7197 1874838 -1991799 -6683734 -8862159 -6853469 -2806349 -195441 -113462 -1765194 -5173835
7188 -5173835 -10153695 -13184190 -9684791 -795351 6032500 5820415 2208427 1468356 3360350
7179 3360350 2953325 66610 618448 7186496 13699023 12991472 6044852 -313786 -2531328
7170 -2531328 -2671786 -2838340 -2277987 -852793 -1037910 -4137136 -7444813 -7910027 -6678258
7161 -6678258 -7025738 -8899050 -8776422 -5077622 -826946 155893 -2287316 -5297628 -6632992
7152 -6632992 -6231664 -5111140 -4121671 -3360441 -1968123 719989 3004480 1315063 -5151551
7143 -5151551 -11425128 -11433201 -5849629 -2168008 -5667994 -13106272 -17553543 -17044866 -15066764
7134 -15066764 -13779230 -10972295 -4519712 3513685 9079370 10433547 8541790 4907899
7126 4907899 952176 -1685414 -2507839 -3434160 -6643188 -10974368 -12282368 -8170750 -1298659
7117 -1298659 2895598 1368108 -4017596 -8632132 -9151098 -5710828 -867586 2696652
7109 2696652 3299815 377302 -4758761 -8338360 -6589400 -312801 4379655 1956769
7101 1956769 -6346304 -13973945 -16345292 -14885836 -14085865 -16907133 -23416227 -31244868
7093 -31244868 -35999340 -33609380 -24693604 -15290810 -10746750 -9483414 -5371653 3699493
7085 3699493 12239547 13174681 5547459 -5273760 -13771816 -18697597 -21633938 -23360360
7077 -23360360 -23125023 -20874822 -18403024 -17383431 -17221211 -16187703 -14160571 -12401569
7069 -12401569 -10623921 -6755490 -748748 3778724 3826878 1083046 -727937 -649759 624473
7060 624473 4741357 13491783 22973567 25806665 20881608 15550409 15320418 16553929 13478204
7051 13478204 7515869 3802518 2109438 -1674462 -6961769 -8931072 -7302094 -7213085
7043 -7213085 -10355902 -12537352 -12113820 -13345229 -17593531 -18313688 -10619765 -355011
7035 -355011 3223982 149758 -1896868 329978 2299312 -240073 -6297149 -12992447
7027 -12992447 -18195486 -19175616 -14053296 -6035833 -1568905 -2526782 -4067987 -1709136
7019 -1709136 3190864 6508100 6276125 2804253 -2711363 -7677502 -9104791 -7078756
7011 -7078756 -4828473 -3956489 -2347349 1727895 6359693 8610604 7675941 3775080 -3233314
7002 -3233314 -12045731 -19120158 -21615078 -19315100 -13095112 -4699761 1307624 189074
6994 189074 -5995161 -8645209 -3166826 4911182 8039753 6474325 5227963 5307810 4144256
6985 4144256 2023556 1519376 1922863 460966 -1839086 -1772750 -1017087 -4859314 -13066466
6976 -13066466 -18494454 -16813050 -12002472 -9565464 -9198112 -7474805 -3960069 -1015906
6968 -1015906 199047 647735 1561477 3154318 4053352 1932318 -3252165 -7226334 -5822383
6959 -5822383 -1029965 1357430 -94054 -1521229 -1197595 -1957147 -4673989 -5555348 -2825441
6950 -2825441 -342454 -1008574 -2127964 -1412135 -1865951 -5444870 -7319225 -3063496 2909681
6941 2909681 3456072 -315830 -2084721 -1445481 -2975675 -5744767 -3919106 1296032 576469
6932 576469 -8942841 -16694172 -11912791 2332119 14071413 16743706 12936639 7480117
6924 7480117 2846751 -146421 -1842440 -3371674 -4089190 -1341549 4605354 8598536
6916 8598536 7468926 5687490 8893416 14197042 13465027 5496512 -2108331 -4384743
6908 -4384743 -5540826 -10983644 -18492083 -21961671 -20047607 -15943909 -11073713 -4612082
6900 -4612082 1572831 3186766 -165047 -3420890 -2728418 41351 1759429 3330495
6892 3330495 6684495 9049250 5419005 -3493042 -10629536 -11247609 -8127998 -6084861
6884 -6084861 -5350504 -4125527 -4454941 -9847298 -17542087 -18881302 -9648147 3568214
6876 3568214 10089596 6289618 -1990854 -6413062 -3589967 2783432 5100962 -1524212
6868 -1524212 -13564584 -21049692 -17453015 -6749522 1427274 2235998 -1641865 -6081995
6860 -6081995 -9474522 -10283750 -6086872 1962442 7587412 6397953 2285306 2760235 9182312
6851 9182312 15770612 17712117 15578955 11033559 3149827 -8015650 -17524796 -19246903
6843 -19246903 -12651946 -3394023 2365249 2648251 17080 -714782 3460686 9398251
6835 9398251 8825270 -2836667 -19156536 -28016806 -24716113 -16023231 -10276230 -8021356
6827 -8021356 -5343643 -2314383 -2776327 -7031019 -10048830 -8030031 -3002758 823994
6819 823994 2476457 3776234 5402479 6083210 5155438 3506046 1430849 -2648140 -9880109
6810 -9880109 -17945360 -21856090 -18553883 -10232244 -2450563 819882 -225410 -2998835
6802 -2998835 -5527944 -7368251 -8545599 -8405659 -5556734 665148 8129424 12330250
6794 12330250 10866234 7300407 7937275 13830947 18441262 14990391 4395101 -5906020
6786 -5906020 -9575932 -6298249 -896797 596578 -4056524 -10054105 -9541638 -1553782
6778 -1553782 4827913 1491119 -6999596 -8764888 -820653 7240032 7291560 3265390 3582028
6769 3582028 8615295 11615634 9079517 4182773 786854 -828484 -1736791 -1663720 296577
6760 296577 4329746 9813442 15302686 18850717 19472491 17638158 13702384 7768789 2163613
6751 2163613 804307 3378311 3474034 -3105549 -10743347 -10373371 -2120786 4893892 5594962
6742 5594962 4838124 7971898 11991616 10598065 3685726 -3216218 -6457806 -6877841 -6632361
6733 -6632361 -7217813 -9291500 -11084038 -8420836 179354 9672293 13416029 11080615
6725 11080615 8076501 7932622 9210711 9552958 8333506 4807056 -1855549 -9041527
6717 -9041527 -11040988 -5370095 3692114 9745014 10271190 6634050 894521 -4986309
6709 -4986309 -8715363 -8978495 -6492611 -2675421 1385594 4052724 3695090 1476212 1057684
6700 1057684 3818859 6913397 7794723 7442891 6655316 3001466 -4433767 -10591435 -10116356
6691 -10116356 -5446540 -3529797 -5832490 -7896030 -8221962 -10302423 -14616235 -15940179
6683 -15940179 -11620778 -6005230 -2742165 993629 7133069 9283198 470187 -14535728
6675 -14535728 -22697960 -18362886 -8786187 -3255962 -2709146 -2140539 1611482 7457397
6667 7457397 12318941 13250814 9387860 3653966 825313 2456872 5214188 5184666 2113403
6658 2113403 -1610888 -4286195 -5723109 -5986269 -4784704 -1819476 2648636 7114970
6650 7114970 9111452 7453868 4062273 2241090 3392280 6615708 10541002 13465280
6642 13465280 12778087 7470915 1045528 -1426000 477589 2489442 2212746 1803480 2943794
6633 2943794 3474309 1657120 132671 2011367 5398277 5498397 908309 -5213763 -9199996
6624 -9199996 -9395617 -5727003 317194 5661279 7914742 7378172 5274647 1368156 -4293060
6615 -4293060 -8616189 -7817267 -2553123 2045683 1983334 -1856008 -5693350 -6736551 -4975733
6606 -4975733 -2870786 -3446248 -7213988 -10956151 -10945654 -7267503 -3672239 -3577837 -7654261
6597 -7654261 -14558156 -21785965 -25960723 -24740968 -19280594 -13413701 -10079966 -9763186
6589 -9763186 -12065480 -16472091 -20841710 -21339397 -15884626 -7257526 -1304032 -1313680 -4387932
6580 -4387932 -4313297 1130443 6583802 4809246 -4244273 -12983458 -15538680 -14044365 -13519948
6571 -13519948 -14422091 -14247202 -13303120 -13343322 -12267601 -6584698 1103826 3904835 1296005
6562 1296005 1074745 7385131 13285394 10738900 3149465 895655 6798380 13323252
6554 13323252 13884293 9825808 4635628 -1935495 -9809035 -13623491 -7962689 4022379
6546 4022379 12598301 12328339 6708082 1273900 -3171676 -7832415 -10510936 -7791719
6538 -7791719 -1200262 3561560 3726559 1750123 -152808 -3364698 -8778173 -13374849
6530 -13374849 -14212798 -13082521 -13630053 -15817455 -16922129 -16679694 -17637932 -20940260 -24999890
6521 -24999890 -27927148 -28473714 -25554236 -20070312 -16074649 -16231269 -17108481 -13670752 -7934103
6512 -7934103 -7406412 -13890048 -19641061 -17302153 -8798115 -1018350 3190209 5641755
6504 5641755 7537863 8148997 7368174 5849425 3228491 -1028878 -5563611 -8114201 -8100452
6495 -8100452 -6714141 -5251019 -4536098 -4887549 -5675075 -6229986 -7649507 -11520294 -16300926
6486 -16300926 -18005261 -15669277 -12747542 -11423783 -9534792 -5865671 -4309387 -8484744
6478 -8484744 -15351658 -19013609 -18688887 -17919754 -17391035 -13947850 -6640069 910214 4724833
6469 4724833 3602011 -1748574 -8864686 -12809095 -9441760 -512885 7499266 10300891
6461 10300891 8867261 5630359 1168257 -4238163 -8796755 -10763937 -10376676 -9373340
6453 -9373340 -9365808 -10192334 -8870879 -1959509 8874905 15944154 13864484 7015555 4171703
6444 4171703 6978715 9144338 6565137 2006326 -1186936 -3563867 -5276150 -3261544
6436 -3261544 3330353 9358778 9628105 5486169 1795675 202021 -939422 -2663164
6428 -2663164 -5340675 -10183692 -16643327 -20121359 -16676055 -9041258 -3756296 -2669732
6420 -2669732 -1369877 3532482 9362893 11205087 8333062 4891689 4878905 7569427 8257838
6411 8257838 3722771 -3643485 -8576839 -9437630 -9328780 -10368768 -10731855 -9538248 -10480943
6402 -10480943 -15979119 -20359536 -14849000 671663 16093896 22423396 20347536 15868071
6394 15868071 11857874 7431053 2840476 488699 1196277 2632728 2392843 881634
6386 881634 206405 1286831 3077013 4122031 3831267 2304723 150044 -917355 1442875
6377 1442875 7496196 13687289 15485964 12181857 7150376 3198025 -121250 -3942023
6369 -3942023 -7646612 -10699254 -14283992 -18435544 -19628318 -14687724 -5945310 1204295
6361 1204295 5424515 10105106 16475454 20406439 18328449 13096540 10727209 12878016
6353 12878016 15562028 14674790 10099438 4353134 -221566 -1948672 423717 6394944
6345 6394944 12534644 14360625 10212649 2879087 -2908460 -4247560 -1392319 3474020
6337 3474020 7626121 8543181 5090233 -1222155 -6950873 -9462366 -8869020 -7330955 -7004784
6328 -7004784 -8424623 -9887643 -8616361 -3918348 858393 1391272 -2161906 -4796777
6320 -4796777 -2601911 2980095 7853542 9769578 8494997 4347405 -502092 -1633628
6312 -1633628 2649705 7086273 4527667 -4799076 -13262516 -15638770 -14624913 -14904848
6304 -14904848 -15909276 -13730466 -7593521 -904203 2864903 2521976 -1416359 -6651431
6296 -6651431 -9103099 -6089583 171126 4495275 4305526 1157397 -2982834 -7741199
6288 -7741199 -11825305 -12124454 -7860552 -3113439 -2025799 -3162547 -2180545 1139678 3067914
6279 3067914 2981509 4698116 8734367 8791204 548918 -10073890 -13628808 -10056426 -8023810
6270 -8023810 -11491851 -14264673 -10342071 -3310984 -1062281 -5647548 -13233419 -20887663
6262 -20887663 -28078272 -33112622 -33237270 -28304851 -20991899 -13783871 -8347774 -6365535
6254 -6365535 -7540968 -8202140 -5761726 -3189135 -4564211 -7497858 -5803805 215050
6246 215050 2521866 -3591159 -12656144 -16287641 -12937945 -7137678 -2871101 -1655309
6238 -1655309 -4348166 -10471729 -16857014 -20168426 -20044267 -17757267 -13520139 -7609722
6230 -7609722 -2406083 -298822 -551996 -753182 -294692 18593 573287 2332884 4399715
6221 4399715 4842287 3421040 1230660 -1523708 -5001532 -7981882 -9285985 -9869846 -10552165
6212 -10552165 -9040671 -3325758 2709455 2291106 -4590517 -9496682 -5932673 2751855
6204 2751855 8995010 10724112 10894924 9954336 4731592 -4849513 -13098469 -15051536 -12727299
6195 -12727299 -12310288 -16611504 -22597619 -25705393 -24623512 -21728750 -20035805 -19980470 -18829530
6186 -18829530 -13795755 -6250949 -1489608 -2511686 -5053489 -1882490 7431939 14262313
6178 14262313 10597035 -1250319 -11332912 -12865371 -7048671 1651707 10140001 15350638
6170 15350638 12998787 1977509 -11330308 -17033931 -11171897 249087 7324447 5761460
6162 5761460 38493 -2584800 -522142 892684 -2862854 -8657799 -9493074 -4075366
6154 -4075366 1707308 3513003 3767715 5481951 5717022 367645 -7633789 -11282897 -9699980
6145 -9699980 -8824441 -11228361 -11905916 -7106889 -1523839 -1677359 -5911105 -6903086 -2635442
6136 -2635442 1074456 -343827 -3671643 -2922990 2365114 7066272 7269725 4148093 1012311
6127 1012311 -1115798 -3797004 -8148451 -13009385 -16288702 -17215109 -16539645 -14877360 -11895879
6118 -11895879 -7619058 -3800663 -2885161 -5348663 -8818101 -10538047 -10443772 -10831104 -12687688
6109 -12687688 -13571252 -10669201 -5622034 -4057504 -9074078 -16778866 -20381364 -18015569
6101 -18015569 -14124532 -13061336 -14054958 -13843822 -12011572 -11136982 -12406028 -13645616 -12313637
6092 -12313637 -8837764 -6036179 -6030181 -8571873 -12034018 -15155299 -17467886 -18410501 -16890084
6083 -16890084 -12398335 -6210553 -452927 4028732 7593337 9413838 7293588 1406423
6075 1406423 -3731597 -3898698 -936491 -565671 -4385042 -7821199 -7317801 -5566824 -6515438
6066 -6515438 -8314609 -5823426 1102796 6587162 6423660 2755192 -214250 -1785980
6058 -1785980 -4119789 -8494609 -14151728 -19073672 -20435754 -16167916 -7612469 1090704
6050 1090704 7512308 12708174 17211643 18246716 13601824 5984515 436990 -978532
6042 -978532 821965 5195901 11396300 16361375 16829511 13168481 7982677 2089826 -4497304
6033 -4497304 -9083447 -8613297 -4889669 -2466120 -1584536 1228051 5257898 4778706 -2103397
6024 -2103397 -10114166 -15107243 -19417077 -24976607 -27295664 -22174912 -13737971 -9042299
6016 -9042299 -7796781 -4417378 1479056 3883396 -218300 -6634230 -10473395 -11717646
6008 -11717646 -12348369 -11945296 -8746410 -3073313 1986108 2540598 -3283815 -13043093 -21032022
5999 -21032022 -23218903 -20363273 -15157418 -8627952 -1711984 2379236 1198391 -3385022
5991 -3385022 -8279957 -13432041 -18648192 -19296468 -11951102 -2795243 -2380272 -11164173 -17865050
5982 -17865050 -14606390 -6821941 -4486813 -9337089 -15253543 -16883376 -13266598 -6062610
5974 -6062610 1568884 6277757 7691541 8486819 9812073 9814063 8252852 8162146 10216279
5965 10216279 9980454 4438042 -2821770 -6905498 -8132781 -9004523 -8972460 -7585175 -8792510
5956 -8792510 -15430415 -22362186 -22530300 -18101265 -17671470 -22736839 -25202115 -19951319 -12252360
5947 -12252360 -9327544 -10820305 -12029738 -11990768 -13342234 -16588903 -18713417 -16694174
5939 -16694174 -10161354 -1730742 3998194 3866827 165565 -973594 3208478 8959720
5931 8959720 11879288 12861790 15196827 18332244 18618878 15092977 10437417 6341260 1766009
5922 1766009 -3479204 -7103902 -8043874 -8797700 -11351647 -12813001 -8736512 -475676 4539431
5913 4539431 1553192 -5037222 -6679364 -1031395 5675407 6799870 2914284 -162957
5905 -162957 1184564 5118939 7587285 6608351 3290380 164282 -985718 -353353 521194
5896 521194 731761 976308 2299523 4487274 6043191 5077271 216210 -7876128 -15351304
5887 -15351304 -17403181 -13031280 -6281998 -1526465 974265 3448214 6625374 9712268
5879 9712268 12689482 15660051 16805801 14030973 8327341 2762160 -1554974 -5571645
5871 -5571645 -8620681 -8223762 -4320403 -347116 1364948 2343988 4212312 4880209 1512626
5862 1512626 -4072538 -6319994 -2715255 2702581 4095980 1018797 -1189397 1388175
5854 1388175 5814757 6415834 3105648 1692111 5212890 9442764 9707416 7932232 8339666
5845 8339666 9489056 6926934 2209960 2028686 7616614 11990078 10233313 6416827
5837 6416827 6552460 9777400 11198738 9640015 7453224 5243882 1979612 -1037606
5829 -1037606 -1176630 874304 1555364 -215421 -1402735 922554 6053523 10578622 11185058
5820 11185058 7015288 900334 -2689438 -2781010 -3697771 -9485588 -18042410 -23672079 -24202458
5811 -24202458 -22287861 -20717363 -20255231 -21553339 -24839006 -27224601 -24443742 -16473728
5803 -16473728 -8020634 -2468320 904719 2512209 -44499 -6987268 -12612007 -10828968
5795 -10828968 -2627909 5657126 10085707 11315503 10069722 5026999 -3550094 -11241709
5787 -11241709 -12586269 -5875251 5459855 14918581 16683515 9805081 -392793 -6855773
5779 -6855773 -7749954 -7535398 -10605235 -15820276 -18394568 -15159763 -6493338 4740890
5771 4740890 13880902 16274628 11995720 7762605 10168594 16998980 19470886 13935909
5763 13935909 6598237 4111997 4207207 435286 -6914054 -10951553 -8666454 -5006131
5755 -5006131 -4791026 -5825166 -3507497 1198472 2663354 -1832157 -8923556 -13480584
5747 -13480584 -13742843 -12010088 -11840505 -14699508 -18383610 -18964440 -15019313 -9306546 -5507339
5738 -5507339 -4419383 -4619847 -5624389 -8162769 -11565023 -13063784 -10530249 -4910128
5730 -4910128 558410 2983365 1634047 -2113835 -6305003 -10049376 -13553986 -16588916
5722 -16588916 -17786276 -16060309 -12057487 -7524672 -3865628 -1989483 -2773335 -6528868
5714 -6528868 -12164852 -17493011 -20254400 -19041379 -14358797 -8922777 -5237581 -2327496
5706 -2327496 2976953 10375906 14472661 11368624 4615495 910905 1135952 50782
5698 50782 -5056887 -10043454 -9926102 -5443332 -861796 2171862 5395786 9853261 14011918
5689 14011918 15704274 13860199 8545363 1161570 -5471878 -9041858 -10026360 -10689569
5681 -10689569 -11719249 -11501471 -9260936 -7319898 -8988056 -14920578 -22534791 -28591963
5673 -28591963 -31674319 -32687288 -33694401 -35699004 -36806556 -33463698 -24808306 -14856166
5665 -14856166 -8329506 -4997223 -1173101 3109185 2751338 -4179898 -10796450 -8594358
5657 -8594358 1568147 10724004 13430319 12783123 13099489 13333646 10716323 6482902 3874514
5648 3874514 3128421 2338456 1496875 2082445 3805010 4815302 4065878 973133 -5305688
5639 -5305688 -13001066 -16344106 -11676176 -3845020 -1524123 -6326786 -11631371 -12710940
5631 -12710940 -12473252 -15134798 -19385391 -21429691 -21134119 -21135411 -22178148 -23075885 -23675106
5622 -23675106 -24323960 -23593034 -20127714 -16130515 -15187866 -16278781 -13688359 -4652098 5685500
5613 5685500 9738840 6729970 3428608 5111174 8370903 5210657 -6688909 -20610430
5605 -20610430 -28257291 -27988054 -24078639 -20311268 -17353300 -15146099 -14108628 -13703674
5597 -13703674 -12873004 -12412246 -14023981 -16505573 -16277527 -12838132 -9956625 -9399609 -7502538
5588 -7502538 -1687086 2974080 -787697 -11502821 -19069351 -16670553 -7946842 -602950
5580 -602950 2699974 3963699 4068546 2310125 417134 1881858 6301071 8515699 5540415
5571 5540415 1077708 102503 1547741 596379 -3049943 -4316066 -765671 3622422 5024367
5562 5024367 5570049 8687299 12153305 10964879 5394548 811634 -163855 -191243 -1358551
5553 -1358551 -1816302 125037 2954167 5274870 8265385 12010651 12752437 7349642 -1642829
5544 -1642829 -8593283 -10962364 -10062566 -7340057 -3336129 275272 821335 -2640997 -8298684
5535 -8298684 -13134545 -14425766 -10784252 -3523650 3634639 7722928 8733831 7745149
5527 7745149 4694765 8052 -3486240 -3487851 -2236598 -4132183 -9113065 -11609763 -7374699
5518 -7374699 888884 6393525 5627512 1418887 -1004265 81376 1477367 -586058
5510 -586058 -5661997 -9859872 -10858692 -9853641 -7986044 -3711739 4026510 11963385 14915137
5501 14915137 11581392 5582956 790595 -2472489 -6482296 -12797805 -19948312 -23721065
5493 -23721065 -20624343 -12185804 -4695623 -3136683 -6233351 -8773476 -7413008 -2514423
5485 -2514423 3987026 9934193 13300994 13864278 13860357 14879126 15422476 13993739 12634573
5476 12634573 13625290 14237459 9718590 1171574 -4878669 -5683699 -5699904 -8706803 -11654617
5467 -11654617 -10188173 -6468229 -6596730 -11986064 -17770634 -19392113 -16982703 -12833190
5459 -12833190 -7851529 -2111702 3052468 5497730 4515000 1499661 -1786899 -4962137
5451 -4962137 -8599400 -12580738 -15840667 -17654125 -17904209 -15972323 -11350023 -6134719
5443 -6134719 -4272542 -6223419 -6934238 -2417461 3740712 4862979 979136 -1245954
5435 -1245954 1295059 3756500 1331647 -3338061 -4364774 -826599 3097423 4154722
5427 4154722 2745268 871017 166807 1165310 2555248 2147370 -122338 -1861662 -2119229
5418 -2119229 -2998185 -5353678 -5750972 -778274 7817934 15446969 19912917 20838343 16429479
5409 16429479 6090417 -4649878 -7576547 -1445754 6009135 7261404 2692482 -2384906
5401 -2384906 -4778316 -4818020 -3174312 416749 5551404 10169602 11559556 8267356 1710446
5392 1710446 -4129956 -5842629 -3730643 -977891 22178 -761249 -2427355 -4005015
5384 -4005015 -4111596 -2266387 -786595 -2715056 -7227066 -9827669 -8032867 -3960459
5376 -3960459 -152579 3556934 6760680 5941968 -701213 -8563686 -11689677 -11069109 -12466110
5367 -12466110 -16335570 -16186389 -8863859 -582008 1292297 -1897492 -3589572 -2553437
5359 -2553437 -4006701 -10979460 -20271544 -27683878 -32061683 -32542519 -26998184 -16556162
5351 -16556162 -7685291 -5513327 -7479631 -7565301 -4666972 -2310839 -1696781 -400423 2157182
5342 2157182 3202634 1497875 -1048486 -3974077 -9434721 -16528510 -19679119 -16525558
5334 -16525558 -12805694 -14107877 -16362276 -11324690 63674 7245655 3939401 -4080941
5326 -4080941 -7535722 -4330492 1740255 7694055 11352959 8297335 -4011747 -19389413
5318 -19389413 -26632218 -21977571 -13152442 -8746901 -8214866 -6197825 -2593974 -2048023
5310 -2048023 -4858709 -5396524 -1193648 2405111 278859 -4406180 -5086008 -1614817 665265
5301 665265 205423 1146983 5291864 8276963 6393029 2615336 2488044 7193492 13765807
5292 13765807 19339715 21963436 19734868 12861309 5113178 190213 -1927449 -2590569
5284 -2590569 -1011970 3343946 7534531 8904288 10004717 14327522 18620726 16095854
5276 16095854 7356636 999080 1409522 2793785 -1144635 -7862249 -11552859 -13111174
5268 -13111174 -17707053 -24804860 -27478513 -21888918 -12335913 -5870692 -5399881 -8781968
5260 -8781968 -11764251 -11185879 -7593669 -4855760 -5295088 -6164273 -3720670 507220 1674703
5251 1674703 -680705 -1945471 -257720 341540 -2906541 -5981112 -3843446 1636378
5243 1636378 4128935 1394252 -2962594 -5370461 -5900991 -6158555 -7062204 -9061845 -11815232
5234 -11815232 -13471868 -12682182 -11111982 -11391280 -12995451 -13191123 -11643172 -10322086 -8797817
5225 -8797817 -4181035 2982723 7315633 5521581 769603 -2676658 -5316919 -9049392
5217 -9049392 -11351564 -7945917 388955 8473587 13271323 15307329 14483388 9806328
5209 9806328 3613071 619414 971519 -967631 -8100645 -14876219 -13939971 -5976841 1280202
5200 1280202 2878613 1472618 1824729 3917579 3887489 434088 -2608662 -1123305 3750219
5191 3750219 7280465 7653062 7557098 8654686 8483404 5476389 3271336 5450288 8534509
5182 8534509 5981877 -1730701 -7069134 -5990812 -2702819 -2404879 -4934032 -8119888
5174 -8119888 -12178358 -17162829 -20225365 -19323535 -16561832 -14521874 -12308996 -8431685
5166 -8431685 -4422515 -2168243 -738678 651822 -75646 -3602367 -5696420 -2808932
5158 -2808932 1802025 2847001 1221842 1473213 3233438 2123852 -1637017 -2761118
5150 -2761118 330082 3064545 2764264 2748715 5524226 7501894 4719686 -52409 -558903
5141 -558903 4445818 9820277 10652418 7515267 4754674 4876236 5418345 1982073 -5481904
5132 -5481904 -11125826 -9686306 -3022210 2406840 3404817 2173986 1407229 1156328 820078
5123 820078 540667 -280529 -2724415 -5667627 -6243114 -4041263 -2280362 -3685082 -7270304
5114 -7270304 -9954806 -9551498 -6014652 -1700527 -53348 -1641484 -2138571 2752059 10937983
5105 10937983 15942088 14854018 10573568 6627542 4240861 4532004 8376346 12841034
5097 12841034 12623842 7025598 1451261 189666 1561089 1816194 -281012 -4522113
5089 -4522113 -10456058 -15092852 -13607117 -5452591 3355448 6701940 4451886 388036
5081 388036 -2545321 -3081517 -1232021 955742 1354541 1429942 3837061 5847301 1308088
5072 1308088 -8855377 -14980603 -11252823 -3550952 -271758 -1832782 -4816344 -9775232
5064 -9775232 -17258205 -21559712 -17503180 -10037577 -8072998 -11096251 -11142349 -6694248 -4533848
5055 -4533848 -6903653 -6690839 1025609 10319867 12070858 5267804 -3447964 -8038525
5047 -8038525 -7678039 -5873668 -7351255 -13479806 -19426295 -18584809 -10815353 -2959772 -17396
5038 -17396 207108 1477246 2200370 -1758716 -9262897 -13357022 -9348835 -939809 3425430
5029 3425430 -242060 -7535250 -11641229 -11570303 -11593108 -12982078 -10981937 -2478051 7337696
5020 7337696 10450233 5975518 -81764 -3698695 -6190394 -8658095 -8543480 -3966092
5012 -3966092 2116978 4843440 2849202 -1011395 -3101903 -1812987 2224576 7525803
5004 7525803 13173255 18873635 23804647 26395470 25810807 22924356 19549970 17514535
4996 17514535 17977591 19837943 19430140 14586428 8471317 5657474 4891350 980626 -5851003
4987 -5851003 -9177547 -6801514 -4585775 -6271631 -7096350 -2971885 1355314 491065 -1826468
4978 -1826468 338366 3965421 2518158 -1842294 -2075343 646471 -1115782 -7225213
4970 -7225213 -9277292 -4270938 1334688 2518276 1087380 -1259882 -5666778 -9807593
4962 -9807593 -8252024 -1968208 1426997 -90110 467843 6523541 11175071 8381200
4954 8381200 2743471 1622370 3910572 3377183 -1479797 -7032871 -10532951 -11386912 -9135633
4945 -9135633 -4340325 538891 3852795 6167595 7588529 6853619 4289496 2241849
4937 2241849 1735824 2128080 3865540 7379254 10075518 9452047 7728028 7405158 4808517
4928 4808517 -3617851 -10982909 -6896591 5731743 12967974 10221608 7531316 11458982
4920 11458982 15138395 12034813 7103222 6677846 7972477 6759812 6239786 10189700
4912 10189700 15281897 17489381 18633918 20329510 19399044 15204781 13158972 15398161
4904 15398161 16852968 15553407 16678996 21369299 23049569 20275764 20285045 23863203 21583049
4895 21583049 12494397 10030778 19788082 28748822 27858459 26921809 33853069 38897547
4887 38897547 35463191 35964156 48051040 56682415 52108174 53029422 75207919 100041124
4879 100041124 105678627 105613165 119535779 132654777 132376623 157472248 239938133 309339318
4871 309339318 242879669 33303975 -170835267 -234402712 -182407042 -129304891 -121530830
4864 -121530830 -119677023 -98128681 -80457504 -81457318 -81929110 -71411034 -65711817 -70030748
4856 -70030748 -65802895 -46665667 -32439035 -34813754 -39735073 -35885222 -32367950 -35318167
4848 -35318167 -33134990 -19494476 -8379378 -11325698 -19134725 -20231154 -19251986 -23222127
4840 -23222127 -25865706 -20825970 -16342768 -21504610 -29651217 -30140089 -26432966 -27890811
4832 -27890811 -32059609 -29865822 -22583414 -19880459 -24407298 -29856925 -31847539 -31052811
4824 -31052811 -27857343 -22503180 -18643696 -19491936 -22369715 -23040842 -22624355 -24310466 -26381345
4815 -26381345 -24819497 -20410916 -17385376 -16945615 -17179645 -17351604 -17753219 -17458053 -16246579
4806 -16246579 -16244932 -17979857 -18086531 -15075364 -13716568 -18415032 -24968923 -24584245 -14800393
4797 -14800393 -1767378 7300169 9840035 7083953 1518768 -4569857 -10244117 -15489557
4789 -15489557 -19188005 -19642942 -17857455 -17075984 -17785759 -17014567 -14328696 -13849861 -17347355
4780 -17347355 -19978604 -16959326 -10457798 -5357120 -1878709 2276950 5323047 2859023
4772 2859023 -5227103 -14322466 -20883204 -24477097 -24906767 -21645559 -16102524 -11006337
4764 -11006337 -7513653 -5324486 -4602150 -5022379 -4364218 -1391309 1122325 -108641 -3424594
4755 -3424594 -4382261 -2922248 -3935362 -9976930 -17402706 -21386715 -21751438 -21763978 -23153250
4746 -23153250 -24490556 -23691840 -20457732 -16236503 -12707621 -10727585 -10486366 -11867942
4738 -11867942 -13965896 -14950461 -13920875 -12709516 -14003554 -17423011 -19508240 -18324425
4730 -18324425 -16079962 -16087124 -18854861 -22324223 -24402522 -24211580 -22376981 -21098518 -22465439
4721 -22465439 -25865911 -28477806 -28630594 -26762170 -23109793 -17523169 -12160612 -10641213
4713 -10641213 -12815867 -13909808 -11194642 -8208346 -9476247 -14056749 -17739202 -19116499
4705 -19116499 -19633122 -19458870 -17428710 -14287054 -12418893 -12557244 -13341265 -13486532 -12023410
4696 -12023410 -7594246 -478605 5585270 6758687 3865483 973029 -245732 -1684677
4688 -1684677 -4685488 -8098309 -10773127 -12831600 -13688586 -11761652 -7440885 -3770757
4680 -3770757 -2390011 -875089 3463010 8264038 7474811 -1417117 -13640333 -22219798
4672 -22219798 -25527456 -27319561 -29503102 -28469342 -20902449 -10413743 -4225376 -4066579
4664 -4066579 -4687614 -1882206 2251318 3628787 1936194 -556708 -3242855 -7351238
4656 -7351238 -13288580 -19861937 -25144051 -27171758 -25534736 -23024437 -23293228 -25896979
4648 -25896979 -26465010 -22986340 -18644694 -16709507 -16198693 -15029615 -13925733 -14089294 -14149385
4639 -14149385 -12817473 -11654380 -11574434 -9538030 -3099227 4028096 5721108 1557067
4631 1557067 -3087597 -4227067 -2748094 -1421470 -1961053 -4526420 -7215329 -6967923 -3710520
4622 -3710520 -2179212 -6660598 -15436732 -23233680 -26960736 -25878930 -19254887 -8687643
4614 -8687643 -348726 662214 -3148865 -5808920 -6710436 -9409289 -13185498 -12962455 -7743756
4605 -7743756 -2330566 291132 1946770 3559349 2958615 254631 -934218 -162389 -2061456
4596 -2061456 -8421827 -13957764 -13718480 -9783681 -6573445 -4133313 -817967 1182502
4588 1182502 -1510994 -7322828 -11033921 -10374906 -7722398 -5837018 -4694689 -2265565
4580 -2265565 3005268 9599219 12430914 7506816 -2038806 -7975611 -6759555 -3647129
4572 -3647129 -4792484 -9444518 -13657787 -17785404 -24760556 -32772967 -35229143 -28345361
4564 -28345361 -15247528 -2523113 4518714 3949078 -1826583 -7021811 -7323842 -4344058
4556 -4344058 -3284439 -6460943 -11449458 -15282593 -17511788 -18478649 -17200665 -12651557
4548 -12651557 -6007043 -302070 2039102 1069626 -1051680 -2303176 -2768865 -4127534
4540 -4127534 -7341874 -11487993 -14511968 -14057290 -8303878 1636327 10140635 10966830 4154000
4531 4154000 -3297865 -5220287 -2661195 -954838 -2826609 -6661910 -9612379 -9759512
4523 -9759512 -6593799 -1972346 376124 -1285029 -4149112 -4442362 -2687280 -2847936 -6632666
4514 -6632666 -11203711 -12786954 -10458594 -5754093 -148498 5883158 11566623 14465754
4506 14465754 11801460 4334123 -2204160 -2327788 2452084 5195629 2581448 -1300218
4498 -1300218 -1944894 -1098757 -2918687 -6713739 -8124280 -5825065 -2633761 -954766 -1357425
4489 -1357425 -4928326 -12348726 -20320378 -23238941 -19544227 -13104535 -7781107 -4462403
4481 -4462403 -4291900 -9921697 -20424130 -28508345 -27243581 -18565224 -11628959 -12623123
4473 -12623123 -18663461 -22159695 -19150184 -12216030 -6397287 -3924791 -3244331 -2023330
4465 -2023330 203260 2222887 2494145 -270118 -6449215 -14247511 -20160626 -22221963
4457 -22221963 -22097130 -22456581 -22968765 -20839743 -15215662 -9159802 -6719846 -9117157 -14011276
4448 -14011276 -17530521 -17024536 -12925574 -8182755 -5364136 -4635113 -5054638 -6659883 -9684786
4439 -9684786 -12496370 -12512630 -9489051 -6354225 -6278054 -9794893 -14890986 -19062251 -21290804
4430 -21290804 -22537614 -23808341 -23414783 -17848843 -6901139 3857291 8392064 7003979
4422 7003979 4782662 3985046 1969921 -2714004 -6669820 -6730510 -5429653 -7622546 -13157117
4413 -13157117 -16707486 -14800484 -9758149 -5971348 -5122691 -6537880 -9673867 -13544607
4405 -13544607 -15087424 -11602861 -5197930 -1688943 -3616783 -7032538 -7517074 -6867969
4397 -6867969 -10033267 -16812784 -21484595 -21136107 -19502521 -20561488 -22779957 -22963351 -21913713
4388 -21913713 -21634820 -19676074 -12172817 -1977063 2110039 -4101274 -14685931 -20897512
4380 -20897512 -20606106 -17807040 -15548455 -13242390 -10224428 -8215521 -8871149 -10825790
4372 -10825790 -10948100 -8061594 -4200335 -2300852 -3776656 -8302064 -14130318 -17670468
4364 -17670468 -14921749 -5984313 2924921 5289995 2248418 1474699 7388979 15837499
4356 15837499 19996032 18287358 14175178 10906371 9203640 8070662 5273573 -1169568
4348 -1169568 -9645161 -15045985 -14531885 -11024712 -8581248 -6970828 -3973004 -400745
4340 -400745 1101449 334413 -1240669 -3845417 -8178658 -12641812 -15521453 -17852488 -20149328
4331 -20149328 -19080140 -12488685 -4909145 -1720971 -166879 6120657 14948588 16865769
4323 16865769 9449276 1468708 219236 2706927 3044916 1316892 515194 820617 1694895
4314 1694895 4309180 7359650 5877197 -839297 -5503132 -2851894 1594657 -467243
4306 -467243 -7536188 -11416898 -10101386 -9172965 -11290935 -12679815 -11372711 -11553904 -16481156
4297 -16481156 -22362788 -23189481 -18595168 -13446648 -11253040 -10950155 -9914502 -7963398
4289 -7963398 -7264060 -8681668 -9575632 -6651743 -663470 3814332 3948675 2050193 2397284
4280 2397284 6414178 12101160 16587627 18160590 17242516 16051977 15772568 14220962 8868251
4271 8868251 1792871 -2248013 -2894461 -4542324 -8627931 -11131910 -9970037 -8924279
4263 -8924279 -10697109 -11907073 -9711358 -7936617 -10853001 -15627492 -17319109 -16986024
4255 -16986024 -17789698 -17249063 -11820294 -6160322 -8446154 -17763454 -25381976 -28141998
4247 -28141998 -30984619 -35462343 -35919032 -30127749 -24576668 -24621406 -26845867 -25954628 -22630453
4238 -22630453 -19600920 -16081370 -11635778 -10024259 -13126972 -15730354 -12807732 -8044088
4230 -8044088 -8228713 -12372126 -14079458 -12814408 -14234776 -18884776 -18999783 -9978265 1277670
4221 1277670 4434362 -1502836 -8440773 -10394342 -9451779 -10273933 -12928337 -13675013 -10803760
4212 -10803760 -6763905 -4700751 -5197562 -7046630 -9310033 -11445321 -12957834 -14434199
4204 -14434199 -17497644 -21722376 -22776676 -16516560 -5049715 3759952 3788180 -3645592
4196 -3645592 -11817005 -14838486 -11636483 -5637340 -1842638 -3468218 -10105611 -18396162
4188 -18396162 -24236336 -25017155 -21281192 -16672345 -14930996 -16266146 -17763165 -17398484
4180 -17398484 -15750741 -13719095 -11412887 -9952649 -11093161 -13940707 -15522380 -15663793
4172 -15663793 -16935904 -18502779 -15919481 -9658721 -6969971 -10802340 -13996717 -10720335
4164 -10720335 -6611445 -9399970 -15812344 -17557546 -15050410 -14457293 -15540982 -13933015
4156 -13933015 -11598755 -12902441 -14310780 -11459556 -11748514 -23431556 -36374486 -33847074
4148 -33847074 -21055714 -18013754 -24331699 -20787262 -10340888 -19470097 -40512899 -13149929
4140 -13149929 97635751 230750550 283896259 231940288 147035030 100809156 91663654
4133 91663654 81500377 61118292 48792381 49510601 49016411 39810552 28549290 20493847
4125 20493847 14048516 9051560 7494305 7717967 7546361 9888273 16677958 21889021
4117 21889021 19562080 14084801 13218217 15482313 14337435 10861152 11533251 15920666
4109 15920666 17341452 14876081 14476112 17603347 18167431 12755673 6140653 3816421
4101 3816421 4777574 4307049 3862 -6583255 -11576891 -11813170 -8542445 -6742962 -8186669
4092 -8186669 -8035562 -2172858 5554010 8768022 7999368 8129287 9068487 6733160 1886153
4083 1886153 -378080 -1931 -2394549 -8101339 -10198145 -4941102 2032259 3966063
4075 3966063 1768344 619018 2542633 6293757 10735342 14435908 14852997 11339814
4067 11339814 6779484 3833411 1978530 240389 -51331 2315824 5720666 7808672
4059 7808672 8473790 9061902 10411426 12692233 15034528 14870940 10531146 4701518 1493792
4050 1493792 -190790 -5233897 -13037353 -15950554 -10246966 -2777961 -1705383 -5387878
4042 -5387878 -6483948 -3554141 -1728020 -3445312 -5145357 -3390207 841211 4667132
4034 4667132 6341067 5534031 3747332 4130328 7825766 11238176 10133264 5370927 1086930
4025 1086930 -1332453 -3283637 -4651800 -4782438 -6472961 -12524984 -18548837 -16693419
4017 -16693419 -8106031 -3955720 -10488872 -20119682 -22434403 -17717419 -12846765 -8915641
4009 -8915641 -1629674 8262751 13889093 12263005 8080559 5796929 4224472 1564435
4001 1564435 96081 1874746 3719489 777123 -7130445 -16064185 -22873933 -26376765
3993 -26376765 -25648198 -21072381 -16210331 -14731095 -15338111 -13108647 -6482166 326401
3985 326401 3311989 4199529 7344139 12588869 14391047 8694280 -1397160 -8485172
3977 -8485172 -8868950 -5931519 -4927408 -6073040 -5119006 -460346 3575339 2489356 -1715326
3968 -1715326 -3017505 194785 2864972 184170 -6496741 -12358218 -14878413 -14261839
3960 -14261839 -10239185 -2272047 7145505 12737528 11478341 5865155 1170582 344713
3952 344713 2064861 2732799 -132480 -5551411 -9686772 -9685608 -7191803 -6899294 -11230892
3943 -11230892 -17746385 -22371872 -23663042 -22885022 -21453022 -19912582 -18341677 -16002952
3935 -16002952 -11460143 -4877917 698885 2700683 2991413 5423172 9393262 9592793
3927 9592793 3782213 -2679908 -3260095 933514 2483534 -2995693 -12469145 -20468473
3919 -20468473 -24775262 -25879197 -24061453 -19777411 -15505226 -14516813 -17572561 -22018633
3911 -22018633 -24310101 -23023482 -19678090 -16853222 -15232233 -12968549 -8969611 -5905712
3903 -5905712 -7441809 -12390801 -14769658 -10992155 -4039233 1444408 4981250 8132953
3895 8132953 9622903 7209372 2734201 241763 -326702 -2425719 -5940355 -6673446 -3943928
3886 -3943928 -2706597 -5536555 -8318909 -7807742 -7894111 -12654200 -17615121 -15237618 -6738777
3877 -6738777 -751044 -740659 -1457617 961895 2959300 862287 -2183409 -1491250 1332433
3868 1332433 1171508 -2526812 -5481751 -5190021 -3496888 -2920508 -3878816 -5582277 -7065024
3859 -7065024 -7550273 -7970974 -11293003 -18670056 -26041547 -27728195 -23346655 -18203886 -16701989
3850 -16701989 -18296397 -20240679 -20984529 -19797714 -16242504 -11958753 -10583718 -13739870
3842 -13739870 -18658858 -21518369 -21721349 -21355133 -21925017 -23199629 -23748695 -21051176 -13102498
3833 -13102498 -2367621 3662290 -663518 -12148490 -21595989 -23465875 -19710222 -14314092
3825 -14314092 -8410708 -2608447 -219121 -4206915 -12214919 -18001701 -17883971 -13642951
3817 -13642951 -9252601 -6873934 -6105918 -4943875 -940400 6428187 13461710 14234512
3809 14234512 6718661 -4178894 -11545001 -13757563 -14862434 -17953503 -20768989 -19105074
3801 -19105074 -12870667 -6788418 -5468454 -9190641 -14467299 -17532533 -17024175 -14218795
3793 -14218795 -11312669 -9385799 -7976485 -6439067 -4765630 -2565744 1309238 6416002
3785 6416002 9130454 6251246 181086 -2755671 -409954 1887505 -1557589 -8977862
3777 -8977862 -13635528 -12344147 -7792479 -3414162 -236881 942554 -1512129 -7413400
3769 -7413400 -14087063 -19806497 -25128062 -29619478 -30560773 -26825101 -20925151 -14970737
3761 -14970737 -7957045 -33625 4188813 1283162 -4412744 -5179142 149925 5797852
3753 5797852 8065824 9006430 10386400 9960925 6346011 2790623 2718871 5078778 7273422
3744 7273422 9219145 10796074 8632746 461439 -9213786 -13144540 -10644495 -8049569
3736 -8049569 -9645840 -13067304 -15032490 -16538845 -18911499 -18504003 -10598956 2310328
3728 2310328 11118710 10489273 5200563 3583089 6875443 8765320 5106661 -51311
3720 -51311 -241798 4479484 7965231 6477275 3044977 2532704 5309384 7607759 6459933
3711 6459933 2562334 -896649 -1218421 1225908 2990056 1356195 -1717992 -1413873 3782005
3702 3782005 10205231 14089420 15462532 15508840 13715636 10598985 9907316 13680170 17129238
3693 17129238 13371808 2740098 -6966101 -9525171 -5800874 -424127 2769092 1613609
3685 1613609 -3599204 -8816458 -9422488 -6212613 -4794617 -7778858 -11392240 -11700433 -10176174
3676 -10176174 -10132178 -10937453 -9455318 -5191024 -593507 2570512 4367784 5091300 4634913
3667 4634913 2742848 -1231974 -7182986 -12016285 -11538038 -6475483 -3363051 -6640938
3659 -6640938 -13098883 -17612784 -20784816 -25785690 -30512259 -29617578 -23472885 -18264597
3651 -18264597 -16531490 -14283230 -9471290 -6697453 -9538699 -13507172 -12002220 -5977695
3643 -5977695 -2129829 -3176065 -5444433 -5928088 -6435261 -8982313 -11044202 -8530486 -1733372
3634 -1733372 4713419 7648138 8668271 10598819 12629358 11518132 7327139 4694732
3626 4694732 6455611 8452912 4199599 -6134612 -15215104 -17466704 -14884454 -12628525
3618 -12628525 -12323828 -12120864 -10582751 -7362838 -1779716 6075339 13686029 18279438
3610 18279438 19964223 20310687 18824026 13881601 6739016 1308508 -499319 -525476 -1070178
3601 -1070178 -2562355 -5016666 -8788016 -12673088 -14012009 -12242259 -9889490 -8460177
3593 -8460177 -6196797 -2222873 92485 -2338063 -6404679 -5981332 -536503 3964893
3585 3964893 3420819 563694 -114869 1405582 2126162 687464 -2481701 -7193601 -12091140
3576 -12091140 -13124643 -7783445 -88061 3146919 1197055 -82188 2274613 3576588
3568 3576588 -588323 -5893861 -3911134 6439410 16947713 19660226 14526894 7072101
3560 7072101 2066120 879576 2250158 3544232 2549067 -552034 -3489077 -4292944 -2349230
3551 -2349230 2259321 8100806 11255949 8125021 574688 -4602146 -3158301 2052186
3543 2052186 5681241 6244417 5336077 3230879 -861485 -5423575 -7314415 -5672695 -2364278
3534 -2364278 936485 3376461 3622793 1470781 93800 2482953 5714966 3746537
3526 3746537 -2944613 -5927872 -36465 8667670 10644235 5308740 402971 632980
3518 632980 2669817 1898498 -826891 -1370787 1658386 5330333 5600907 949467 -6201667
3509 -6201667 -11122398 -10779150 -6547705 -2407159 -1107463 -3137173 -7932102 -13566573
3501 -13566573 -16263770 -13657426 -8492974 -5492806 -4115671 1370183 13005619 24545271
3493 24545271 28622604 25019140 18292178 10388564 435643 -9973191 -16650575 -17899520
3485 -17899520 -15401293 -10189059 -2515606 3811363 2622294 -6375766 -14888980 -15025060
3477 -15025060 -7854027 226714 6169744 10585585 11935711 6857226 -3234117 -11299110
3469 -11299110 -12549948 -9365653 -6214353 -3302864 1583086 7770809 12380497 14981715
3461 14981715 17327438 18633499 15571621 8334918 2636255 2652871 4843865 2847011
3453 2847011 -2884710 -5072026 333895 8692023 13411324 14146052 14525681 14676764 11538797
3444 11538797 6187362 4997582 11075156 18627947 19502138 13084769 6084980 3662739
3436 3662739 4528385 4886755 3701618 2504946 2105212 1377807 -1252250 -6011742 -11066952
3427 -11066952 -13343608 -10717207 -3662167 5558439 14658898 21165657 21566359 13633986
3419 13633986 622818 -9291144 -10019587 -3263509 4125089 7436230 7250423 6593447
3411 6593447 7484297 10043875 12417166 11101871 4032376 -5235667 -8935493 -3524536
3403 -3524536 4470351 4438761 -6031328 -17749673 -20118451 -12233801 -1750261 4947205
3395 4947205 7682727 8346025 6472263 1185189 -5152192 -8201659 -5938386 -76310
3387 -76310 5900280 8718388 6671288 1186739 -3577715 -4644477 -3121255 -1408313 1179681
3378 1179681 6884557 14159960 17763560 15098058 9048075 3106704 -2907198 -10084280
3370 -10084280 -16617102 -20055842 -21256370 -22619197 -23733492 -22180934 -17854158 -13141689
3362 -13141689 -9246098 -5563179 -2488068 -1369474 -1325891 574985 5214323 10449845
3354 10449845 14755464 18423346 20324118 17603039 10726423 5008827 3984188 4325536
3346 4325536 984183 -5080152 -8399257 -6559093 -2053078 2342070 5638350 6523341
3338 6523341 3825601 -275304 -1668754 -63334 464919 -1988027 -3860481 -1382285
3330 -1382285 4124014 8361999 8605226 4268798 -3496538 -10074724 -9058514 35557
3322 35557 8282586 6358555 -4297676 -13691312 -15395706 -11622331 -6972379 -3045198
3314 -3045198 -490771 -1072083 -4818641 -8570870 -9806134 -9138300 -7259206 -2930940 3244627
3305 3244627 6328118 2218815 -6340507 -12457168 -13029407 -11326927 -12418948 -18351261
3297 -18351261 -26946054 -33076287 -32104353 -24548867 -16613301 -13726544 -14331484 -12476382
3289 -12476382 -5637398 2878439 8676067 10269870 8420701 4536122 296629 -3260855
3281 -3260855 -6244008 -7585312 -3651713 7063146 18619960 22044231 16000259 8326563
3273 8326563 5455089 5617636 5334610 6664068 12234796 17251982 14180658 4482443 -1626463
3264 -1626463 1519718 8115115 9851103 6501363 3531575 3066525 2478150 307533 -1608908
3255 -1608908 -2310564 -3913782 -8183526 -13696712 -18036259 -20754686 -22534464 -23086740 -21681400
3246 -21681400 -18555988 -14144502 -8167245 -1444376 2674877 1479444 -3012974 -6143749
3238 -6143749 -6897611 -8818850 -13726961 -17947576 -16984619 -11271293 -4538739 1507773 7652391
3229 7652391 13358323 15731303 12550420 4610801 -4620275 -10572572 -10426217 -6460002
3221 -6460002 -4904635 -8969279 -14786487 -17128508 -16643719 -17004627 -17148556 -12761900 -5066418
3212 -5066418 -1008632 -3018577 -5259332 -3152273 -405279 -1954876 -5115576 -3737310
3204 -3737310 2017646 6035321 4785387 320835 -4254970 -7538099 -8444403 -6431216
3196 -6431216 -3364131 -1807989 -1388228 258494 3166492 4565345 2607217 -1822863
3188 -1822863 -6469318 -8560970 -5421024 2835303 11918713 17276264 18318965 16334393
3180 16334393 10567013 592156 -9223655 -13175583 -12018037 -12073876 -15850918 -18615152
3172 -18615152 -16007784 -10649679 -8574894 -11966165 -17574760 -20451320 -18062472 -12333396
3164 -12333396 -7871440 -6651249 -5765685 -3136481 -2961399 -10088152 -20314913 -23411135
3156 -23411135 -16703904 -8601947 -6319828 -7120683 -5603193 -3132206 -4301868 -8642342
3148 -8642342 -11988015 -13365326 -15128767 -17971312 -20129739 -20037902 -16498320 -8539194 1590073
3139 1590073 8116518 8155592 5544070 4556062 3513384 -463467 -4236058 -2880948 1331996
3130 1331996 1533056 -3124401 -6582983 -5654991 -3698689 -3516208 -3244483 -1484731 -825301
3121 -825301 -3462049 -7680488 -11072861 -13436595 -14611508 -13380350 -10476300 -8932449
3113 -8932449 -9635141 -10332339 -10646816 -13547078 -19484039 -23767847 -23224406 -21419988 -23251287
3104 -23251287 -27613638 -29701350 -28066274 -25154192 -22715668 -20643476 -18794584 -16326810
3096 -16326810 -10983426 -2899958 2781655 1727799 -2652564 -3532016 -1234598 -2956280
3088 -2956280 -10625346 -15830864 -11087509 -1270467 2070387 -4419679 -12738636 -15185384
3080 -15185384 -13391870 -13237629 -15025333 -13259497 -5072116 5251077 11163960 10713825
3072 10713825 7023197 3692283 1808029 1040580 1734095 4928111 10569940 16195750
3064 16195750 18044828 14270910 6906076 -352624 -6110964 -11372936 -15546963 -15031414
3056 -15031414 -7706887 2821470 9817040 9717585 4446339 -1520401 -4776247 -4776421 -3783715
3047 -3783715 -4210157 -5062720 -3148327 821689 1042867 -4905210 -10044407 -6298292 3362263
3038 3362263 8206920 4824372 1062728 3047401 6081033 3037945 -4186843 -7670560
3030 -7670560 -4571014 295831 1408398 -2092446 -6893014 -8465465 -4999072 -395770
3022 -395770 -790319 -6079045 -8797290 -4573154 885148 183682 -4584083 -5757018 -2358129
3013 -2358129 -552009 -2685349 -3992590 -1586619 539212 -1608735 -5978838 -8790212
3005 -8790212 -10192418 -11815636 -12437459 -10273165 -7076280 -5909785 -6233744 -4810292 -1003335
2996 -1003335 1751210 6820 -5987090 -12846135 -17086951 -17313028 -14064966 -8255855
2988 -8255855 -756543 6067932 8259057 4135051 -2390380 -5201123 -2977492 -297612
2980 -297612 -1414978 -5794339 -10730570 -15269329 -19339167 -21142303 -18244990 -10930731
2972 -10930731 -2767590 2421742 3747617 3504770 4033217 4246272 836353 -5835443 -9435996
2963 -9435996 -4593203 5216075 10908683 8528309 2231856 -3379147 -8159163 -12063459
2955 -12063459 -12051321 -7281692 -2713095 -2727475 -4506463 -2610636 2570010 6193494 6847057
2946 6847057 7361104 8474544 7406043 3497044 395663 938165 3498604 5126874 5343158
2937 5343158 5040900 3940977 963712 -4177034 -10699596 -16821488 -19799575 -17699543
2929 -17699543 -11750332 -5479647 -1260574 736382 505507 -2137466 -5287605 -5336826 -1419129
2920 -1419129 2733297 3553862 2590808 3945354 7452868 7636671 707064 -9541297 -15233003
2911 -15233003 -13342091 -8570407 -6480743 -6506391 -4595052 -907506 -140104 -3728771 -6790848
2902 -6790848 -5490411 -3108930 -4534552 -7947093 -7510509 -2880003 -249641 -3706731
2894 -3706731 -10591319 -16329235 -19185174 -18782949 -14398035 -7041903 245236 6298977
2886 6298977 12797735 19489221 22322015 19216048 14232654 12364308 12810325 11272844
2878 11272844 6857476 2480528 -452973 -3602972 -7970660 -11946627 -13445032 -11661305
2870 -11661305 -6820234 -335699 5128604 7867808 8860922 9279969 7557216 2024144
2862 2024144 -4426027 -6372949 -3125785 -305741 -2770982 -8839079 -13177617 -12993756
2854 -12993756 -9475800 -5147197 -2157249 -2125368 -5356451 -10009220 -13128921 -12834497 -9607017
2845 -9607017 -6066722 -5391736 -8750173 -13820177 -16650218 -15197954 -10397141 -4405399
2837 -4405399 362444 744328 -5695715 -17168178 -27510857 -31449386 -29128326 -24181000
2829 -24181000 -18711628 -12369645 -5838104 -2535619 -5365271 -12564171 -18155058 -17083233
2821 -17083233 -9691657 -775337 5466474 8653419 10587243 12258864 13546661 14042732
2813 14042732 12136573 4922172 -7757528 -19771821 -22898250 -15342749 -3396755 5576400
2805 5576400 8519626 5150752 -3586748 -13121273 -16239032 -10759511 -2962118 831663
2797 831663 2794510 8408286 15511352 15693099 6575861 -3936245 -7343119 -3127701
2789 -3127701 4222361 11350559 15927866 14938959 7716372 -1402607 -7155132 -8962206
2781 -8962206 -9920585 -11609915 -12519136 -10832035 -6822097 -3040096 -2835825 -6982223 -11177695
2772 -11177695 -9861126 -3938099 -1143133 -6204949 -14306936 -17811369 -15866415 -12741445
2764 -12741445 -10055969 -6878777 -5310584 -8521762 -13420398 -12665605 -5416178 670001
2756 670001 405652 -2444011 -2738692 -1603617 -2032098 -2568691 -1003523 274430 -1123711
2747 -1123711 -1547997 2918464 7472580 3677549 -7316754 -15125031 -14738314 -12594224
2739 -12594224 -15223864 -19497605 -19184003 -15253500 -13149339 -13303072 -11063506 -4836845
2731 -4836845 1581084 5012231 6385045 7065753 5535443 -204930 -8940002 -16602180
2723 -16602180 -19547408 -17086824 -11797338 -7524367 -6193106 -6659836 -7211490 -7935612 -9045457
2714 -9045457 -8355009 -3516735 3392893 6825209 4406614 45919 -1134738 1177853
2706 1177853 3437728 3411025 1816610 -408235 -3684027 -8010190 -11542192 -12278988 -10442421
2697 -10442421 -8009759 -5940147 -2949339 2146423 7407841 8745022 4828713 -196293
2689 -196293 -738867 3843218 8901307 10706563 10464949 10783666 10643469 7071276 1149866
2680 1149866 -1217422 3820704 12358753 16179583 11683570 3693377 -214155 2019307
2672 2019307 5613211 5512828 2386594 863483 2982658 5602271 4486146 -1070679
2664 -1070679 -8560060 -15346321 -19967845 -21914808 -22136591 -22756704 -24079953 -22748347 -15746687
2655 -15746687 -6030712 -651774 -2139357 -5053508 -3316673 1988152 5574956 6527353
2647 6527353 8963851 14118211 17013297 13797037 8734955 9539219 16953249 23253919
2639 23253919 21720279 14125317 7196872 4461611 4282063 4203330 3680784 2519707 -12675
2630 -12675 -3046621 -3535034 -96540 3913521 3624164 -1540017 -7531807 -10999139 -12371552
2621 -12371552 -13130675 -12925328 -11385409 -10608083 -12716060 -15575710 -14096545 -6562262 2591698
2612 2591698 7417908 6110066 920039 -5474883 -11194160 -13955389 -11844861 -6047166
2604 -6047166 -722706 1027990 -189346 -2294331 -4944628 -8760601 -12447037 -13203753
2596 -13203753 -10309136 -6315103 -3780125 -2266058 267286 4184866 7749049 9420557
2588 9420557 9150681 7539075 5149413 3017111 2616069 4405919 6847228 7632419 6022494
2579 6022494 3704864 3137617 4991055 7510056 8832318 9507257 11412679 14032139 13844041
2570 13844041 8905232 2350615 -1049701 -686024 486801 1513664 4199842 7654946
2562 7654946 6916968 -11077 -7563892 -9382683 -7218357 -7913952 -12463636 -13845876 -7064931
2553 -7064931 3526894 9679555 8527908 3190360 -3291890 -10383365 -17038763 -20345334
2545 -20345334 -18897496 -15564826 -14755005 -17008339 -17868252 -13260086 -5306922 -687729
2537 -687729 -2488378 -6103668 -5547322 -1783386 -893200 -4764738 -8502301 -8124919 -5962330
2528 -5962330 -5698551 -6174113 -4016269 435848 4110356 6312219 8691651 11188475 11965468
2519 11965468 10850087 9326098 7608500 5059848 2756184 1993308 1066743 -2227979
2511 -2227979 -5448215 -3761685 2448171 7349315 7886719 7021882 7411710 7487048 6144235
2502 6144235 5591966 6111221 3603728 -3001227 -7086608 -3127106 3852398 4470196 -1912943
2493 -1912943 -7433200 -7706397 -6125637 -5952339 -5329222 -2277446 1005790 1560631 -615128
2484 -615128 -4143890 -7776438 -8819718 -4273446 4267319 10534369 10746150 7690499 5750667
2475 5750667 5415504 5106026 4881248 5169609 4586397 2190384 -242001 -995794 -1432227
2466 -1432227 -3654303 -7260614 -10918699 -14820222 -18740359 -19997590 -16678511 -11125004
2458 -11125004 -7055365 -4848059 -2653790 -266994 1443337 3063403 4900470 4456434
2450 4456434 -306598 -6578208 -9816978 -10052126 -10548761 -11261247 -8961159 -3874257 -744711
2441 -744711 -2094188 -5029025 -6240958 -6162343 -6617994 -7892547 -9498284 -10779049 -10201666
2432 -10201666 -7547169 -6666926 -11167398 -17044190 -15799648 -6609489 1259921 1322481 -1602785
2423 -1602785 -532450 2465298 1087244 -3997780 -6896245 -6741133 -7848984 -10509705
2415 -10509705 -9843328 -4941587 -1866414 -4854663 -10118097 -11633536 -9136130 -7314994
2407 -7314994 -9815921 -16415091 -23920421 -27966483 -25751577 -18555635 -10446935 -4322465
2399 -4322465 -905767 -829324 -4226510 -8038827 -7623568 -2428252 3007420 4879418 3846303
2390 3846303 1823896 -1375537 -6303878 -11835287 -16785609 -20845003 -22528931 -19728688
2382 -19728688 -14125531 -10978158 -11806164 -11505378 -6370053 -623675 159719 -1643384 271746
2373 271746 5033639 5391264 -144957 -3715707 594737 8128296 10481687 6543496 2013754
2364 2013754 715867 1312546 1697012 2304104 4411958 7812095 10858698 11254460 6800653
2355 6800653 -2759500 -14161007 -22269281 -23982169 -19957148 -12842483 -5266400 368296
2347 368296 2236506 881621 -318243 1650350 5867713 8798283 9355281 10439618 14058772
2338 14058772 17026339 14471760 6882768 137418 -2111258 -2491407 -4375458 -5689623
2330 -5689623 -2156978 4879164 8362276 3758950 -5966140 -14572539 -18831542 -19165703
2322 -19165703 -16666093 -12002231 -6321267 -1262074 1924424 2736751 1646798 327313
2314 327313 416757 1483211 1576352 243031 -1069631 -2496141 -6685622 -13771396 -18130581
2305 -18130581 -14506745 -6394510 -3359098 -9012023 -16192346 -16576939 -11281215 -8089658
2297 -8089658 -10663736 -15252078 -17383845 -16929748 -15423769 -12589150 -8125010 -4226242
2289 -4226242 -3351092 -4852252 -6248363 -6721440 -6998255 -6849317 -5615760 -4845032 -7257861
2280 -7257861 -12408618 -15991781 -14769487 -10396328 -7082604 -6747067 -7518025 -5991472 -259966
2271 -259966 8158214 14810737 16096818 13360557 11896750 14969061 19961139 21298117
2263 21298117 16160521 6817671 -1335798 -3630095 131539 4902294 5127251 1072562
2255 1072562 -1520841 1180947 6673856 10248594 10504242 8830726 6630560 5809074 8866700
2246 8866700 14811663 17576013 12685665 3483853 -3480404 -6960401 -9766153 -11186830
2238 -11186830 -7559723 -212496 4234230 3064650 731491 770707 613052 -2233119 -4544364
2229 -4544364 -2706509 444660 -675254 -6219091 -10964484 -11167989 -7845135 -4428654
2221 -4428654 -3933988 -7013647 -10501820 -9806286 -4961938 -1726702 -3959342 -7868558 -7416521
2212 -7416521 -2696778 1389478 2634503 2874058 3136835 2255064 -165683 -3553494 -8465802
2203 -8465802 -14593097 -17475998 -12380968 -1766705 6091397 6965779 4625343 3709203
2195 3709203 3488677 1149341 -2866133 -6185905 -8516186 -11090918 -13703686 -14981570
2187 -14981570 -14710910 -13863667 -12881098 -11338464 -8934944 -6115206 -4152439 -4537896 -7253182
2178 -7253182 -10021920 -10896590 -11172878 -13568629 -17754642 -20337254 -19481553 -16839112 -14501181
2169 -14501181 -12936249 -12551906 -14098573 -16367405 -16600047 -14676365 -13902716 -16006580 -18526797
2160 -18526797 -19248716 -19841930 -22060967 -23340170 -20212403 -14297624 -10608473 -10510344 -10365214
2151 -10365214 -7527548 -4151837 -3660727 -5901359 -7755602 -7500674 -6781376 -8034736 -11002411
2142 -11002411 -12890079 -11948700 -9302426 -6096973 -689004 8481278 18108526 22004753
2134 22004753 18649627 13351243 11564483 13248055 15320526 16102580 15047477 11686239
2126 11686239 7993954 8554760 14581979 20559758 21047300 18271543 18008066 20089068 19228845
2117 19228845 14639090 12050342 14718103 18395822 18029533 14529355 11315593 8194064
2109 8194064 3255910 -1679127 -2626454 183385 2132190 1234052 1261384 5503405 10383370
2100 10383370 9276199 2001318 -3880611 -3003285 283810 -1844546 -9210023 -13795052
2092 -13795052 -11209588 -5931063 -3075668 -1073826 2947641 5601260 1780094 -5982965
2084 -5982965 -9946527 -8150805 -5925428 -6031360 -4644879 498170 4725996 3453089
2076 3453089 -448779 -1347457 350550 -748151 -6740458 -13691978 -16844493 -15257534
2068 -15257534 -11269218 -7770904 -6205829 -5871574 -5314637 -4698459 -5238705 -5778238 -2681101
2059 -2681101 4994865 12719340 15412085 13135573 9298797 5406804 1015708 -2877658
2051 -2877658 -4678321 -5822366 -9284999 -14093685 -15386080 -11248256 -5932974 -4063674
2043 -4063674 -4343771 -2003494 3805146 8249527 7003935 2072258 -334052 2589299
2035 2589299 6515888 5136142 -1909069 -8448776 -9367374 -6270503 -4204802 -5098505 -7014977
2026 -7014977 -8330340 -9259490 -9360978 -6628269 -132080 8135711 14679184 16600663 12646674
2017 12646674 4269995 -4145913 -8331625 -8191361 -7239847 -7721565 -8404533 -7754644 -6678656
2008 -6678656 -6645683 -7398756 -8562957 -11541886 -17133789 -22516168 -23608752 -20063158 -15098270
1999 -15098270 -10497385 -5087180 954532 3926259 1426414 -3152665 -4577951 -2993521
1991 -2993521 -3067636 -5961171 -6917316 -2959973 1213775 -964047 -8814131 -15783881 -18582085
1982 -18582085 -19562572 -19922993 -16670375 -9008575 -2526292 -2416840 -5796602 -5924085 -2242009
1973 -2242009 -633158 -3800163 -6952189 -5079153 -402893 551623 -4836162 -12840087
1965 -12840087 -18124532 -18515232 -15287246 -10810890 -6829848 -4182886 -2876899 -1752078
1957 -1752078 1277196 7081310 12951803 13978677 8110190 -1185139 -8502103 -11533757
1949 -11533757 -11294718 -9349340 -7424542 -8247629 -13152634 -19028545 -20854971 -17491107
1941 -17491107 -12161069 -7449260 -3425484 -952948 -2433554 -7521175 -11855886 -12427679
1933 -12427679 -11197754 -11127289 -11580404 -10267791 -7037295 -2975175 1630617 5466737 5141813
1924 5141813 -246687 -5724590 -5845228 -1947502 194152 -1360941 -3432080 -3852229 -3753232
1915 -3753232 -3588275 -2057579 -158931 -1485745 -6456695 -10278334 -8963300 -4030688
1907 -4030688 804096 4092024 5491812 3914825 98646 -2134849 -952982 -250728
1899 -250728 -4176184 -9914944 -10490329 -3703321 6062521 14126187 18813879 18717296 12269638
1890 12269638 1834805 -6462133 -9728597 -11541432 -15393523 -18481268 -16045765 -9362261
1882 -9362261 -4459813 -3731599 -3865483 -2884119 -4316024 -11253429 -19316560 -20010922 -11205250
1873 -11205250 -1068685 181706 -8772647 -19417791 -23337262 -21270722 -20789584 -25855905
1865 -25855905 -31549402 -30621906 -23058953 -15947165 -14310063 -15690023 -15156632 -12535532
1857 -12535532 -11658834 -13943057 -16195872 -15226474 -12196365 -11126979 -13983060 -17913849
1849 -17913849 -17326755 -9473460 1251984 6006744 494014 -9776209 -15781718 -15440752
1841 -15440752 -13936927 -14157395 -12592370 -6874318 -1553244 -1572212 -4361259 -4687433 -4339503
1832 -4339503 -9084821 -16738436 -17191391 -6937752 4313494 6500425 2524346 2286982
1824 2286982 7792466 11859934 9845968 4917038 1101739 -2115530 -6016043 -8758787
1816 -8758787 -8386117 -6190279 -4385588 -3253306 -2874426 -4763183 -9084591 -12815358 -13602265
1807 -13602265 -13152202 -13556699 -12576153 -7120101 -383083 -106569 -8274872 -16867361 -16908245
1798 -16908245 -9194981 -2507485 -2250996 -4829171 -4191561 -315228 2153108 1961584 3103036
1789 3103036 7292433 9123516 2926792 -7951728 -14096617 -11985207 -7577801 -6756964
1781 -6756964 -7796480 -6457391 -3560657 -2599344 -3221863 -2505364 -526959 734961 2243769
1772 2243769 5612303 7219767 1852528 -7365761 -10450766 -4475038 1371536 -972446
1764 -972446 -6682368 -5849795 1734945 7188733 5589044 807242 -2476295 -4531621 -6646847
1755 -6646847 -7164229 -4612863 -1324477 -818348 -3205200 -5166979 -3607085 1479219 6782043
1746 6782043 8304546 5615371 3036898 4657553 8914557 10940563 9674244 8784968
1738 8784968 10256749 11542880 10749826 10237948 11979991 12914578 9060085 2102797 -2434172
1729 -2434172 -2704796 -2306105 -4663071 -9127462 -13082565 -14917447 -14224604 -11794422 -10397063
1720 -10397063 -12983377 -18612154 -22288069 -20653191 -16190208 -13776400 -14367614 -14522579
1712 -14522579 -11635336 -7092202 -3906472 -3351297 -4594545 -5641424 -3659691 3264991
1704 3264991 12522639 16992385 11969574 1549486 -5342442 -5542965 -4476147 -7164691
1696 -7164691 -10815705 -9804711 -4689106 -1258734 -2031542 -3901550 -4279582 -4457086 -5465429
1687 -5465429 -5201947 -2284363 750419 1159460 366250 1497382 4259459 5138412 1595373
1678 1595373 -6066181 -15428269 -22263336 -22208729 -15621753 -9532362 -10808318 -17493703 -20694007
1669 -20694007 -15759690 -8157961 -6693637 -13570520 -23157611 -28691441 -27787216 -22008877
1661 -22008877 -13363764 -2470327 9891914 20196331 22779441 14763895 389919 -11129305
1653 -11129305 -13146227 -6964115 111622 1562976 -3141457 -8990451 -10516833 -6643088
1645 -6643088 -726156 3547360 5173523 4897517 3285714 827823 -1648692 -4121703
1637 -4121703 -7570781 -11592133 -13507562 -11869196 -9228499 -8867813 -10139174 -9957265 -7767756
1628 -7767756 -5751364 -5047808 -5481678 -8149318 -13553978 -17261518 -13154854 -2760307
1620 -2760307 4280238 2490250 -1488078 1890622 11326948 16212604 10814871 1015365
1612 1015365 -4165240 -3013802 -563030 -666971 -2117548 -2089462 -637710 -348919 -2414471
1603 -2414471 -4904084 -5733163 -5903931 -7780010 -10637228 -10572160 -5652543 958310 4295803
1594 4295803 2564532 -2103232 -6337340 -8121302 -8225140 -9645842 -13846197 -17477476
1586 -17477476 -15847631 -10262145 -7844108 -12035888 -17462339 -17446710 -12632149 -7855071
1578 -7855071 -4278357 -472594 1479893 -1843573 -7743688 -9326440 -5598840 -2826029
1570 -2826029 -4211522 -5140622 -1767286 2230662 2182760 229352 579882 912270 -4458157
1561 -4458157 -14495762 -21480154 -21613598 -19761755 -21778249 -26676222 -29225245 -27269039
1553 -27269039 -23165387 -19197329 -14611265 -7970274 -1033422 1397939 -3441773 -11739859
1545 -11739859 -15554202 -10959213 -2342664 2949354 2739189 376181 -1816881 -5628283
1537 -5628283 -12604934 -19880573 -22779177 -20106534 -14635416 -8960118 -2950248 4427480
1529 4427480 12382621 18488703 21136747 20873023 19147753 16562521 13175401 10035129
1521 10035129 8814430 9351874 9003993 5711841 726656 -3155708 -5133140 -6274088
1513 -6274088 -6682487 -5549000 -4111508 -5398400 -9683820 -12963242 -12048533 -8801683 -6564648
1504 -6564648 -4580247 17011 5811572 7832222 5476526 4516800 8350039 11713235
1496 11713235 7859663 -848147 -5459546 -2849330 555777 -1162986 -5348073 -6065773
1488 -6065773 -2988436 -300570 539347 1770762 4071623 5237652 4442136 3629464 3651190
1479 3651190 2577848 -769436 -4766958 -8139348 -12244973 -18002836 -22937466 -24026897
1471 -24026897 -22111352 -20909025 -22280393 -24458565 -24543336 -21149301 -15005102 -8376170
1463 -8376170 -3702764 -1844763 -1884238 -2835448 -4368457 -5581638 -5206447 -4143450 -5283921
1454 -5283921 -8707572 -9579306 -4196787 3579856 6141701 1895013 -3157920 -4147462 -3045329
1445 -3045329 -3524308 -4270364 -1530179 3681250 5505394 751967 -6898429 -11627242 -12135654
1436 -12135654 -11591004 -12297203 -13137156 -12633311 -12060606 -13574922 -16451679 -17703432 -16460530
1427 -16460530 -15234037 -15842059 -16325854 -13774180 -8719761 -4602081 -3666879 -5277382 -7574209
1418 -7574209 -8850354 -7837919 -4700415 -1472362 361415 2287041 6656118 12589812
1410 12589812 16539952 16990953 16040740 15973251 16835858 17918566 18838796 18234299 14305626
1401 14305626 8223973 4265692 4381499 4918918 1454614 -4584417 -6941414 -1694217
1393 -1694217 8667704 17962545 21458515 18819261 13693165 10361676 9703563 8720301
1385 8720301 4671386 -1376812 -6214932 -8386452 -8564840 -6880526 -2259192 5173104
1377 5173104 12659324 16722559 16134493 12737390 9421240 7203329 4597125 490573
1369 490573 -3077039 -2931558 388345 2274154 -395369 -5622327 -9784134 -12540637 -15981767
1360 -15981767 -20551260 -24420700 -26017465 -25000187 -21619011 -17183707 -14190247 -13804405
1352 -13804405 -14149055 -13210062 -12151022 -13033208 -14404843 -12592911 -7169947 -1930552 -64703
1343 -64703 -885093 -1459035 861186 7164536 15322287 19788527 16355310 7452485 -357425
1334 -357425 -4299151 -7221321 -11224907 -14059854 -13748597 -12563913 -13279637 -14550569 -13503117
1325 -13503117 -10779851 -9372498 -9529701 -8239314 -3759904 1948030 5956016 7990745
1317 7990745 10446679 15027489 19855708 20916238 17100827 12326603 10522337 9876313
1309 9876313 5606117 -2018835 -6872553 -5081814 443303 5188514 8131422 9103037
1301 9103037 5919826 -1445187 -7367529 -6431408 -965945 1778549 -1394457 -7637094
1293 -7637094 -13614917 -18354695 -21001422 -20236107 -16558612 -12033108 -7606394 -3227389
1285 -3227389 89674 1343214 1871849 3393946 4701830 3818717 2181169 2339212 2523828
1276 2523828 -1306553 -8311506 -13402284 -15612686 -19639319 -27069587 -32183675 -30085902
1268 -30085902 -24057403 -20486495 -20336516 -20320712 -19582007 -19983745 -21180145 -20320191 -16660565
1259 -16660565 -12655692 -9934096 -7190901 -3058886 986464 1925239 -1137843 -5185781
1251 -5185781 -5572120 -792545 5291232 7355305 4616257 1066283 -219731 -299036 -1222529
1242 -1222529 -2736899 -3711897 -4209870 -4317775 -3463225 -2832900 -5582544 -11855208 -16197064
1233 -16197064 -13591071 -6537190 -2528335 -5228390 -11254332 -15079467 -14104762 -9283648
1225 -9283648 -3772902 -1095178 -2072611 -3337248 -988578 4311851 8041950 7553576 4835197
1216 4835197 3311873 4066682 5867842 7158602 7105424 5713879 3586945 1201896 -1446182
1207 -1446182 -4057836 -5590508 -5514779 -4922276 -5417206 -7299142 -9413713 -10180289 -8608520
1198 -8608520 -5597215 -4358188 -7433935 -12646048 -14537841 -11038283 -6011175 -3686412
1190 -3686412 -3634192 -3317414 -2177245 -233107 3903494 9702682 12479848 9117820 3593923
1181 3593923 1920732 3762187 4396008 2942255 2344504 2393314 -318197 -5559179 -9434651
1172 -9434651 -11714657 -16085917 -21854272 -23132155 -19134990 -17586294 -22991497 -27966126
1164 -27966126 -22580504 -7996055 5671978 12328509 14439582 15892446 16288672 13215606
1156 13215606 6382614 -1861171 -8537089 -12216021 -13793307 -14620885 -14266828 -12050088
1148 -12050088 -10027985 -10700406 -11829434 -8739406 -2985036 -2519404 -9977858 -16818634
1140 -16818634 -14174545 -4607811 2753836 4486045 3484169 827368 -4684908 -9944057
1132 -9944057 -8656365 -526599 6680224 6105611 -1350334 -9826263 -13905989 -10866931
1124 -10866931 -2238265 5784403 7519505 4368642 2609762 4482133 6116523 5075882
1116 5075882 4454115 6773873 8250940 3130818 -8271352 -18863744 -21315209 -14010338
1108 -14010338 -1795356 8155508 12257602 12752934 13419784 14383515 13349850 10343013
1100 10343013 7431568 4453288 -613717 -6775188 -9844351 -8026410 -3788198 585966
1092 585966 5048944 8338347 7212649 1437383 -4258065 -5499802 -2403666 3003488
1084 3003488 9395504 14279602 14201339 9972862 7588570 10214646 12877633 9314780 1060531
1075 1060531 -4984891 -5918009 -4879220 -4720028 -4310205 -1754955 1931072 3738831 2408874
1066 2408874 1020412 5121394 16159645 27178768 28983674 21491343 14206920 13278918
1058 13278918 13535829 7451352 -3206423 -10832322 -13454491 -15537941 -18852351 -19666846
1050 -19666846 -15574895 -9437947 -5276751 -4238479 -5128171 -5320673 -1344274 7411722
1042 7411722 15725351 17455756 13341070 9593085 8928621 8067908 4717727 1635782 1847354
1033 1847354 4287335 6389066 7286187 6428993 2521529 -3948060 -9896749 -13031201 -13522553
1024 -13522553 -11666463 -7571265 -4232824 -6405669 -14011725 -20601376 -21223860 -18355069
1016 -18355069 -16950894 -16993241 -14829394 -9537610 -3891894 -82979 2296214 4570870
1008 4570870 7488023 10625411 11855999 8854781 2467472 -3311610 -5891408 -6024225
1000 -6024225 -4021255 1942022 10865498 16353029 13786161 7560882 5987591 10261210
992 10261210 13701390 11774340 7843439 7740144 12411496 17708850 19206850 16071684
984 16071684 11584477 10045011 11911555 12848114 9443286 4413022 3092567 5871147
976 5871147 8015540 6780608 4431744 3355635 2269037 -763166 -4740713 -7484647
968 -7484647 -8636106 -8665109 -6847029 -2755812 1360429 2166398 -916473 -5092436 -7547766
959 -7547766 -8338244 -9657580 -12930149 -17233478 -20583651 -22021475 -21593758 -18992628 -14242666
950 -14242666 -9820145 -9208546 -11892679 -12589005 -7810160 -570726 4429035 7487676 11512338
941 11512338 15348590 15199447 11776295 9936298 10872394 10732110 8119738 6565833 7117439
932 7117439 4795719 -3530216 -12871831 -16330987 -13544187 -8560973 -3397471 1171474
924 1171474 2064748 -2672399 -8923787 -10599229 -7146824 -2034769 3820917 10754651 14336344
915 14336344 8549370 -4544485 -15604975 -19977738 -21907754 -24593834 -23592539 -14931520
907 -14931520 -3830821 1101775 -884620 -3270681 -2324319 -834439 -1989766 -4479790
899 -4479790 -5038676 -2802154 295504 1840290 872776 -1514619 -3310315 -3910058 -4785969
890 -4785969 -7038583 -9225784 -9066290 -6850452 -5685517 -8067739 -12780236 -15347907 -11778164
881 -11778164 -2400461 8259139 16059649 20743390 23524421 23030400 17164264 8271454
873 8271454 1789171 -1045415 -4276835 -9253383 -11031657 -6468340 -957431 -1588529 -6969439
864 -6969439 -9976630 -8405548 -6218094 -5177558 -2479796 2228395 4054397 -206774
856 -206774 -7206400 -11899691 -13279567 -12566538 -9505709 -3997804 1141093 2528881 101260
847 101260 -3596344 -6653970 -8529651 -9046435 -8471102 -7529687 -6336613 -4731534 -4053671
838 -4053671 -6064008 -9352275 -10021243 -7380609 -5372533 -6051653 -5441221 527979 9042022
829 9042022 13814508 13571534 12652001 14175046 16868586 18264602 17108503 12709279 5645396
820 5645396 -710640 -2926441 -2168753 -2838161 -6201232 -8846246 -8125697 -5547396 -3588235
811 -3588235 -2616778 -2662279 -4976656 -9502102 -13335147 -14167784 -13234879 -12453993 -10577055
802 -10577055 -5184463 2519985 7973381 8458471 5853589 3689631 2983040 1727569 -2148818
793 -2148818 -7865730 -11935205 -11481007 -7283054 -2786848 -212961 1018226 1769872 1074311
784 1074311 -2020448 -5868893 -7640544 -7168414 -7634497 -11773358 -18239726 -22473840 -21197966
775 -21197966 -15899168 -11538724 -11366230 -13220944 -11855103 -5091497 3321610 7522481
767 7522481 5348736 -363023 -5479813 -8354931 -9948428 -11263297 -11626899 -9870344 -6833261
758 -6833261 -5611778 -8510425 -14311622 -19619443 -22553919 -23810185 -24235737 -23182940 -19977582
749 -19977582 -15494075 -10967272 -6179375 -479641 4489314 4816806 -1573068 -11186951
741 -11186951 -16948463 -15050862 -9012293 -5306506 -5542651 -5600268 -2816357 -365649 -2111809
732 -2111809 -6182599 -7530452 -5154568 -2581165 -2069159 -2800164 -4597794 -8535681 -12896011
723 -12896011 -13216651 -8326203 -2546268 -35552 -622106 -2965714 -7419790 -12942253 -15446722
714 -15446722 -13031514 -9353368 -7860913 -6124348 -559211 6307582 8889089 6840968
706 6840968 4493837 3118667 -274099 -6516296 -12330328 -15407837 -16311700 -14662687 -8872223
697 -8872223 -1054893 3316507 3114812 3916237 9398360 14722060 12639586 3243047 -6438027
688 -6438027 -10562068 -8579318 -2989399 2995980 6061806 4426062 -654847 -6648800
680 -6648800 -12481272 -17942978 -21555600 -21453900 -18026760 -13632707 -9858298 -6741458 -4365853
671 -4365853 -3355990 -3747314 -4937739 -6879392 -9839015 -12586852 -12168835 -6667558 1779049
662 1779049 7415145 5463810 -2840500 -10489542 -11497028 -7310335 -4737096 -7495260
654 -7495260 -12031393 -12232516 -5864595 4583084 14670415 19909219 17752713 10589986
646 10589986 4991328 5099358 8001339 8156971 4749547 1481586 646117 1511964 3847944
637 3847944 8325283 12929913 13745555 11044229 10267909 14229901 18138011 16154046 10033148
628 10033148 6497171 7386391 7593617 3284205 -2503571 -4467289 -1713064 2887139 7338355
619 7338355 11054791 12275684 9021246 2880576 -1641517 -2796435 -3793106 -7645402 -12488372
610 -12488372 -14709478 -14736570 -16040631 -19017618 -19781871 -15876609 -9836034 -5396939 -2924413
601 -2924413 -859205 563496 134575 -888391 601739 5295622 10245902 12432963 11611791
592 11611791 9121279 6002547 3466735 3269940 5422806 6332603 1706672 -8121588 -17616058
583 -17616058 -22055510 -22813272 -24637898 -28258630 -28675334 -22192640 -12693717 -7874512 -9974319
574 -9974319 -13472061 -12523480 -7641718 -3282723 -1209876 930898 5251489 10436061 13312284
565 13312284 12116305 7766660 2817666 -540280 -2057784 -3306043 -5856755 -9740861
557 -9740861 -13777147 -16852211 -18487024 -18632553 -17396148 -14808623 -10897753 -6433113 -3165678
548 -3165678 -2127479 -1829668 207107 3715299 5081694 1299949 -6632666 -14726303 -19119915
539 -19119915 -18136666 -13315303 -8901544 -7969453 -8327630 -5070098 1781012 5828592 2757348
530 2757348 -3471410 -6409131 -5807178 -5778884 -6717350 -5023364 -432710 2273297 253293
521 253293 -3230626 -3550030 -340710 3174832 3777506 31075 -6872016 -13049992 -15191107
512 -15191107 -14468931 -14642424 -16335992 -16813044 -15511163 -14995634 -15233664 -12364595 -5939757
503 -5939757 -2135478 -5380366 -10958173 -11269865 -6587245 -3823694 -6157190 -9665173 -10057331
494 -10057331 -7455371 -3748328 141002 2896157 2574046 -381542 -2741056 -2710048 -2065406
485 -2065406 -2704145 -3755449 -4063770 -5115194 -8810972 -13822891 -17067011 -18272332 -20180314
476 -20180314 -23651824 -25249978 -21720505 -15462363 -12618935 -15289468 -18403738 -16356512
468 -16356512 -10641025 -7455717 -8589394 -9193407 -5712887 -1460322 -1179927 -3593717 -3723293
459 -3723293 -506069 2773215 4776702 7716315 12079825 14465274 12522449 8457889
451 8457889 5495279 3736312 1718096 -437665 -1849185 -2884694 -4004362 -4219481 -2970217
442 -2970217 -2051472 -3277975 -5484908 -6372791 -6302156 -7401228 -9345781 -9010417 -4793628
$$ [...]
##END NTUPLES=NMR SPECTRUM
##END=
