##TITLE=31Pdec_DE-106_78_TFA
CDCl3, 64 sc
 1.9.2025
##JCAMPDX= 6.0         $$ Bruker NMR JCAMP-DX V2.0
##DATA TYPE= NMR SPECTRUM
##DATA CLASS= NTUPLES
##ORIGIN= UXNMR, Bruker Analytische Messtechnik GmbH
##OWNER= root
$$ XWIN-NMR		Version 3.5
$$ Mon Sep  1 13:58:34 2025 Russian Standard Time (UT+4h)  she@DPX200
##.OBSERVE FREQUENCY= 81.013821
##.OBSERVE NUCLEUS= ^31P
##.ACQUISITION MODE= SIMULTANEOUS
##.ACQUISITION SCHEME= undefined
##.AVERAGES= 64
##.DIGITISER RES= 17
##SPECTROMETER/DATA SYSTEM= spect
##.PULSE SEQUENCE= zgpg30
##.SOLVENT NAME= CDCl3
##.SHIFT REFERENCE= (INTERNAL, CDCl3, 0, 198.062)
##AUDIT TRAIL= $$ (NUMBER, WHEN, WHO, WHERE, WHAT)
$$ ##TITLE= Audit trail, XWIN-NMR		Version 3.5
$$ ##JCAMPDX= 5.01
$$ ##ORIGIN= Bruker BioSpin GmbH
$$ ##OWNER= she
$$ F:/spectra/data/she/nmr/P31/2/pdata/1/auditp.txt
$$ ##AUDIT TRAIL=  $$ (NUMBER, WHEN, WHO, WHERE, WHAT)
(   1,<2025-09-01 13:57:31.60 +0400>,<she>,<DPX200>,
      <created by zg, POWCHK disabled, PULCHK disabled
       configuration hash MD5:
       00 E9 B6 7A A2 85 ED C7 34 08 36 98 17 FE 4E 26
       data hash MD5: 32K
       12 E3 04 82 B5 74 A9 CA 29 B2 8C CB 31 B7 57 AB>)
(   2,<2025-09-01 13:57:33.85 +0400>,<she>,<DPX200>,
      <Start of raw data processing
       efp BC_mod = 2 LB = 1.5 FT_mod = 6 PKNL = 1 PHC0 = 1351.592 PHC1 = 309.5 SI = 64K 
       data hash MD5: 64K
       74 A6 00 A3 E1 CA 21 26 C4 0C 7F C9 68 DF AA EA>)
(   3,<2025-09-01 13:57:49.98 +0400>,<she>,<DPX200>,
      <pk PHC0 = -45.13608 PHC1 = 0 
       data hash MD5: 64K
       F9 D6 76 70 80 1C 34 40 63 7B 3B BD 10 D8 71 EF>)
(   4,<2025-09-01 13:57:57.68 +0400>,<she>,<DPX200>,
      <abs ABSG = 5 
       data hash MD5: 64K
       CD 89 FD 9B 35 58 FD 1F EC D5 65 2E 5D 77 E4 B5>)
$$ ##END=
$$ 
$$ hash MD5
$$ 13 3D A9 DF DE FE A1 FD 60 90 60 F2 FD 5C 6E 86
##$RELAX= 
##$RELAX= 
##$RELAX= 
##$RELAX= 
##$RELAX= 
##$RELAX= 
##$RELAX= 
##$RELAX= 
$$ Bruker specific parameters
$$ --------------------------
##$DU= <F:/spectra>
##$EXPNO= 2
##$NAME= <P31>
##$PROCNO= 1
##$TYPE= <nmr>
##$USER= <she>
##$AMP= (0..31)
100 100 100 100 100 100 100 100 100 100 100 100 100 100 100 100 100 100 
100 100 100 100 100 100 100 100 100 100 100 100 100 100 
##$AQSEQ= 0
##$AQ_mod= 1
##$AUNM= <au_zg>
##$AUTOPOS= <>
##$BF1= 81.014009
##$BF2= 200.13
##$BF3= 200.13
##$BF4= 200.13
##$BF5= 200.13
##$BF6= 200.13
##$BF7= 200.13
##$BF8= 200.13
##$BYTORDA= 1
##$CFDGTYP= 0
##$CFRGTYP= 5
##$CHEMSTR= <none>
##$CNST= (0..31)
1 1 145 1 1 1 1 1 1 1 1 1 1 1 1 1 1 1 1 1 1 1 1 1 1 1 1 1 1 1 1 1 
##$CPDPRG= <waltz16>
##$CPDPRG1= <>
##$CPDPRG2= <waltz16>
##$CPDPRG3= <>
##$CPDPRG4= <mlev>
##$CPDPRG5= <mlev>
##$CPDPRG6= <mlev>
##$CPDPRG7= <mlev>
##$CPDPRG8= <mlev>
##$CPDPRGB= <>
##$CPDPRGT= <>
##$D= (0..31)
0 1 0 0 0 0 0 0 0 0.06 0 0.03 2e-05 3e-06 0 0 0.0002 0 0 0 0 0 0 0 0 0 
0 0 0 0 0 0 
##$DATE= 1756720650
##$DBL= (0..7)
120 120 120 11 120 120 24 19 
##$DBP= (0..7)
150 150 150 150 150 150 150 150 
##$DBP07= 0
##$DBPNAM0= <>
##$DBPNAM1= <>
$$ [...]
##$SUBNAM3= <"">
##$SUBNAM4= <"">
##$SUBNAM5= <"">
##$SUBNAM6= <"">
##$SUBNAM7= <"">
##$SUBNAM8= <"">
##$SUBNAM9= <"">
##$SW= 400.765351723535
##$SWIBOX= (0..15)
0 1 3 0 0 0 0 0 0 0 0 0 0 0 0 0 
##$SW_h= 32467.5324675325
##$TD= 32768
##$TD0= 1
##$TE= 0
##$TE2= 300
##$TE3= 300
##$TEG= 300
##$TL= (0..7)
0 120 53 12 22 120 120 120 
##$TP= (0..7)
150 150 150 150 150 150 150 150 
##$TP07= 0
##$TPNAME0= <>
##$TPNAME1= <>
##$TPNAME2= <>
##$TPNAME3= <>
##$TPNAME4= <>
##$TPNAME5= <>
##$TPNAME6= <>
##$TPNAME7= <>
##$TPOAL= (0..7)
0.5 0.5 0.5 0.5 0.5 0.5 0.5 0.5 
##$TPOFFS= (0..7)
0 0 0 0 0 0 0 0 
##$TUNHIN= 0
##$TUNHOUT= 0
##$TUNXOUT= 0
##$USERA1= <user>
##$USERA2= <user>
##$USERA3= <user>
##$USERA4= <user>
##$USERA5= <user>
##$V9= 5
##$VALIST= <valist>
##$VCLIST= <CCCCCCCCCCCCCCC>
##$VD= 0
##$VDLIST= <DDDDDDDDDDDDDDD>
##$VPLIST= <PPPPPPPPPPPPPPP>
##$VTLIST= <TTTTTTTTTTTTTTT>
##$WBST= 1024
##$WBSW= 4
##$XGAIN= (0..3)
0 0 0 0 
##$XL= 0
##$YL= 0
##$YMAX_a= 30844
##$YMIN_a= -14763
##$ZGOPTNS= <>
##$ZL1= 120
##$ZL2= 120
##$ZL3= 120
##$ZL4= 120
##$ABSF1= 198.0616
##$ABSF2= -202.7028
##$ABSG= 5
##$ABSL= 3
##$ALPHA= 0
##$AQORDER= 0
##$ASSFAC= 0
##$ASSFACI= 0
##$ASSFACX= 0
##$ASSWID= 0
##$AUNMP= <proc_1d>
##$AZFE= 0.1
##$AZFW= 0.5
##$BCFW= 0
##$BC_mod= 2
##$BYTORDP= 0
##$COROFFS= 0
##$CY= -3
##$DATMOD= 1
##$DC= 0
##$DFILT= <>
##$DTYPP= 0
##$F1P= 0
##$F2P= 0
##$FCOR= 1
##$FTSIZE= 65536
##$FT_mod= 6
##$GAMMA= 0
##$GB= 0
##$INTBC= 1
##$INTSCL= 9.790993e-09
##$ISEN= 30
##$LB= 1.5
##$LEV0= 0
##$LPBIN= 0
##$MAXI= 10000
##$MC2= 0
##$MEAN= 0
##$ME_mod= 0
##$MI= 50
##$NCOEF= 0
##$NC_proc= -8
##$NLEV= 6
##$NOISF1= 182.463
##$NOISF2= 159.3651
##$NSP= 0
##$NTH_PI= 0
##$NZP= 0
##$OFFSET= 198.0616
##$PC= 4
##$PHC0= 1306.456
##$PHC1= 309.5
##$PH_mod= 1
##$PKNL= yes
##$PPARMOD= 0
##$PSCAL= 0
##$PSIGN= 0
##$REVERSE= no
##$SF= 81.0140089999434
##$SI= 65536
##$SIGF1= 159.3651
##$SIGF2= -187.1042
##$SINO= 113.3802
##$SIOLD= 16384
##$SREGLST= <1H.CDCl3>
##$SSB= 0
##$STSI= 65536
##$STSR= 0
##$SW_p= 32467.5324675325
##$SYMM= 0
##$S_DEV= 0
##$TDeff= 32768
##$TDoff= 0
##$TI= <>
##$TILT= no
##$TM1= 0
##$TM2= 0
##$TOPLEV= 0
##$USERP1= <user>
##$USERP2= <user>
##$USERP3= <user>
##$USERP4= <user>
##$USERP5= <user>
##$WDW= 1
##$XDIM= 65536
##$YMAX_p= 61618794
##$YMIN_p= -364128730
$$ End of Bruker specific parameters
$$ ---------------------------------
##NTUPLES= NMR SPECTRUM
##VAR_NAME=  FREQUENCY,     SPECTRUM/REAL,   SPECTRUM/IMAG
##SYMBOL=    X,             R,               I
##VAR_TYPE=  INDEPENDENT,   DEPENDENT,       DEPENDENT
##VAR_FORM=  AFFN,          ASDF,            ASDF
##VAR_DIM=   65536,         65536,           65536
##UNITS=     HZ,            ARBITRARY UNITS, ARBITRARY UNITS
##FACTOR=    0.49542278885378, 1,            1
##FIRST=     16045.7642231865, 0,            0
##LAST=      -16421.768244346, 0,            0
##MIN=       -16421.768244346, -364128730,   0
##MAX=       16045.7642231865, 61618794,     0
$$ Real data points
##PAGE= N=1
##DATA TABLE= (X++(R..R)), XYDATA
$$ [...]
9617 -2931999 -3700834 -3720884 -2997423 -1942794 -638376 942389 2016686 1471690 -231557
9608 -231557 -848241 826815 2860054 2421673 -549312 -3767385 -6131156 -8298000 -9723654
9599 -9723654 -8354345 -4519290 -1990329 -2831474 -3846247 -1323450 2678205 2746762 -2020392
9590 -2020392 -6704368 -7420044 -5637992 -4461732 -3986770 -2473010 221416 2722363 4327236
9581 4327236 5167824 5017666 3543857 1353493 -257417 -326209 1374444 4199588 6589307
9572 6589307 7181488 6326656 5430210 4700267 3181044 1320387 1275599 3511671 5165576
9563 5165576 3587374 -17839 -2386497 -2388332 -1401874 -570630 -90392 -748853 -3593371
9554 -3593371 -7610955 -9763155 -8314615 -5031511 -3355044 -5036101 -8835942 -11777780
9546 -11777780 -11374716 -7355567 -1750602 2877747 5428598 6509485 7092903 7365209 6775933
9537 6775933 4967096 2732464 1793928 2858957 4050409 2676417 -1015270 -3524841
9529 -3524841 -2641320 -658332 -1224295 -4191340 -5962390 -4466659 -1289644 1316903 3109075
9520 3109075 4690472 5742044 5787917 5347185 4912314 3753438 1205843 -1394016 -1536513
9511 -1536513 1586445 5932392 8483532 7752261 4551324 1020110 -926461 -755836 641844
9502 641844 2161343 3765970 6223414 9382930 11243022 9548955 4426866 -1329225
9494 -1329225 -5080696 -6841861 -8255711 -9737116 -9991132 -8332473 -5964351 -4295948
9486 -4295948 -3158819 -1627877 231304 1485010 1680523 1107094 55353 -1297679 -2457125
9477 -2457125 -2798283 -2103401 -513617 1696832 3904376 5243256 5446510 5058938 4464867
9468 4464867 3575594 2926462 3704657 5551774 5658917 1876118 -3944169 -7587458 -7288532
9459 -7288532 -5281133 -4576484 -5734517 -7057243 -6745062 -4548998 -2039426 -1153989 -1912563
9450 -1912563 -2268738 -1039953 289493 203729 100737 2093389 4918162 5316141 3321947
9441 3321947 2613381 4791413 6700327 5110945 1318371 -991951 -416454 1620790 3356458
9432 3356458 3883156 3229181 2812166 4416573 7326645 8176044 5305295 1522547 561739
9423 561739 2378987 4074130 3953259 2338889 -201044 -2704630 -2985021 125439 4237868
9414 4237868 5753650 4257578 2041075 46695 -2494045 -4720243 -4182251 -970100
9406 -970100 1512598 1202039 22758 445066 1978912 2940332 3571457 5198080 7579338
9397 7579338 9069982 8796203 7429699 6426140 7153986 9670157 11742159 10629978 6817071
9388 6817071 4350434 6097461 10019492 11618871 8925433 3668541 -1207131 -3469166
9380 -3469166 -2157814 1671192 5096835 5842239 4496262 3243070 3052565 3225299 2752340
9371 2752340 748630 -3310390 -7935117 -9341119 -5371830 774039 3462726 1409040
9363 1409040 -1118668 -444771 1905979 2130935 -642297 -4140190 -6442533 -7349071 -6768278
9354 -6768278 -3936901 1203232 7007637 11158587 12421188 11370094 9718171 8829706
9346 8829706 8536674 7486749 4900642 1801225 160648 880711 2887522 4272885 4170118
9337 4170118 3339325 2898339 2868883 2544794 2104895 2731343 4616082 5990173 5248625
9328 5248625 3188711 1702295 898162 -606882 -2735451 -3452983 -1729215 950828 2885253
9319 2885253 4136778 5057767 4662994 2308516 -258608 -636508 1014158 2383253 2323398
9310 2323398 1912503 2329161 3599526 5713298 8985771 12385829 13124289 9429456 3133962
9301 3133962 -1611358 -1972590 1752852 7244510 11985372 14177593 13060888 9107593
9293 9107593 3834181 -915086 -3830325 -4668057 -4118105 -3022837 -1676028 -37456 1521501
9284 1521501 2259379 2030725 1600233 1503392 1088397 -548367 -2926513 -4446589 -4421295
9275 -4421295 -3862418 -3781241 -3731921 -3029790 -2555258 -3705283 -5746949 -6101945 -3795308
9266 -3795308 -852539 696936 1385131 2321502 2506189 699961 -1268104 -411220 2442199
9257 2442199 3223450 870071 -792992 769253 2373475 -28328 -4812949 -6898018
9249 -6898018 -4889949 -1961907 -340864 894376 2327148 2592803 1453314 1118898 2866327
9240 2866327 4991584 5699400 5612276 5782698 5522247 4044130 2210309 791700 -996740
9231 -996740 -3270473 -3935572 -1805592 715843 946929 212613 1390869 3370599 2016640
9222 2016640 -3358691 -8411761 -9590308 -8172613 -7072950 -6666007 -5915627 -5275974 -5759448
9213 -5759448 -6396124 -5285979 -2847132 -1736726 -3174261 -5109564 -4980636 -3214963 -2637241
9204 -2637241 -4532899 -6745891 -6715396 -5479065 -6602998 -10837531 -14187367 -12962912 -8956604
9195 -8956604 -7117956 -9140501 -12225163 -13720171 -13620255 -12040591 -7865817 -1748473 2467796
9186 2467796 2010636 -830603 -1522084 962336 3523069 3339193 646889 -2537343 -4394578
9177 -4394578 -4012940 -1916334 -123089 -336101 -1967786 -3071860 -3017185 -2892058 -3425939
9168 -3425939 -4047003 -4098797 -3515282 -2067987 561507 3510763 4932958 4114239 2232050
9159 2232050 401455 -1752094 -4644584 -7049153 -7297872 -5642261 -4028408 -3564644 -3401391
9150 -3401391 -2414053 -982131 -375996 -920438 -1661579 -1815065 -1664407 -1605226 -1081726 540674
9140 540674 2353417 2449806 468653 -1527026 -1530575 -144775 410074 -601805 -1533461
9131 -1533461 -688043 1344920 2171792 210506 -3354741 -5410533 -4110636 -1124482 203041
9122 203041 -915902 -1741377 -120446 2040081 1343134 -2003193 -4175388 -2875666 -28392
9113 -28392 1509151 1738462 2366942 3355004 2852260 328489 -2169874 -2554167 -1309938
9104 -1309938 -557740 -982508 -959427 819426 2892108 2544743 -419072 -3022245 -2790712
9095 -2790712 -604493 1173926 2006535 2993364 4470994 5811042 6932851 7850249 7251964
9086 7251964 4188109 1108190 2081900 7060295 10872476 9652791 5753007 4052259
9078 4052259 5506753 7174520 7258282 6911758 7285950 7644441 6980257 5409213 3235046
9069 3235046 260773 -3159483 -5623353 -6118753 -5231952 -4278174 -3725344 -2948228 -1221188
9060 -1221188 1360249 3784724 4827849 3923239 1388692 -1914372 -4721142 -5619282 -4332373
9051 -4332373 -2694079 -2797043 -3834294 -2674279 1557662 5631727 6523905 5370926 4720940
9042 4720940 3916708 786135 -3242936 -4090600 -1401974 244312 -2002553 -5063780 -4692630
9033 -4692630 -1413320 1254981 2271396 3261906 4326380 3271147 -656011 -5021002
9025 -5021002 -7163740 -7196221 -7165122 -8317503 -9861906 -9786432 -6681372 -1434677 2853789
9016 2853789 3499474 983401 -1517027 -1351399 1371670 4353832 4853795 1177188 -5916849
9007 -5916849 -12765603 -15229141 -12740946 -9137975 -8352434 -9977484 -10513980 -8520085 -6406973
8998 -6406973 -6524124 -7605288 -7027526 -5298437 -5469293 -8004005 -9227498 -6460897 -2391189
8989 -2391189 -1751446 -4849647 -7238686 -5537899 -831117 4005035 7515618 9108543
8981 9108543 7878825 4062933 202463 -1124593 -51688 1338666 1562325 332005
8973 332005 -2111519 -4599876 -5013472 -2606112 233292 354001 -2451132 -5775239 -8041117
8964 -8041117 -9618068 -10817401 -10964959 -9725413 -7639373 -5269009 -3446066 -4009085 -7875340
8955 -7875340 -12224604 -12399364 -7642074 -2487031 -1040518 -2141369 -2013331 350406 2879924
8946 2879924 4071652 4185294 3330601 942249 -2565450 -5537688 -6959838 -7268475 -7006160
8937 -7006160 -5939043 -3945123 -1763934 -319241 144005 -16018 -337864 -577208 -828321
8928 -828321 -1233860 -1432752 -805082 438490 1188139 975187 647061 819482 903764 798458
8918 798458 2056624 5431400 8459574 8099231 5218604 3556273 4197750 4284593 2017368
8909 2017368 -389339 -645549 -445723 -2792300 -7063718 -9809540 -9640560 -8468789 -8051963
8900 -8051963 -7916054 -7140171 -6049487 -5259511 -4448683 -2886827 -385132 2575639 4959843
8891 4959843 5623999 4735843 4475030 6836029 10752820 13060862 12540427 11182838 10852346
8882 10852346 10663756 8991476 6530972 5544530 6767008 8662937 9525309 9080243 8091930
8873 8091930 7360214 7167180 7115218 6586954 5682402 5263112 5732707 6543347 7449172 9136650
8863 9136650 11464766 12103210 8778935 2653924 -2337668 -3824478 -3140828 -2642318 -2471902
8854 -2471902 -1246648 948572 1902246 -47947 -3515400 -5001070 -2475116 2342648
8846 2342648 5764009 6048156 4688561 3622031 2553246 310939 -2126985 -2010122 1639020
8837 1639020 6507048 9552565 9848848 8422281 6638894 5624112 6178696 8066683 9788795
8828 9788795 9838862 7965451 4972144 1965480 112227 177897 1635511 2977643 3480744
8819 3480744 3818025 4380585 4191196 2551658 760511 792523 2801532 5132036 6312696
8810 6312696 5905900 4030359 1502498 56503 851836 2816590 3827835 3438561 3035536
8801 3035536 3406789 3800008 3577381 3143633 2810207 2366495 2382374 4228204 7746998
8792 7746998 10360821 9864570 7126962 4734131 3819858 3662131 3765753 4624369 6304595
8783 6304595 7544891 6771534 3592811 -699177 -3785507 -3879727 -1233240 2198123 4964804
8774 4964804 7291115 9443268 10150590 8254582 5204566 3730705 3932533 2954775 -580717
8765 -580717 -3984812 -4083011 -1791936 -688497 -1694228 -1972691 379716 3128473 3033531
8756 3033531 510247 -999018 384939 3151499 5120393 5890890 5926928 5078993 3434636
8747 3434636 2503590 3864484 6882213 9022895 8475638 5668438 2353402 42717 -739466
8738 -739466 -493532 -158928 -88333 103042 262658 -865579 -3842061 -6889608 -7597529
8729 -7597529 -5892388 -3616181 -1426166 1686931 5506934 7675085 6807415 4477931
8721 4477931 2613971 772735 -2100756 -4843017 -5508812 -4743947 -5056807 -6871334 -7824428
8712 -7824428 -6453673 -4366275 -3762609 -4505721 -4887114 -4145509 -2940020 -1975343 -1326161
8703 -1326161 -907567 -712157 -487558 285675 1827754 3500241 3906837 1883609 -2232861
8694 -2232861 -6470504 -8821880 -8999867 -8268871 -7639944 -6747532 -4681050 -1660647 385132
8685 385132 -733592 -4979566 -9242524 -9952717 -6828662 -3019901 -1122530 -457634 764382
8676 764382 2250445 2524476 1906412 2125493 3214874 3138224 742183 -2975876 -6786748
8667 -6786748 -10216767 -12195168 -11254490 -8209946 -6265076 -6752550 -6798906 -3364190 1996410
8658 1996410 4963408 4167088 2453145 2600258 4196367 5256574 4953729 3776753 2284534
8649 2284534 763163 -511034 -1421773 -2117567 -2555354 -2210484 -566751 2172708 4932166
8640 4932166 6301632 5425985 2577506 -1163886 -4656236 -6834699 -6576177 -3605978 245983
8631 245983 2020870 752896 -1256280 -1185999 1055376 3302643 4088345 3876467 3780880
8622 3780880 4324168 5403367 6477851 6672056 5290802 2314140 -1616758 -5117548 -6118561
8613 -6118561 -3580018 267326 1288968 -1635111 -4946378 -5489687 -5150665 -7487542 -11393311
8604 -11393311 -12156783 -8519203 -4497892 -3359084 -3591459 -2449598 -129069 1717360
8596 1717360 2819862 3312863 2352615 192983 -595152 1259800 2923257 1409744 -1411862
8587 -1411862 -1493059 862761 1429841 -1026510 -2648546 -585519 2519044 2381724 -1124875
8578 -1124875 -4419575 -4799610 -2363748 1527974 5526612 8370432 9358276 8897608 7863111
8569 7863111 6708475 5676051 5084805 4630328 3188567 277426 -2891955 -4718947 -4991369
8560 -4991369 -4556836 -4006064 -3749927 -4597733 -6716499 -8325962 -7032206 -2718631 2022921
8551 2022921 4571418 4463530 2913506 1406937 1143814 2664104 5192578 7037393 7341165
8542 7341165 6943251 6959058 7095808 6152634 3849969 1337555 -94209 -178801 516088
8533 516088 1392986 2196615 2896893 3464049 3697439 3256723 2061478 731983 327390
8524 327390 1264273 2530498 2444600 526244 -1658966 -1996430 -90228 2445650 3883044
8515 3883044 3823903 2600423 257518 -3038818 -6184464 -7718133 -7034518 -4398255 -337617
8506 -337617 3938234 6146063 4707441 1076959 -1334294 -1077972 -39800 -288999 -1276411
8497 -1276411 -1370605 -593181 23773 766351 2710536 5118542 5486121 2688849 -1417460
8488 -1417460 -4195533 -5047042 -5544577 -7468500 -11010130 -14362120 -15082675 -12508559 -8690414
8479 -8690414 -6298082 -6041257 -6992550 -8508079 -10057147 -9830179 -6183057 -897678 1568583
8470 1568583 -665267 -4387394 -5385109 -3229156 -407748 1514592 2734330 3468413 3742960
8461 3742960 4323804 5715064 6520788 4793583 988303 -2209538 -3166697 -2936133 -3460781
8452 -3460781 -5412911 -7895533 -9214094 -8121007 -5379991 -3611055 -4228298 -5231313
8444 -5231313 -3932290 -1276516 -895118 -3824423 -6996078 -7792289 -7332107 -7595609 -7652301
8435 -7652301 -5254006 -964784 1859471 1154759 -1621839 -3753806 -4571133 -5716715 -8340703
8426 -8340703 -10759005 -9903730 -5452884 -1121311 -266134 -1315717 -151583 3408516 4967977
8417 4967977 2236416 -1214194 -1046160 1964594 4110348 4494901 4980833 5869326 5726247
8408 5726247 5202380 6928120 10706872 12356671 9187525 4140521 2336083 4970896
8400 4970896 8503430 9005588 5803915 1406206 -887009 402045 3730154 6065982
8392 6065982 6067106 5270024 5701105 7088395 7351526 5425655 2533115 525934 -256332
8383 -256332 -1010756 -2713798 -4990977 -6925985 -8380657 -9718145 -10429614 -9174513 -5509454
8374 -5509454 -478982 5018114 11079474 17002758 20143234 18480984 13547042 8797421
8366 8797421 5537834 2581937 -325533 -1388292 263445 2703514 3483234 2227322
8358 2227322 31891 -2226507 -4006331 -4934820 -5531144 -6807421 -8315023 -8180526 -6185858
8349 -6185858 -5040410 -6923131 -10236406 -11748184 -10778168 -9091640 -7538932 -5300695
8341 -5300695 -2225443 480421 2183747 3456841 4386227 4080305 2415465 600792 -652913
8332 -652913 -1927316 -3270943 -3233771 -1008991 1719785 2609175 1605741 623067 760092
8323 760092 1374341 1824550 2521980 3668391 4182988 2988299 875137 -29806 1203294
8314 1203294 3130734 3776416 3117239 2955448 4397252 6293925 6621744 4959333 3119850
8305 3119850 3481623 6808643 11198385 12905934 9109515 947442 -6520110 -8630913
8297 -8630913 -5714017 -2578184 -3199456 -6739414 -9160948 -7887335 -4189216 -1596232
8289 -1596232 -2688441 -6982835 -11167255 -11701533 -8066291 -3469829 -1694575 -3233879
8281 -3233879 -5147226 -4647725 -1940454 733007 1870844 1677531 767377 -926897 -3526767
8272 -3526767 -6032185 -6495087 -3735854 1148461 5364889 6907175 6374595 5912278 6491595
8263 6491595 7058179 6608129 6036026 6872969 8710133 9222704 6982492 3259914 537807
8254 537807 -150049 83231 -461771 -2257730 -4145788 -4509951 -2892907 -385523 1647576
8245 1647576 2805557 3303279 3149050 2621427 2953353 5057873 7666805 8266650 6101715
8236 6101715 2838763 126395 -1793565 -2838149 -2700892 -2506112 -4397740 -8027726 -9834149
8227 -9834149 -7808509 -4684768 -3807202 -4020318 -2120608 1223960 2247901 349839 -674143
8218 -674143 1721718 5649447 8278250 9194448 9037693 7903775 6621732 6783195 7884870
8209 7884870 7132341 3747223 723516 436696 1359823 1410679 1654264 3709047 5979777
8200 5979777 5972279 4542546 4258123 4880130 4132192 2040778 776684 610031 -285724
8191 -285724 -1989146 -2412592 -1220814 -734460 -1928514 -2618118 -1073201 1101259 1379167
8182 1379167 -239567 -1754309 -1874471 -1040749 -648518 -1844509 -4183566 -5465215 -4247370
8173 -4247370 -2272661 -2409141 -4252124 -4365176 -1489369 1223260 530282 -2709145 -5427651
8164 -5427651 -6492540 -6875996 -7056622 -6476090 -5060811 -3617432 -2955606 -3646204 -6068186
8155 -6068186 -9618212 -12387941 -12661929 -10489187 -7252575 -4280585 -2344479 -1639443 -1558470
8146 -1558470 -1195570 -555996 -400209 -592645 10169 1386949 1702033 41070 -1649001
8137 -1649001 -982550 1530986 3342694 3435679 3300640 4585160 7326100 10503608 12932067
8128 12932067 13355191 10863106 5816048 -183058 -5527899 -9492298 -11901805 -12493925
8120 -12493925 -10973179 -7629017 -3629289 -312526 1969794 3815668 5193769 4715226
8112 4715226 1548422 -2553580 -4688252 -4106483 -2504547 -1108848 592972 2899161
8104 2899161 4785596 5638360 6286285 7270728 7714452 6948300 5624184 4128279 1664993
8095 1664993 -1758895 -4250587 -4548231 -3945662 -3970163 -3880077 -2593461 -1507934 -2799172
8086 -2799172 -5893657 -8137083 -8340507 -7456813 -6479005 -5975130 -6999479 -9989364 -13283626
8077 -13283626 -15185074 -16832979 -20164638 -23525999 -22805829 -17321885 -11187858 -7796440
8069 -7796440 -6039839 -3490417 -479228 1110898 1012561 288176 -710906 -2058612 -2918431
8060 -2918431 -2327237 -708689 795377 1880419 2753576 2973824 1937102 42290 -1762574
8051 -1762574 -3163423 -4215410 -4441883 -3357682 -1572909 -277558 238948 639220 1259139
8042 1259139 1686926 1557232 846214 -725160 -3619293 -7280243 -9632127 -8639102 -4470650
8033 -4470650 371375 3342202 3975129 3483001 2803376 1917901 945537 641111 1243036
8024 1243036 1829551 1663028 1433448 2308654 4425428 7144772 9921492 11842509 11369493
8015 11369493 8270819 5153503 5018333 7357574 8639801 6930504 4127189 2971800
8007 2971800 3583343 4049028 3278640 2084558 1920214 3256016 4934496 4970219 2501789
7998 2501789 -1005564 -3063164 -2532924 -132327 2838930 5133342 5460799 3461388 828053
7989 828053 -83875 996564 2243168 2538151 2701522 3588821 4531959 4319754 2607394
7980 2607394 -31491 -2439122 -3253952 -2267001 -1374119 -2697265 -5788922 -8271310 -9006593
7971 -9006593 -8628894 -7159752 -3760543 684558 3380899 2971901 915373 -1114317 -2765255
7962 -2765255 -3363144 -1750866 1000130 1728986 -322434 -2048562 -1300784 -50212 -457076
7953 -457076 -1039875 144376 1417571 297104 -1955865 -2650031 -2628628 -4462797 -6910448
7944 -6910448 -5945638 -1100390 3640710 5580046 5827151 5526481 3787537 778431 -840264
7935 -840264 395792 2426003 2933664 2567861 3016504 3956276 4018733 3336264 3153177 3737617
7925 3737617 4185857 3806168 2769611 1840074 1833213 2656317 2918871 1658054 320856
7916 320856 1317787 4380487 6277644 4858526 1694766 -150197 480820 2493450 4236961
7907 4236961 4685394 3993900 3449855 3904392 4241771 2910860 879280 861960 3242690
7898 3242690 5262596 5127454 4245294 3902225 2432390 -1898771 -7250667 -10302370 -10771473
7889 -10771473 -11043078 -11971897 -11856460 -9596288 -6362124 -3549038 -1038078 1626211 3733064
7880 3733064 4123251 2731203 645539 -1134042 -2624595 -4613182 -7577201 -10907995
7872 -10907995 -13397355 -14381879 -13955896 -12218713 -9168192 -5451267 -2280806 -307257
7864 -307257 629229 603819 -337317 -1139863 -393187 1512336 2682930 2917912 4441235
7855 4441235 7991384 10380302 8339343 3264158 -646914 -2039034 -3111758 -4927241
7847 -4927241 -5327659 -2536594 1753613 4512237 4970681 4570461 4399230 4147695 3140985
7838 3140985 1345975 -447603 -922037 810676 3939976 6052001 5149923 1523143 -2590000
7829 -2590000 -4913154 -4625814 -2556173 -320597 1038824 1855454 3064690 4660706 5571682
7820 5571682 5313885 4979264 5866015 7586791 8376150 7135358 4385422 1195837 -1895302
7811 -1895302 -4452142 -5445277 -3968957 -575918 2825208 4558683 4293159 2753083 1075023
7802 1075023 467395 1528809 3452873 4668208 4671345 4323851 3916539 2400612 -278950
7793 -278950 -1573833 823673 5294208 7896574 7550136 7058539 8472585 10062489 9253341
7784 9253341 6418587 3889757 2666587 2047725 1564800 1400800 1381443 1124538 900266
7775 900266 1159596 1700141 2443210 4320423 7906602 11675615 13217590 11992222 9454150
7766 9454150 6736731 3873838 1243159 -168238 -549906 -1682038 -4491495 -7266316
7758 -7266316 -7534912 -5244929 -2928812 -2627484 -3478225 -2884524 221212 4013544 5977952
7749 5977952 5832834 5396467 5891144 6674918 6825501 6521224 6074351 4852918 2334229
7740 2334229 -605438 -2569413 -3090469 -2166816 695696 5402873 9761018 10841435 8089430
7731 8089430 3882468 777152 -858700 -2277039 -4203841 -5650106 -4801254 -1333692
7723 -1333692 2265276 2729761 -206190 -3235263 -3356028 -978898 1698702 3617062 4591230
7714 4591230 3974278 1977711 970515 2632279 4635852 3221212 -1259436 -4563494
7706 -4563494 -4492969 -3353940 -3740407 -5036089 -5521394 -5186759 -4582474 -3091497 -432192
7697 -432192 1729047 1678741 88473 -1083253 -1154072 -749727 -197094 708463 1954440
7688 1954440 3306322 4342851 3962761 1175942 -2869128 -5332880 -5336165 -5367489 -7361288
7679 -7361288 -9125536 -7116937 -1736161 2827430 3837234 2702667 2099020 2410835 1903488
7670 1903488 -765382 -4979021 -8510929 -9112452 -6256241 -1575669 2469357 4123649
7662 4123649 2747250 -1033803 -4904421 -5914685 -3485450 -802098 -1761482 -6651511
7654 -6651511 -11918453 -14018073 -12508080 -9549631 -7419152 -6658103 -6139749 -4941468 -4019909
7645 -4019909 -5057262 -7478385 -8332628 -6182484 -3332040 -2396001 -2209138 348006 5388994
7636 5388994 9727958 11308198 11104199 10346737 8731064 6369418 4937630 5218162 5335622
7627 5335622 3192719 -605453 -3873349 -5880479 -7616522 -9643533 -11283838 -11842797
7619 -11842797 -11447353 -10553897 -9337378 -7593849 -4888045 -1136130 2521106 3971397
7611 3971397 2089321 -1683810 -4405312 -4421451 -2801526 -1960064 -3039794 -4770852 -5043868
7602 -5043868 -3556975 -2312027 -3048276 -4921103 -5771967 -5171368 -4654506 -5008307 -5191268
7593 -5191268 -4564929 -4379506 -5683543 -6998711 -5759986 -1642267 2844675 4942489 4015314
7584 4015314 1702702 491803 1722898 4235937 5373586 3915021 1401565 6895
7576 6895 119197 871351 1692809 1893187 168431 -3218716 -4854343 -1758449 3671715
7567 3671715 5498354 1621475 -3719575 -5876313 -5039223 -3704640 -2068796 901892
7559 901892 3927161 4649169 3593089 3584876 5472880 7376831 8095216 8321386 8313375 7294911
7549 7294911 5572266 4279165 2492263 -2057525 -8362685 -11884739 -10846925 -9230635
7541 -9230635 -10701783 -12851291 -11371649 -7498261 -6492772 -9658309 -12598071 -11739299
7533 -11739299 -8471814 -5804816 -4495970 -4061217 -4703226 -6262402 -7204905 -6390690 -4580901
7524 -4580901 -3115607 -2363751 -2190976 -2489830 -2583944 -1605644 16995 1028204 1522384
7515 1522384 2618724 3730683 2799301 -35258 -1888473 -1437102 -728487 -1076676 -529689
7506 -529689 2020456 3491313 1077337 -2375759 -1852563 2236079 4370431 1588037 -3269494
7497 -3269494 -6408100 -7390235 -7462640 -6850061 -5559325 -4691066 -5079504 -5772912 -5107851
7488 -5107851 -2638431 443213 2085751 782505 -2560584 -4492100 -2471744 1632326
7480 1632326 3409406 1432896 -1047642 -411107 3169925 6566333 7175461 4874337 1713775
7471 1713775 185443 872996 1825010 1231519 9535 -11397 441201 -739564 -2638695
7462 -2638695 -1555115 3485299 8690754 10527488 9865139 9087215 7809112 4388566 -55202
7453 -55202 -2342726 -1501571 101164 -107916 -2310097 -4737315 -5413978 -3608866 -538023
7444 -538023 1617353 2014382 1898294 2608135 3892588 4858675 5263119 4907040 3187140
7435 3187140 539563 -1045126 -473020 778063 1132182 1694042 4268448 7555212 8114271
7426 8114271 5168626 1949973 1585297 3614676 5522578 6036794 5456659 3715371 4623
7417 4623 -5321766 -9720319 -10548379 -8108758 -5509805 -5003846 -5555648 -5050348 -3724633
7408 -3724633 -3506459 -4636276 -5383157 -5075864 -4793868 -4651453 -3326412 -1356809 -1832653
7399 -1832653 -5790667 -9488045 -8791826 -4437807 -543097 409985 -1288211 -4654350 -8370703
7390 -8370703 -10392871 -10048900 -9442358 -10055358 -9304397 -3767668 5126160 12212080 14911029
7381 14911029 14872857 13636301 10759323 6940363 5091505 6624336 9418380 10918960
7373 10918960 10965676 10479395 9717351 9007501 9022486 9172228 7747683 4670240 2100438
7364 2100438 1455437 1957666 2947282 5136466 8299583 10059967 8561206 4586631 -18429
7355 -18429 -3973339 -5723952 -3673104 1142328 4982990 5694397 4787689 3769580 1394329
7346 1394329 -3001855 -6267080 -4926503 -177535 3747760 4825168 3853482 1273626
7338 1273626 -3050908 -7418798 -9020339 -7368713 -4709116 -3108052 -3056402 -4224632 -5252803
7329 -5252803 -3560987 1887629 8067008 10825791 9953532 8572268 8055617 6963377 4957153
7320 4957153 3922303 4306625 3911447 1794149 187448 700322 1464101 250374 -2003849
7311 -2003849 -3205420 -3609590 -4700879 -6152165 -6671260 -6807553 -8047759 -9591068 -8876769
7302 -8876769 -5605441 -2792960 -2990963 -5284358 -7072851 -7438574 -7402628 -7535805 -6773048
7293 -6773048 -3966901 40602 2576406 1589371 -2250968 -6186930 -7994167 -7628812 -6458245
7284 -6458245 -5616311 -5413337 -5774149 -6654285 -8010797 -9465391 -10030647 -8610746 -5268170
7275 -5268170 -1568294 1128682 3319441 6231598 9472880 11425029 11923060 12503858 13435546
7266 13435546 12735080 9510861 6296289 6008761 7987940 9352333 9256688 9136295 9233117
7257 9233117 7943379 5087630 2978514 3005287 3504846 2634625 1343888 1452111 2383188
7248 2383188 2305552 1530259 1957351 3352055 3129808 626049 -1066593 795625 4488916
7239 4488916 5825838 3252128 -954228 -3880278 -4364951 -2481705 1150721 4980634
7231 4980634 7125546 7201901 6456957 5613902 3968498 1337950 -654443 -596715 521693
7222 521693 711016 -115957 -267080 1031847 2688457 3591968 4036733 4951592 6700837
7213 6700837 8928235 10789426 11207109 9687783 6985665 4291843 1968390 -27586
7205 -27586 -884690 374481 2834104 3861078 1901350 -2006568 -5761214 -7876180 -7438117
7196 -7438117 -4415063 -1015792 -779755 -4518721 -8464641 -8381630 -4642184 -1327477 -1080207
7187 -1080207 -3056126 -5489067 -7606021 -8607311 -7330130 -4204511 -1692742 -1322096
7179 -1322096 -1654111 -638132 1324364 2491136 3004836 4735798 7988100 10482689 10209209
7170 10209209 7679188 4676761 2324968 1300028 2286789 4565432 5369170 2821957
7162 2821957 -999242 -2215441 -319558 1291658 509549 -563788 450823 1875526
7154 1875526 405307 -3597391 -6506794 -6685705 -6035974 -5941616 -4982701 -2103488 737500
7145 737500 1252967 244466 28091 790126 934339 272784 374109 1771060 2913684
7136 2913684 2303661 221509 -1904307 -2612332 -886385 3032317 7019000 8503832 6957172
7127 6957172 4116825 1833214 849824 1511082 3894376 6796114 8271989 8007815 7710657
7118 7710657 8248922 8000625 5534857 2633768 2501411 5280598 7348727 5499501 369228
7109 369228 -4918869 -8274134 -9787811 -10239536 -9999071 -9573815 -9952014 -11403236 -12449496
7100 -12449496 -11238203 -8107877 -5644130 -5433150 -5655560 -3218009 1972035 6280696
7092 6280696 6328864 2680470 -1095492 -2305239 -1260619 15256 171576 -631539 -1598230
7083 -1598230 -2256553 -2339206 -1200521 1816335 6120843 9592656 10242648 8070133 4972965
7074 4972965 3113674 3599112 6084630 9043282 10967335 11863513 12760408 13163196 10615899
7065 10615899 4511792 -1134526 -1572489 2461799 5428662 4082787 698153 -1541783
7057 -1541783 -2745419 -3936840 -3847050 -1305408 1414126 1273666 -734529 -1058712 703186
7048 703186 1141183 -1699030 -5671888 -8041818 -8916743 -9929740 -11547945 -12926929 -12957142
7039 -12957142 -10667147 -6111724 -1462174 561749 144091 464876 3391818 6943010
7031 6943010 8335712 7778953 7474464 8166590 8618524 7755393 5599478 2585434 -473581
7022 -473581 -2060737 -1085925 1647120 4118446 5081549 4558126 2892597 633125 -758767
7013 -758767 557438 4987940 10740803 15145005 16582494 15326397 12828130 10117891
7005 10117891 6949970 2945215 -728875 -2055458 -793456 1041763 2025977 3114144
6997 3114144 5377856 7453844 7131716 4622607 2299311 1617755 2099130 3018048 4139501
6988 4139501 4803998 4270677 3384882 4209616 7403509 11318803 14167477 15728164 16399797
6979 16399797 15988441 14296008 11905434 9582700 7546925 5714424 3930047 1838025
6971 1838025 -475524 -1696848 -555168 1863607 2717685 970296 -1231232 -1558712 -257057
6962 -257057 1150752 2137950 2578215 1534083 -1109482 -2848682 -1052979 2819875 3909022
6953 3909022 -433892 -7347598 -11561146 -10616864 -6275766 -1691529 1773246 4986249
6945 4986249 8781782 11751918 11171779 6556424 1162550 -1396026 -1340670 -1866729 -4494279
6936 -4494279 -7389828 -8558958 -8440816 -8272559 -7808927 -6307805 -4453993 -3469592 -3070838
6927 -3070838 -2007474 -101883 1886921 3893090 6050315 6804326 3991668 -1478730
6919 -1478730 -5284327 -4518481 -1212432 696356 505972 580304 1909621 2750763 2054925
6910 2054925 1515340 2761402 4479296 4245903 2043459 -41449 -968272 -1585097 -2492703
6901 -2492703 -2994460 -2477953 -1224371 579088 3074642 5359381 5412521 2433981 -1807339
6892 -1807339 -4809605 -5461175 -3687235 293214 4839293 6590724 3704710 -1206162
6884 -1206162 -3685802 -2809731 -1675230 -2517842 -4046814 -4471039 -4476814 -5403993 -6577908
6875 -6577908 -6850860 -7427147 -10405622 -14933078 -17404086 -15830702 -11967428 -8595513 -6577080
6866 -6577080 -5356011 -4602825 -4121603 -3365994 -2354291 -2246112 -3826464 -5999455 -6840176
6857 -6840176 -5755683 -3862417 -2766595 -3578648 -6192490 -8572201 -7756099 -2959823 2988072
6848 2988072 6580941 7155424 6054903 3619972 -417675 -4245688 -4927456 -2502094 -231570
6839 -231570 26341 -225985 127487 -578428 -3416594 -6208190 -7023446 -7548817 -9453722
6830 -9453722 -9901666 -5370784 1402288 3698325 370780 -1996930 1822330 8785001
6822 8785001 12256761 10173061 5595305 1753335 -232885 -376731 265850 -488621 -3555959
6813 -3555959 -6603319 -6574772 -3724939 -1232458 -1219828 -2894513 -4198777 -3600155 -661704
6804 -661704 3392608 5834329 4717156 1013183 -2610693 -4681076 -5375506 -4885301 -3124303
6795 -3124303 -741027 1349816 3371093 6042099 8683226 9710558 9145501 8905089 10115790
6786 10115790 11555434 11397134 9478605 7263741 6202864 6460197 6864545 6138295 4436079
6777 4436079 3174078 2988142 2831714 1796956 606963 258453 588580 1515505 3888206
6768 3888206 7044058 7484164 3140054 -2372091 -3532970 -392684 1746214 117096
6760 117096 -2451686 -3163933 -3327330 -4596916 -5171159 -2922157 537398 2184862 1936448
6751 1936448 1687612 1804937 1550246 1442294 2103364 1972731 -682680 -4358158 -6067697
6742 -6067697 -5915093 -6650680 -8834747 -9812249 -8067084 -5534686 -4386224 -3929213 -2213960
6733 -2213960 910993 3765824 4950399 4616784 4251244 5410829 7861874 9123365 7066600
6724 7066600 2777633 -642361 -1877000 -2096779 -2033992 -973502 700643 791057 -1192715
6715 -1192715 -2162166 553539 5051390 7385615 7074193 6970869 8111902 8247270 6230552
6706 6230552 4356540 4287442 3588620 -415799 -5125234 -5082447 255233 5194575 5373652
6697 5373652 2918402 1827290 1660268 -418785 -3524945 -3722006 -439485 2317007 2092724
6688 2092724 1318251 2742043 5008588 5404299 4439898 4695755 6660317 8522675 9193213
6679 9193213 9096376 8560191 7533635 6520886 6139413 6250395 6767077 8201737 9922558
6670 9922558 9415101 5424022 467455 -2189850 -2711320 -3058980 -2684782 342027 4574933
6661 4574933 5872815 3323895 477271 -358289 -1050255 -3132721 -4255551 -2012592 1635779
6652 1635779 3135315 2585028 2800027 4301630 4701422 2888380 735698 -33211 -341553
6643 -341553 -1982006 -4803088 -6950127 -7394737 -7244055 -8287090 -10523894 -11675826 -9622216
6634 -9622216 -5023002 -737953 1221236 1202872 533218 -7767 -141483 -29942 -751098
6625 -751098 -3332835 -6680853 -8093841 -6712681 -4734295 -4067048 -3723933 -2253622 -800168
6616 -800168 -1148531 -2097159 -997831 1518723 1809087 -1096402 -3257329 -1086022 3431197
6607 3431197 5160425 2260696 -2199593 -4649240 -4662007 -3706657 -2292515 137283 3338844
6598 3338844 5821657 6336776 5013854 3095587 2261724 3886709 7662071 10788540 10082328
6589 10082328 5808436 2231273 3092136 7348061 10693299 10554012 8019663 5431052
6581 5431052 4030141 3969749 4673693 4664070 2600177 -893831 -3685284 -4812437 -5388344
6572 -5388344 -6499568 -7782424 -8710396 -9702503 -10995427 -11739509 -11234949 -9979411 -8629296
6563 -8629296 -7072576 -5422313 -4698301 -5390289 -6349737 -6257594 -5423612 -5175867 -6192598
6554 -6192598 -8170015 -10248139 -11096647 -9690060 -6801641 -4613673 -4107134 -4151347 -3908206
6545 -3908206 -4317614 -5858060 -6653781 -4817150 -1447250 753082 996221 637602 634632
6536 634632 712315 529308 -169080 -2115428 -5375595 -7895159 -7045011 -2803547 1894411
6527 1894411 4049662 2991846 361699 -1274320 -391056 1836198 2488511 414349 -2304851
6518 -2304851 -3419694 -3388179 -3507448 -3003065 -594030 2277668 2757665 574212 -2007787
6509 -2007787 -3767535 -5253426 -6282867 -5829021 -4544275 -4365725 -5165694 -4733830 -2715267
6500 -2715267 -1555853 -2517864 -3680758 -3335659 -2674075 -3245635 -3980591 -2906203 -356172
6491 -356172 1460069 1172849 -803000 -3133595 -4395566 -4062615 -3451416 -4547926 -7265965
6482 -7265965 -9210085 -8745342 -6770428 -4855043 -3411099 -2494504 -2493686 -2983047 -2758513
6473 -2758513 -2085830 -2904549 -5561766 -7576144 -7337086 -6797339 -8220794 -10150022 -9372182
6464 -9372182 -5740974 -2322047 -1300509 -2082429 -3059142 -3109785 -1669846 596155 1325639
6455 1325639 -1325882 -5878868 -8687777 -8107540 -5977521 -4787987 -4935988 -5255867 -4916649
6446 -4916649 -3967178 -2706603 -1253030 336194 1746348 2382464 1951950 922011 -172224
6437 -172224 -1587989 -3503227 -4645217 -3606824 -1605127 -1512241 -3344905 -3519622 -405652
6428 -405652 2157311 -96972 -5287492 -7631398 -5433251 -2873426 -3465388 -5405815 -4976554
6419 -4976554 -1896483 809147 866396 -1147592 -3247849 -4373629 -5219809 -6985499 -9255758
6410 -9255758 -9758167 -7105722 -3176093 -1337629 -2567784 -4883890 -6476621 -7468038 -8159526
6401 -8159526 -7564317 -4936081 -1467639 946015 2043146 3144174 5006751 6682929
6393 6682929 6694891 4863994 2645007 1646458 2026405 2595434 2324407 1223060 -136910
6384 -136910 -1089627 -850590 716251 1956785 614531 -2919922 -5039496 -2940331 1978977
6375 1978977 6027007 7184284 5719875 2592961 -499252 -934320 2095633 5424793
6367 5424793 5335266 2555000 820998 974536 212953 -2495436 -4315021 -3317420 -1734422
6358 -1734422 -2159397 -3370258 -2650161 -212133 1461035 1292338 -708 -2198285 -5599888
6349 -5599888 -9078669 -10486788 -9334447 -7445208 -6526228 -6149306 -4525829 -771389 3739677
6340 3739677 6289142 5598437 3648173 3610721 5742124 6875987 4774338 1324159 -3256
6331 -3256 1459593 3481394 4290286 4065402 3474326 2666108 1928778 1830721 2216250 2067224
6321 2067224 813768 -882879 -1952351 -1991934 -1270137 -89333 1427927 2911386 3465740
6312 3465740 2412359 481577 -536272 -28462 406299 -650774 -1949162 -1456334 -146061
6303 -146061 -1124315 -4657058 -7110724 -6134200 -4038106 -3966761 -5235237 -5243198 -4086738
6294 -4086738 -3911157 -4703849 -4269778 -2371056 -1634011 -3503359 -5859465 -5931052 -3809761
6285 -3809761 -1773472 -1238160 -1532617 -1173974 421209 2451850 3814365 4525079 5387930
6276 5387930 6117144 5205265 2584943 812302 1828636 3853102 3786691 1749979 530765
6267 530765 1082462 1719302 1894967 3354737 6423470 8281483 6907376 4407796 4154164
6258 4154164 6146887 7362244 5665176 1524939 -3259673 -6768664 -7698067 -6769924 -6914758
6249 -6914758 -10171819 -14521255 -15532149 -11428980 -5163016 -1068434 -556290 -1614831
6241 -1614831 -1708562 -378838 909300 1027398 790701 1808861 3893797 4672341 2391214
6232 2391214 -1712316 -4729326 -5189937 -3901195 -2221876 -811431 7235 49318 -63785
6223 -63785 909618 3140308 4801593 3812464 495049 -2350181 -2490776 -851984 -226634
6214 -226634 -1517136 -2469533 -833378 2314090 3850844 2697345 814142 38363 -63412
6205 -63412 -373259 -183128 1409513 3363669 3853457 2881362 1915253 1357242 340105
6196 340105 -991133 -1076960 557637 2160451 2180392 1593986 2533307 5230216 7466708
6187 7466708 6930254 3444998 -1036411 -4227685 -5343177 -5296527 -5073616 -4382681 -2587233
6178 -2587233 -435895 580779 603021 1370083 3209419 3906595 1833708 -1494033 -3787043
6169 -3787043 -5374217 -7679876 -9302748 -6974286 -771070 4851262 6615096 6338461
6161 6338461 7302626 8941686 7966566 3612380 -1212120 -3871810 -4516608 -4258564 -3163825
6152 -3163825 -1118531 904095 1676857 1005917 -555249 -2524198 -4434563 -5649018 -5712733
6143 -5712733 -4406121 -1501344 2514726 5501169 5039860 1397896 -2261555 -3433707
6135 -3433707 -2738625 -2028625 -1674336 -1166024 -935465 -1539691 -1874505 -338212 2514484
6126 2514484 4397161 4312407 3424915 2929836 2773636 2602982 2242976 994726 -1727417
6117 -1727417 -4586369 -4972718 -2256313 1194408 3029619 3307884 2948788 1706751 -676435
6108 -676435 -2818818 -3282147 -2940208 -3682850 -5215803 -5307631 -3321057 -1457212 -1744812
6099 -1744812 -3289775 -3542608 -1433638 1659820 3566436 3192985 1036477 -1494443 -3208020
6090 -3208020 -3916020 -4252550 -4731723 -5032645 -4223459 -1748563 1620229 3849497 3093142
6081 3093142 -641673 -5462914 -9255699 -10976164 -10416660 -7772074 -4095255 -1328626
6073 -1328626 -821094 -2086684 -3676077 -4696452 -4668778 -2761565 1297224 5866844 8548543
6064 8548543 8751252 7731177 6225605 3933223 1557208 968920 2132983 2039208 -1258749
6055 -1258749 -5045252 -4883738 -496372 3779314 4366035 1949642 -735268 -2261204 -2627360
6046 -2627360 -2033220 -1087476 -889360 -1348900 -515103 2750521 6339204 7154476 5395611
6037 5395611 4371525 5797310 7448224 6456531 3131227 -35083 -1911536 -3318465
6029 -3318465 -4479827 -3909150 -513893 4364171 7909545 8420423 6465577 3900626 2281134
6020 2281134 1975878 2209900 1887183 722559 -381364 -389741 426841 614951 -656197
6011 -656197 -2527092 -3862622 -5176187 -7736567 -10534306 -9817653 -3139765 6797145 13891482
6002 13891482 14250471 9024847 2016536 -3886473 -7671118 -9383460 -9450253 -8039213 -4651446
5993 -4651446 683999 5763154 7635238 6422948 5604914 7094082 8296056 6330159
5985 6330159 2990011 2014770 2760595 1004830 -3853798 -7073485 -5746281 -3566811 -5400489
5976 -5400489 -10050874 -12091097 -9177237 -3942796 376950 2560383 2002377 -1448005
5968 -1448005 -5435851 -6135891 -2832035 972505 2461723 3118665 5457579 8286220 8132067
5959 8132067 4527558 1034705 796731 3187042 5345926 5277463 2757849 -1196681 -4597683
5950 -4597683 -5313986 -3057379 -246557 144781 -2392675 -5635712 -7220386 -6846580 -5939870
5941 -5939870 -5790397 -6294320 -6243230 -4679842 -2014854 310381 1337255 1434784 1485976
5932 1485976 1865175 2714120 4401169 6589997 7492551 5787149 3249414 3416829 6851281
5923 6851281 9685378 8399597 4504733 2460846 3964883 6627788 7815531 7175249
5915 7175249 5100628 1378824 -3369099 -6874357 -7501474 -6196708 -4828861 -3648337
5907 -3648337 -1803611 547225 2324751 3275210 3990414 4221740 2700808 -829607 -4319837
5898 -4319837 -4832206 -1220427 4513174 8446460 7950502 4315818 1740715 2999146 6495911
5889 6495911 8323186 6696927 3346891 979755 778874 2406981 4899565 6792785
5881 6792785 6457980 3491145 -466744 -3131407 -3880416 -4095117 -4968843 -5535582 -3756007
5872 -3756007 322942 3646762 3528820 1272671 645970 2740040 4555877 3624603 1711506
5863 1711506 1797987 3047823 1763426 -3089295 -8253288 -10500497 -9993711 -8411099 -6115072
5854 -6115072 -2897083 45785 851681 -839546 -3732110 -6372754 -7798251 -7354883 -5167314
5845 -5167314 -2670722 -1741990 -3106349 -5736027 -7453259 -6185277 -1727709 3235956
5837 3235956 5034509 2824905 -444167 -1765897 -1568753 -2116486 -3577694 -3792812 -1640966
5828 -1640966 1411550 3418423 3985436 3812794 3682765 4401546 6345424 8368410 8414946
5819 8414946 6065957 3385573 2286495 2056055 716171 -1847731 -3520809 -2625970 97655
5810 97655 2311242 2228256 -29789 -2666630 -3818942 -3303385 -2567752 -2649844 -2820335 -1921595
5800 -1921595 -376491 261975 -576516 -2037388 -3358181 -4475181 -5042029 -4367941 -2840510
5791 -2840510 -1982747 -2308854 -2478820 -1645380 -1280245 -3032584 -5708135 -6416441 -4538103
5782 -4538103 -2645000 -3147307 -5613944 -7979263 -9032763 -8927488 -8324917 -8007506 -8664829
5773 -8664829 -10173301 -11372780 -11058764 -8964561 -5699074 -2332509 -80939 574407 734116
5764 734116 1953351 3793567 3727287 314956 -4634293 -8084686 -8929330 -8002541 -6076651
5755 -6076651 -3488004 -1025414 659881 2304921 5050647 8321722 10294108 10426767
5747 10426767 9844482 9188149 8067457 7031745 7837740 10569198 12356585 10638515 6434973
5738 6434973 2710057 580475 -882086 -1883334 -1446236 141777 811998 -347456 -1460105
5729 -1460105 -590502 1265676 1739196 793313 659012 2120630 3250595 2779688 2572035
5720 2572035 4819788 8183768 9233052 7218076 4717176 3247308 1042993 -3475575
5712 -3475575 -8418086 -10725082 -10180152 -8838775 -7544527 -5550540 -3118813 -1818586
5704 -1818586 -1906858 -1682487 -183917 1310221 1353494 344176 -581355 -1438138 -2972964
5695 -2972964 -5061821 -6616023 -6945785 -6661176 -7131721 -8911290 -10572031 -9811860 -6389944
5686 -6389944 -2997655 -1935084 -1953812 -409379 2257076 3022712 1295928 286090 2299107
5677 2299107 5410929 6467342 5183513 3479995 2681495 3315255 5979317 10183793 13442474
5668 13442474 13486838 10606561 6488850 2122069 -1676032 -3511239 -3385577 -3779322 -6230986
5659 -6230986 -8304482 -6869381 -3150834 -1110413 -1558700 -1700907 -557666 -829107 -4237547
5650 -4237547 -8452184 -10430010 -10209290 -9535070 -8828866 -7479023 -5650993 -4067830 -2998564
5641 -2998564 -2661976 -3542031 -5276130 -6359621 -5873303 -4400099 -2610311 -426971 1693976
5632 1693976 2461290 1781571 1279267 1577389 1085584 -869618 -1888812 60629 2726606
5623 2726606 2093599 -2041451 -6014737 -7487007 -7648096 -7951854 -7682311 -6004148 -4106618
5614 -4106618 -3594707 -4135656 -4212993 -3318190 -2154606 -1374261 -1231261 -1918848 -3144682
5605 -3144682 -3756934 -2943606 -1758080 -2369052 -5363114 -8432302 -8371085 -4344269 1101976
5596 1101976 4299842 3607936 440992 -2390154 -3089168 -2017434 -1117739 -2245236 -5441556
5587 -5441556 -8612864 -9398104 -7547099 -4925607 -3132211 -2109451 -1488046 -1908232 -3740697
5578 -3740697 -5519870 -5488255 -4354313 -4520920 -6278843 -6748497 -3669012 1221877 4024812
5569 4024812 3083724 243214 -1701289 -1406807 833732 3698167 5306106 4384438 1653059
5560 1653059 -709479 -1436924 -1216953 -953687 -156496 1862429 4076880 4636493 3473234
5551 3473234 2451265 2652038 2947436 1879050 -285832 -2152819 -2742910 -1630408 1133477
5542 1133477 3986427 4125638 814092 -2433420 -1376392 3416521 7012188 6383174 3678228
5533 3678228 2382436 2848846 3352451 3338940 3195420 2222204 -530859 -4015993 -6057559
5524 -6057559 -6128535 -5267650 -3745865 -1155423 1430906 2048729 916442 364298 1102661
5515 1102661 1284871 363362 903557 4438406 8061170 8134615 5686023 4626129 5412745
5506 5412745 4402787 42716 -3991553 -3669763 130242 3635911 5417025 6598465
5498 6598465 6977986 4632748 22225 -2752178 -833902 3209253 4546930 2390166
5490 2390166 454387 1354200 3499405 4487065 4721897 5457546 5386138 2485495 -1514199
5481 -1514199 -2167268 1486587 4967413 4249643 958845 -704400 -195929 -628528 -3448931
5472 -3448931 -6498536 -7767342 -8182280 -9390871 -10857192 -10853829 -9190052 -7389150 -6633968
5463 -6633968 -6709849 -6838997 -6732479 -6665647 -6805187 -6671417 -5645934 -4184281 -3694434 -4436788
5453 -4436788 -4590592 -2930450 -1406187 -2565316 -4857142 -3850989 1103686 4909044
5445 4909044 3362059 -1252845 -3934936 -3752519 -3336754 -3448990 -2320580 113569 1496758
5436 1496758 1090095 926856 1938321 2170093 294353 -1943131 -2588276 -2458167 -3253598
5427 -3253598 -4482345 -4346714 -2624666 -1014316 -1294155 -4024378 -8004701 -10394871 -8961648
5418 -8961648 -5036121 -2452083 -2654411 -3088278 -1725707 -489011 -1866513 -4501677 -5253819
5409 -5253819 -4075661 -3530792 -4357188 -4793047 -3960294 -2799660 -1606455 420196 2802706
5400 2802706 3664053 2608398 1378482 1054076 889661 602718 1426851 3795548 6103482
5391 6103482 7186739 8357314 11382324 15482534 17761685 16241963 11790538 7387417
5383 7387417 5594132 6162162 6402117 4725245 3014539 3901391 6538889 7555799 5948394
5374 5948394 4114867 3610991 2960389 862625 -1344288 -2263136 -2981134 -4763628 -6192980
5365 -6192980 -5206235 -2709738 -1600412 -2825300 -4631175 -5404269 -5311246 -5169565 -5283774
5356 -5283774 -5557566 -5684217 -5208586 -4137699 -3238098 -3089719 -3276270 -3144686 -2905754
5347 -2905754 -3438815 -5398795 -8643786 -11843300 -12877602 -11026106 -8676749 -8917712 -11193240
5338 -11193240 -11707868 -8772783 -5013905 -3138637 -2654732 -2757679 -5096276 -10332087 -14554985
5329 -14554985 -13285039 -7678121 -2787849 -599373 1051070 3022381 2893774 -623430
5321 -623430 -5041196 -7298811 -6797123 -4193470 -87917 3772139 4801676 2887498 1164951
5312 1164951 1814483 3150280 2595310 464598 -1314602 -2468563 -3887153 -5071978 -4729059
5303 -4729059 -3492274 -3613300 -5678609 -7571926 -7325146 -5563522 -4296816 -4275760 -4533680
5294 -4533680 -4039409 -2706999 -693098 2235492 5845829 8603858 8954198 7401991 6049601
5285 6049601 5859818 5848518 5405504 5430299 6005247 5102972 1729344 -1456607 -1500259 121820
5275 121820 -524952 -3743144 -5857299 -5217796 -4587112 -6139031 -7654867 -6068860 -2160783
5266 -2160783 934840 2038481 2152696 1797381 809293 6718 472694 1353104 559807
5257 559807 -2136832 -4470779 -4500920 -2713791 -915926 -172477 -422765 -1298259 -2434281
5248 -2434281 -3104574 -2389756 -450728 580721 -1695642 -6520823 -9489348 -7254782 -2064580
5239 -2064580 644309 -910642 -3015994 -2083844 709262 2106157 1718050 1691305 2729702
5230 2729702 3228022 2186220 736600 366006 1192467 2556521 4211565 6205832 8051277
5221 8051277 8623801 7104089 3986888 782922 -1596389 -3577507 -5351737 -5478428 -2690977
5212 -2690977 1400962 3578287 3064381 2023115 1656988 529118 -2153838 -4412475 -4604189
5203 -4604189 -4306380 -5640786 -7481682 -6965747 -3585659 706394 4476941 7374349 8515074
5194 8515074 7034790 4133460 2330685 2632629 4110019 5839492 7354817 7670905 6064046
5185 6064046 3679971 2369374 2114340 1601761 1033001 1992458 4417592 6010432 5154534
5176 5154534 2576964 -171447 -2108745 -2603875 -1727834 -1001163 -1863652 -3352168 -3416041
5167 -3416041 -2458545 -2900597 -4934535 -5748463 -3907519 -1495828 -461820 234672 1864602
5158 1864602 3087348 2477634 1661242 2875127 4893096 4510192 1234301 -2451619 -4986077
5149 -4986077 -6969638 -8686631 -9346351 -9192550 -9688838 -10867594 -10893509 -9147401 -7397641
5140 -7397641 -6756671 -5872535 -3852588 -2698146 -4279500 -6468740 -5371220 -856115 3148109
5131 3148109 3990024 2968127 1956681 439213 -2260871 -4335788 -3845666 -2248109 -2587720
5122 -2587720 -4762846 -5583946 -3622852 -999674 503582 2232484 5773558 9463871
5114 9463871 10180812 7492529 3827451 1160342 -335679 -595233 1080883 4334274 6835437
5105 6835437 6211253 2512159 -1698520 -3518075 -2002991 1222319 3520136 3575018 2052076
5096 2052076 -13479 -2585805 -5722051 -8184765 -8380528 -6597067 -4970514 -4777981 -4807644
5087 -4807644 -3284291 -802602 -21464 -2051970 -4271261 -3091782 1379147 5196378
5079 5196378 5580307 4043902 3125017 2219202 -464675 -3299945 -2628964 1291670 3905649
5070 3905649 2959145 1453022 2176343 3327067 2430555 931738 1051954 1068350 -1710074
5061 -1710074 -5392192 -5967645 -4113188 -4192594 -6618503 -6725322 -2495953 1623898 1144734
5052 1144734 -2099386 -3144383 -931062 1066878 88053 -2663512 -3890677 -1905737
5044 -1905737 1592664 3056242 718497 -3488255 -6330063 -6888812 -6463761 -5792780 -4557986
5035 -4557986 -3169159 -2528691 -2103498 -726120 757140 418708 -1102828 -1055656 847373
5026 847373 1728000 463762 -165401 2051776 5317718 6926585 6882548 6048769 3490867
5017 3490867 -1282214 -5540067 -6178596 -4225705 -3506088 -5452293 -7881244 -8546613 -7456253
5008 -7456253 -5654120 -3792601 -2274050 -1330558 -586375 544756 1921344 2793981 2804050
4999 2804050 2410854 2458831 3437836 4827367 5386346 4776648 4365194 5134543 5403286 2667726
4989 2667726 -2408722 -6188858 -6609874 -5238650 -4242581 -3751723 -3132911 -2506026 -1822113
4980 -1822113 -601918 244905 -1469685 -5958039 -10307279 -11841869 -10793986 -8730904
4972 -8730904 -6552566 -5032352 -4893135 -5219342 -4322086 -3168746 -4843400 -9202620 -11584155
4963 -11584155 -9040780 -4619962 -2882128 -4192080 -6249857 -8310789 -10585373 -11893996
4955 -11893996 -11282219 -10058812 -9376144 -7946810 -4990926 -2965043 -4109752 -6632127
4947 -6632127 -7730195 -8095033 -9776089 -11866889 -12324797 -12047899 -12854169 -13071853 -9636553
4938 -9636553 -3531279 1063470 2285567 1512029 -224283 -2873294 -5273411 -6204843 -6888880
4929 -6888880 -9064525 -11519528 -11862613 -10545564 -9707006 -9409694 -8566488 -8016984 -8922628
4920 -8922628 -9777429 -8894098 -7954957 -8947202 -9745402 -7412188 -3710097 -2191405 -1922205
4911 -1922205 257002 3126919 2860260 -10781 -1504676 -881635 -493567 -449584 324877
4902 324877 -549640 -5641353 -11513500 -13096680 -12436230 -15069221 -19540569 -19630194 -15682586
4893 -15682586 -13811508 -14538055 -12708354 -8515774 -7531895 -9529793 -8959081 -6991111 -10342576
4884 -10342576 -17233584 -18583460 -14742195 -15556287 -21761219 -24238499 -24928773 -36895344
4876 -36895344 -57691449 -69124248 -75650959 -111486908 -183407156 -233590787 -198844051
4869 -198844051 -94942636 -2495305 28505416 21736697 19222991 24739085 20847178
4862 20847178 9283882 5620753 10563695 12109665 8192819 7216970 10849176 12547918
4854 12547918 10407492 8483128 7519665 4966686 2012319 1590378 1864638 -290220 -2172393
4845 -2172393 731451 6422744 9354644 9125534 9554548 11769198 14398666 17614001 20936743
4836 20936743 20496517 14764885 9321869 9237595 10657796 7518658 2842786 4455969 11836455
4827 11836455 16511159 14755489 11149459 9362290 7681222 4739191 2195397 155811
4819 155811 -3492820 -7708456 -8479790 -5868341 -4720631 -6537676 -6670251 -2045181 3894546
4810 3894546 6880315 7490212 7928949 7538023 5185661 2734247 2412819 3032820 1953306
4801 1953306 -939748 -3812063 -5902332 -7581349 -8451019 -7415652 -4267862 -206070
4793 -206070 2799145 3138392 1274961 203145 2489058 6849499 9528236 8990139 7114402
4784 7114402 5862784 5411441 5833873 7690895 10024405 10428853 8369633 6140125 5263376
4775 5263376 4191618 1151399 -2714085 -5019149 -5692268 -6889377 -9701399 -12290456
4767 -12290456 -11571273 -6559673 -91209 3322419 2045581 -849767 -1176093 1794268
4759 1794268 5459445 7296388 6301228 2310497 -3498056 -8057056 -8983910 -7357191 -5546579
4750 -5546579 -3118478 1930097 8407798 12279549 12210849 11113057 11326592 11805925 11223770
4741 11223770 10263721 9146989 6320361 1874821 -678260 1285421 5546048 7797125
4733 7797125 6616587 3635259 608814 -1392515 -1430394 222111 1329180 22979 -2622321
4724 -2622321 -3657924 -1317591 3649706 8555670 10158978 7117361 1800325 -1957232
4716 -1957232 -3306756 -4483833 -6284118 -6652021 -4788185 -3041109 -2760768 -1809773 1145345
4707 1145345 3257151 1825750 -879302 -1006025 1008041 2084336 2059412 3009192 4322495
4698 4322495 3381617 882449 739122 4034016 7075747 6474440 2846507 -1319478 -4318921
4689 -4318921 -5001805 -3122726 -990702 -1785367 -5048386 -6699566 -4804840 -2370600 -2597369
4680 -2597369 -4045968 -2995637 1136879 5223060 6491111 5297437 4082342 4614143
4672 4614143 6105244 5885486 2648253 -1193138 -1830854 1260983 4787568 6051913 5847909
4663 5847909 6191352 7174910 7340142 5761624 2670866 -876679 -3277103 -3565049 -2766000
4654 -2766000 -2579677 -2496832 -339110 3781889 6620765 6201127 4608792 4577342 5507612
4645 5507612 5218967 3955736 4015661 6342084 9842189 13453669 16716999 18698636 18411211
4636 18411211 16354155 14187050 12923867 12421379 12071554 10884578 7719458 2919941
4628 2919941 -869545 -1006863 2354739 6818999 10377819 12372110 12823605 12333491 11938879
4619 11938879 11756036 10681604 8695495 7945616 9579877 11029833 9184383 5252577
4611 5252577 3304069 4295043 4786377 1970985 -2940821 -6997565 -8465371 -6728976 -1991149
4602 -1991149 3556017 6473907 5534232 2951648 1306814 1017079 1560526 2821503 3841146
4593 3841146 2520588 -1466639 -5182584 -5800738 -4004884 -2055280 53134 3971952
4585 3971952 9270210 12864366 12395121 8569686 4044483 1202338 960777 2622604 4733112
4576 4733112 6508005 7975896 8526348 6751359 2739041 -936589 -2035979 -1167411 249472
4567 249472 2996545 8350805 14252236 16442995 13758738 9536749 7107910 6448439 6173794
4558 6173794 6093114 6075603 4726489 1572797 -954274 -213377 2884364 5232283 5985006
4549 5985006 6887364 8256896 7915054 5320033 3705157 5509995 7718865 5245373 -1623482
4540 -1623482 -6842716 -6443158 -3343906 -2376329 -3406217 -2633511 959441 4340352 5388283
4531 5388283 5448089 6097296 6591089 6117325 5949887 7269661 8768836 8538451 6815493
4522 6815493 4803387 2244919 -1452896 -4866824 -6049921 -5782115 -6626057 -8868509 -10055417
4513 -10055417 -8944723 -7466771 -7822445 -9483482 -10136297 -8383152 -4796821 -1349173
4505 -1349173 -207142 -1924908 -4406172 -4785777 -2715366 -682861 -813556 -2631269 -4419491
4496 -4419491 -5527415 -6608384 -8398943 -10760307 -12373072 -11420588 -7441586 -2415219
4488 -2415219 871523 1195305 -1218206 -5990052 -11797087 -15351392 -14226840 -10629559
4480 -10629559 -9191092 -10610920 -10917380 -7958127 -4713008 -4087327 -4175336 -1953648 1305693
4471 1305693 2305643 1383125 1542795 2838173 2179013 -1101466 -3536315 -2474684 380628
4462 380628 1699705 371132 -2550727 -5544238 -6947143 -5435643 -1650689 1859887
4454 1859887 3357642 3460562 3296123 2600061 753565 -1488292 -2553156 -1657663 951778
4445 951778 4608387 8343250 11124006 12666604 13465189 13711970 12999336 11277765 8948069
4436 8948069 5726269 959796 -4236481 -6856790 -5353572 -1879126 218869 96366
4428 96366 -824010 -1654055 -2611877 -3353603 -2865864 -1200824 313385 880806 926685 809378
4418 809378 225045 -793168 -1593596 -1999409 -2403541 -2408868 -912888 1687956 2929673
4409 2929673 1213630 -1845331 -3502364 -3455506 -3597218 -4637354 -4933633 -3019240 281140
4400 281140 2961087 3941362 3343502 1619171 -557208 -1951244 -1374169 1050472 3524940
4391 3524940 3818250 1248273 -2337926 -3970581 -2528287 -7875 919601 288848 612638
4382 612638 3263377 6451661 7412530 5621850 3153996 2479723 4303441 6900124 7386356
4373 7386356 4496211 186196 -2535401 -3151033 -3358651 -3539232 -2261018 34145 136410
4364 136410 -3186836 -6497272 -6456354 -4680537 -4484224 -5166978 -3866429 -1472002 -1625135
4355 -1625135 -4314631 -5721568 -4935064 -5508153 -8813787 -11048817 -9536907 -7431453 -8519326
4346 -8519326 -10941411 -10185130 -5783791 -945898 2690441 5868476 8310331 8359781 5915887
4337 5915887 2831212 479750 -851707 -739289 906844 2788772 3871636 5247023
4329 5247023 7977216 10169047 9200681 6151559 4597199 5037643 4051219 -222633 -4964110
4320 -4964110 -6554288 -5149856 -3565692 -3194032 -2881358 -1199635 1533080 3513287 3264115
4311 3264115 1172979 -911165 -1737962 -1752087 -1886858 -2342407 -3224617 -5022647 -7256666
4302 -7256666 -8010559 -6377176 -4130512 -3236995 -3025719 -1920784 -660413 -1105536 -2655510
4293 -2655510 -2732058 -612409 1854800 3357604 4510404 6009761 7570846 8765787 8987587
4284 8987587 6939797 2438897 -1686568 -2213670 -35873 640539 -2183000 -6215859 -8607442
4275 -8607442 -9032883 -8471435 -7517718 -6787208 -6819902 -6871513 -5802873 -4521906 -5214491 -7686155
4265 -7686155 -8987331 -7503698 -5138504 -4521066 -6046148 -8390880 -10000990 -9545055 -7002059
4256 -7002059 -4762923 -5372721 -7665613 -7609463 -3730440 790455 2400828 1186435 -543964
4247 -543964 -1477044 -1665947 -1305007 -441451 998993 3360140 6517607 9242001 10505221
4238 10505221 10653457 9783411 6526071 970221 -2976678 -1868420 1775544 2389518 -968196
4229 -968196 -4339341 -5685677 -6811437 -8282403 -7843609 -4995840 -2235094 -597574 1245191
4220 1245191 2598790 858246 -2782020 -3557932 -863978 253827 -2386464 -4366176
4212 -4366176 -2461724 158514 397469 754098 3630948 5649467 3083692 -1546983 -3705759
4203 -3705759 -3811216 -4869713 -6640624 -7063346 -6343908 -5244940 -2658100 1032954 2019468
4194 2019468 -1216563 -4346869 -3852310 -2843018 -5264430 -8804604 -9259864 -7893448 -8432610
4185 -8432610 -10216762 -10163842 -8411516 -6701008 -4579934 -2238413 -3085143 -8262429 -12949322
4176 -12949322 -13352930 -12365847 -12893428 -11770990 -6889612 -3619905 -6129493 -8856402 -5609376
4167 -5609376 -772799 -1538594 -5141806 -4729953 -2356958 -4674880 -10725566 -15402340 -19654906
4158 -19654906 -25609212 -27973720 -23129914 -19514192 -24680491 -30426275 -27231048 -23614638
4150 -23614638 -30988545 -40071798 -37709834 -36399091 -55024930 -79979514 -88156682 -105111688
4142 -105111688 -183363942 -305108462 -364128730 -286524766 -130061169 -15787633 11333596
4135 11333596 2840566 9090132 23209832 24234371 19385944 22127319 25650328 20964203
4127 20964203 16306571 19914898 23303905 17608251 9793299 8627168 9459997 5771790
4119 5771790 2326099 4725615 8052570 7194189 7195086 12633261 17356200 15235420 11183817
4110 11183817 11420824 12417749 9525168 7124915 9723077 11803332 7442859 1956607
4102 1956607 2745767 5828023 3182409 -2623102 -3179172 997464 2224074 -911902 -2805880
4093 -2805880 -1400789 455104 2458597 6228349 8586289 4630363 -2989735 -6224251
4085 -6224251 -2972219 1192354 2456218 2631677 3290811 2874069 714644 -1483205 -2852079
4076 -2852079 -3563458 -2222762 2181250 6402604 6113601 2526856 843796 2496512 4062807
4067 4062807 3762273 3742827 5305243 6629036 6285652 5088031 3632714 1525641 -346211
4058 -346211 -146388 1642533 2266649 625256 -1398183 -1915047 -1155103 -521431 -1359771
4049 -1359771 -4223429 -7529173 -7818258 -3454399 2752997 6483340 6392395 4086985 1431963
4040 1431963 -95804 618207 2648691 3262581 1949811 1725694 4107424 6039023 4986622
4031 4986622 3614038 5198184 7526997 6278569 1977673 -1538632 -3415966 -5170171
4023 -5170171 -5736026 -3004453 974181 2250702 1584491 2838248 5441959 4918442 1068057
4014 1068057 -923834 1379760 4510539 5512186 5619790 5607752 3228337 -1929380 -5983669
4005 -5983669 -6247432 -5065907 -5342984 -6105120 -5444078 -4274068 -3932410 -3010875 148437
3996 148437 3967014 5446429 3821832 430416 -3150008 -5124241 -3864697 -184643
3988 -184643 2722962 3219476 3036899 3817583 4435121 3597745 2518019 2617810 2706988 965108
3978 965108 -1905497 -3872853 -4567196 -4922913 -5136060 -5214966 -6477265 -10037384 -14191118
3969 -14191118 -15498593 -12769630 -8574497 -6390257 -7046238 -8381581 -8051406 -6082243
3961 -6082243 -4180217 -2961081 -1374851 762508 1755282 904912 221297 1078238 1341316
3952 1341316 -1107649 -3955048 -3531624 -899044 -244138 -1906156 -2096528 345942 2270740
3943 2270740 2152392 2282401 3430610 2827610 -20869 -885586 2287307 4811687 1910999
3934 1910999 -3981881 -7242369 -7188730 -7244774 -8383692 -8636929 -7882086 -8225444 -9910993
3925 -9910993 -10859650 -10182505 -8746693 -6462756 -2339624 2641551 5651499 5433740 3503043
3916 3503043 1945457 1815354 3262889 5441671 6891503 7545588 9126991 11866106 12839809
3907 12839809 10207653 7009225 7098583 8875911 7489348 2627415 -671365 506191
3899 506191 3197086 3731612 2725213 2837545 4706330 7400889 10360989 12492417 11468913
3890 11468913 6597862 986353 -1668801 -1533528 -1529334 -2501543 -2248027 355500 2821423
3881 2821423 2080481 -1394834 -4216192 -4339995 -3087146 -2729347 -3563226 -4290375 -4228884
3872 -4228884 -3748285 -2961609 -1457667 613516 2352600 3047475 2332560 -129049 -3615326
3863 -3615326 -5595438 -4387258 -2450197 -4003140 -8682089 -10999222 -7866900 -3232850
3855 -3232850 -2266623 -3837740 -2938451 1018052 3076273 135216 -4598007 -6013217 -3234525
3846 -3234525 343370 1539628 404051 -589729 502809 2910869 4013328 2381939
3838 2381939 -1044038 -5109380 -9781004 -13996050 -14524477 -9808595 -3492403 -832266
3830 -832266 -2252393 -3750896 -3299237 -2987573 -4201474 -4495520 -1205078 4355132 8242693
3821 8242693 7920981 3875669 -1053138 -3036186 8980 5735335 9109372 8002105
3813 8002105 5347620 4672058 5594230 5504310 3863019 2507482 2625534 3488723 3786786
3804 3786786 2744630 400125 -1994134 -2538333 -969219 384572 -503123 -2121396 -1031538
3795 -1031538 3233053 6760103 5640772 658091 -3512676 -3443121 -274215 2378559 2925518
3786 2925518 2922122 3688446 3669474 772835 -3711081 -5859542 -3829868 294261 3714027
3777 3714027 5664324 6126902 4463006 1365651 98228 2894375 7065223 7633154 3744696
3768 3744696 -297353 -892237 656240 1129872 297187 474185 2243171 3227336 1544330
3759 1544330 -1359711 -2403589 -473399 2761936 5248852 6676410 8054827 9999151
3751 9999151 11935561 12627305 11089289 7332062 2702145 -787186 -2171136 -2617156 -4098016
3742 -4098016 -6717014 -8119186 -6346669 -2811505 -1121658 -2614759 -4412245 -3149027
3734 -3149027 335323 2125312 942928 43010 2125730 4919045 4494120 1278358 -759215
3725 -759215 -267550 168831 -614505 19158 3457034 6120381 4167500 -453699 -2309274
3716 -2309274 383120 4238882 5662722 4277742 1707585 -275347 -383705 1083752
3708 1083752 1944205 1014107 569042 3309849 7651895 9372056 7682929 5936459 5908040
3699 5908040 5358563 2557635 -504786 -1423137 -735708 266876 2251333 5715955 8470476
3690 8470476 8152237 5750478 4115807 4286954 5529169 7449533 9464934 9536452 6435894
3681 6435894 2522126 1321478 2656153 2981253 561747 -2491580 -3872024 -4166113 -5125248
3672 -5125248 -6748436 -7542964 -6704271 -4904575 -3335772 -2540401 -1911576 -273097 2588431
3663 2588431 5099859 5284779 2920531 -289350 -2540178 -3327290 -3365749 -3912826 -5881217
3654 -5881217 -8740269 -10524033 -9849844 -7730881 -6397072 -6472562 -6483031 -5284935 -3799758
3645 -3799758 -3723005 -5165187 -6214478 -4770645 -697427 3756727 5821839 4672071 1845130
3636 1845130 -767111 -2628429 -3974990 -4583294 -4119127 -3023981 -1835895 -29117 3121113
3627 3121113 6641685 8361075 7764779 7034973 8265425 10416780 10260302 6288634 688052
3618 688052 -2969071 -3291437 -1685480 -4518 1152340 1734304 1410447 459600 285488
3609 285488 1552740 2650812 1789689 -3808 -175036 1313672 1775310 -26014 -2157232
3600 -2157232 -2851014 -2885487 -3259156 -3138317 -2053388 -1638851 -2694008 -2767869 197695
3591 197695 3533683 2770831 -1976502 -6160940 -7028030 -6101151 -5220116 -3721072 -677347
3582 -677347 2987980 5966453 7825270 7866079 5328121 1970290 1705489 5713352 10145140
3573 10145140 10824424 8291713 5865793 4574214 3061137 1434768 1728482 4311329
3565 4311329 6682151 6637587 4480384 1310316 -2655262 -6672327 -8296632 -5811693 -1071142
3556 -1071142 2089727 2149493 908945 204569 -358601 -1566184 -2375109 -1333757 776375
3547 776375 1764433 1227740 923285 1746007 2395550 1870057 1394947 2446678 4257807
3538 4257807 4977977 4389850 3715945 3281737 2163144 68695 -1947102 -2777301 -2151220
3529 -2151220 -356108 1707711 2343086 430110 -2696890 -4016950 -2087445 1194384
3521 1194384 2531141 477069 -3412062 -6330476 -7092574 -7233801 -8662917 -10313391 -8759850
3512 -8759850 -3018562 3146537 5568075 4823586 4611311 6100070 6910999 5371161 2689714
3503 2689714 676559 195735 2187917 6967288 11655054 11784685 7171274 3095924 3550066
3494 3550066 6213356 6680750 4791635 3323878 2715218 1337187 -214128 309204 1993934
3485 1993934 1047707 -2924280 -4929104 -1139959 5565949 9459509 9358312 9015648 10974992
3476 10974992 13210864 12400127 8207610 3146777 -449994 -2079629 -2443792 -2434771 -2662063
3467 -2662063 -3120189 -3170817 -2364106 -1282753 -952504 -1320471 -1134718 140422 957683
3458 957683 -845109 -5303458 -9746115 -11078480 -8361582 -3366581 927852 2624654
3450 2624654 2367001 2486737 4248151 6227017 6081246 3572593 863138 -36693 982307
3441 982307 2970989 5250485 7300613 8175649 6919959 3618236 -100657 -1780074 -82742
3432 -82742 3468746 5508860 4470465 2330627 1552413 1523503 145517 -1979909 -1996080
3423 -1996080 496929 2371028 1607572 64192 2025 512968 -382500 -2197123 -3045668
3414 -3045668 -2696582 -2082219 -1111624 364438 552534 -2150375 -5426201 -4798626 206582
3405 206582 4513261 3490215 -1538344 -5373227 -5101667 -2310480 270426 2317326 5245926
3396 5245926 8968856 10949231 9210583 5309758 2834582 3212428 4746949 5917246
3388 5917246 7355271 9588793 11213736 11244133 11335417 13157163 15003808 14000818 10888633
3379 10888633 9348380 10535214 11450898 9521550 5973298 3295583 1611569 -661001
3371 -661001 -3980199 -7164579 -8888928 -8490244 -5950698 -2120929 1402952 3279552 3090346
3362 3090346 1028337 -2257997 -5358841 -6639461 -5539996 -2742065 940874 4881341
3354 4881341 7864290 8306179 5730681 1204118 -3791907 -7986021 -10096497 -9596661 -7848097
3345 -7848097 -6791109 -6219296 -4245151 -950604 760056 -813720 -3514334 -4598230
3337 -4598230 -4769567 -6354426 -8622761 -8089820 -3712329 865894 1443919 -1913976 -5377319
3328 -5377319 -5734809 -3142344 33391 1916694 2362639 2214132 2145158 2396428 3024739
3319 3024739 3746553 3764258 2534031 738648 -290704 -285452 -340880 -1168217 -1866217 -1038334
3309 -1038334 1350978 3691920 3983095 1328470 -3109080 -6518967 -6721358 -4383251 -2151233
3300 -2151233 -1443876 -1321548 -793596 -439583 -686340 -257373 1802885 3809470 3452801
3291 3452801 1565985 1370723 3729441 5528082 3853672 18566 -2085827 -664616
3283 -664616 2432158 4382811 4165541 2482958 127404 -2621501 -5184013 -6215533 -4729799
3274 -4729799 -1622591 719041 833047 -281159 -676349 -49164 200856 -620562 -1368958
3265 -1368958 -934884 -160071 -729891 -2654519 -4141136 -3998858 -2955569 -2177987 -1643613
3256 -1643613 -849233 -190133 -324221 -704132 -333546 123653 -1155663 -4036458 -5731316
3247 -5731316 -4489693 -2372032 -2482549 -4527152 -5389003 -3722349 -1628675 -1492019 -3258096
3238 -3258096 -5559992 -7696085 -9381418 -9886234 -8663779 -6139995 -3144532 -206566
3230 -206566 2278185 4180686 6159715 8656275 10045643 7752645 2253738 -2004952
3222 -2004952 -1489428 2023996 3890186 2298760 -722667 -3249005 -5665141 -8596056
3214 -8596056 -10947008 -11192645 -9450652 -7320674 -6179858 -6025078 -5539594 -3221531 1025853
3205 1025853 5450229 8053621 8373876 7184636 5141074 2847460 1748788 3267046
3197 3267046 6642050 8831598 7375966 3058040 -618840 -652558 2445460 4825111 3283512
3188 3283512 -735321 -2563073 -491855 1455338 -1073551 -6307879 -8454093 -5572605
3180 -5572605 -1698480 -536986 -686625 938452 3764694 4467455 1821816 -1963015 -4265548
3171 -4265548 -4370489 -2941974 -920480 768785 1475066 1120418 -61599 -1742195 -3146407
3162 -3146407 -3282566 -2196412 -1265208 -1533807 -2538919 -3461822 -4319738 -4913779 -3791224
3153 -3791224 -13317 4635890 7014076 6112150 3740175 1879469 907662 521860 786366
3144 786366 1669001 2635321 3229022 3337898 2795573 1614298 579645 513776 985660 1067939
3134 1067939 1342338 3361893 6664504 8320087 6661156 3840811 3080806 4585984 6012347
3125 6012347 6153739 6057880 6621442 7056333 6312629 4771513 3940719 5087090 8119544
3116 8119544 11031056 10894542 6895747 2276485 1433980 4676767 7784697 7644264 6183311
3107 6183311 6864449 8996440 8388325 3279124 -3161361 -6835971 -6895382 -4812093 -1445983
3098 -1445983 2854261 6376299 6839221 4343436 1689486 1043409 1683405 2000593 2391646
3089 2391646 4383316 7350817 8216058 5162531 204109 -3055617 -3188772 -1223662 1783464
3080 1783464 5431013 8503515 9111553 7004842 4018165 1447800 -1240220 -4087071
3072 -4087071 -5129868 -3140017 -264050 472828 -730292 -1355020 -772934 -630240 -1310919
3063 -1310919 -1286736 -534696 -1369097 -4520754 -7212997 -7015222 -5321661 -4915010 -5959405
3054 -5959405 -6630525 -6193809 -5167242 -3611228 -1490680 202667 752760 1174831 2341420
3045 2341420 2865645 1326205 -525168 157247 2596466 3088668 536678 -2008144 -2083688
3036 -2083688 -1012884 -1006655 -1647416 -1008645 1507176 4939766 7930930 9006071 7314224
3027 7314224 4305910 3133481 5069511 7847389 8695339 7577685 6254224 5720751 6023441
3018 6023441 7054202 7815736 6309147 2160525 -1694092 -2047907 489811 2359931 1535271
3009 1535271 -633006 -1629315 -121494 3476357 6963078 7165793 2787588 -3387442 -6786545
3000 -6786545 -5759642 -2618433 -113443 1240326 2022030 2126046 1242421 -133212 -1227128
2991 -1227128 -1768053 -1615726 -573310 630970 141182 -2962670 -6723340 -7723784 -4863007
2982 -4863007 -942801 262761 -1759742 -3970385 -4027146 -3511739 -5399012 -9117326 -10738478
2973 -10738478 -8685609 -6547868 -8260258 -12497808 -14598715 -12934018 -10279943 -9057004
2965 -9057004 -8288050 -6057503 -2502327 859672 2963482 3193060 1051042 -2933769 -6955838
2956 -6955838 -9427476 -9879801 -8145372 -4221996 373136 2795771 1614113 -1759929
2948 -1759929 -5119798 -7437853 -7942041 -5344647 -26015 4392555 4147318 -222015 -4321594
2939 -4321594 -4781945 -2400178 -580204 -1770563 -5257947 -7623318 -5835045 -677873
2931 -677873 3683762 4431120 3140914 2805464 3431055 2965585 1485055 1367426 3364027
2922 3364027 5407605 5819139 5057141 3612198 964524 -2111156 -2930458 -636731 1468842
2913 1468842 -350051 -5483815 -9926553 -10832167 -8075727 -2455150 4948395 11771046
2905 11771046 15127239 14048215 10017990 5143772 935800 -1619847 -2496168 -3011543
2897 -3011543 -4207106 -5044616 -3944042 -1845104 -1510273 -3529604 -5299897 -4671857 -2455484
2888 -2455484 -337781 1545121 3569230 5074906 5591065 6121143 7463292 8500257 7837785
2879 7837785 5883614 3561427 422674 -3723775 -6647012 -6045854 -3428742 -2691583 -4916113
2870 -4916113 -7357584 -7662067 -6188157 -3856595 -919504 1266369 583861 -2123208 -2763725
2861 -2763725 434182 3909097 3959769 2341678 3245338 6538041 7949203 5270331 715175
2852 715175 -2782681 -4282082 -3701429 -1334209 776897 7012 -3215001 -5472560 -5023699
2843 -5023699 -3794296 -3603536 -3250185 -1199234 1313980 2219260 1864990 1985299 2699457
2834 2699457 2700103 1451816 -602702 -2908810 -4166552 -2347978 2415563 6312349 5808623
2825 5808623 2106771 -989148 -2521860 -4394450 -6662428 -6796118 -4041529 -752219
2817 -752219 1625813 4284714 7303305 7879402 4835738 1864142 3115116 7579624 10904242
2808 10904242 11196593 9982028 8749285 7886299 8247636 10348345 12164767 10931776 7302247
2799 7302247 4742961 4555676 4663835 3921843 4131160 6266214 7890374 6667252 4110173
2790 4110173 3331959 4726518 6264007 6756320 6526840 5947030 5610573 6990127 10461971
2781 10461971 13370770 12642255 9019408 6197916 5887335 6379809 6204905 6303391 7611515
2772 7611515 9068234 9501648 9432053 9388283 8271692 5355195 2519208 2282559 4299246
2763 4299246 5785975 5052080 2827471 401206 -1579821 -2311126 -841922 2195742 4228806
2754 4228806 3301313 408620 -1552044 -782893 2060485 5071654 6859334 7203465 6638097
2745 6638097 5634207 3985654 1057944 -2996368 -6350613 -6579471 -3212032 1115466
2737 1115466 2813136 774669 -2761698 -4695723 -3752095 -825755 2134059 3124351 1284020
2728 1284020 -1814283 -3021909 -1048726 1741374 2358764 1127809 746081 2188162 4029525
2719 4029525 5540907 7447427 9164506 8590801 6111507 5674012 9487405 14189978 15209634
2710 15209634 12946235 11266899 11293704 10570490 7954664 5390067 4252985 3459415 2398361
2701 2398361 2636748 4900639 6788290 5650082 2235974 -412209 -681672 513471 1483266
2692 1483266 1278748 103761 -836681 -589686 -91640 -1295326 -3918347 -4773364 -1857401
2683 -1857401 2311674 3449349 779112 -2463476 -3353944 -2015372 5491 1996741
2675 1996741 3847727 4942698 4503152 2684237 662658 -372397 -216606 259013 107479
2666 107479 -546026 -760711 -364701 -564717 -2357811 -4934231 -6491398 -6237922 -4771514
2657 -4771514 -2899617 -1142572 -190337 -627136 -1957466 -2864387 -2827675 -2739443 -3458219
2648 -3458219 -4383212 -4154084 -2560966 -1098768 -1335506 -2978278 -4011188 -2918071 -361289
2639 -361289 1789884 2687144 2875183 2596088 1055129 -2011739 -5113650 -6422051 -5954742
2630 -5954742 -5475681 -6473768 -8844035 -11169784 -11661071 -9274560 -4738651 -258661 2438691
2621 2438691 3534854 4171007 4718694 4810568 4490272 4141580 3447106 1574108 -1400076
2612 -1400076 -4069483 -5002252 -4044696 -2281282 -1015474 -676507 -512189 345822 1461534
2603 1461534 1501160 277416 -805864 -998928 -1433328 -2821666 -3372815 -1051437 2954338
2594 2954338 5383751 5240001 4611188 5048768 5577101 5007123 3983056 3513328 3216204
2585 3216204 2400451 1579525 1572213 2080930 2332405 2260176 1991268 1069411 -595542 -1729048
2575 -1729048 -979650 1087590 2371721 1558345 -626659 -2370895 -2510842 -1452630 -544417
2566 -544417 -290159 509989 2939917 5592986 5687245 2914361 321993 389279 1967417
2557 1967417 2493474 1564502 446018 -508264 -1557502 -1724162 -75398 1473529 -326077
2548 -326077 -5192327 -8759724 -8045294 -4933108 -2498442 -282647 3908822 8876653 10315939
2539 10315939 6707285 1960499 639301 2643401 4755719 6032655 8648575 13301051
2531 13301051 16784177 15829498 11476442 7422713 5123907 3095374 745756 -93278
2523 -93278 1523097 3312041 2713972 713105 506405 2941967 5300888 4706709 1254091
2514 1254091 -2496374 -3989304 -2407436 1043058 4159000 5610310 5939458 6359240 6934588
2505 6934588 6717154 5317920 3278925 1020382 -1394002 -3306774 -3460497 -1414886 1873558
2496 1873558 5321550 8831300 12659707 16243883 18134625 16887853 12089533 5125057
2488 5125057 -1064887 -3902913 -3323458 -1570605 -737715 -1107785 -1919637 -2722573 -3434800
2479 -3434800 -3824755 -3582297 -2485021 -217823 3239876 6622405 7704178 5557800 1997310
2470 1997310 -161521 -75909 634040 172787 -1447398 -2717415 -2261787 -62592 2411549
2461 2411549 3204612 1545911 -1201150 -2626253 -1664092 215630 490132 -1709640 -4582691
2452 -4582691 -5535505 -3991343 -2036529 -2246038 -5282098 -9743350 -13555222 -14791828 -12047761
2443 -12047761 -5785235 575078 2815234 307870 -3005507 -3371259 -1943981 -2966826
2435 -2966826 -7793383 -12976003 -14714971 -13109172 -10767000 -8853344 -6469491 -3249355
2427 -3249355 -489444 548992 -76215 -1839348 -4487814 -7224608 -8487862 -7789877 -6927693
2418 -6927693 -7955875 -10394789 -11842809 -11082021 -8999460 -6445034 -3092795 862352
2410 862352 3644533 3915884 2758318 2260666 2896990 3559268 3386943 2140074 -454324
2401 -454324 -3957061 -6381511 -6181151 -4877215 -5385011 -7456440 -7370162 -3240621 1791551
2392 1791551 3602497 2557074 2504932 5140527 7823592 7141857 2778122 -2666742 -6404810
2383 -6404810 -7431650 -6578977 -5153101 -3428366 -802607 2262186 3475397 1250228
2375 1250228 -2466845 -3611097 -536027 4179902 6818085 6112872 3222132 -453872
2367 -453872 -4108877 -6843937 -7563571 -5884879 -2686195 374688 1838871 1310145 -316962
2358 -316962 -1722258 -2555021 -3796831 -6520940 -10463239 -13977648 -15272043 -13754532 -10562191
2349 -10562191 -7805665 -6816290 -6990369 -6763434 -5683225 -4768966 -4658947 -4428607 -2965828
2340 -2965828 -738640 805320 1141172 883853 343752 -869023 -2581352 -3601319 -3225544
2331 -3225544 -2388699 -2439928 -3276258 -3686660 -3367454 -3447577 -4624250 -5749934 -5223053 -3377747
2321 -3377747 -2315445 -3062100 -3880703 -2291796 1686441 5390552 6625497 5811078 4540363
2312 4540363 3159675 1066548 -1179609 -1860603 -627609 573107 173730 -708264 -290519
2303 -290519 451457 -1184858 -5029800 -7161213 -5091885 -1677904 -1418330 -4137469 -5382089
2294 -5382089 -2920841 374715 1138096 84846 -82340 809138 818337 -162477 136952
2285 136952 2728074 5486346 5586308 2178831 -3763540 -10351584 -14647845 -13638432 -7329085
2276 -7329085 -101088 2859657 540795 -3594284 -6112110 -7004645 -8123554 -9507709
2268 -9507709 -8775692 -4354727 1758418 5518769 5043739 2333228 429783 -66670 -638825
2259 -638825 -1866039 -2498407 -1491447 620141 2733642 4090245 3694301 575566 -4154455
2250 -4154455 -6909554 -5006775 166344 4677010 6065209 4503251 960591 -3427529
2242 -3427529 -6211062 -4520962 1386011 6915873 7255294 2484224 -2483040 -3024833 850759
2233 850759 5272674 6807858 5454094 3630138 3107925 3760850 5062186 7401955 11012053
2224 11012053 14479358 15735727 14371149 11773416 9010507 5889168 2363379 -575893
2216 -575893 -2277305 -3612390 -5572304 -7209215 -6261056 -1976287 3513687 7029543 7268520
2207 7268520 5791041 5357383 7363280 10645303 12570999 11358919 7584028 3602446
2199 3602446 1443297 1091840 871067 -398971 -1942722 -2141103 -723524 981087 1737591
2190 1737591 1142449 -1225869 -5511845 -9769169 -10550561 -6960940 -2491374 -845079 -1465355
2181 -1465355 -1637270 -1405715 -2775055 -4755363 -3672960 710780 3562068 1490607 -2660297
2172 -2660297 -4045967 -2089298 236520 1051959 438068 -1495657 -4157242 -5364491 -3829207
2163 -3829207 -1707394 -1566181 -1900124 703470 5597051 8388203 7421048 5787982 5812913
2154 5812913 5495305 2455032 -1854594 -4429924 -4840105 -4558543 -4074418 -3238065 -3013120
2145 -3013120 -4169337 -5071499 -3382700 276440 2646554 1926252 -394745 -2165210 -3269399
2136 -3269399 -4807196 -6755335 -7661591 -6448319 -3707600 -998937 664017 1153462 344095
2127 344095 -2107780 -5686196 -8721848 -10121232 -10580979 -10912998 -10084622 -6745117 -2181416
2118 -2181416 433993 -181682 -2412787 -4635909 -6888068 -9211256 -10676309 -10963136 -10878191
2109 -10878191 -10416361 -8359695 -4760938 -1767941 -977260 -1940240 -3868979 -6150661 -6524717
2100 -6524717 -2488876 3772928 5965059 2108397 -1465522 1551085 8587014 12508104
2092 12508104 11881775 11066824 11899249 11962256 10927739 11898250 14974201 15380268 10488476
2083 10488476 3977605 339808 -713964 -1705100 -2980856 -3781687 -4527190 -5115744 -3735148
2074 -3735148 -151595 2529463 2219871 1243886 2273812 3534620 1720916 -2452101 -5542233
2065 -5542233 -6632762 -7280473 -7340547 -5073641 -1183257 1105561 371425 -1694137 -3490628
2056 -3490628 -5009654 -5865443 -4891184 -2469261 -730665 -678089 -1224872 -1425487 -1327876
2047 -1327876 -355546 2388382 5470776 5584646 1957640 -2051388 -3132190 -1618807 475491
2038 475491 2611078 4844751 5859754 4623724 2923710 3450221 5555659 5442871 1192317
2029 1192317 -4270999 -6380578 -4180607 -1248930 -1489211 -4815082 -7544890 -6840462 -3806043
2020 -3806043 -1535893 -903928 169982 3213570 6675576 7957620 6967706 6282393 7933064
2011 7933064 11046024 12934219 12009916 9242234 6777976 5447698 4158998 1904308
2003 1904308 -426959 -1094840 117336 1776526 2973824 4318825 6428520 8642782
1995 8642782 9949206 10319102 10394811 10500084 10594640 10565312 9894294 7733710 4257293 1465953
1985 1465953 1431935 3624929 5028458 3521244 530021 -577505 1321338 3540161 2845226
1976 2845226 -521974 -3392054 -3947753 -3607554 -4059197 -4441689 -3175713 -1108003 -413274
1967 -413274 -1003299 -643062 1261717 2578869 1908419 803440 1268254 2964941 4458982
1958 4458982 5606326 6787409 6953284 4700924 972276 -1308808 -538387 2081481 4650247
1949 4650247 6795766 9080911 11151894 11606231 9650469 6109271 2424139 -839181
1941 -839181 -3753611 -5586725 -4995912 -2323204 -317541 -1106853 -3405015 -4522488 -4265755
1932 -4265755 -4308191 -4126211 -994361 5055576 9614816 9340009 6486567 5523121 7238787
1923 7238787 9007390 9302446 8707496 7298476 4384501 836857 -1277235 -1719587 -2153336
1914 -2153336 -2868426 -2149929 359799 2330705 2018184 614029 -65867 -164332 -386714
1905 -386714 90123 2151472 4419485 4665701 3025159 1827057 2354208 3431694 3331174
1896 3331174 1703720 -588648 -2415098 -2869308 -1808246 -318913 44529 -1091859 -2434720
1887 -2434720 -2408426 -705436 1614304 3131469 2990992 1265186 -1083706 -2557185 -1881574
1878 -1881574 971438 4303147 5752466 4508506 2286085 1416382 2140637 2756408 2421003
1869 2421003 2416246 4002043 6333232 7732809 8174924 9033919 10704737 11850117 11020657
1860 11020657 7961922 3451915 -946972 -3074624 -1694883 1672163 3744661 2974924
1852 2974924 962792 -189854 -545504 -1288840 -2310469 -2487976 -1774232 -1426045 -2328346
1843 -2328346 -4272210 -6524863 -7879542 -6763321 -3093601 288163 174155 -2855988
1835 -2855988 -5019718 -4460693 -3280162 -3494472 -3751266 -2049406 636343 2121267 2702492
1826 2702492 4131771 6057700 6619668 5893399 5488634 5047117 2673747 -908447 -2348254
1817 -2348254 -805939 400233 -1216680 -3984408 -5571319 -6403936 -6979136 -5002633 1095306
1808 1095306 7976365 10699824 8980986 6502181 5113000 3838549 3130315 5349314
1800 5349314 9948473 12273591 9292803 3694295 183747 -64958 880581 1737262 3194024
1791 3194024 5666103 7841495 7779894 4880785 882677 -1229121 -233728 1527916 791998
1782 791998 -2203182 -3921287 -2637501 -994732 -2098319 -5115508 -6769505 -5816310 -3831421
1773 -3831421 -2317193 -1197113 -24119 1143630 2292664 3536955 4375862 3863086 1760585
1764 1760585 -1193312 -4269170 -7321077 -10165933 -11859103 -11001331 -7001829 -1164695
1756 -1164695 3865760 6312144 6616846 5963827 4282501 1291026 -1165546 -508993 2405006
1747 2405006 3390061 618277 -2461794 -2058843 510929 1319273 48218 17478 2514140
1738 2514140 4733222 3947348 855288 -2071352 -3244538 -2214796 453887 2628758
1730 2628758 2017528 -806493 -2647829 -1887251 -375295 31262 522888 2998541 6487960
1721 6487960 8210291 7070382 4000184 -134693 -4615517 -7531438 -6930129 -3428525
1713 -3428525 300906 2724153 4299309 5262791 4872241 3348494 2398612 2881467 3741133
1704 3741133 4132889 4705070 5605383 5200191 2556369 -382051 -1183138 -376053 -387546
1695 -387546 -1922452 -3681937 -5006667 -6200036 -6455416 -4325153 -778755 817631 -1213765
1686 -1213765 -4918697 -7761828 -9414740 -10384211 -10210483 -8720823 -7117955 -6075833 -4649398
1677 -4649398 -2887915 -3314418 -7250887 -11546433 -11955668 -8397532 -3912850 50250 3725518
1668 3725518 5819605 4800496 3031914 4732478 9108847 10254246 5341043 -1615153
1660 -1615153 -6177254 -9123825 -12739827 -15680077 -15525118 -13368562 -11694297 -10041574
1652 -10041574 -6901120 -3853844 -3344738 -3818335 -1766865 2183698 3982242 2762122
1644 2762122 1962922 3266597 4054091 2384454 430382 817383 2741705 3990804 4208089
1635 4208089 4082580 3319541 1636762 101843 -513764 -1415775 -4076951 -7845457 -10617515
1626 -10617515 -10984187 -8811965 -4957948 -1341586 118188 -302228 -330320 1035730 2108582
1617 2108582 1406007 33494 -398188 -434018 -1317194 -2284473 -1669365 67632 683655
1608 683655 -695910 -2673238 -3858048 -4472790 -5400858 -6704760 -7404746 -6350364 -3603211
1599 -3603211 -1205753 -1614668 -4613895 -6801233 -5266172 -965564 2768516 4338066
1591 4338066 5055072 6586814 8655991 9462513 7605951 3507581 -718273 -2994116 -2978500
1582 -2978500 -1644932 354032 2530144 3121641 283739 -4505750 -6762965 -4364900
1574 -4364900 -483411 752477 -533358 -1409270 -757009 597279 2831360 6568556 9975667
1565 9975667 10045605 7017606 4436492 4371514 5360791 5559792 5106646 4586406 3760052 2797428
1555 2797428 2519561 2609766 1788908 354549 26673 629875 -85062 -2203904 -2501031
1546 -2501031 607833 4093715 4841998 4376357 5889347 8740907 9585878 7724786 5711117
1537 5711117 5186589 5436502 5858017 6623927 6736172 4589635 1159583 -173332 2052608
1528 2052608 5593031 7879378 8746343 8736938 7335274 4716813 3093615 4017107 5764559
1519 5764559 5648896 3864277 2735759 2885861 2672737 1355686 388539 986876 2371303
1510 2371303 3274762 3609520 3711042 3383466 2872378 3499642 5764488 7652446 6611330
1501 6611330 2915908 -665563 -2610533 -4220103 -6826069 -9141456 -8827098 -5776082
1493 -5776082 -2296803 -298781 401882 955157 1813264 2530220 2461670 1369411 -163924
1484 -163924 -913442 -274810 692869 396442 -1011277 -1581628 -199295 1929621 3219847
1475 3219847 4014512 5649027 7910087 9003275 7970276 5771908 3833050 2807999
1467 2807999 3061852 4881775 7349313 8260248 6531698 4012691 3456061 4941304 5759451
1458 5759451 3985953 815580 -1071152 -205510 3196644 8044710 12452654 14142367
1450 14142367 12516752 9912996 9147238 9984835 9711174 7080906 3604980 627590 -2282103
1441 -2282103 -4803683 -4466604 -390138 3418006 1948043 -4069340 -8551921 -7531438
1433 -7531438 -3209976 320281 2380936 4845453 8269969 11311785 12766926 12116283
1425 12116283 9035489 4384125 874429 608999 2341759 3080303 1945320 385992
1417 385992 -936015 -2795456 -4767388 -4810866 -2524294 -307825 212990 639632 2678384
1408 2678384 4586450 3506389 210132 -1514583 2872 2626710 4178653 5074108
1400 5074108 6094693 6058074 3715564 406932 -1376610 -1381285 -1660699 -3598868 -6530977
1391 -6530977 -9168541 -10780558 -10928826 -9693721 -8549327 -9451999 -12290894 -14452255 -13756387
1382 -13756387 -10823295 -7684156 -5084169 -2362414 658143 2998269 3656087 2568889
1374 2568889 568983 -1032551 -1185778 -81034 1031364 1597859 2607807 4783271 6816128
1365 6816128 6892060 5415208 4461642 4721092 4884048 4189389 3471622 3014224 1468899
1356 1468899 -1789453 -4976124 -6236017 -6303179 -6853437 -7171789 -4846107 311139 5229266
1347 5229266 7043066 5951239 3941397 2220731 1067570 1042974 2626154 4839203 5725606
1338 5725606 4672429 3290177 3322819 4405493 4831088 4077456 3240664 2895681 2132671
1329 2132671 553435 -334244 595780 1480457 -512488 -4798772 -7515317 -6521594 -3826962
1320 -3826962 -2036525 -903364 740096 1833046 598725 -2013924 -3241753 -2464796
1312 -2464796 -1749323 -2519051 -3999494 -5093777 -5585011 -5204590 -3723341 -2430977 -3273362
1303 -3273362 -5755916 -6847919 -4906136 -1612161 978913 2892569 4176219 2940619
1295 2940619 -1893118 -7554446 -10075249 -9164995 -7751981 -7276400 -6391086 -4350187 -2687561
1286 -2687561 -2682996 -3597918 -4515893 -5823605 -7588187 -8380922 -7338350 -5927287 -5967676
1277 -5967676 -7039736 -7523386 -7169980 -6747671 -5930458 -3740170 -851756 713701 439694
1268 439694 -79741 183458 338417 -345789 -921965 -551025 -79638 -127130 983071 5058856
1258 5058856 10405760 12842051 10733183 7052610 5596809 6585033 7029961 4554636 -97293
1249 -97293 -3848316 -4014096 -727377 3059144 4576803 4256929 4689369 6539339 7330221
1240 7330221 5269186 2536236 2918259 7151806 12548748 16645113 19100555 20083560 19059634
1231 19059634 16028354 12435574 9838976 8466994 7641582 6826442 5824781 4667218
1223 4667218 3565278 2288587 -245243 -4515920 -8582702 -9489054 -7045459 -4437171
1215 -4437171 -4056110 -4464755 -3069251 -351003 761267 -837783 -2927129 -2933531 -887916
1206 -887916 966060 503558 -2537123 -6272846 -7997284 -6517230 -3308188 -951924 -707060
1197 -707060 -2035725 -3758562 -4752943 -4282304 -2951385 -2757491 -4717028 -6974410 -7031497
1188 -7031497 -5407462 -4843110 -5933894 -6271779 -4677253 -3485246 -4875410 -7178864 -7196581
1179 -7196581 -4717362 -2207393 -862752 442495 2473788 4301274 5012128 4843697 4076960
1170 4076960 2365127 -282121 -3169847 -6005952 -8976237 -11319597 -11407628 -9091272 -6561176
1161 -6561176 -5725183 -5823241 -4888542 -2675177 -716806 -60317 -422378 -1321882 -2507693
1152 -2507693 -3114247 -1882135 1040898 3484784 3394209 1205142 -704612 -856573 -252462
1143 -252462 -847942 -2939074 -4649748 -3970716 -777416 3307323 6485346 7938071 8131775
1134 8131775 8529091 10148683 11491405 9007723 1491226 -6677084 -9325784 -5796571
1126 -5796571 -1608333 -845338 -1100678 1714964 6506682 8681270 7006402 4549258 3263428
1117 3263428 1919995 -65406 -871349 239772 1261346 1107074 1608219 3604571 4317041
1108 4317041 1698079 -1356392 -893827 1987822 3052270 1686818 1203817 2584195 2613341
1099 2613341 -494410 -3546728 -2648064 1600868 5301928 5843513 3574301 518486 -936971
1090 -936971 556977 3651754 5111718 3533200 1126032 691472 2204062 3669019 3849830
1081 3849830 2501800 -608657 -4733875 -7225103 -6024851 -2694459 -704847 -820883
1073 -820883 -411335 2442097 6386444 9026367 9668120 8707677 6050906 1908176 -1749452
1064 -1749452 -2400551 245395 3756949 5457163 4724742 2830567 1310197 903017 1580706
1055 1580706 2934610 4390503 5366858 5607543 5530167 6092904 7929189 10354518 11474284
1046 11474284 9878975 6454814 3920283 3922038 4996822 4399605 1789102 -295047 31652
1037 31652 1595056 2262724 1834682 1231922 323180 -1029920 -878735 2583926 6850320
1028 6850320 6871961 2114165 -1671751 167144 5076322 7447327 6308891 5024343 4860197
1019 4860197 3483017 113455 -2124278 -861532 1481569 797873 -3142438 -6489007
1011 -6489007 -5965917 -1829264 3594838 8437081 11612375 11960887 8882366 4157229 1547740
1002 1547740 2939988 5532041 5042273 1806118 927574 5100003 10126136 10264099 5948515
993 5948515 2617065 2873962 3838605 2538349 96277 -860143 7153 1345686 2337957
984 2337957 2628477 1771881 317157 -56551 1122411 2114220 1634713 958961 1806505
975 1806505 3585794 4521023 4323801 3884250 3275114 2010757 637066 149795 174698
966 174698 -516827 -1813704 -2173301 -764905 1648953 4068793 6238100 7956360 8429878
957 8429878 6968762 4150546 2033019 2806346 6540238 10379882 11141972 9003670 7284351
948 7284351 8001049 9190873 7680630 3042715 -2540634 -6955939 -9061302 -8198904 -4916619
939 -4916619 -1557108 -270543 -820125 -1752415 -2816118 -4377173 -5406882 -4508427 -2546191
930 -2546191 -1752997 -2224045 -1746615 559480 2772093 2955946 1353514 -871581 -3064216
921 -3064216 -4451198 -4088169 -2569771 -2114974 -3714391 -5556785 -5430311 -3419918 -1067053
912 -1067053 961687 3039160 5201351 6775315 6999956 5514698 2931260 1131311 1726731
903 1726731 3770378 4542685 3352868 2732519 4527032 6640277 5842034 2680310 1036435
894 1036435 2928061 6016342 6810564 4627126 1494032 -675295 -1676396 -2278959 -2987944
885 -2987944 -3813292 -4674118 -5308637 -4786573 -2093676 2029509 4693756 3815107 1153521
876 1153521 548528 2886258 4884834 3782177 1192312 656801 2911890 5611644 6750279
867 6750279 6195599 4317193 1307287 -1942711 -4048390 -4698786 -4868867 -5255337 -5525796
858 -5525796 -5169428 -4039731 -2082620 318717 1765755 1005235 -1043712 -1774604 -33039
849 -33039 2292714 2596971 729383 -993268 -606850 1401245 2935973 2909214 2550737
840 2550737 3691345 6063979 7471100 6940889 6176523 6703431 7072515 5016758 1577475
831 1577475 469664 3184771 7106333 9084594 8586765 6302707 2052798 -3823034 -8485293
822 -8485293 -8542447 -3948309 1575794 4148402 2955318 230126 -1007286 596899 3652598
813 3652598 5424210 4732224 3045859 2298365 2513929 2496800 1980670 1669946 1550692 663726
803 663726 -1335075 -3505478 -4628945 -4025308 -1577677 1872512 4257985 3914212 1855965
794 1855965 1029106 2583415 4114256 2624373 -1649973 -5465502 -6018465 -3116447 1514618
785 1514618 5682518 7530852 6344079 3296788 713264 -102723 -41091 -826557 -2820526
776 -2820526 -4641259 -4795530 -3197258 -1038017 428036 762789 299060 -404929 -1016472
767 -1016472 -1523152 -1988610 -2221699 -1811663 -689230 432045 562145 -487245 -1940367
758 -1940367 -3264714 -5052778 -8025511 -11410240 -13252214 -12578057 -10505102 -8824346 -8107654
749 -8107654 -7602768 -6297329 -3578612 290067 3463909 3188794 -1273676 -6686035 -8497011
740 -8497011 -5777898 -2066279 -821145 -1540702 -1296351 1235630 4666476 7027938 7624872
731 7624872 7081391 6599176 6951568 7519962 6859043 4892386 3592530 4375732 5877351
722 5877351 5931261 4845310 4578345 5161222 4448875 1643836 -1303381 -2413892 -1662478
713 -1662478 391343 3583762 6644084 7064664 4220987 804129 -687626 -1296846 -3482524
704 -3482524 -7027747 -9271404 -8575565 -5643284 -2149763 216379 304879 -1039239 -1051349
695 -1051349 1467893 3877783 3182465 577953 -351033 919805 1577029 356656 -850976
686 -850976 -660969 -16865 467027 1654492 3153498 2663309 -202950 -2301370 -1211862
677 -1211862 1299988 2143425 1036918 -326502 -1167571 -1368707 -139634 2667502 5325342
668 5325342 6408151 6721068 7135325 6425741 3671529 899052 458762 1384419 1399427
659 1399427 983552 1998129 3595244 3399720 1934476 1770588 2734291 2352532 1042348
650 1042348 1996805 5051333 5691442 2140494 -1225964 -391781 2460641 3134394 1962557
641 1962557 1945621 2865192 1909604 -1109138 -3596023 -4768797 -6273775 -8037139 -7458795
632 -7458795 -3785229 17783 1272789 860993 859831 1196122 748111 203006 1412634
623 1412634 4384805 6861538 7013132 5201423 2829799 620216 -1325587 -2512434 -2099670
614 -2099670 2052 2776820 5176658 7039648 8439961 8671034 6917744 3870535 1452924
605 1452924 488416 -280846 -2073305 -3919357 -3849094 -1799552 -7368 -235430 -1495746
596 -1495746 -1177617 1714388 4954060 5210630 1853714 -2058093 -3254906 -2015674 -1201249
587 -1201249 -2079698 -3088237 -2880155 -2293480 -2298896 -2107364 -894593 336437 464220 338836
577 338836 1124134 1888563 1222502 181199 862165 2620515 2628105 225384 -2092391 -2468705
567 -2468705 -1844312 -1598374 -1480031 -904971 -158161 772032 2536175 4486856 4465702 1917287
557 1917287 -690885 -1110763 -161337 413368 1114655 3379867 6331079 7381203 5651414
548 5651414 2681663 11859 -2012966 -3177465 -3047510 -1895364 -471117 1272488 3811958
539 3811958 6324061 6872529 4793781 1711245 -308679 -700395 -240935 28697 -662424
530 -662424 -2392145 -4065455 -4011657 -1621032 1930896 4790259 5864842 5164455 3422949
521 3422949 1722393 959066 1144354 1304490 383471 -1530185 -2792327 -1382719 2831396
512 2831396 7107292 8175009 5945925 3704337 3904304 5185728 4922669 3351714 2884198
503 2884198 3935470 4181496 2412056 572079 634098 1392322 275427 -2749468 -5102462
494 -5102462 -5131488 -3959397 -3475242 -3866979 -3999286 -3495708 -3324120 -4214050 -5360244 -5401130
484 -5401130 -4338177 -3562642 -3884407 -4519362 -4475991 -3919444 -3322193 -2216147 -58260
475 -58260 2260343 3148095 2252461 457770 -1583240 -3468377 -4126452 -2828947 -988099
466 -988099 -810917 -1949122 -1755773 597738 2760897 3023660 2904215 4084580 5082052
457 5082052 3617214 807865 86880 2535452 5922042 8207222 9538108 10549183 10972843
448 10972843 10614436 9916952 8816325 6499799 3021886 -87366 -1512846 -1407123 -452147
439 -452147 1160877 3131322 4485612 4470140 3318204 1523326 -898896 -3799039 -6295405
430 -6295405 -7523020 -7413055 -6126353 -3460125 232082 3043090 2728392 -753150 -4620132
421 -4620132 -5704322 -3404598 -44765 1583790 749329 -1228699 -3006198 -4362559 -5227050
412 -5227050 -4773422 -2550956 186529 1719958 2253367 3529636 5793481 6720351 4303897
403 4303897 -282734 -3855069 -4641232 -3492336 -2072961 -1005066 49821 1316032 2424831
394 2424831 2794082 2165333 672766 -1497504 -4184083 -6815430 -8334477 -8084227 -6507017
385 -6507017 -4435888 -2129679 181357 1397329 699311 -542938 136323 2804581 4560909
376 4560909 3441828 1140081 310303 698981 68469 -1991795 -3638180 -3925705 -3921799
367 -3921799 -4201874 -3493428 -992592 1615246 1949536 -141514 -2680785 -3901357 -3347198
358 -3347198 -1298004 1444681 3323825 2980248 857034 -1074859 -1639625 -1741548 -2815853
349 -2815853 -4765494 -6343870 -7143833 -7970720 -9052216 -9108511 -7126329 -4354969 -3268416
340 -3268416 -4570636 -6382814 -6756915 -5956288 -5513882 -5826341 -5737410 -4190808 -1302436
331 -1302436 2124440 5169907 6756876 6077732 3661609 1362658 561664 677849 83102
322 83102 -1722315 -3561110 -4220526 -3869803 -3420543 -3056978 -2196372 -823358 -45193 -907684
312 -907684 -3087968 -5186300 -6049240 -5470014 -3964435 -2402986 -1574108 -1412584 -793272
303 -793272 1149575 3513486 4276161 2622798 -183027 -2499316 -3977692 -5079634 -5843385
294 -5843385 -5951644 -5451018 -4600943 -3399441 -1939626 -790258 -261455 269025 1375902
285 1375902 2246174 1421352 -1070584 -3331081 -3690920 -2509072 -1513074 -1850223 -3160831
276 -3160831 -4244375 -4258693 -3324605 -2148727 -1184219 -346703 425385 733170 213938 -696935
266 -696935 -896980 380961 2716381 4620647 4747973 3344231 2209928 2630158 3782494
257 3782494 4317064 5084124 8238211 13139403 15484501 12219685 5698965 926070 -166053
248 -166053 532518 1303797 2549831 4759845 7116836 8804375 9784588 9686583 7725820
239 7725820 4459801 2035140 1879471 3384419 5331656 7172606 8417141 8401799 7443975
230 7443975 6784852 6678914 6015736 4513239 3605704 4226447 5333199 5655049 5287133
221 5287133 4529248 3004031 1256455 1232780 3355130 4979820 3972256 2138302 2444674
212 2444674 4165821 3956758 1140825 -1381233 -1670612 -1086961 -1288091 -1710650 -1507781
203 -1507781 -1763672 -3755125 -6237616 -6480229 -3775654 -501717 580538 -687061 -2014524
194 -2014524 -1526888 197935 1425368 1955544 3054499 4589090 4257806 974401 -2659214
185 -2659214 -3237924 -842286 1617893 2458462 2290836 1719727 746069 425118 2320011
176 2320011 5749441 8013584 8000670 7234424 6733025 5533201 3493756 2823568 4885854
167 4885854 7604655 8189659 6825771 5539326 4745050 3197843 615632 -1659482 -2291783
158 -2291783 -968412 1499489 3013776 1389202 -2782208 -5759679 -4925051 -2133980 -742707
149 -742707 -687099 673852 3662841 5481607 4361215 1562925 -1189794 -3453421 -4526623
140 -4526623 -3065271 394326 3010079 3396082 3622649 5556131 7290010 5805713 1801762
131 1801762 -1022263 -963322 171081 599943 916851 2044890 3091281 2791508 1769963
122 1769963 1769993 3207846 4724499 4882636 3377027 838864 -1646088 -2984933 -2953421 -2639228
112 -2639228 -3217802 -4267678 -4166063 -2270380 300809 2408010 4257057 6191116 7151644
$$ [...]
##END NTUPLES=NMR SPECTRUM
##END=
