##TITLE=31Pdec_DE-105_oil_TCM
CDCl3, 24 sc
 1.8.2025
##JCAMPDX= 6.0         $$ Bruker NMR JCAMP-DX V2.0
##DATA TYPE= NMR SPECTRUM
##DATA CLASS= NTUPLES
##ORIGIN= UXNMR, Bruker Analytische Messtechnik GmbH
##OWNER= root
$$ XWIN-NMR		Version 3.5
$$ Fri Aug  1 13:54:55 2025 Russian Standard Time (UT+4h)  she@DPX200
##.OBSERVE FREQUENCY= 81.013821
##.OBSERVE NUCLEUS= ^31P
##.ACQUISITION MODE= SIMULTANEOUS
##.ACQUISITION SCHEME= undefined
##.AVERAGES= 64
##.DIGITISER RES= 17
##SPECTROMETER/DATA SYSTEM= spect
##.PULSE SEQUENCE= zgpg30
##.SOLVENT NAME= CDCl3
##.SHIFT REFERENCE= (INTERNAL, CDCl3, 0, 198.062)
##AUDIT TRAIL= $$ (NUMBER, WHEN, WHO, WHERE, WHAT)
$$ ##TITLE= Audit trail, XWIN-NMR		Version 3.5
$$ ##JCAMPDX= 5.01
$$ ##ORIGIN= Bruker BioSpin GmbH
$$ ##OWNER= she
$$ F:/spectra/data/she/nmr/P31/2/pdata/1/auditp.txt
$$ ##AUDIT TRAIL=  $$ (NUMBER, WHEN, WHO, WHERE, WHAT)
(   1,<2025-08-01 13:53:38.50 +0400>,<she>,<DPX200>,
      <created by zg, POWCHK disabled, PULCHK disabled
       configuration hash MD5:
       00 E9 B6 7A A2 85 ED C7 34 08 36 98 17 FE 4E 26
       data hash MD5: 32K
       C8 78 C5 29 F1 4A 53 37 65 80 32 C3 0A 67 0A 8E>)
(   2,<2025-08-01 13:53:42.31 +0400>,<she>,<DPX200>,
      <Start of raw data processing
       efp BC_mod = 2 LB = 1.5 FT_mod = 6 PKNL = 1 PHC0 = 1127.182 PHC1 = 868.2987 SI = 64K 
       data hash MD5: 64K
       63 03 6E 34 8F FF 7F 5B 92 6D E7 1D AD B7 F9 3E>)
(   3,<2025-08-01 13:53:57.23 +0400>,<she>,<DPX200>,
      <pk PHC0 = -4.380794 PHC1 = 0 
       data hash MD5: 64K
       49 C0 88 D6 76 63 FD D3 24 DA 1C 60 20 7C BC C3>)
(   4,<2025-08-01 13:54:17.93 +0400>,<she>,<DPX200>,
      <pk PHC0 = -7.62036 PHC1 = 2.200235 
       data hash MD5: 64K
       C1 88 A4 70 A1 DF 8A C3 95 55 12 F8 76 CC 46 87>)
(   5,<2025-08-01 13:54:23.90 +0400>,<she>,<DPX200>,
      <abs ABSG = 5 
       data hash MD5: 64K
       1E 71 BE E8 D6 E7 81 58 53 D8 E2 59 F1 27 2A 99>)
$$ ##END=
$$ 
$$ hash MD5
$$ 73 F9 2B E1 CB B9 84 B1 69 AD 75 A5 95 28 57 87
##$RELAX= 
##$RELAX= 
##$RELAX= 
##$RELAX= 
##$RELAX= 
##$RELAX= 
##$RELAX= 
##$RELAX= 
$$ Bruker specific parameters
$$ --------------------------
##$DU= <F:/spectra>
##$EXPNO= 2
##$NAME= <P31>
##$PROCNO= 1
##$TYPE= <nmr>
##$USER= <she>
##$AMP= (0..31)
100 100 100 100 100 100 100 100 100 100 100 100 100 100 100 100 100 100 
100 100 100 100 100 100 100 100 100 100 100 100 100 100 
##$AQSEQ= 0
##$AQ_mod= 1
##$AUNM= <au_zg>
##$AUTOPOS= <>
##$BF1= 81.014009
##$BF2= 200.13
##$BF3= 200.13
##$BF4= 200.13
##$BF5= 200.13
##$BF6= 200.13
##$BF7= 200.13
##$BF8= 200.13
##$BYTORDA= 1
##$CFDGTYP= 0
##$CFRGTYP= 5
##$CHEMSTR= <none>
##$CNST= (0..31)
1 1 145 1 1 1 1 1 1 1 1 1 1 1 1 1 1 1 1 1 1 1 1 1 1 1 1 1 1 1 1 1 
##$CPDPRG= <waltz16>
##$CPDPRG1= <>
##$CPDPRG2= <waltz16>
##$CPDPRG3= <>
##$CPDPRG4= <mlev>
##$CPDPRG5= <mlev>
##$CPDPRG6= <mlev>
##$CPDPRG7= <mlev>
##$CPDPRG8= <mlev>
##$CPDPRGB= <>
##$CPDPRGT= <>
##$D= (0..31)
$$ [...]
##$SUBNAM3= <"">
##$SUBNAM4= <"">
##$SUBNAM5= <"">
##$SUBNAM6= <"">
##$SUBNAM7= <"">
##$SUBNAM8= <"">
##$SUBNAM9= <"">
##$SW= 400.765351723535
##$SWIBOX= (0..15)
0 1 3 0 0 0 0 0 0 0 0 0 0 0 0 0 
##$SW_h= 32467.5324675325
##$TD= 32768
##$TD0= 1
##$TE= 0
##$TE2= 300
##$TE3= 300
##$TEG= 300
##$TL= (0..7)
0 120 53 12 22 120 120 120 
##$TP= (0..7)
150 150 150 150 150 150 150 150 
##$TP07= 0
##$TPNAME0= <>
##$TPNAME1= <>
##$TPNAME2= <>
##$TPNAME3= <>
##$TPNAME4= <>
##$TPNAME5= <>
##$TPNAME6= <>
##$TPNAME7= <>
##$TPOAL= (0..7)
0.5 0.5 0.5 0.5 0.5 0.5 0.5 0.5 
##$TPOFFS= (0..7)
0 0 0 0 0 0 0 0 
##$TUNHIN= 0
##$TUNHOUT= 0
##$TUNXOUT= 0
##$USERA1= <user>
##$USERA2= <user>
##$USERA3= <user>
##$USERA4= <user>
##$USERA5= <user>
##$V9= 5
##$VALIST= <valist>
##$VCLIST= <CCCCCCCCCCCCCCC>
##$VD= 0
##$VDLIST= <DDDDDDDDDDDDDDD>
##$VPLIST= <PPPPPPPPPPPPPPP>
##$VTLIST= <TTTTTTTTTTTTTTT>
##$WBST= 1024
##$WBSW= 4
##$XGAIN= (0..3)
0 0 0 0 
##$XL= 0
##$YL= 0
##$YMAX_a= 4792
##$YMIN_a= -4797
##$ZGOPTNS= <>
##$ZL1= 120
##$ZL2= 120
##$ZL3= 120
##$ZL4= 120
##$ABSF1= 198.0616
##$ABSF2= -202.7028
##$ABSG= 5
##$ABSL= 3
##$ALPHA= 0
##$AQORDER= 0
##$ASSFAC= 0
##$ASSFACI= 0
##$ASSFACX= 0
##$ASSWID= 0
##$AUNMP= <proc_1d>
##$AZFE= 0.1
##$AZFW= 0.5
##$BCFW= 0
##$BC_mod= 2
##$BYTORDP= 0
##$COROFFS= 0
##$CY= -3
##$DATMOD= 1
##$DC= 0
##$DFILT= <>
##$DTYPP= 0
##$F1P= 0
##$F2P= 0
##$FCOR= 1
##$FTSIZE= 65536
##$FT_mod= 6
##$GAMMA= 0
##$GB= 0
##$INTBC= 1
##$INTSCL= 9.790993e-09
##$ISEN= 30
##$LB= 1.5
##$LEV0= 0
##$LPBIN= 0
##$MAXI= 10000
##$MC2= 0
##$MEAN= 0
##$ME_mod= 0
##$MI= 50
##$NCOEF= 0
##$NC_proc= -9
##$NLEV= 6
##$NOISF1= 182.463
##$NOISF2= 159.3651
##$NSP= 0
##$NTH_PI= 0
##$NZP= 0
##$OFFSET= 198.0616
##$PC= 4
##$PHC0= 1115.181
##$PHC1= 870.499
##$PH_mod= 1
##$PKNL= yes
##$PPARMOD= 0
##$PSCAL= 0
##$PSIGN= 0
##$REVERSE= no
##$SF= 81.0140089999434
##$SI= 65536
##$SIGF1= 159.3651
##$SIGF2= -187.1042
##$SINO= 113.3802
##$SIOLD= 16384
##$SREGLST= <1H.CDCl3>
##$SSB= 0
##$STSI= 65536
##$STSR= 0
##$SW_p= 32467.5324675325
##$SYMM= 0
##$S_DEV= 0
##$TDeff= 32768
##$TDoff= 0
##$TI= <>
##$TILT= no
##$TM1= 0
##$TM2= 0
##$TOPLEV= 0
##$USERP1= <user>
##$USERP2= <user>
##$USERP3= <user>
##$USERP4= <user>
##$USERP5= <user>
##$WDW= 1
##$XDIM= 65536
##$YMAX_p= 435797340
##$YMIN_p= -126580085
$$ End of Bruker specific parameters
$$ ---------------------------------
##NTUPLES= NMR SPECTRUM
##VAR_NAME=  FREQUENCY,     SPECTRUM/REAL,   SPECTRUM/IMAG
##SYMBOL=    X,             R,               I
##VAR_TYPE=  INDEPENDENT,   DEPENDENT,       DEPENDENT
##VAR_FORM=  AFFN,          ASDF,            ASDF
##VAR_DIM=   65536,         65536,           65536
##UNITS=     HZ,            ARBITRARY UNITS, ARBITRARY UNITS
##FACTOR=    0.49542278885378, 1,            1
##FIRST=     16045.7642231865, 0,            0
##LAST=      -16421.768244346, 0,            0
##MIN=       -16421.768244346, -126580085,   0
##MAX=       16045.7642231865, 435797340,    0
$$ Real data points
##PAGE= N=1
##DATA TABLE= (X++(R..R)), XYDATA
$$ [...]
9386 3497507 8069720 9864686 4527228 -2448007 -4789935 -3793843 -3949631 -5386138 -4968081
9377 -4968081 -1787016 2197444 5080574 5791196 3611690 -709575 -4672936 -6663623
9369 -6663623 -7650923 -9027439 -10380482 -10663274 -9841292 -8056884 -4862162 -573834 3290727
9360 3290727 6153064 9254459 13277675 16895797 18795956 19256132 18713120 16960378 14806132
9351 14806132 13877083 13397677 10266316 4487123 1404053 5474873 14254017 21651192
9343 21651192 24733000 23857930 18896198 10411059 3053198 1918630 5199120 5647987
9335 5647987 438702 -5298138 -6427451 -4361294 -2810637 -1528809 1287119 3359805
9327 3359805 292891 -7706063 -15329291 -18194952 -15821025 -9188753 227 6914222
9319 6914222 5581660 -3613854 -11962292 -11862676 -6197757 -4363478 -10155402 -17850450 -20274618
9310 -20274618 -16551981 -10693110 -6191027 -4187129 -4347694 -5059910 -4310327 -2328878 -2010626
9301 -2010626 -5068225 -9303704 -11503430 -11496395 -11255429 -11304740 -10313868 -7415115 -3074995
9292 -3074995 1261937 2766406 -1555675 -10488469 -17183130 -15814756 -9004998 -4916162
9284 -4916162 -6913029 -9673548 -6370944 3186919 12656387 15364924 9894794 1302910
9276 1302910 -3045411 -480247 4457581 5854500 3093241 -644658 -3863148 -6297281
9268 -6297281 -5124058 2049378 10683725 12536185 6808592 1901979 4024942 10170439
9260 10170439 14959491 17684804 18300733 12913957 -386668 -15607356 -25152798 -28894548
9252 -28894548 -31065475 -31466445 -26956460 -19858446 -17193992 -21052441 -25861341 -26317592
9244 -26317592 -23055258 -19404531 -16948907 -15495535 -13863588 -9965374 -3365708 2151717
9236 2151717 2274130 -1432966 -2748840 1119219 6529623 8982447 7760324 4415885
9228 4415885 847896 -130145 3315635 7960667 7491883 593273 -6836582 -9866929 -10965983
9219 -10965983 -14973333 -20910763 -22998466 -18404340 -10551097 -5255725 -5869943 -11456887
9211 -11456887 -17651099 -19858050 -17343439 -13837165 -13056821 -14403713 -14087790 -9626802
9203 -9626802 -2210209 4709468 8518551 9835561 11863713 16092493 18885604 14676634
9195 14676634 3186258 -8859408 -14310686 -11891359 -5039199 2823633 9797806 14420677
9187 14420677 15999919 15635281 15081695 14697141 13362752 9753053 2920963 -7330950
9179 -7330950 -19411122 -29644177 -33893942 -29942800 -19312518 -7674668 -1861573 -3667799
9171 -3667799 -6997803 -4124156 5171252 13727575 16103031 13373166 8163224 208231
9163 208231 -9970264 -17113099 -15583018 -6117469 4922138 11681154 12070729 7409410
9155 7409410 1880893 272774 2952590 4642252 1048150 -5223541 -8450778 -7254352
9147 -7254352 -4533176 -2060030 337920 1619974 395740 -1672491 -1881914 -1354853 -3147580
9138 -3147580 -6003278 -5572151 -2280774 -1958374 -6841581 -11723571 -12043092 -10666898 -12556218
9129 -12556218 -16733370 -18311550 -15900045 -12265436 -9061877 -5284174 -584440 3439940
9121 3439940 5459667 5411590 3374151 -431018 -4736071 -8143616 -10535246 -12080515 -11931893
9112 -11931893 -9865936 -7920119 -7722999 -7155309 -2846483 4338516 9655989 10586698 9198778
9103 9198778 7628263 4870423 103025 -3928248 -4022905 -1378772 -253628 -2469707 -5910315
9094 -5910315 -8146278 -8906478 -8721102 -7660214 -6374280 -6394158 -8122953 -9981094 -10774933
9085 -10774933 -11531741 -13437682 -15144032 -14168593 -10346953 -5593460 -378895 6651507
9077 6651507 14352489 17204604 10966634 -518828 -7491347 -4434173 3994057 8757829
9069 8757829 6584635 2047432 433453 1849380 3466272 4568899 6339569 7959042
9061 7959042 6600299 1810353 -3151826 -5572224 -6137284 -5850404 -3101871 3071906 9040648
9052 9040648 10047972 6774440 4293014 4751893 5707700 6233209 9123498 14404422 15793094
9043 15793094 8401863 -3175393 -9679158 -8435582 -4729473 -2815981 -1166318 2464863
9035 2464863 6405101 8025278 7688398 6737384 4005723 -2301244 -10186693 -14368843 -11895728
9026 -11895728 -5810115 -2212390 -3724689 -6605915 -5523280 -1145571 -520196 -8019107
9018 -8019107 -18337461 -22234686 -17938504 -12068362 -9344832 -7230332 -2803848 984335
9010 984335 502157 -1433960 441814 4999740 6171285 2796091 843441 4405167 9730701
9001 9730701 11032575 8448855 6809600 8667036 11816694 12939522 11324139 9085409
8993 9085409 8828190 10616211 10888628 6010964 -2156861 -6375782 -1845612 7453709 12642189
8984 12642189 9448288 1568131 -4863117 -7283808 -6737654 -4691356 -1827776 968587
8976 968587 2231525 1058141 -1631817 -3456871 -3032783 -2309099 -5053715 -11758150 -17361446
8967 -17361446 -16191281 -8488709 373164 6641871 11070245 15054981 17949531 19918040
8959 19918040 23636454 29875169 33978147 30645134 20975809 11142990 4779035 331756
8951 331756 -4133864 -7304507 -6923270 -3175819 1228581 2710083 -1289145 -9674051 -17113171
8942 -17113171 -18917348 -16538493 -15245734 -16703208 -17967473 -17883093 -18903950 -20777374
8934 -20777374 -18337815 -9388929 196835 4003503 3447614 3243414 2575969 -2193936 -8792420
8925 -8792420 -11222401 -9958921 -11602100 -17384519 -20323729 -16620466 -12144801 -13010569
8917 -13010569 -16281059 -15959367 -13052862 -12632374 -14051329 -11545712 -3742873 3903895
8909 3903895 6624544 5007238 1485507 -2820617 -6244179 -6019273 -1999974 2274623
8901 2274623 4432182 6222489 9107532 9823464 4302368 -5182625 -11030131 -9242331
8893 -9242331 -4129225 -2407868 -5106272 -8022558 -8689313 -8995160 -10383178 -10438578 -7015064
8884 -7015064 -2984283 -2692791 -4728684 -2982009 4231032 10530256 9366166 2163909
8876 2163909 -4664507 -8491547 -12306023 -18376697 -23555158 -21954793 -11104983 4671804
8868 4671804 16524115 17855805 10117232 1098172 -3044623 -2435723 -7699 2993074
8860 2993074 5918859 6903695 5976996 7143871 12806050 18415461 18044425 13651257 12568444
8851 12568444 16352604 19109314 17808823 16909179 19838524 22653834 20814700 16937014
8843 16937014 16271291 18222755 18078218 14750690 11406293 9897436 9487716 10044371 11838825
8834 11838825 12826296 10523634 6306514 3844716 3543324 2418913 -762954 -4147974
8826 -4147974 -6399945 -7705566 -7405430 -4868832 -2611155 -3783733 -6251453 -4428861
8818 -4428861 1922406 6262114 4588057 656626 -890502 -1031604 -2053125 -2031065 1049177
8809 1049177 3907361 2837486 779393 2829197 6865671 6054228 32652 -4023004
8801 -4023004 -2443289 206010 -117898 -386436 3078644 7301950 7329599 4457931 3883418
8792 3883418 6226266 7274671 5613693 4951020 7853513 11752713 13175762 12479292 11808788
8783 11808788 10824581 7664433 3277239 1753314 5589391 12312943 16788868 15989809
8775 15989809 10692695 3395336 -3881887 -9765970 -13273145 -14579398 -15339016 -17152587
8767 -17152587 -19917529 -22122314 -22017609 -18102109 -10166276 -1311828 3004534 792807
8759 792807 -2757584 -998965 4992840 7124112 1123967 -7567541 -10993582 -8021369
8751 -8021369 -3295317 114861 2982337 6600969 11177571 16663852 21656635 22217549
8743 22217549 15556549 4799183 -3498021 -6923165 -8923317 -12382585 -15138040 -13647831
8735 -13647831 -8365041 -3116983 -486512 362817 1790669 4643350 7060511 6497232
8727 6497232 3334729 1290674 2748850 4983764 3441993 -2164678 -7908577 -11012318
8719 -11012318 -11752103 -10579651 -7686516 -5730154 -7998593 -12184019 -10946038 -1754365
8711 -1754365 8124258 10599074 7407631 6876784 11985909 16978837 15773510 9135385
8703 9135385 2221522 -1749395 -3539829 -5405354 -8312797 -11322038 -12925576 -12524890
8695 -12524890 -10271277 -6308543 -1880012 -597535 -5407529 -13429460 -17265530 -13497974
8687 -13497974 -6808293 -3244404 -2884991 -2717787 -3145956 -6049068 -8504135 -5180739 2787120
8678 2787120 7639361 5566584 2011349 3323857 7518813 7612527 1620083 -5293209 -8068942
8669 -8068942 -7449929 -7570159 -10173618 -12784896 -12054857 -7854058 -3624146 -2904599 -6059419
8660 -6059419 -10454535 -13021327 -12326809 -9236394 -6322089 -5672409 -6634887 -6949745 -6596407
8651 -6596407 -8337444 -13190439 -17905925 -19039921 -17009285 -13552579 -8207517 -1154850
8643 -1154850 3409217 2259512 -229826 3199109 11611095 16055181 11867350 4512665
8635 4512665 1108710 2081521 4161224 6059313 7240573 5749631 1614605 -1344633
8627 -1344633 -1139245 -1264770 -4476431 -6922929 -3877241 1957340 4051236 1866318 748315
8618 748315 3124640 6127925 7805600 9503670 11315368 10946575 8580644 7566197 8321046
8609 8321046 6591225 411774 -5737828 -6970137 -4349052 -1709844 380883 3208463
8601 3208463 5077929 2875204 -2529480 -6941558 -8813902 -10565215 -13520156 -15329898
8593 -15329898 -13570157 -8612111 -1542183 7283868 15221447 16216131 6903315 -7440590
8585 -7440590 -17058390 -17709638 -13187253 -8307625 -3976934 -188261 1254039 187629
8577 187629 104204 2414663 2082016 -5495940 -15394338 -17561440 -10263365 -2807590 -3408643
8568 -3408643 -9872176 -14417334 -12604072 -4875483 5686842 13545180 13018373 4621265
8560 4621265 -4042671 -7054347 -6252216 -5428470 -3618347 599754 2956959 -1106790 -7922226
8551 -7922226 -10079206 -7534380 -6435900 -8175640 -8374525 -6851620 -9022275 -14970335
8543 -14970335 -16323810 -8596793 1087712 4270691 2721164 3328697 6727762 8306353
8535 8306353 7003745 5649936 4432235 1010528 -3574633 -5451654 -4421006 -4222209
8527 -4222209 -5874252 -6170260 -3771734 -1537130 -1004432 561864 4869497 8402518 7193212
8518 7193212 3288224 2673682 7609926 13992375 16470424 14361945 11974639 13640060
8510 13640060 18585443 21117577 16796307 8047256 1993299 2748790 8008815 13584497
8502 13584497 18258789 22259966 23671126 19985431 12625951 6736047 5812705 8470734
8494 8470734 10951421 11153245 9819142 9358955 11774016 15943707 16826647 10125854 -1003110
8485 -1003110 -6863887 -1539768 9762272 16891064 16533768 13563998 11622238 8316901
8477 8316901 1587201 -4799497 -6396917 -4951984 -4914480 -5378435 -1540175 6216018 10973917
8468 10973917 8879947 4824802 5196630 8862413 9701687 5846715 1618719 669075 1549991
8459 1549991 1237126 -344734 -1493029 -2221968 -3737311 -5128500 -3555814 1336998 5478928
8450 5478928 4965461 1506039 667719 4703643 9977919 12561332 13425893 15651453 18871401
8441 18871401 20176292 19407258 19306941 20119873 18303393 12408503 6731221 6152564 9414611
8432 9414611 10665122 6861402 872684 -2800138 -3128702 -2625348 -3699699 -6109475 -7919099
8423 -7919099 -8324713 -8803523 -11014923 -14013541 -14503427 -10072565 -1744461 6612525 11201973
8414 11201973 11344005 10175714 11287100 13903103 13180023 6998866 427073 346970 6858960
8405 6858960 13496602 15144421 11754915 4826270 -4494028 -12659049 -14306706 -8401701
8397 -8401701 -209491 5116588 7373446 7890852 6061302 2653816 1990501 6061375 10075938
8388 10075938 9222446 6891215 9862547 16932534 19239185 12431687 2540224 -2044159
8380 -2044159 207675 4876543 7968606 8670881 7869267 6277169 3706826 -67533 -3207981
8371 -3207981 -2040200 4379034 11184204 12339837 7708199 2192335 -1494038 -4989002
8363 -4989002 -8975878 -10389394 -6932730 -1103624 2490344 1780420 -2001063 -5862800
8355 -5862800 -6309645 -1779804 4590825 6997685 3443091 -1792210 -3543439 -1444701
8347 -1444701 1399114 3122211 4049571 4344814 3311633 935720 -1514840 -2813600 -3244625
8338 -3244625 -4619623 -8395562 -13265791 -15546953 -13222925 -8560141 -4851104 -1795498
8330 -1795498 3035731 8947697 11986989 10304387 6205489 2267491 -1062503 -3034809
8322 -3034809 -1577984 3223791 7520968 7766527 4479002 664013 -1376276 -861115 1053987
8313 1053987 795627 -4407789 -11625057 -14181283 -10111882 -4753165 -2948377 -3138892 -2123409
8304 -2123409 -1042432 -2363667 -4784789 -5953767 -6942217 -8800670 -7850363 -837144 7252014
8295 7252014 7739278 467204 -5240332 -2778019 4637525 10552546 12966563 12794424 10111866
8286 10111866 6052839 4772756 9185166 16653616 22131072 23804409 22798279 19477313
8278 19477313 13997426 9560179 10805227 17964453 25492930 27899232 24990426 20038729
8270 20038729 14761394 8640826 2519942 -265502 2165476 6923084 9008689 6572024
8262 6572024 1738380 -2977362 -6547205 -8005531 -6388250 -3029152 -953529 -543378
8254 -543378 1223259 5286118 7600173 4966752 988105 1830879 7531360 12138552 12158430
8245 12158430 10372794 10603461 12595458 13378593 10566469 3059220 -8491931 -20148922
8237 -20148922 -26078568 -23740493 -16665139 -10838437 -9155513 -9862297 -9192457 -5168185
8229 -5168185 38085 1724332 -1754532 -5685163 -3953409 2913966 8078237 7430558
8221 7430558 4556450 4742681 7406044 7736788 3996087 -278259 -1063337 1598064 4144080
8212 4144080 3239446 -1176458 -5886791 -7599835 -6401901 -5318011 -6210631 -7283552 -5349333
8203 -5349333 315716 6953044 10391302 8022864 1107568 -5288989 -5944388 -87483
8195 -87483 8089041 13767804 15769760 16682219 19643158 24687706 27535125 23310700 13205793
8186 13205793 5690358 7775904 15963016 19903336 14944599 6482660 1188545 -797682
8178 -797682 -2701220 -5367100 -8622955 -14317088 -23052134 -30342738 -30954691 -25913694 -21065360
8169 -21065360 -19625636 -20052799 -20352803 -20127099 -18389685 -13473700 -5971389 1231741 6380368
8160 6380368 9713005 11001826 9455546 6445420 4997944 5594446 5408970 2847152 30335
8151 30335 -670729 -5550 -38212 -1249497 -3442762 -7575162 -14078082 -20268098 -22027100
8142 -22027100 -18444157 -13280087 -11127903 -12698153 -14454208 -12838253 -8189728 -3649435
8134 -3649435 -594765 2776145 7367480 10120761 7782925 2399587 -497203 849106
8126 849106 2401195 244163 -4889512 -10371885 -15411052 -19333250 -18946490 -11636016 -437014
8117 -437014 7329891 7028058 417339 -7453306 -12748415 -13898472 -10761605 -4643612 1798703
8108 1798703 6326880 8810192 10376139 11151847 9933231 6354619 2377075 692575
8100 692575 1982685 4643262 7058613 9010577 10617075 11167366 9810236 6477459 1439025
8091 1439025 -4843917 -10441373 -12142174 -8867623 -3774651 -657755 804210 3346313
8083 3346313 6394871 6074137 1629501 -2413043 -2698759 -1835688 -3358919 -5169204 -2893194
8074 -2893194 1894341 2547474 -3059337 -9126188 -10223937 -8468979 -8931576 -11269649 -10674583
8065 -10674583 -5812599 -1120794 -840870 -4574834 -9656424 -14289778 -16553764 -13676920
8057 -13676920 -5510949 3024876 6071389 2729107 -3288413 -8510011 -11379884 -10495809
8049 -10495809 -5402292 692642 3021673 1011216 -1785566 -4306214 -9549183 -17181734
8041 -17181734 -20255194 -14487858 -6564920 -6118176 -11541788 -11799987 -2616765 7380304
8033 7380304 9495425 6384165 5372297 6300249 3500751 -2975312 -6080268 -2140883
8025 -2140883 3774867 4766540 -99718 -6846705 -11577610 -12076063 -7822852 -1558094 1446104
8016 1446104 -1027960 -4600534 -3449127 1838500 4921010 2230445 -2584589 -3962107
8008 -3962107 -1300752 1675757 2537409 2332737 2768200 3948179 5493954 7815906 11006285
7999 11006285 13638175 13961258 11841139 8697111 5949407 4190932 3365758 2946649 2206590
7990 2206590 892907 -689215 -2515777 -4796416 -6430696 -4918081 546375 6825908
7982 6825908 9783577 9001403 7223120 5368584 1415359 -4630110 -8090729 -4971302
7974 -4971302 2014512 6437577 6685664 7827361 14071337 22598653 27103791 25407642
7966 25407642 20786394 16691015 13212189 9085620 4232379 -1353315 -9008803 -19008478
7958 -19008478 -27807721 -30841279 -28395746 -25735926 -26103373 -26342318 -21861749 -13751903
7950 -13751903 -7395538 -4797787 -2352485 2845919 8152642 9377693 7355459 7144139
7942 7144139 10957186 14654998 12369108 3372550 -6690862 -11070973 -7835763 -772673
7934 -772673 4799411 6396881 4826609 1890417 -879648 -1877147 -44563 3358310 5102468
7925 5102468 3287336 -515734 -3306074 -4000911 -3736977 -3640801 -3704855 -3666611 -3732251 -4164963
7915 -4164963 -4908228 -5815300 -6700454 -7018733 -6024125 -3645842 -1107715 -323093 -2269751
7906 -2269751 -5808457 -8485617 -8890628 -7917051 -7346901 -7811294 -8799267 -9769923 -9972109
7897 -9972109 -8025543 -3644257 690828 2206597 1981812 3780283 8166264 11088064
7889 11088064 9911782 7401451 6726374 5451793 -1045089 -11375852 -18076075 -16400756
7881 -16400756 -9604436 -4219216 -2778460 -2621099 44383 6130890 12460795 14226058
7873 14226058 10194439 5130381 4554655 7512799 8383537 6237618 7063067 14000704 20817948
7864 20817948 20462786 16087968 16204615 20644421 19996325 10317426 -101785 -2839677
7856 -2839677 -955302 -2151423 -5983518 -6229683 -2779229 -1656932 -3711546 -3071336 1045789
7847 1045789 682193 -7647625 -14546713 -10279665 276949 4359572 -600998 -5503706
7839 -5503706 -4925212 -3532128 -5408037 -6629501 -3025409 2083370 3532063 2256073
7831 2256073 1807064 1184724 -2685331 -8118527 -10314914 -8264770 -4826087 -1397335 2168566
7822 2168566 3516982 -293797 -6514014 -7970818 -2149969 5471695 8813814 7832249
7814 7832249 5825181 3978696 1472293 -1642261 -4547709 -6996823 -8323766 -6735731
7806 -6735731 -1936335 2680840 2815322 -2124369 -8788744 -13649972 -15200828 -12888373
7798 -12888373 -6499076 2038771 7920212 7271702 2324299 480980 5882426 13030521
7790 13030521 12220702 1786539 -8777919 -10022867 -3686084 615295 -2561104 -9824635
7782 -9824635 -14960607 -14962930 -10079544 -2327320 4618864 7255678 5631783 3082909 2172009
7773 2172009 2989956 5202470 8535668 10834498 9204927 4314809 407191 -421859 -1052693
7764 -1052693 -4828236 -10789028 -15045317 -14734079 -9491500 -1419732 5423948 8107654
7756 8107654 8027494 7891930 5511012 -4045130 -18297032 -25678128 -18751555 -4553433
7748 -4553433 3842103 2817404 -628932 -707085 1058250 1162151 -682821 -2866119 -3878706
7739 -3878706 -1999269 3253396 8760552 10521879 9114484 8720109 10475994 11058334 8591180
7730 8591180 5353789 3083732 177266 -3963697 -5925724 -2949427 2477366 6051078
7722 6051078 7192442 7851971 8165911 7290529 6957195 9631731 13328341 12663082 6368801
7713 6368801 394162 1386492 9065253 17048343 19892340 17271914 12070470 6944327
7705 6944327 3371355 2071975 2735554 4072211 5482719 8099342 12619548 16690401
7697 16690401 16971731 14237702 13469401 17040799 20481865 18151027 11328711 6590470
7689 6590470 6681409 7664358 6190278 4853833 7111248 10287571 8371162 851454 -5626215
7680 -5626215 -5343970 -75156 4093880 4290190 2897444 2953718 3856687 2353068 -3226802
7671 -3226802 -10510215 -14722851 -12743317 -6031079 245589 1511330 -2325094 -7478319
7663 -7478319 -10730950 -12172916 -12868779 -11583114 -6551269 -302166 750397 -6279812
7655 -6279812 -15655910 -18116487 -10661641 915403 9046726 11446572 10452531 7882264
7647 7882264 3232459 -3320481 -8823392 -10408142 -9407133 -10120496 -13769044 -16185926
7639 -16185926 -13754945 -9551215 -9605465 -13560054 -13881622 -6046041 4772967 10294082
7631 10294082 9174012 6632655 6291788 6804969 5856341 3516784 1311468 693092 2415746
7622 2415746 5161537 5449358 1451271 -3968285 -6819311 -7400314 -8650677 -10320345 -9489712
7613 -9489712 -6715386 -6356241 -9452570 -11200847 -7990290 -2898150 -1057100 -2578661
7605 -2578661 -3421924 -1323590 2279063 5205898 6853326 7806319 8585219 8735892 7102393
7596 7102393 3869704 1659707 2495995 4254136 3227619 225372 406872 6173475 13812965
7587 13812965 18405608 18490661 14690758 8027283 1770155 633855 4818383 8064023
7579 8064023 4735638 -3898940 -12774609 -18739712 -20379013 -16497173 -9003058 -3719112
7571 -3719112 -3768276 -5292242 -4136813 -2921846 -5726811 -9376842 -7453259 -1060669 2170215
7562 2170215 -683361 -5124221 -7975815 -10972540 -14043535 -12927877 -7091473 -3419326
7554 -3419326 -7227507 -14425583 -17481140 -15388323 -12585246 -10657185 -6736558 410072
7546 410072 7439254 10748806 11015225 11826539 14627486 16264351 12414956 3453333 -4810836
7537 -4810836 -7613324 -6546505 -5890787 -5759280 -3140939 1504501 4340936 5268408 8976010
7528 8976010 16814216 23163108 23233441 19723469 17619067 16484630 12948663 7969963 6110704
7519 6110704 8695663 12367824 14078770 13677240 11751809 8365543 4125323 -137646
7511 -137646 -4664999 -9509018 -12603347 -11699425 -7859997 -4548818 -3522775 -3890894 -4736127
7502 -4736127 -6065465 -7262078 -7083207 -5557888 -4153178 -4047172 -5585500 -8740200 -12424330
7493 -12424330 -14353672 -13651935 -12436340 -12311608 -10638846 -3841004 6115240 12507363
7485 12507363 11669298 6459608 1042456 -4008478 -9322994 -12675330 -10830728 -4610860
7477 -4610860 577156 -121038 -6203493 -12449052 -14318395 -12630793 -12096644 -14940452 -17865717
7468 -17865717 -16995005 -13700865 -12265505 -13112837 -12771737 -10417542 -9341757 -10444124 -9434524
7459 -9434524 -3847856 1411604 309129 -5140999 -7260118 -3407939 831582 -209712
7451 -209712 -5381584 -9620026 -10245806 -8031791 -4578410 -1561837 -1362912 -5551433 -12519502
7442 -12519502 -18320353 -20178826 -18138565 -13422040 -6856911 339463 5663333 6980729
7434 6980729 4995845 2627598 1441175 -35595 -3407089 -6916712 -6781821 -1978014
7426 -1978014 4218586 8120188 9282700 9049993 7202777 2498763 -3947634 -8512069
7418 -8512069 -9233277 -8351102 -9203101 -11517279 -11477942 -6598461 706549 5329116 5055750
7409 5055750 2989064 3552446 6533900 6893723 1402008 -6324736 -9674944 -6924922 -2153963
7400 -2153963 1613473 5987281 11972222 15259895 11240810 2794605 -1955656 382613
7392 382613 5228616 7350111 6739069 5455665 3324638 151197 -1433520 358002 2257988
7383 2257988 -288089 -6668169 -12572564 -16428687 -19448999 -20083718 -14434400 -3460778
7375 -3460778 5608298 7656252 5360726 3912855 4085468 3908217 3555217 4014208 3267231
7366 3267231 -1146237 -6575735 -7082428 -1353178 5240217 7921570 8665347 12787522 21121479
7357 21121479 28089316 27666295 19983843 11337988 7904573 10160562 13806030 15020700
7349 15020700 13224494 9407737 4467798 -201283 -2972626 -3962336 -4603331 -4490527 -1630061
7340 -1630061 2859460 4112189 361781 -3200374 -1465802 2591573 1911736 -4560323
7332 -4560323 -11204068 -14177797 -14746695 -13974231 -10012819 -2530699 4870227 8881670 9449194
7323 9449194 6917393 456723 -8246022 -13723524 -12540564 -7632358 -3770408 -1166457
7315 -1166457 3052590 8786216 11945017 9130455 1152511 -7596239 -11864610 -8943768
7307 -8943768 -1322832 4689393 4404742 -1499614 -8688110 -12905921 -11934711 -6777810 -2158171
7298 -2158171 -2935504 -8163123 -11348831 -8547240 -3213613 -538926 -202064 1647969 5868330
7289 5868330 10146438 13611974 16974260 18828080 16549364 11347515 8425860 10875435
7281 10875435 16209072 19879453 19747762 16172850 10129366 2974599 -2957551 -4955626
7273 -4955626 -1656373 5286625 11404761 12869633 10332004 7607404 6315878 4929836
7265 4929836 3953534 7154309 14420674 18316357 13295066 4787823 2489465 6997603
7257 6997603 10508847 9318539 7060032 5281706 233475 -8029651 -12061101 -7699405
7249 -7699405 -1487184 -1465558 -5974248 -8030903 -6583543 -6413907 -9546456 -13687707 -17936230
7240 -17936230 -23557806 -29091928 -30301571 -25947113 -19478714 -14245190 -10395641 -6906968
7232 -6906968 -3479233 100103 3917883 7101458 9101710 11171799 14269999 16648588
7224 16648588 16323942 14516110 13174898 10600582 4064489 -3932188 -7197253 -4342396
7216 -4342396 -1164919 -3156584 -9246245 -14025774 -12748501 -3571910 10893793 22962444
7208 22962444 25062993 17657107 8703914 3992424 1987931 -493617 -2826873 -3691608
7200 -3691608 -4528386 -5742280 -3917546 2134794 6298392 2199480 -6895570 -11377082
7192 -11377082 -7497428 -584973 3459280 4088039 3132052 1628032 1283289 4274376 9224963
7183 9224963 11060163 7183377 952958 -2829396 -3224398 -2412790 -2501801 -4822014 -9687729
7174 -9687729 -14958235 -17306969 -16645260 -16627244 -19007651 -20693550 -18872381 -15657035 -13990543
7165 -13990543 -11894268 -5706693 2487246 6064473 2772699 -2257282 -3709108 -2427578
7157 -2427578 -2627978 -5821248 -10028828 -13156978 -14666940 -14754325 -13938556 -13406113 -14468588
7148 -14468588 -17362583 -20862658 -22947659 -21921618 -17457877 -10627311 -2578285 6247194
7140 6247194 14759894 20038668 19468912 14043778 7658024 2855020 -809745 -3774738
7132 -3774738 -4285563 -797272 4918659 8744852 7782896 2425694 -3931941 -6884048 -4751361
7123 -4751361 -1353610 -2760126 -9623904 -15191147 -13351773 -6145250 265837 4727818
7115 4727818 10801075 17984074 19823293 13235585 4303393 436402 358690 -2909352 -10940132
7106 -10940132 -17339108 -16547634 -10524218 -5167020 -3621032 -5069937 -7413695 -8751282
7098 -8751282 -7795506 -4819963 -1310777 2265240 6648044 10632492 10290111 3984999 -3557411
7089 -3557411 -5491207 -590279 6198994 10551783 12754465 14505036 15226412 13276462
7081 13276462 8507508 2098625 -4130433 -7035924 -3596300 4489794 9881386 6614953
7073 6614953 -2870832 -10732192 -13139223 -13354297 -15122208 -16588271 -13097900 -4422061
7065 -4422061 3297208 3300161 -4777035 -14182772 -17799779 -15532045 -13872957 -17763840 -24697487
7056 -24697487 -28292167 -25738870 -19141644 -11046465 -2387992 5390936 10194494 12378725
7048 12378725 14776311 18124029 19243495 15476783 8451132 1612441 -3596205 -6963907
7040 -6963907 -7171730 -3079841 3584803 8875913 9492824 4533025 -3538055 -8914962 -6827676
7031 -6827676 -34199 2536540 -3233899 -10555777 -10857015 -5434142 -1915110 -1789207 375882
7022 375882 5542551 7201521 2831516 87445 5625224 13723922 13470031 3981189 -5080961
7013 -5080961 -6909015 -4134283 -1556304 696698 4125073 7489189 9285891 10778518
7005 10778518 12502439 10631864 1662921 -10519267 -17151482 -14610066 -7880727 -3083015
6997 -3083015 -729376 1301266 2129096 -344223 -4066941 -4376405 -963764 1217202 -986479
6988 -986479 -5167180 -8329774 -11140286 -14067737 -13459582 -6510109 2302074 5468932 2456707
6979 2456707 -22486 1932680 4588022 3486145 211565 -719863 1826440 5471778
6971 5471778 7950332 8282281 6640248 5294451 7194699 11420666 13061546 10341323
6963 10341323 8320766 11395498 15275222 12131860 2248173 -5618835 -5785351 -1861055
6955 -1861055 117049 -313275 167994 2419913 3873796 2307488 -1749875 -5578599 -6131909
6946 -6131909 -2480337 2963155 6921977 8848912 10025897 9786426 6553942 3129797
6938 3129797 5832497 15500826 23768707 22765696 15447756 11019697 11942853 11588138 4990369
6929 4990369 -3896931 -7854898 -5074025 504654 4434792 4541356 772959 -4627248
6921 -4627248 -7874980 -6950753 -3506638 -6481 3510163 7658901 10257713 7897353
6913 7897353 806331 -6702134 -11063618 -12301453 -11496914 -8138497 -1668374 6067475
6905 6067475 11872730 14164071 13856825 12974877 13174636 14811640 16558517 16533950 14399443
6896 14399443 11693392 9938594 9606440 10904933 13345066 13914653 8842383 -546050
6888 -546050 -6500731 -2947254 6658968 13354087 13488499 11225495 10594514 10286366 8035089
6879 8035089 5602213 6157744 9459626 12724756 14461521 14669567 12597470 7077031 -1227598
6870 -1227598 -9570818 -14910762 -15619275 -12889390 -10751296 -12224906 -14675658 -12155998
6862 -12155998 -3773903 4100601 6354971 5473753 5478504 4082750 -2816355 -11722710 -14296500
6853 -14296500 -9077557 -3105013 -852992 1254852 6696263 11800294 11219710 5905226
6845 5905226 1178553 -3147 1881505 5569341 8869362 8426997 3594642 -1311959
6837 -1311959 -1993455 661707 3625892 7078608 12061673 15036009 10673345 -120201
6829 -120201 -10055203 -13763276 -11890295 -6866472 116731 6625427 8763323 6246389
6821 6246389 3778741 4589744 6183900 5443589 4062844 4628602 4427597 -1238432 -10724749
6812 -10724749 -16534272 -14551586 -8201725 -2592766 898346 2496244 1061050 -3380740
6804 -3380740 -7205797 -7030761 -4161368 -1869665 72627 4214428 9704694 12138374
6796 12138374 9600772 5119803 2075852 485828 -847853 -1689179 -1743045 -2085292 -3365777
6787 -3365777 -4795655 -6243118 -8488689 -9989035 -7332487 -1579685 187207 -6010657
6779 -6010657 -14167475 -16145798 -13257862 -12849203 -15129432 -12186327 -1302107 9050912
6771 9050912 9991370 2431500 -7374457 -16268862 -23089392 -24545758 -18897357 -10791402
6763 -10791402 -6295884 -4932433 -2108746 2243217 3465799 106755 -3704986 -4511825
6755 -4511825 -3340650 -2138946 -588864 1851124 3885355 4077753 2621386 606543
6747 606543 -669902 441177 4573747 9687020 12840166 13436854 12515203 9496382 2800573
6738 2800573 -6194801 -12897499 -13962089 -9984042 -3955674 548644 378951 -4489872
6730 -4489872 -9215357 -8526168 -3249561 931908 1338514 925528 2548206 5151522 7257890
6721 7257890 9871017 13305404 14587708 10988210 4004116 -2148751 -4080350 -540869
6713 -540869 6602012 11837476 10711974 6768640 9021690 19689180 29262421 27785235
6705 27785235 16735145 5007912 -2775644 -7942521 -10834987 -9337606 -3660534 3347657
6697 3347657 10560960 18119781 23058419 21107935 13432321 6302076 3081853 1407841
6689 1407841 -793588 -1876528 -804471 423025 1346487 5158238 12780604 19151476
6681 19151476 19691219 17078740 16744668 17953315 14757037 5242293 -5073306 -9923203
6673 -9923203 -8770668 -5442113 -3202896 -2926429 -4287137 -6715128 -9424299 -11483660
6665 -11483660 -12111887 -11153272 -9742216 -10174740 -14148934 -20852030 -27226257 -30119955 -27831578
6656 -27831578 -20123384 -8209388 4560132 13119468 13754782 7713561 922061 -1387085
6648 -1387085 -48010 -916484 -7979359 -18496837 -25660996 -25044098 -17609131 -7797820
6640 -7797820 -411685 1567522 -1493369 -6081381 -8594545 -8396022 -7166010 -6242575 -6237100
6631 -6237100 -8140897 -12115207 -15555970 -15364245 -12414523 -10667522 -11031752 -9438999 -2906964
6622 -2906964 5266627 9002026 6472127 1248907 -2375519 -2869412 -980650 1869611
6614 1869611 4357324 5579083 5013289 2380858 -1508430 -3897757 -1964472 3727386
6606 3727386 9342253 11981211 11832726 9666072 5229385 -251072 -3123834 -1561965
6598 -1561965 1725918 3891923 6407148 11286303 15085013 11849267 1816811 -7466939
6590 -7466939 -9619065 -5583730 -771233 522463 -2963949 -9595251 -15207611 -15788072
6582 -15788072 -11292443 -5320672 -901374 1227384 852286 -1283573 -1204284 4993594 13754422
6573 13754422 15435858 6972151 -1480516 1613288 13382530 19439809 12383148 768945
6565 768945 -2714212 3310082 9630639 9641103 6467078 6663465 11040557 14336609 12205730
6556 12205730 5680689 -1105949 -4940469 -4367389 756405 7987873 12254638 10593680
6548 10593680 6657627 6879524 11435779 12735891 4870878 -8506231 -18343544 -19825542
6540 -19825542 -15048648 -8418220 -3255207 -1836718 -4504589 -8027249 -7797926 -2645589
6532 -2645589 4263095 9254572 10732719 8290675 2484106 -3496394 -4764401 551869
6524 551869 8830432 14664079 16119540 15232211 14360776 13675745 12193219 10056470 8846879
6515 8846879 9458909 10458004 9816039 8102638 7959776 9861189 11049927 10268038 10344529
6506 10344529 12886687 13528010 7749493 -295546 -1534780 4861619 9023548 3901921
6498 3901921 -4980508 -7871950 -3797863 866555 3473319 7508029 14484702 20054719
6490 20054719 19976205 15579262 11427978 10697998 14191708 20673893 26223223 25927161 18807182
6481 18807182 9808061 5020697 5745310 8437010 9182376 6536676 1070117 -5298164
6473 -5298164 -9191439 -7469553 -1108453 3565249 395116 -8803263 -14445072 -9737140
6465 -9737140 632824 6093781 3789492 1544868 5978712 13177958 15039713 10508860
6457 10508860 5136076 2373924 1488787 2520356 6341290 9461342 5688869 -4689910
6449 -4689910 -12982905 -12440607 -6122245 -1319206 -216774 169055 2080485 5223507 8765410
6440 8765410 11400809 10912985 6802560 1999312 -718594 -2386974 -5260283 -8393340
6432 -8393340 -8928101 -6415908 -2936131 -130213 1374532 1328158 1363435 4951800 12522899
6423 12522899 18892498 19515912 17043112 16877083 18289526 15908618 8977138 2543286
6415 2543286 -671325 -2848159 -4571216 -2966647 1178337 1511419 -4441185 -9807676
6407 -9807676 -7375512 711961 7488867 10993170 13541245 14893556 13218607 10707568
6399 10707568 10935676 11556382 7123460 -408493 -1852041 5863114 13400519 10836072
6391 10836072 1036961 -4396809 -106834 7783866 11209166 9932242 9570949 12712298
6383 12712298 15608912 14175860 10505023 10391022 14786021 17650659 14454012 9308330
6375 9308330 9299156 13689389 14461362 7885662 -41921 -1753196 2987700 9199005 13638584
6366 13638584 15881802 15489878 12378523 8355963 4673995 -442230 -8239787 -14947634
6358 -14947634 -15150212 -9227147 -3444845 -2450651 -5097324 -7793416 -8375955 -6213175 -2155770
6349 -2155770 565446 -1320967 -6669213 -10663397 -10829716 -9033950 -6791266 -3044681
6341 -3044681 1348919 1626795 -4570063 -12345968 -15200733 -12789941 -8765440 -3803517
6333 -3803517 3489008 10556430 12639911 10747455 11234704 15755079 17943051 13292223
6325 13292223 6798469 6222051 11842692 17916602 21231858 22753999 22789838 20382080 16949928
6316 16949928 15116980 13800318 9705417 4257202 3317504 8172509 12489317 11551263
6308 11551263 9383492 11906015 17042293 17726275 12514994 6673535 3211356 -519902
6300 -519902 -5860442 -8463877 -4172343 4768258 12748263 17048140 17934067 15544125 10790624
6291 10790624 7398800 8461429 11425258 10483944 4189627 -2645828 -4938657 -2086643
6283 -2086643 3469142 8760836 10380841 5922365 -2246988 -7323455 -4825687 2566469
6275 2566469 8715146 10475722 8323500 2961779 -5202086 -14131302 -20859182 -24017660
6267 -24017660 -23687121 -19823403 -13545724 -8864553 -9333779 -12852267 -13337354 -8241197 -1047337
6258 -1047337 4590230 9307150 14419962 17240861 13634260 3974391 -6359832 -12126790
6250 -12126790 -12263950 -9729617 -8938100 -12317702 -17677849 -19833173 -16286041 -10160829
6242 -10160829 -6091721 -4979051 -4985882 -5772531 -8316888 -11474352 -12493866 -11098819 -9748115
6233 -9748115 -9477648 -8811777 -7439727 -7241965 -8075970 -6176424 452537 7650453 9337679
6224 9337679 4769401 -1096840 -3299758 -485534 5782429 12160756 14564252 11295738
6216 11295738 5498240 2178568 2845661 5448326 8993100 14463020 20614350 23152355
6208 23152355 20376778 16127565 13899874 10900775 2325037 -9918032 -17709342 -16508636
6200 -16508636 -10625898 -7315521 -8787930 -11790160 -12330147 -8673897 -1970178 3651598
6192 3651598 3573751 -1823417 -5617413 -1623215 7437380 12502668 8935472 1132069 -4407041
6183 -4407041 -6638906 -8053057 -8252677 -3728670 6178285 16332696 20079099 15266609
6175 15266609 5623678 -2717597 -5702407 -3599247 138542 2311069 2618785 2958767
6167 2958767 4440792 5863667 5513434 3909598 3764064 6738540 10842331 12112497 9006629
6158 9006629 4107153 1034898 792096 1889432 2715344 2418554 742661 -1136094 -746611
6149 -746611 2437336 5055089 4052515 1658826 2197288 4606214 3485281 -1594439 -3898231
6140 -3898231 603270 6996948 9375729 9591575 12031557 14228806 10658984 3375283
6132 3375283 -42857 1120469 -641558 -8284128 -14740028 -14032831 -10221717 -9810062 -11525739
6123 -11525739 -10433668 -7619207 -8026915 -11020634 -10812238 -5973307 -1670583 -1471851 -2806584
6114 -2806584 -2248008 -104457 2530994 6523587 11207514 12040510 6005408 -2839490 -7301148
6105 -7301148 -5428053 -1319396 1506396 3270911 4265847 2793572 -858741 -2048799
6097 -2048799 2880652 10851988 15587061 15947063 16420037 19045989 19516931 13422861 2719003
6088 2719003 -6931964 -12557315 -14658993 -14202215 -12455921 -11801455 -12667125 -11272590 -4916407
6079 -4916407 1772593 1271745 -6283042 -12672566 -12792668 -10753476 -12674553 -18464359 -23785878
6070 -23785878 -25965362 -24656384 -20312262 -15441196 -14100703 -16574066 -17453313 -12563314
6062 -12563314 -5032410 -882230 -1390492 -3765991 -6579152 -9802042 -11600586 -10237175
6054 -10237175 -8117902 -9308197 -13646046 -17316834 -18265248 -16848157 -12264146 -3297210
6046 -3297210 7460281 14552768 15244132 11052250 4750722 -398170 -315419 5461397 10054746
6037 10054746 6298585 -2601233 -6401913 -2750802 -1050483 -8328376 -18536338 -21302412
6029 -21302412 -16050270 -11063268 -11491381 -14428506 -14832082 -11046885 -4021829 4987744
6021 4987744 14264450 20857587 21525934 15199788 5004166 -3233536 -6370409 -7101115
6013 -7101115 -9391209 -12032940 -10624196 -5212526 -779759 423083 1418302 3841501
6005 3841501 4685198 2526801 1265334 3691763 6471647 6093922 5034921 6760406 8972098
5996 8972098 7818357 5053372 4406833 4063530 261235 -3814419 -1039376 8133117 15127795
5987 15127795 15079996 11853693 9722013 7427748 3543412 1225477 3350396 7609003
5979 7609003 10440983 11957460 13177860 12043984 6548013 -645514 -4702016 -4095673
5971 -4095673 -575516 4237364 9041760 11847376 12431934 13918849 17866853 19448187
5963 19448187 12569844 -523671 -10054684 -10311925 -5627439 -2480234 -297127 5475633
5955 5475633 14008136 18498955 14980271 6947976 -187495 -5193970 -9144221 -11183706
5947 -11183706 -10330359 -9299894 -11387409 -13837967 -9674987 2263165 13852583 17228094
5939 17228094 13996266 11074115 10472106 8425914 3286554 -1534290 -3428287 -4627467
5931 -4627467 -8052493 -12295482 -13423929 -10139359 -5077820 -1960017 -2821067 -7060804
5923 -7060804 -11927357 -14580649 -14588702 -13890969 -14034775 -14585926 -14705908 -14708786 -14846416 -13774097
5913 -13774097 -9937905 -4151729 627338 2252197 1216846 -562694 -1871291 -2639815
5905 -2639815 -3037975 -3135367 -3358242 -4138450 -4595225 -2669379 2306057 8010308 11648079
5896 11648079 13433066 15540012 17865316 17442293 12709914 5986356 668496 -2051659
5888 -2051659 -3024506 -4128738 -7993587 -15376922 -21564291 -19488584 -9014756 941819
5880 941819 3143161 900596 1577552 5231808 6477616 5255671 7643495 15643515 23573178
5871 23573178 26418651 25341009 22519370 16864052 8629047 2910002 3590113 7279352
5863 7279352 7928926 4937093 2267973 1570328 1000482 202923 1906212 7590374 14498721
5854 14498721 18275834 17134275 12761918 8320466 6379466 8127224 13109838 18507654
5846 18507654 19219123 11415033 -2165255 -12539219 -13062194 -6640125 -1493678 -933849
5838 -933849 -1030743 2365418 8683033 14706090 17204402 13289360 2974000 -7889275
5830 -7889275 -12320818 -11101810 -11682038 -16742117 -20071439 -16753196 -11128439 -9988894
5822 -9988894 -13046658 -15480655 -15761088 -15410553 -14414170 -12460904 -11965410 -14364032 -15751675
5813 -15751675 -11573014 -3631167 2693950 6067784 8764863 10917165 11229665 11775798
5805 11775798 15689468 20837422 21889542 18323886 14529971 12297387 9312346 5201629
5797 5201629 2793149 2589659 1915956 515366 1080999 3036771 1979897 -2712009 -5665845
5788 -5665845 -3530622 180002 1170693 258576 -76422 -441352 -2172642 -4015321 -4668887
5779 -4668887 -5402631 -6994190 -7257005 -4746925 -1900645 -1341244 -1862815 -1168625 51448
5770 51448 -115066 -1262625 -1685499 -811472 1574802 5877845 10302141 11200686 8499947
5761 8499947 7275054 10593497 14268638 12812488 7583696 4439866 5690372 9124038
5753 9124038 13007185 16839600 18312847 14903616 8638515 4811220 5366731 7022774
5745 7022774 6202036 2653559 -1827652 -5101381 -5053810 -1319795 3235495 5384597 5491825
5736 5491825 5764253 5428926 1563362 -5318090 -10677756 -11891488 -11116298 -10880447 -10169994
5727 -10169994 -6980814 -2375321 324601 -552992 -3209161 -4008382 -878669 4048300
5719 4048300 5795568 2032094 -3601269 -5639701 -3334946 -485515 416133 598190 1738000
5710 1738000 3533895 4793240 4111856 -213009 -7448850 -12001436 -8464423 63596
5702 63596 3718505 -1888787 -9606917 -9859503 -2056480 6441042 9488062 6514011 407124
5693 407124 -4616123 -4476149 1315426 7902255 9631262 6026089 1232845 -1260578 -895638
5684 -895638 1674888 5537647 9091441 10934725 10877567 8815303 4262196 -1125788 -2953584
5675 -2953584 835243 6137044 7482792 5005464 2628047 931605 -2922777 -8479573
5667 -8479573 -10823994 -7543759 -2344794 131609 -489692 -1838469 -2091218 -288397 3255149
5658 3255149 5493404 3138001 -2103157 -4813470 -3955633 -4897755 -10776061 -16868808 -17568663
5649 -17568663 -14504359 -12749292 -12599448 -10828310 -7487392 -5362522 -4148289 -1088159
5641 -1088159 3299905 5728409 5994460 6893146 8503359 8203154 6471283 6593850 7799732
5632 7799732 5058100 -2518070 -9315999 -11770822 -13060741 -15892738 -16889126 -13146375
5624 -13146375 -9030358 -10192989 -14564389 -15912881 -14024384 -14564635 -19496616 -23804763
5616 -23804763 -22433313 -15631583 -6388399 3417023 12825692 20481259 24782635 24300529
5608 24300529 18835854 11733638 9141781 13529111 19106828 17511549 7586389 -3914832
5600 -3914832 -10521525 -10890579 -6220612 1879079 9869934 13341884 11854570 9613129
5592 9613129 9584594 9661673 6104075 -1788188 -11614900 -19831697 -22712328 -18345134 -9315848
5583 -9315848 -1065975 3671361 6508651 8805397 8739000 4705728 -1192510 -5210985 -5603633
5574 -5603633 -2876594 1368280 4672162 5289688 4640936 5482632 6836587 4541122 -1628365
5565 -1628365 -6046709 -5607127 -5641246 -12652829 -23954076 -29912584 -25481338 -14900439
5557 -14900439 -5426913 -758387 -939252 -4686341 -10079235 -14910469 -17400204 -16008449
5549 -16008449 -9633233 233071 8825590 12242995 11682530 11139944 11729565 11320448 9352881
5540 9352881 8215743 8761598 7628741 1271614 -8890136 -17385643 -20283521 -18438836
5532 -18438836 -15221056 -12492206 -10095240 -8728560 -10722691 -16140833 -20028348 -16937840
5524 -16937840 -7786706 1199535 6200339 8292210 8117204 4001148 -2248581 -3900305
5516 -3900305 1504280 6457732 3062586 -5471771 -9804111 -8115096 -6746324 -8362840
5508 -8362840 -8357137 -4450209 -1577426 -3580644 -6552563 -5015087 56244 3946460 5208611
5499 5208611 5372317 4504913 1863972 -540702 575595 4982751 8679059 8289864 3728562
5490 3728562 -2575858 -6789762 -5065366 3058664 12369331 15576169 10327735 1520441
5482 1520441 -4101357 -4892211 -5061505 -8662682 -13933952 -15091639 -9902734 -3279891 -1409624
5473 -1409624 -3946559 -5145814 -2053617 2291648 4403496 4995620 5943490 6052541 3401920
5464 3401920 56675 401756 4606007 7016416 2850597 -4992379 -8121871 -2267492
5456 -2267492 6938402 10045775 5413075 1403765 5168612 12818110 15126539 10741141
5448 10741141 7328307 9141749 10264440 3787644 -7408130 -14376827 -13993566 -11680146
5440 -11680146 -12837027 -16387786 -17953267 -15858700 -11784651 -7400904 -3060531 127319
5432 127319 -693701 -6789649 -13931979 -14930817 -7947260 121044 1588217 -2539682 -5059455
5423 -5059455 -3157353 -951023 -1254069 -1155216 1797886 4790312 4880820 3941464 3826305
5414 3826305 1216340 -6599257 -14115021 -13062140 -4386794 2192389 1062582 -3198625
5406 -3198625 -4132136 -1775819 431432 2423191 6649999 12613042 16403853 15664831 12534058
5397 12534058 10999054 12260567 13337657 10676711 5193348 2301541 5393371 10450430
5389 10450430 9759098 963772 -10012247 -15552581 -13776601 -8835220 -5770929 -5955039
5381 -5955039 -6256938 -2266912 6427509 14295743 14914873 7754564 -2160595 -10712587 -17277670
5372 -17277670 -20616692 -17070429 -5914550 6871671 14272184 15987644 16783565 18387042
5364 18387042 17432828 11551635 3231871 -3703778 -7937772 -9189850 -6381206 -352291
5356 -352291 4019680 2402229 -2995461 -5549551 -2417545 2665005 5342283 5937348 7059645
5347 7059645 8771747 8846554 6418698 3084304 1160791 2294480 6362468 10140271 9092391
5338 9092391 3031433 -1938551 -551573 4025272 3998997 -2209975 -7747326 -6652719 -753079
5329 -753079 4434589 6352339 5456875 2532980 -645871 -883575 2499761 5221420 3026534
5320 3026534 -2242437 -4832024 -2299296 2572664 6260675 7660170 6989347 4650861
5312 4650861 1849784 289512 582538 1923854 2952529 1915523 -2730649 -9772962
5304 -9772962 -14143240 -10985969 -1087893 9454169 15046755 14761437 11185094 7079119
5296 7079119 3561629 430598 -2208752 -2791879 107674 4659063 6319068 3190871
5288 3190871 -809178 -466014 3970419 6892939 3990376 -3063947 -8692642 -9078605 -5698819
5279 -5698819 -3354982 -4036751 -3564338 3068758 13276399 18103529 13511077 6031609
5271 6031609 4151533 8226377 13054663 16465301 19701639 22083123 21745623 20397022
5263 20397022 21099143 21946988 18308413 11495656 8734900 13243420 20174110 24027290
5255 24027290 24475635 22958145 19393857 15202786 14085616 15956070 14786328 6790922
5247 6790922 -3237290 -8379311 -8843150 -9413305 -10327756 -7237504 -81755 4047781 -721883
5238 -721883 -11243305 -18467946 -16813666 -8572275 155632 5943264 9835122 13864832
5230 13864832 17706514 19481896 18322666 14529203 8380145 986182 -4570455 -5876752
5222 -5876752 -4891276 -5970846 -9633699 -11294159 -7524991 -1058090 2357556 672945
5214 672945 -2477197 -2029383 2905583 7689818 7188908 2407152 -328717 1641871 2907017
5205 2907017 -1359513 -6050909 -2514754 7248915 11423439 4878798 -3493751 -3688555
5197 -3688555 2458947 6585343 6172108 5006542 5157726 5364470 5720234 8140277 12582128
5188 12582128 16815317 19150287 18380129 13020633 4282311 -2226270 -1873346 3446597
5180 3446597 8772049 12810010 16685639 18217025 13487203 3837370 -4111943 -5948841
5172 -5948841 -2596742 3845468 11965212 17839503 15806475 5605976 -4980706 -7757012
5164 -7757012 -1973602 7514562 16780291 24174529 27521524 24677935 17293476 10545989
5156 10545989 7491407 5823080 2330815 -951461 1539072 10511591 18645240 18480608
5148 18480608 11273364 4476864 1938897 1234533 351266 1284560 5194113 9318518 11963871
5139 11963871 15937939 22712738 27056788 22929589 12356650 2914629 -2162400 -5633687
5131 -5633687 -8566272 -7322289 -19662 8845723 13165421 11865980 8464477 5983209
5123 5983209 4596665 3405860 2579754 3188145 5117801 5678766 1652561 -6457938 -13571666
5114 -13571666 -14944171 -11085492 -6340738 -3491250 -1541552 1529190 5423969 7288042
5106 7288042 4602279 -1376024 -5778484 -5351687 -2711039 -2609965 -4716671 -4346516 -326212
5097 -326212 3582678 6479586 12732668 22973804 29466066 26343426 18885952 15498671
5089 15498671 15121087 10989825 3472628 -592373 -94742 -1143579 -5382981 -6285859 -144937
5080 -144937 7189556 8686273 5086114 1372026 -582875 -1663710 -1889134 -1138372 -604794
5071 -604794 -604838 292912 1977349 2263563 1758533 4783435 12066066 16761567 12568031 3031329
5061 3031329 -2495539 -986427 1292653 -1555124 -6897611 -7602305 -1936291 3973689
5053 3973689 4101317 258285 -857806 2781568 6296813 6440765 7390721 13800593 21710417
5044 21710417 22452697 14324329 4447186 -876335 -1978251 -1460483 140000 2407542
5036 2407542 3605327 3545866 4231793 5934078 6312821 4905605 4467418 6068235 6991711
5027 6991711 5814835 5623135 9206309 14252799 16531143 15675431 15037816 17266469 22063973
5018 22063973 27180787 30347599 31140219 31077753 30617995 27220016 19196170 10347528 6747510
5009 6747510 9266495 13439614 16366421 18834806 20524648 18741895 13283779 7663071
5001 7663071 4108973 1791722 584575 1313580 1780019 -1063696 -3835824 1035806 13376891
4992 13376891 23169728 24068196 21408717 21698235 21630740 14913923 4468303 -685821 1987607
4983 1987607 6597698 8273621 8049298 8306596 8664014 7791199 6567710 8274441 15707678
4974 15707678 27007130 35039995 34207432 27726905 23758096 24177988 22999609 16927787
4966 16927787 10522078 8305417 8798905 10001103 13626110 19113736 20339725 14262958
4958 14262958 6949845 4840514 5493284 3355834 -658441 -2402194 -2509126 -3667433
4950 -3667433 -3694087 1179404 8774480 13169876 12019688 6730857 -690666 -5847660 -2452961
4941 -2452961 8640359 16261866 12555454 4760453 4794286 11892422 15455104 11290783
4933 11290783 4259139 -2608366 -10079992 -14588575 -9642877 2984897 13047272 14955361
4925 14955361 13043938 11985209 10177190 5890466 3288059 7912799 19382607 31092789
4917 31092789 35790412 31633790 24251474 21160783 22946582 23582631 20754603 19497423
4909 19497423 22510180 24883538 23873920 25319113 32664439 38002944 33691737 25617154
4901 25617154 24484031 30361680 36271182 40373012 43646006 42611523 36227024 32830987
4893 32830987 38017463 43496654 40616716 35235493 34882939 32916822 23002278 16699769
4885 16699769 25569860 38678407 42161834 46897631 67235746 87445319 86625083 83251973
4877 83251973 109049013 150018298 172041383 200093535 293078499 418223977 435797340
4870 435797340 268297951 23773871 -122058183 -126580085 -88360573 -85585354 -97457566
4863 -97457566 -85901367 -66405484 -65622438 -70886016 -60995110 -46096181 -42739042 -40846651
4855 -40846651 -26503411 -12144406 -15064813 -26146865 -26750680 -20360943 -22535017 -32396313
4847 -32396313 -37216350 -35482642 -34821232 -34812762 -30155812 -24504238 -25055502 -28839162 -28167337
4838 -28167337 -24145177 -22564879 -22536487 -20760292 -20590478 -25503825 -30077364 -28576991 -25891074
4829 -25891074 -28769924 -32925705 -30517134 -24159699 -21418779 -21091507 -17491593 -13480609
4821 -13480609 -16130897 -22760835 -24242019 -20436884 -20073063 -25638351 -29642911 -26872629
4813 -26872629 -20972820 -17460013 -17617160 -20136303 -22646578 -21551192 -15622553 -8996889
4805 -8996889 -6230952 -6691294 -8141464 -11723152 -17630955 -20656878 -17517726 -14402223
4797 -14402223 -18749260 -26864873 -28771180 -23024912 -17445759 -16374466 -16294772 -13992381
4789 -13992381 -10868532 -8702616 -7976747 -10149248 -15138706 -17688099 -13203198 -5827641
4781 -5827641 -3186283 -4578297 -2856067 2920015 6054736 3686569 257434 -1740724
4773 -1740724 -5094577 -9612769 -9791733 -4561148 -1155688 -4485828 -9514088 -9326118 -5051572
4764 -5051572 -2439664 -3084857 -4274155 -4293736 -3223977 -761931 2785277 4761390 2296246
4755 2296246 -4589707 -13079938 -19261842 -19721133 -14215050 -6932414 -2006992 1848068
4747 1848068 7966651 13317654 9696528 -4447051 -18876347 -22160904 -14082936 -4225433
4739 -4225433 -812703 -3883109 -7619823 -6879721 -2156211 1077833 -1180514 -6588659
4731 -6588659 -10249113 -11522770 -12864226 -13523115 -10567311 -5921298 -5226551 -8284982 -7982824
4722 -7982824 -1610056 3862889 1975500 -4241058 -8467011 -10229746 -11779300 -11148340
4714 -11148340 -5685019 952168 2679950 -119086 -2118980 -1760989 -1949651 -3229961
4706 -3229961 -2878591 -591037 991135 1636808 3768058 6974211 7744556 5252704 2079754
4697 2079754 -1328994 -6992460 -13011989 -13362198 -6862395 -617480 -865036 -5396456 -9188253
4688 -9188253 -12640367 -18490431 -23992252 -23007531 -15135617 -7059020 -4422945 -6949939
4680 -6949939 -12049824 -18486093 -24721527 -27688274 -26167106 -23147626 -22246266 -23244843 -23469689
4671 -23469689 -22383101 -22065272 -23245737 -23428024 -20113087 -14387974 -9698105 -7517699
4663 -7517699 -5914421 -2863619 625117 2271265 2451473 3848694 6938990 8745110
4655 8745110 7783464 7600457 12258232 19876360 24496106 23939890 21762081 20879524 19544255
4646 19544255 15387970 9538953 4043684 -1428359 -7030573 -9834409 -7411254 -2133431
4638 -2133431 2091977 5214151 8528157 9028486 2759608 -6698904 -10378586 -6338821
4630 -6338821 -3235708 -8098285 -16370145 -18852533 -14022750 -7928239 -4993136 -4828708
4622 -4828708 -6441983 -9765103 -13254785 -14806610 -15062672 -15449796 -13259851 -4153772 9217522
4613 9217522 16609700 11607913 89966 -6498996 -4102390 1540678 4053839 3338991
4605 3338991 2462380 1786714 -400232 -3171781 -3118445 -3995 1490031 -1607485 -4946525
4596 -4946525 -2153497 5430172 9439683 5604239 -891548 -3232892 -1371798 642465
4588 642465 1271549 845519 -2128864 -8396286 -13819119 -13544313 -9137979 -6019780 -4727159
4579 -4727159 -970085 5587748 9295461 6767374 1027352 -4695574 -11021647 -16977385
4571 -16977385 -16845981 -8068207 1994195 3458337 -4129917 -12789431 -17358914 -19801047
4563 -19801047 -22618080 -24130299 -22264316 -18534635 -15319500 -11800706 -5427507 3870910
4555 3870910 13212930 19969229 23634938 24534025 22327322 16895688 10153880 5497571
4547 5497571 4590359 5491431 5270013 4026422 4456317 7250360 9232474 7434086 3344975
4538 3344975 1327372 3787377 9447985 15295959 18271282 15924005 8186204 -890335
4530 -890335 -5122156 -1210832 8563997 18500722 23361349 20711955 11778535 1049442
4522 1049442 -6544076 -9517330 -10189902 -10431684 -8718797 -3361965 2713021 3787991 -1508054
4513 -1508054 -7797467 -9139338 -5254726 72616 4026880 5307839 2343011 -4257448
4505 -4257448 -8541307 -4254304 5891729 11337982 6462894 -2629705 -7440969 -8306143
4497 -8306143 -11103941 -16529245 -19532274 -18097942 -15693304 -14422861 -11971961 -7275616
4489 -7275616 -3987299 -5431533 -9866796 -13423664 -14658643 -13913818 -11423663 -8854673
4481 -8854673 -9796342 -15334077 -21105585 -21956803 -18078089 -13667202 -11059135 -9499547 -8667576
4472 -8667576 -9584115 -11800987 -12930199 -11838821 -9772497 -7377492 -3215644 2962371
4464 2962371 7626551 7152569 3584500 3532060 10021514 17733456 18670319 11320128 1454708
4455 1454708 -5502123 -9274585 -11448289 -11787089 -10473071 -10464244 -13652611 -16889653 -16037486
4446 -16037486 -12438770 -10868957 -12081072 -12385649 -10418554 -8942619 -9038951 -7796666 -3675387
4437 -3675387 618683 3019649 5316520 8407464 8627234 3043652 -4570235 -7569054
4429 -7569054 -4639814 -337596 1433621 887628 -128909 -807441 -1238456 -1686220 -2315653
4420 -2315653 -2661570 -1821883 163342 2194486 3990048 6566532 10144407 13338551 15118038
4411 15118038 15610885 14566826 11619993 8447541 7291169 6791213 3661632 -412347
4403 -412347 750268 7720275 12060045 7935859 1460037 1566963 5881862 4239127 -5556762
4394 -5556762 -14307361 -14325364 -7990822 -1533338 2786562 5022003 3634330 -2303339 -9869448
4385 -9869448 -14705220 -15407465 -14189995 -14889533 -20516076 -29843640 -36075817 -32684704 -21765539
4376 -21765539 -12812638 -11595321 -14185220 -14173062 -11420341 -9830563 -9960736 -9124830 -7430942
4367 -7430942 -8376559 -12747591 -16109138 -14233337 -8293588 -2560556 1135989 4024710
4359 4024710 6360114 5942414 1681299 -3766651 -7081959 -8606868 -10875568 -13525423
4351 -13525423 -13269804 -9732419 -7636205 -10827509 -16876159 -20585401 -20770194 -20044409 -19234401
4342 -19234401 -16103924 -9801889 -3125875 724995 1412871 601583 -386216 -1076178 -1030366
4333 -1030366 605188 4488088 9431931 11784574 8671382 2535273 -361959 2396757
4325 2396757 6260692 6626971 5321169 6257368 7818240 5054505 -2106035 -8430038 -10526355
4316 -10526355 -9178150 -5149088 1433552 7388459 8602257 7157676 9960394 17886109
4308 17886109 22631271 18262865 10449455 9054464 15353354 21992828 23166158 19388473
4300 19388473 13194110 5258832 -4173212 -12985107 -17585083 -14980143 -5206477 7344851
4292 7344851 16383910 18888780 16768374 12904390 8090297 3272855 1510978 4453183
4284 4453183 8987427 11027934 11355513 13851893 18336804 19190100 12265591 393026
4276 393026 -9510656 -13006600 -10544950 -5103023 269999 2728617 -259842 -9022371
4268 -9022371 -19693071 -25717997 -23092160 -14281349 -5991294 -2811331 -3646715 -4184212
4260 -4184212 -1728974 2644210 5761746 5622787 3313144 1653046 1757075 1640204 -1008153
4251 -1008153 -5360583 -7844124 -5745283 88946 5532659 6120911 1422196 -3085659
4243 -3085659 -1085070 6427279 11296835 8831922 4564714 6354098 12914239 15890814
4235 15890814 11798385 5715812 3089477 3784765 5581269 8399473 12734714 17438333
4227 17438333 20963056 22437925 21141868 17816818 16092191 18582177 21710157 19077601
4219 19077601 10383155 2202039 -698763 304011 2854767 7296126 13093713 16834699
4211 16834699 16553079 14083192 11385384 8804363 8042029 11292069 15544650 13791701
4203 13791701 4864218 -3525220 -4800584 -1076940 2812928 7011659 13533057 20245095
4195 20245095 23321214 22627524 20409695 17294708 12949637 8114161 3643347 384954
4187 384954 852284 6469123 12598023 12636475 8193447 7574245 12438422 15314751 13629591
4178 13629591 15331235 24364004 31064436 25848215 14014004 7524836 9062569 13374641
4170 13374641 17791655 21964361 23109138 20676911 20243069 24826630 29223974 30662419
4162 30662419 35755748 47236597 54408482 49073111 40505669 40820578 46464856 49730510
4154 49730510 55980865 70228069 79988441 75426494 73404807 92544033 118570398 133621371
4146 133621371 168070040 265644472 387920374 416492308 288396452 85867718 -53953049
4139 -53953049 -87986329 -78712415 -83399351 -94453702 -88263007 -73182976 -66409521 -62174209
4131 -62174209 -49003672 -34580848 -31303644 -34020053 -31024881 -24541954 -23862028 -27921832
4123 -27921832 -29306456 -28217907 -29706976 -32436806 -31050218 -25865696 -21859534 -21549862
4115 -21549862 -24978272 -32049705 -39400289 -40480211 -34315131 -28277505 -26563788 -22732836
4107 -22732836 -10643396 3796657 10286172 8440169 5656255 4700905 2692277 -78474
4099 -78474 253993 3349201 4891337 4788258 7264757 11722524 11173186 2564827 -7528080
4090 -7528080 -11229019 -8883140 -6385897 -6197300 -5351035 -1360751 3477563 4499463 -127373
4081 -127373 -7528084 -13292354 -15947243 -17513345 -19762431 -21650110 -21550744 -20315811 -19844605
4072 -19844605 -19422808 -16124079 -9116660 -1335850 3927692 6282083 6951928 5894707
4064 5894707 2273087 -2624818 -5251181 -3847782 -1537134 -3631736 -11837075 -22605129
4056 -22605129 -31541175 -37496220 -40971445 -40533189 -34009403 -23096154 -13551012 -9295591
4048 -9295591 -8354931 -6518522 -3718043 -4450427 -11855997 -23059090 -31066150 -30635853 -22110585
4039 -22110585 -10417915 -1115114 3028087 2855715 1168449 32198 -954074 -3822857
4031 -3822857 -9338137 -15167717 -17741783 -16051866 -12806932 -11401194 -12239243 -12465272 -9152669
4022 -9152669 -2738909 2597331 2543195 -2807142 -8789531 -11454886 -11913456 -13799061 -17591857
4013 -17591857 -20101477 -19166675 -15943166 -12362660 -9261813 -7507069 -7947270 -9471665
4005 -9471665 -10107996 -10783411 -14561565 -21114550 -25884307 -26466639 -25774914 -26494986 -26488808
3996 -26488808 -22846812 -16817577 -11255732 -6630480 -3140470 -3047492 -6521567 -8596719
3988 -8596719 -5248187 386177 2957519 3158334 5136852 8030012 6787531 587952
3980 587952 -5691317 -8203204 -7156319 -3874914 -155631 367211 -4115120 -9288023 -9656055
3971 -9656055 -6623255 -5629481 -7064477 -7623523 -9154921 -16544291 -26434651 -28482422 -20485995
3962 -20485995 -12409889 -11530248 -13274815 -11956609 -10840054 -14052588 -16768695 -12552865
3954 -12552865 -4600639 -630556 -1034515 -917556 -184110 -2255044 -5098437 -3096284 2616159
3945 2616159 4411436 -386929 -5779285 -6162547 -2713243 707789 2141778 419636
3937 419636 -5023045 -11126673 -12707731 -9144489 -5640889 -6089990 -8567277 -9656938 -9222700
3928 -9222700 -8507656 -7079055 -4602132 -2991805 -3774778 -5036509 -3763111 -325073 1607451
3919 1607451 -631724 -5878133 -10482243 -11712683 -9943572 -7738331 -6752144 -6118822 -4421709
3910 -4421709 -2114372 -472893 1029203 4227725 9256759 13887339 16057007 15494977
3902 15494977 12640867 7502744 235568 -7898020 -14466423 -16785629 -13940089 -8654459
3894 -8654459 -5829390 -7758346 -11757131 -13811446 -13111886 -11170346 -8227060 -3561358
3886 -3561358 1506937 4354845 5011011 6318711 9261480 10707336 7356881 354356
3878 354356 -5613559 -7226900 -5507230 -3928737 -4083366 -3909299 -922500 3559920 5693633
3869 5693633 4989492 5880134 11298433 17239844 17063006 9931736 1572418 -2857414 -3319455
3860 -3319455 -2288090 -1086684 -181670 -691882 -3494610 -7328362 -8984709 -6028826 160966
3851 160966 4393268 2179308 -5452939 -13302623 -18163196 -20891206 -22059752 -20050645
3843 -20050645 -15676452 -13882990 -16760019 -19045738 -15804612 -10798694 -10637268 -13601585
3835 -13601585 -12416980 -6830905 -4447945 -8270389 -12265906 -11720079 -9438068 -7863853
3827 -7863853 -3502396 4903374 9972464 5216155 -4203308 -8495280 -7322940 -7897503
3819 -7897503 -11021362 -9111073 485363 9319990 9310680 3890371 2225633 6372534 10130336
3810 10130336 9050681 5892056 5208558 6650891 6155879 1919102 -3475085 -6831434
3802 -6831434 -8263833 -10166427 -13018303 -13689650 -8531750 2270043 13932206 20838926
3794 20838926 21208932 17991198 14908601 12102808 6995188 -552848 -6352278 -6865251
3786 -6865251 -4083027 -2564929 -2760038 -1002748 3615239 6271165 2308523 -6354175
3778 -6354175 -13009601 -13179965 -8295809 -3416820 -2713747 -6518200 -11599472 -14357907 -13935983
3769 -13935983 -12013379 -10361286 -9723051 -10044747 -9886453 -6738709 -707784 3165269 218391
3760 218391 -6423296 -8478489 -3531011 1475397 -173229 -6693324 -12241462 -15124902
3752 -15124902 -17362756 -19651551 -21514136 -23733597 -25862729 -23857082 -15657833 -7245002
3744 -7245002 -6930302 -14190480 -20271516 -20093935 -17199492 -15509435 -12826374 -6223618 1117043
3735 1117043 3336239 -435763 -5968812 -9823723 -11601627 -11192926 -7400419 51239
3727 51239 9049726 16159683 18459730 14946020 7341341 -710070 -6096768 -7894953 -6823701
3718 -6823701 -4271771 -2008438 -1116382 -458146 2130149 6253473 8516137 6943314 3664526
3709 3664526 1162763 -2018355 -8698848 -17404769 -22974662 -22971759 -20189318 -17865906 -15440749
3700 -15440749 -10886342 -4971578 -707926 449771 -295986 -1372137 -2350955 -3111384 -3044994
3691 -3044994 -1676597 707951 3377076 5552920 6448304 5643506 3737866 2102872 1554141
3682 1554141 1412028 126830 -3088420 -7228314 -10273097 -11287292 -11423495 -12033672 -12089971
3673 -12089971 -9191057 -3641431 685648 1396548 1625327 6002330 13346120 16951348
3665 16951348 12792134 4336516 -2024036 -3538852 -1500055 2108665 5775290 8012203
3657 8012203 8276156 7439169 5821952 2371369 -2590404 -6192347 -7254529 -9406223 -16242618
3648 -16242618 -24830161 -28242181 -24090106 -16551187 -10131959 -5742090 -3378196 -3947136
3640 -3947136 -6485374 -7372435 -4833293 -1561576 -755298 -1998373 -3115685 -3668889 -4173549
3631 -4173549 -3748128 -1038909 3664429 8965713 13653200 16105298 14494171 9624473
3623 9624473 5607224 5100751 5315387 1583487 -5982299 -12362203 -14035801 -12755265 -12224690
3614 -12224690 -13206232 -13422983 -11291971 -7958948 -5148665 -2299613 2231332 7009419
3606 7009419 7238147 718330 -7888446 -11841515 -10032490 -6176849 -1425963 6800930
3598 6800930 17785528 25035242 23937089 17763265 12583061 9487251 5594891 205294
3590 205294 -4070628 -5023115 -2704898 1199718 3709639 2145691 -2437876 -5702423 -6047394
3581 -6047394 -7102426 -11332912 -14742436 -12248364 -5410720 320842 4024845 9284202
3573 9284202 16456429 20511110 17408410 8630053 -1442232 -9658513 -15312357 -19697766
3565 -19697766 -24286785 -27647786 -25914256 -18673637 -11622286 -9697241 -10501034 -9363158
3557 -9363158 -7961231 -11362428 -18169819 -20978724 -16690155 -9577345 -3596193 1453659
3549 1453659 4954945 3861768 -1324923 -5091677 -4344845 -2034506 -862693 1077211
3541 1077211 5424011 9688109 11597712 12346932 12340754 9044529 2836969 -439428 2556044
3532 2556044 7102176 7936863 7493528 10437846 14111216 11906259 4058383 -2275552 -3230955
3523 -3230955 -2016185 -2090075 -2544122 -1896975 -1646087 -3420679 -5455715 -4313512 953252
3514 953252 7473394 10886731 8885439 2834049 -4361168 -11467712 -18323861 -22677932
3506 -22677932 -21277952 -15080214 -9543730 -7937997 -8202792 -8434494 -10524496 -14763091
3498 -14763091 -15999122 -10845424 -4844130 -5735475 -11893221 -14431270 -9859284 -3791238
3490 -3791238 -1873358 -3577152 -6368820 -10103309 -14601211 -17186965 -15705746 -11711870
3482 -11711870 -8800660 -9197356 -12384551 -15454154 -15310290 -12580997 -12149828 -17090176 -23732979
3473 -23732979 -26308448 -24549335 -22001777 -18646157 -11527156 -2308824 2748558 1726820
3465 1726820 -236194 828978 2576263 1905239 141935 -445255 -412477 -285261 1275716
3456 1275716 3125715 494696 -7489365 -13615105 -10935377 -1833439 6038404 9470674
3448 9470674 10122668 8515863 4051557 -635700 -1708907 -213963 -765361 -4334544 -7457415
3439 -7457415 -8491345 -9186518 -9476909 -6417830 -138634 4224867 3276111 27758 -1070602
3430 -1070602 -363095 -957471 -3048749 -3903288 -2367216 -536944 -1319996 -5897846 -12704033
3421 -12704033 -17750471 -17524445 -12989706 -8892140 -7470097 -5284106 1042623 8383984
3413 8383984 10620634 7492513 5122214 7161169 10033304 8966619 4829604 1797079
3405 1797079 932402 -76358 -2033136 -2905251 -1594190 -86822 -819761 -3612878 -6100244
3396 -6100244 -6264784 -4156566 -1744789 -1054181 -2078375 -3235214 -4237163 -6702344 -10591037
3387 -10591037 -12361801 -9440770 -4697908 -2876413 -3906849 -4100908 -3078736 -4023566
3379 -4023566 -6734677 -6648911 -2807970 -672392 -3469429 -6359294 -3971759 1195518 3646815
3370 3646815 3747493 4612965 3483179 -5018392 -17759959 -24165413 -20289060 -14219040
3362 -14219040 -14107092 -17205102 -15504484 -7752809 -488672 811114 -2827290 -6665806
3354 -6665806 -7388519 -5357110 -3456421 -3982892 -6452080 -8714162 -9190838 -6578447 813203
3345 813203 11949282 20387067 19625186 11923963 7127067 10824071 17732953 19146309
3337 19146309 13180455 4698966 -1735852 -5196938 -6504320 -6357292 -5131761 -3137961
3329 -3137961 -1444835 -2023069 -5082797 -7205064 -5852088 -5133669 -11589539 -23374960
3321 -23374960 -30028012 -25715465 -16505590 -10494041 -6868379 -554762 7428060 11526629
3313 11526629 10589432 8419464 7277570 6866552 7765838 9597701 7794811 -594670 -9047073
3304 -9047073 -7418057 4018499 14129759 15916079 14240771 15796086 18815886 17830946
3296 17830946 13349859 10902238 13063306 17203952 19775841 19247447 15818432 11161088
3288 11161088 7934207 7584891 9056562 10546626 11343710 11277695 10208927 9027874 9141171
3279 9141171 9727326 7571754 1360462 -5458097 -8069353 -5866888 -3159516 -4336945
3271 -4336945 -8925244 -11811328 -9097385 -3591647 -2193843 -6698685 -10532978 -7759288
3263 -7759288 -1962947 -1030501 -5618216 -9679570 -11275269 -14333810 -18382457 -15769472
3255 -15769472 -3824357 7734681 8089744 -1123390 -9998301 -13741893 -14730508 -14418476
3247 -14418476 -11349970 -6587976 -4012232 -4450200 -4956901 -4444050 -4958683 -6787119 -7212692
3238 -7212692 -5049936 -1896747 1850717 7353576 12543503 12219318 5307065 -2451801
3230 -2451801 -5790924 -5848502 -5949497 -5847190 -4432380 -4589734 -9739441 -17134006 -20143223
3221 -20143223 -17185504 -13497759 -13221732 -14400946 -13856936 -12911227 -14682684 -18055272 -18338338
3212 -18338338 -13420345 -6060981 19501 3397461 3754424 567155 -5168326 -10152789
3204 -10152789 -12051126 -12104919 -12275700 -11349605 -7002450 -880554 2206181 639941 -1990000
3195 -1990000 -2383144 -1622036 -1886018 -2348601 -1279246 220024 30600 -974867 -281238
3186 -281238 1707518 1891515 -928669 -4822739 -8134515 -10899908 -12354110 -10368374 -4964459
3177 -4964459 109665 1331364 -509087 -1780107 -454944 2384709 4659939 5394867
3169 5394867 4916154 4117392 3831347 4400428 5285313 4853581 1219643 -5344302 -10864749
3160 -10864749 -10783791 -5862195 -2603204 -5364740 -10216315 -10386095 -6407638 -5739070 -11833688
3151 -11833688 -18966414 -20416233 -17240332 -14962208 -14819633 -13360877 -9369199 -5918167
3143 -5918167 -4835978 -3538806 373742 4319081 3716655 -1153564 -4289957 -898172
3135 -898172 6598959 11254932 9737125 5592255 3732808 4074504 3093967 255279 -810462
3126 -810462 2091742 6467140 9118129 10497969 12688133 15186364 15631275 13613376 11033797
3117 11033797 9114392 7378723 5522639 4413022 5044154 7535181 10815570 12746240
3109 12746240 11954146 10452919 12112894 16633179 17870811 11557580 2231310 -2104231
3101 -2104231 -459572 1651314 2219182 4914065 9849300 10040623 1796137 -7393487 -7758012
3092 -7758012 -259251 5997135 6900818 6447906 7244125 5758430 -467175 -7011052 -8136587
3083 -8136587 -4467474 -929953 860526 4036320 10553947 16872438 16715932 7513646
3075 7513646 -6122087 -15564894 -15829234 -10327802 -7004707 -9712104 -14840141 -16495443
3067 -16495443 -12965786 -7432359 -4299347 -5808221 -10504153 -14066127 -13364970 -10436274
3059 -10436274 -10275161 -13942446 -16909583 -15880142 -13655863 -14008684 -14882405 -11508473 -4713533
3050 -4713533 -712942 -2273794 -4854160 -3105816 2538932 7841035 10413726 11080021
3042 11080021 11536359 12788930 14647427 15227633 12241040 6182601 907764 -494011
3034 -494011 736631 1125038 -432425 -1989805 -1943195 -1186586 -1453420 -2566516 -2128233
3025 -2128233 1810693 7737168 11048898 8603691 2735408 -750283 1081486 5337554
3017 5337554 7104571 4719787 592319 -1684444 -48924 4848775 9999781 12492898
3009 12492898 12428581 12327373 13086950 12259501 7621170 928742 -3583745 -3558448 -71908
3000 -71908 4049211 6020543 4353892 184609 -3223410 -3871059 -3439941 -4900972 -8233128
2991 -8233128 -10116197 -7907433 -2921510 287014 -2326242 -10484655 -19139263 -22875359
2983 -22875359 -21109085 -17585139 -14882562 -12141531 -8854831 -7160220 -8042597 -8687542
2975 -8687542 -6992637 -5751074 -8088684 -11102595 -9222901 -2722031 2537324 3623857
2967 3623857 3343546 3836682 2864069 -1398305 -6223155 -7530170 -4161568 2589643 10311361
2958 10311361 14984223 13365323 8091754 6319568 10550651 14920876 13886189 10113959
2950 10113959 8930968 8858483 4257979 -4505081 -10576946 -10450493 -7795122 -5887255 -2328792
2941 -2328792 5116208 12006104 11679872 4501596 -1941295 -1995359 2208863 5105046 5061863
2932 5061863 5065187 7280600 9794641 9528498 6513968 3826526 4350549 8998581 16854827
2923 16854827 24890544 28534481 25648437 19896097 16831981 16146685 11650273 401179
2915 401179 -12341204 -19976396 -22283154 -22247369 -18974353 -9955880 1217695 6391121
2907 6391121 3253317 -1493864 -1752660 -71506 -2478586 -8493056 -10762897 -4144970
2899 -4144970 7843228 16102526 14199468 3615827 -8213718 -14757672 -15184305 -12435981
2891 -12435981 -8304067 -2751043 2704925 4693479 2457496 -316215 -332955 813402
2883 813402 -401128 -3579791 -4803629 -2525507 254993 728369 493829 2819489 7117103
2874 7117103 9105292 6855362 3956550 4642125 7497234 7200631 2255628 -2693910 -3543972
2865 -3543972 -2153703 -2390722 -3819949 -3420883 -1705161 -2212007 -5306648 -7364899 -6719134
2856 -6719134 -5578407 -4629339 -825297 6485497 11719085 9782229 3747394 907669
2848 907669 2533284 2427171 -4076441 -13697108 -19132661 -16875366 -9784786 -3435909 -1122655
2839 -1122655 -1938695 -3156116 -4029363 -6213365 -10338232 -14207922 -15671780 -15327689 -14436856
2830 -14436856 -12049101 -7001616 -1523112 459677 -1566461 -4078299 -4045207 -1531464
2822 -1531464 2276023 6908601 11858770 16165276 19300990 20741634 18974213 13660738
2814 13660738 8827970 10331672 18643658 26985430 28523410 23208482 15770089 9498284
2806 9498284 4795023 2169595 3142488 7815009 13504152 16399150 14115328 7336816
2798 7336816 -169969 -4118863 -3558735 -1558694 -1157663 -1794936 -1132531 880113 1998675
2789 1998675 1301118 544938 1449317 3189912 3399097 1064369 -1905151 -2038815 2006351
2780 2006351 6794604 6743841 793271 -5168707 -4953819 -60567 2266971 -1127243 -5316979
2771 -5316979 -4735848 -1075076 -348963 -3957499 -6877416 -5091479 -1213281 -659923 -4316870
2762 -4316870 -7797561 -7610684 -5438167 -5219814 -7783404 -10340168 -10677575 -9656042 -9150041
2753 -9150041 -9526142 -10310054 -11603591 -12962650 -12124544 -7375421 -812741 3384834 4250827
2744 4250827 4938239 7403566 9006692 6621403 2162272 1081266 5926926 13746160
2736 13746160 19577017 20324463 15466991 6701305 -2275360 -7755872 -8969847 -7780237
2728 -7780237 -5282973 -1140153 2887511 2169019 -4988493 -12920141 -14017673 -8016172
2720 -8016172 -1974093 -728034 -1611183 -300088 2296605 2498035 305490 -1139375 -1333602
2711 -1333602 -2931810 -6302603 -8147816 -7022047 -6094631 -7889635 -9886532 -8965558 -7389190
2702 -7389190 -9490472 -13573576 -12475303 -3193879 8331909 13893761 11106621 2999439
2694 2999439 -6812090 -15325966 -19368459 -18007043 -14837307 -14005625 -14210624 -10441800 -2034872
2685 -2034872 5094757 6067324 3543348 3755773 8078397 11732098 10235589 4452861 -931944
2676 -931944 -2058074 1196921 5358773 6196323 2890426 -341651 1735132 9193081 16177343
2667 16177343 17124356 12461429 7058661 4425265 4442774 6111741 9575719 14178845 16708792
2658 16708792 14170894 7960422 3040512 2416850 4085358 4212938 1654093 -2104706
2650 -2104706 -6082086 -10622087 -15316401 -18127495 -17150067 -12170092 -4443376 3767839
2642 3767839 9447570 10392539 7273054 3012192 -239389 -2256839 -2912991 -1499407 1095528
2633 1095528 1685976 -1903514 -8166515 -14099520 -18610693 -21969287 -23399018 -21749542
2625 -21749542 -17837895 -13741002 -10091843 -6110988 -1821788 1961227 5353351 8627382
2617 8627382 10079200 7634293 2963619 1126924 5047997 12423267 18760790 21254077
2609 21254077 19150160 13220111 6366462 2341552 2059035 2854533 2469502 1514842 881960
2600 881960 -193084 -1354873 402879 6190588 11668132 12117459 9393770 9138028 11650325
2591 11650325 10738000 2931487 -6654157 -10409702 -7262857 -2541582 -518807 -430779 163397
2582 163397 919118 -728469 -5368781 -9671641 -9520411 -4579183 1488524 5483798 7803563
2573 7803563 10224487 12243483 11646688 7904375 2767581 -2275329 -6815478 -9526066
2565 -9526066 -7909907 -1659173 5089013 6768031 1815371 -5661349 -9883563 -8811460
2557 -8811460 -5220934 -2387927 93575 4441850 9243228 9317142 2767625 -4807115 -6376008
2548 -6376008 -1892882 2972273 5138577 6634319 9046425 10475499 9538241 8131588
2540 8131588 7826653 7001037 4357503 2244592 2952138 3915412 833671 -5060092 -6856536
2531 -6856536 -75048 11819400 21608346 26444376 29702489 34724936 38761188 35433178
2523 35433178 23353247 9594241 2436236 2428656 3514276 1547344 -2287447 -5779885
2515 -5779885 -8243634 -7920801 -2293933 6455525 11113890 8135000 2703995 1282333
2507 1282333 3055871 3581920 3257886 5814495 10413760 12025349 9383550 6452307 5543046
2498 5543046 4776753 3386086 3735032 6037251 6377966 2948291 -120145 1459760 5839994
2489 5839994 7829269 5435831 811422 -2900290 -2963134 2160243 10236206 15432421 14255767
2480 14255767 9925093 8054416 9552446 10868852 9860648 7746750 5686967 2898648
2472 2898648 -1411049 -6868198 -13028569 -19227119 -22877255 -20432834 -11498105 -778569
2464 -778569 5240587 3480660 -3536278 -9791438 -10426887 -5663189 -405719 639360 -2652483
2455 -2652483 -6586870 -7789698 -5614647 -1495576 2460680 4685194 5371096 6122692 7280640
2446 7280640 6589215 2350060 -2886148 -4159472 374923 7726169 13706299 16123399
2438 16123399 14629223 10454505 7046047 7843716 11641612 12748115 8081809 1877457
2430 1877457 278927 2888263 3728566 412037 -2175811 673418 5970576 6763962 1869588
2421 1869588 -2502155 -1539562 1679308 1220550 -2672585 -3760424 1066910 6972921 7591192
2412 7591192 3313846 -338602 -1284757 -3345898 -8986349 -13542511 -10373769 -378145
2404 -378145 7664852 7114060 721339 -4150839 -5165231 -6382709 -10695556 -15190519 -16081227
2395 -16081227 -15135785 -17350105 -23064074 -26462453 -23279193 -17079303 -15317054 -20319462
2387 -20319462 -26584042 -26991501 -19954185 -9999324 -2595027 604811 1694088 2649620
2379 2649620 2539055 -650616 -5788448 -7978428 -3608373 4514372 8724019 3904924
2371 3904924 -7169826 -16316792 -17518977 -11859282 -5323747 -2433887 -2503984 -1788119 1864569
2362 1864569 7152756 11123895 11461130 7484270 806476 -4600424 -4922988 -513003 3620531
2353 3620531 2764915 -2472651 -7237361 -8167778 -6778560 -6999305 -10524434 -15366232 -18462597
2344 -18462597 -18611942 -16497262 -12934890 -8676988 -5718072 -6461403 -10367881 -13441326
2336 -13441326 -12956403 -10773048 -9403611 -7193173 -1967554 1931492 -3323239 -17732470
2328 -17732470 -31358011 -36474980 -36125698 -36264931 -35087536 -27189037 -14900402 -7147145
2320 -7147145 -7350700 -9801542 -9143714 -6784065 -5574901 -4163149 -485736 3353137 3935050
2311 3935050 1858933 831631 3015140 7653595 12565872 14919126 12561156 6933393
2303 6933393 2840597 3043190 4986119 5322216 5324497 8034486 11432892 9271617 -256772
2294 -256772 -10362927 -12658121 -6733682 -452483 -880417 -6794151 -11303040 -10922116 -9593132
2285 -9593132 -12519622 -18359080 -21017123 -18659626 -16483997 -18715451 -21786841 -19243501
2277 -19243501 -11178247 -4275625 -2963792 -4998220 -6887219 -9498157 -15145436 -21503100
2269 -21503100 -22565392 -15832274 -5299952 3969345 11501267 19168005 25402674 25811717
2261 25811717 19688716 11874920 6582658 2989409 -714250 -2771721 -1363196 362381
2253 362381 -2022499 -7072852 -9291250 -7130094 -3695586 -374636 3562882 5095709
2245 5095709 -604301 -10201376 -12618555 -3903258 5994478 7365527 4636245 8070839
2237 8070839 17087535 21681043 17726584 10906576 5943079 1419925 -3452974 -5690026
2229 -5690026 -4960026 -5722771 -9273483 -9936155 -3573534 5037889 8048376 4364540 -604657
2220 -604657 -2590819 -2054244 -1688962 -3428057 -7121366 -10396462 -10816646 -8953219 -7567374
2211 -7567374 -7425879 -6690434 -5005642 -4583692 -5830982 -5646914 -2266840 1551596 2627604
2202 2627604 1568728 407574 -807802 -2187532 -1810169 1273629 4385268 4974202 4704440
2193 4704440 6242067 8169375 7134907 3518028 816709 189197 -628067 -3271137 -6746725
2184 -6746725 -9205197 -9271029 -6478601 -2778820 -2140149 -5788421 -9514962 -8987648 -5733561
2175 -5733561 -3697596 -1958034 3368990 10765258 13481586 9318840 4231988 3731952
2167 3731952 6009724 6972560 7330972 9791954 12156553 8747309 -1547585 -12653823
2159 -12653823 -17590545 -15208844 -10090721 -7143792 -6998404 -6528634 -3663073 -599729
2151 -599729 -767962 -3457302 -4358269 -1828451 524974 -1069897 -5676324 -9758820 -11652968
2142 -11652968 -11685625 -10166054 -7973984 -7271186 -8745697 -9741034 -8139985 -6529600 -8815567
2133 -8815567 -13642716 -15317574 -11382151 -5447547 -1855653 -1112611 -1639790 -2461344 -2376099
2124 -2376099 439327 5779163 10741673 13589246 15610335 16934893 13733775 3460992
2116 3460992 -9255909 -16663527 -17192520 -16166917 -16983568 -16461012 -10956941 -3053943 1279567
2107 1279567 118136 -2900860 -3403976 -199476 4737292 7896673 6456147 1018108
2099 1018108 -4206913 -5751276 -4844672 -5023680 -6496972 -5658247 -407342 6718056 11638523
2090 11638523 12897402 11817777 10411066 10188294 11347765 12093522 10461628 7816108
2082 7816108 8264328 12698707 15561665 10650152 -642864 -10007226 -11445454 -7236117
2074 -7236117 -3795111 -3828541 -4378147 -1582340 4502728 9942776 10706156 6070620 -1040403
2065 -1040403 -6470616 -7761762 -5485465 -2241474 -175086 843878 2359093 4536098
2057 4536098 5208392 2724125 -1129697 -2849542 -1580714 366520 1559902 3399953
2049 3399953 6777135 9169525 7426464 2266463 -2202161 -2954930 -392601 3240863
2041 3240863 6147262 7968884 9798021 12952343 17002565 19891896 20711379 20630797 19726484
2032 19726484 15277780 6100210 -3175410 -6038892 -1921367 3544833 6081787 6703490
2024 6703490 7495635 7839034 7042646 7109942 9569972 11783764 9890371 4448856 138230
2015 138230 127053 3141736 5968349 6558625 4439482 322035 -3601564 -4422373 -1063257
2006 -1063257 4171398 7475469 7152574 4970920 3718795 3851737 3419789 1408624 -255817
1997 -255817 709244 3433300 5141826 5682259 8116602 13760259 18967311 18970635 13843365
1988 13843365 8711056 8381646 12985841 18339349 19400761 14164501 5794902 491981
1980 491981 1497854 5298044 5453619 247949 -5401910 -6121629 -1993223 3091169 7063035
1971 7063035 11057241 15700847 18891008 18383973 14833597 10830980 8009393 6413903
1963 6413903 5620604 4666068 1684417 -4026089 -9737869 -11656590 -9966458 -8818962 -10350261
1954 -10350261 -11773627 -10405646 -8499074 -9576368 -11940468 -10220065 -3134351 4230090
1946 4230090 6677606 4298526 543201 -2366795 -4543323 -6740217 -8917782 -9631499
1938 -9631499 -6772888 -334788 6037569 8585431 8207900 8721636 10460094 9581287 4752310
1929 4752310 195540 -292887 1497543 2222310 2738837 5576982 9075139 9092243 5878680
1920 5878680 4542894 8046525 13415961 15993735 14581817 11211304 8228298 7014569
1912 7014569 7870644 9787220 11280845 12198908 13805584 16661180 19422344 20214963 18459484
1903 18459484 15196296 12411919 11975841 14163355 17085567 18483308 18048731 16964139
1895 16964139 15370844 11949384 6578133 1947595 1156698 4024237 6831964 6095440
1887 6095440 2266628 -741836 94082 3295550 4042809 -1141821 -11292192 -22209587
1879 -22209587 -29733345 -31764044 -28424675 -21373167 -12933641 -5522323 -1362371 -1393453
1871 -1393453 -3577572 -3759997 -120419 4383026 6358409 7281642 10692237 15061059 14841975
1862 14841975 9466313 5396905 6534397 8266807 5419547 971955 649090 2480988
1854 2480988 -711749 -9652866 -16749432 -16554310 -11881152 -8036487 -6468201 -6340214 -7696476
1845 -7696476 -10102251 -11299795 -9642571 -5620577 177968 7659999 14683464 17473158
1837 17473158 15362803 11828241 8960004 4584878 -2475353 -7969407 -7116496 -1801259
1829 -1801259 1285036 -1067081 -5551226 -7390219 -5598827 -2967686 -2890992 -6607613 -12205859
1820 -12205859 -16024273 -15698526 -11770566 -6320842 -1205706 1989877 2139842 110528
1812 110528 -1256279 -169051 2194648 3980000 5229382 6304235 5402674 706081 -5386692
1803 -5386692 -7425790 -3405924 2349136 4698819 4423283 6606077 12464910 16215700
1795 16215700 12352195 3765856 -1385563 -596452 -86882 -5072706 -11544559 -12040328 -6562034
1786 -6562034 -2043682 -1921557 -2224072 901043 5001238 5117692 129594 -7019154 -12498622
1777 -12498622 -13060453 -7429628 1327891 7350969 8266885 7755796 9847206 13284031 14133548
1768 14133548 11519746 7532091 3213174 -1882056 -6989595 -10188261 -11050826 -10846110
1760 -10846110 -10118206 -8091795 -4690693 -1550239 -408719 -1033185 -1069518 1631410 6037704
1751 6037704 8182938 5820696 1789322 422428 1703341 2356790 1836624 2473646 3593994
1742 3593994 1286984 -4248759 -7012425 -3987386 -208366 -1030455 -4393460 -5622307
1734 -5622307 -5103558 -5203147 -3785563 1832847 7194563 4981218 -3859802 -10839406 -12025515
1725 -12025515 -12114508 -15055343 -17702556 -15960754 -11633033 -9016339 -8334502 -6619581 -3105642
1716 -3105642 -205824 422956 551223 3624840 10713308 18432600 21802940 19554840 14989741
1707 14989741 10969151 6994529 3027359 2252439 6097024 9816573 8322318 4089396
1699 4089396 3259667 5348728 3749047 -3272565 -8822208 -6500482 1995174 10396025
1691 10396025 14623303 14301179 11496503 9630800 10445676 11263798 8423740 3115466 -314113
1682 -314113 -1127207 -1912132 -2016054 2123265 9348343 13386888 11901400 9502578 9848780
1673 9848780 11387004 12898492 15737949 17792186 13557560 4467203 550592 5872356
1665 5872356 10611277 5342619 -4250502 -6385091 -1018571 2168107 230016 249110 6780806
1656 6780806 15772111 21889016 23857883 21377303 13842205 3679140 -4811224 -10797434
1648 -10797434 -15921402 -18334437 -14148206 -5219791 1124956 1411667 -795809 -1942073
1640 -1942073 -2516217 -2911998 -1977760 -1694534 -6551621 -15094324 -18809283 -13604144 -6641403
1631 -6641403 -6602785 -11890630 -14386094 -11515390 -8088033 -7533128 -7481711 -4910051 -1326577
1622 -1326577 -961812 -5797155 -13547045 -19622347 -20635564 -16564473 -9942179 -3468992
1614 -3468992 1093182 2707668 1515306 -822690 -2865850 -4865429 -6605498 -5078102
1606 -5078102 2321123 12738503 19822127 21016112 19176782 16719936 12896053 8249878
1598 8249878 6727786 10267594 15128860 16967431 16409183 16126889 15276027 10993819 3733711
1589 3733711 -2752340 -5865966 -5587286 -2618174 1740644 4807633 5007891 4874016 8364113
1580 8364113 14801313 18293748 14385821 5618269 -779263 -146295 5380815 9857138
1572 9857138 10265283 9287156 10813275 14350638 16218111 15269313 13966021 13757849 13380260
1563 13380260 12754008 14359141 18641375 21967416 21815686 20219435 18972040 15646468
1555 15646468 8896621 3885498 6295595 13094334 15809774 12320837 8971373 10491908
1547 10491908 14038915 14940102 12770645 9064770 3717687 -2945789 -8042242 -9538675
1539 -9538675 -9311452 -9818589 -9975831 -7427530 -3139299 -581765 -1456966 -5014881 -10600535
1530 -10600535 -17789630 -24109909 -25368937 -19168529 -7079462 6473540 16439399 19243950
1522 19243950 14953455 7614636 1914864 -754776 -1930317 -2511371 -1892124 -875410
1514 -875410 -2572164 -8260926 -13918571 -13788076 -7626263 -1969822 -2736287 -8037050 -10525697
1505 -10525697 -6674183 -1376351 -2048301 -9549530 -16903745 -16823754 -8820758 1461597
1497 1461597 8299219 10135122 8950840 7355669 6719864 7077062 7909602 8998052 10693661
1488 10693661 13205127 15561740 15809678 12887415 8276844 5179886 5708905 9006497
1480 9006497 12044296 11951729 8007952 2498752 -342331 2189911 8112706 12566526 13669884
1471 13669884 14397074 16808582 17319050 11947526 4620116 4157750 11971160 18842132 17210262
1462 17210262 11278190 9660558 12086036 10607004 2648858 -4707785 -4868346 102124
1454 102124 4243165 5650016 5948484 5565595 4027211 3091558 5390787 10294154 14014406
1445 14014406 13702088 9527763 3492778 -1731290 -3662888 -2103585 188853 1065725
1437 1065725 2225390 6102910 10594057 10996482 7382148 5317701 7446921 9095279
1429 9095279 6002423 2478402 5909057 14630962 18010041 10032489 -2867490 -10528758
1421 -10528758 -10741463 -7746715 -3103918 5125832 15120835 20480216 18876063 16063960
1413 16063960 17745082 21380611 20303715 13390293 6140212 3291645 4342214 5919943
1405 5919943 5157445 1195049 -3222941 -2281060 6533773 16508040 16997459 6165300 -5884092
1396 -5884092 -8791156 -2599627 5912923 12952336 19050979 23860247 25460893 24128875
1388 24128875 21920732 18569403 12133542 3877732 -1971071 -4153064 -5664324 -7636691
1380 -7636691 -6319971 1170682 11599155 19184325 21703449 20037239 14540176 6027835
1372 6027835 -1482502 -3795541 -2014330 -826206 -1122470 1396939 8986337 17160403
1364 17160403 19801201 16496049 12204958 11098723 12898776 14210528 11469923 3392832
1356 3392832 -7555037 -16490757 -20334676 -20181102 -18322832 -14267914 -6162522 4285818
1348 4285818 11304465 10674640 4086591 -3355683 -8565272 -11795483 -13501038 -12381352
1340 -12381352 -7611086 -1679817 954279 -1501408 -6060413 -8329553 -7098198 -4378473
1332 -4378473 -1843857 525406 2350616 2245719 527995 37489 2170143 4145807 3027285
1323 3027285 969236 2857769 9034442 14180309 14431361 12188116 11714418 12518228 10273502
1314 10273502 3560417 -3241665 -4612674 151720 6810857 11233484 12854730 12456074
1306 12456074 8404910 -1723047 -15223388 -23485599 -20366710 -9917109 -2423423 -3165454
1298 -3165454 -8172198 -10911829 -9585279 -6966055 -6304801 -8939592 -13487118 -16059503
1290 -16059503 -13572493 -7964470 -4687011 -5980307 -8557134 -9224465 -9192540 -10462176 -11539164
1281 -11539164 -10364988 -8895761 -10617497 -14901353 -17638417 -16776903 -13989267 -11375123
1273 -11375123 -9335186 -7188708 -3546390 2903680 10632511 14957822 13467502 9907152
1265 9907152 8995843 9330099 6319485 868940 -961889 2578336 5862749 4317658 704233
1256 704233 -35193 2031551 3473435 3372013 3719311 5457029 7190807 7185259 4780096
1247 4780096 670414 -3047598 -4426622 -4228534 -5252690 -8221104 -10475374 -9928470 -7897855
1238 -7897855 -6374225 -4837775 -1895990 1843652 4689502 6047027 5735436 2821769
1230 2821769 -2613538 -7782239 -9393646 -6920306 -2540850 930758 1292237 -1634587
1222 -1634587 -4441754 -2464261 4381867 10457619 11165240 8225854 5839484 4827788
1214 4827788 4151833 5077372 8770426 11750288 9511452 4078036 2190744 5540802 8556769
1205 8556769 7467525 5946116 8603451 13397614 14712287 11112156 5802782 1106760
1197 1106760 -3245272 -6710819 -6695488 -1876457 5340575 10792590 12139681 10364353 8707468
1188 8707468 10020338 13874745 16042249 12102416 2395352 -7189804 -10135105 -4995396
1180 -4995396 3951155 11144124 13917400 12379850 6905518 -2230418 -12668493 -19589820
1172 -19589820 -19434323 -13662069 -7401636 -4175049 -2947571 -620164 3702400 7949780
1164 7949780 10191340 11100558 12406235 13726230 12992805 10639733 11018962 17183070 25499341
1155 25499341 28741467 24513043 17263122 11483148 7065906 3339818 3216433 8928533
1147 8928533 16260758 18275571 14372487 11178776 13833162 19996051 23552845 21421434
1139 21421434 15616314 10833478 10830119 15210326 19262399 18878767 15649559 14576651 16672181
1130 16672181 17143138 12061000 3829512 -1759751 -1715332 2370291 6575562 7309044 3907967
1121 3907967 -23239 -62711 3171496 4638545 2846447 3038320 8960862 15326560 14046753
1112 14046753 5946303 -205674 -390381 -371377 -5518274 -11322399 -9050232 1958294
1104 1958294 12826940 15627521 11372367 6810506 6140882 7350450 5339249 -2351740
1096 -2351740 -12224201 -17099108 -12870676 -3062546 4836703 7626869 8740200 11673503
1088 11673503 14271425 12382439 6981845 3353586 3486802 3749660 1438018 -518279
1080 -518279 1705499 6393749 8386783 6056202 2446394 238082 -521983 405103 4379431
1071 4379431 10351134 13674222 11081699 5125133 1358523 2204017 5666354 9133641
1063 9133641 11741849 12742212 10169966 3133097 -5416686 -10361175 -9651840 -6646098
1055 -6646098 -5974939 -7916798 -8795673 -6758921 -4484245 -4936280 -6858398 -6887589 -4761224
1046 -4761224 -3706481 -6002720 -10309830 -13256892 -12026089 -5967682 2360059 8262257
1038 8262257 9103427 7088408 6126201 7007354 8034340 8901138 10290797 10503864 6920290
1029 6920290 949834 -2957339 -3917826 -5556719 -9136800 -10884634 -8511812 -5296210
1021 -5296210 -4112220 -2041336 4345910 12020649 15361722 14635946 14790862 16787948 15857805
1012 15857805 8854706 -1408491 -10291228 -15951792 -18486475 -17658593 -13399853 -6884448
1004 -6884448 1283 5241094 6867134 4252485 -711325 -5030942 -6721033 -4454060
996 -4454060 2827691 13025274 19304298 15915331 5834156 -1432314 -663193 4044278
988 4044278 6359199 6010265 7217255 11388545 14907030 13853835 8664794 3559199 2115840
979 2115840 3807817 5221277 4735621 4610903 7168236 10548889 10935661 8020789 4854517
970 4854517 2483252 -1200610 -6269359 -8546465 -5052879 1375452 5821923 7475465
962 7475465 9121619 12060778 14739387 15798245 15616969 14776513 13206995 11148962 9295728
953 9295728 7706514 5840005 3782089 2352385 1991137 2586100 4390968 7980921 12877193
944 12877193 16804018 16771264 11248311 2057581 -5658872 -6700704 -521006 7615425 11368413
935 11368413 9158131 4432864 736477 -1594432 -3513898 -4399763 -3177840 -1157540
927 -1157540 -852901 -1606700 571519 6798478 11490935 8445537 -192224 -5413727 -2520287
918 -2520287 3548773 6095415 5507233 6346253 8918819 9089946 5300923 721488 -1505529
909 -1505529 -709474 3574452 11299577 18394563 18768749 12298732 6622331 8039400 14133458
900 14133458 18546775 19657792 20349784 21489426 20401044 15347413 7751489 -166743
892 -166743 -6951941 -10830875 -9847284 -4176261 3177944 8742897 10939667 10194996 7742878
883 7742878 4557809 1083464 -1983266 -3030570 -842176 3336340 6545523 7313253 6595438
874 6595438 5443666 4080219 3806666 6753154 11998571 14620520 11005082 3335205 -3075978
865 -3075978 -5050701 -2668402 2103484 5628552 4275202 -1191796 -5299786 -4775245 -2941351
856 -2941351 -3947396 -6015728 -5067748 -2016827 -629773 -349857 2059138 4905154 3036533
847 3036533 -2716813 -4941517 -185301 6643435 10575206 12386911 13125840 10250275 4334414
838 4334414 2981920 10887560 20566055 21051807 13473416 9750291 15921771 24376011 24582106
829 24582106 15493697 4260913 -2862166 -4556732 -2180488 2427787 7209495 10555924
821 10555924 12466659 14234678 16538681 17878896 15298820 7678440 -1321463 -5186035
813 -5186035 -1100609 6209740 9037867 4806438 -2002056 -5684759 -5078892 -3170296 -2768269
804 -2768269 -3667934 -3498793 -778375 2920901 4276277 2040456 -1269346 -2350987 -903550
795 -903550 789121 1228695 905380 341461 -1325097 -5208242 -10817825 -15507016 -15700814
786 -15700814 -9695321 -148730 7218180 8829897 6707499 5749753 8398341 13012060
778 13012060 16274666 15807752 11873512 8331092 10201162 17724258 24483245 24712938 20931726
769 20931726 19910844 22032017 20640851 13178651 6651039 8057724 13988251 15146302
761 15146302 8868756 1633039 -354555 2013631 4360413 5181834 6247438 8804450
753 8804450 11618860 12178904 8837075 2466179 -3319006 -4545089 -683636 4178118 5001431
744 5001431 899782 -4082224 -5738110 -4517687 -4306212 -6585226 -8035544 -5382352 -622999
735 -622999 1475526 219747 -218327 2797170 6760325 8141113 6713205 3720554 -978166
726 -978166 -6908901 -10904324 -10875951 -9783601 -11641045 -14708877 -13269283 -6104137 1322537
717 1322537 4012412 2654615 273599 -2383034 -5627706 -8043031 -7973715 -6153427 -4300321
708 -4300321 -2254184 1187337 5248692 7054482 4718183 -200983 -3168212 121649
700 121649 9414310 18454851 19938299 12993267 4127133 -69422 864010 3199306 4392911
691 4392911 4521524 4678147 6348808 10509699 15006320 14967371 8795050 1792478 223684
682 223684 3254907 4943803 3328530 2691100 6330724 11776321 14974948 15634850 16240736
673 16240736 18396178 22070894 26287441 28907922 27835520 23998266 21151926 21297768
665 21297768 22355019 21680019 19447412 16943094 14225496 11624446 10811068 11695303 11017668
656 11017668 7427911 5279490 8776936 14199904 13572316 5759597 -1979260 -4680685
648 -4680685 -5928802 -10200138 -14065902 -10488900 437716 10587324 13503794 10433794
640 10433794 5809539 1100815 -4005544 -7158100 -4458774 3627807 10682810 10757441 5192582
631 5192582 906876 2053333 5591011 6113393 3076513 879959 2475393 5732719 7044611
622 7044611 6340314 6611318 9396775 12633616 13043825 9478672 3728992 -1169503 -3281798
613 -3281798 -3021709 -2231772 -1917497 -1462539 -564438 -795029 -3463899 -6315297 -4850884
604 -4850884 1953769 9195514 11179502 7804439 3673576 1724769 735925 -549990 -178662
595 -178662 4006955 10238965 14464619 15251703 14539159 13818797 12113050 8221012 2978192
586 2978192 -1419803 -2921437 -272950 5901444 12167136 14555504 12818044 10536146
578 10536146 9913207 8673293 3964075 -2664738 -6772634 -6380641 -3290416 187337 3210744
569 3210744 5413090 6571985 7663325 10197125 14034048 17394243 19020926 18645679 15699814
560 15699814 10064594 4234021 1830539 2949037 3575904 1115035 -1856615 -1284979 2807600
551 2807600 6683771 7497947 5427995 2314018 461677 2117511 7728324 14608601 18988628
542 18988628 19366066 16617734 11606708 4796255 -2098146 -6560049 -7847642 -7127486 -4763940
533 -4763940 -28194 5520376 7286032 2864603 -3644189 -5616951 -1827375 2358624
525 2358624 1996980 -1854947 -4686619 -4400735 -2580285 -1071871 415029 3255959 7952908
516 7952908 13435671 17370567 17415849 13546400 9177668 8451409 11871165 15806444 16720899
507 16720899 14532563 11311765 8479320 6550929 6052311 6836792 7465443 7081761 7181449
498 7181449 9720301 14079369 17733100 19273202 18776041 16058400 11343313 7153099 6064469
489 6064469 6288328 3411386 -2113032 -3422663 3747572 13812259 17334756 12557300
481 12557300 6565273 5564600 8480900 10897989 11104442 10002510 7981118 4831751
473 4831751 1426492 -1049508 -3004092 -5526842 -7791235 -7403828 -3862395 -132 1270760
464 1270760 838133 2499774 8091085 14808949 18146165 16496273 11657666 5716577 -288698
455 -288698 -4519475 -4100918 1223934 6966721 8052035 4455049 322114 -1990240 -4002779
446 -4002779 -6936534 -8840285 -7759760 -5239132 -4025962 -3868107 -2574049 -511735 -726043
437 -726043 -4044204 -6973745 -5921100 -1379485 3728127 7905495 10945759 11490165 8127867
428 8127867 2951416 722108 3207215 6928876 8343460 8896752 12078838 16860210 17683165
419 17683165 11382127 1297182 -6555030 -9322933 -8232185 -5679415 -3258340 -1637133
411 -1637133 -628348 480745 1844153 2725059 2785948 2891342 3826057 4903323 4596529
402 4596529 1981871 -2767601 -8169089 -11226106 -9202561 -2994606 2640080 3850446
394 3850446 1629177 -415333 -615155 509838 2778381 5817318 6943189 3582175 -1877840
385 -1877840 -3632160 -144523 3494777 3053821 1372601 3618568 9044753 12064826 10538021
376 10538021 8267968 8653113 10031694 9235936 6690045 5488250 7306480 11452693 16345500
367 16345500 19503316 17499168 9227244 -825103 -5486971 -1935252 6076086 13237819
359 13237819 17329017 18053488 14631201 7535493 866566 -602438 3013949 6412860
351 6412860 4794948 -1679910 -9051147 -13318358 -12843700 -8892275 -4520218 -1763458 346625
342 346625 3858846 8290427 10790689 9944101 7248078 4405121 1509832 -1249936 -2651930
333 -2651930 -2772985 -4017324 -7645444 -10817199 -9425149 -3193988 3780212 7074493 5366472
324 5366472 718403 -3289910 -4395791 -3450608 -2576475 -1558227 1675247 6437283 8468199
315 8468199 5732298 1895405 1129461 2366364 2494949 2682361 6477010 12803632 16132828
$$ [...]
##END NTUPLES=NMR SPECTRUM
##END=
