##TITLE=31Pdec_DE-105_oil_3
CDCl3, 24 sc
 1.8.2025
##JCAMPDX= 6.0         $$ Bruker NMR JCAMP-DX V2.0
##DATA TYPE= NMR SPECTRUM
##DATA CLASS= NTUPLES
##ORIGIN= UXNMR, Bruker Analytische Messtechnik GmbH
##OWNER= root
$$ XWIN-NMR		Version 3.5
$$ Fri Aug  1 15:24:49 2025 Russian Standard Time (UT+4h)  she@DPX200
##.OBSERVE FREQUENCY= 81.013821
##.OBSERVE NUCLEUS= ^31P
##.ACQUISITION MODE= SIMULTANEOUS
##.ACQUISITION SCHEME= undefined
##.AVERAGES= 64
##.DIGITISER RES= 17
##SPECTROMETER/DATA SYSTEM= spect
##.PULSE SEQUENCE= zgpg30
##.SOLVENT NAME= CDCl3
##.SHIFT REFERENCE= (INTERNAL, CDCl3, 0, 198.062)
##AUDIT TRAIL= $$ (NUMBER, WHEN, WHO, WHERE, WHAT)
$$ ##TITLE= Audit trail, XWIN-NMR		Version 3.5
$$ ##JCAMPDX= 5.01
$$ ##ORIGIN= Bruker BioSpin GmbH
$$ ##OWNER= she
$$ F:/spectra/data/she/nmr/P31/2/pdata/1/auditp.txt
$$ ##AUDIT TRAIL=  $$ (NUMBER, WHEN, WHO, WHERE, WHAT)
(   1,<2025-08-01 15:23:16.32 +0400>,<she>,<DPX200>,
      <created by zg, POWCHK disabled, PULCHK disabled
       configuration hash MD5:
       00 E9 B6 7A A2 85 ED C7 34 08 36 98 17 FE 4E 26
       data hash MD5: 32K
       88 2E 77 03 5D 40 E8 98 8D 3E DD D3 4A B9 E9 DA>)
(   2,<2025-08-01 15:23:20.45 +0400>,<she>,<DPX200>,
      <Start of raw data processing
       efp BC_mod = 2 LB = 1.5 FT_mod = 6 PKNL = 1 PHC0 = 1115.181 PHC1 = 870.499 SI = 64K 
       data hash MD5: 64K
       6D 17 D8 FD 74 46 C8 BC 23 9E 21 86 77 46 00 7E>)
(   3,<2025-08-01 15:23:58.45 +0400>,<she>,<DPX200>,
      <pk PHC0 = 9.338677 PHC1 = 0 
       data hash MD5: 64K
       12 14 CC 9D E9 04 27 F9 90 11 36 69 0A 7B BE AC>)
(   4,<2025-08-01 15:24:02.31 +0400>,<she>,<DPX200>,
      <abs ABSG = 5 
       data hash MD5: 64K
       83 55 4A 98 08 B0 39 88 4A B4 5A 99 FB 00 2B F5>)
$$ ##END=
$$ 
$$ hash MD5
$$ 87 78 A0 45 94 EF 40 19 F7 67 98 FD 68 CA 46 6B
##$RELAX= 
##$RELAX= 
##$RELAX= 
##$RELAX= 
##$RELAX= 
##$RELAX= 
##$RELAX= 
##$RELAX= 
$$ Bruker specific parameters
$$ --------------------------
##$DU= <F:/spectra>
##$EXPNO= 2
##$NAME= <P31>
##$PROCNO= 1
##$TYPE= <nmr>
##$USER= <she>
##$AMP= (0..31)
100 100 100 100 100 100 100 100 100 100 100 100 100 100 100 100 100 100 
100 100 100 100 100 100 100 100 100 100 100 100 100 100 
##$AQSEQ= 0
##$AQ_mod= 1
##$AUNM= <au_zg>
##$AUTOPOS= <>
##$BF1= 81.014009
##$BF2= 200.13
##$BF3= 200.13
##$BF4= 200.13
##$BF5= 200.13
##$BF6= 200.13
##$BF7= 200.13
##$BF8= 200.13
##$BYTORDA= 1
##$CFDGTYP= 0
##$CFRGTYP= 5
##$CHEMSTR= <none>
##$CNST= (0..31)
1 1 145 1 1 1 1 1 1 1 1 1 1 1 1 1 1 1 1 1 1 1 1 1 1 1 1 1 1 1 1 1 
##$CPDPRG= <waltz16>
##$CPDPRG1= <>
##$CPDPRG2= <waltz16>
##$CPDPRG3= <>
##$CPDPRG4= <mlev>
##$CPDPRG5= <mlev>
##$CPDPRG6= <mlev>
##$CPDPRG7= <mlev>
##$CPDPRG8= <mlev>
##$CPDPRGB= <>
##$CPDPRGT= <>
##$D= (0..31)
0 1 0 0 0 0 0 0 0 0.06 0 0.03 2e-05 3e-06 0 0 0.0002 0 0 0 0 0 0 0 0 0 
0 0 0 0 0 0 
##$DATE= 1754047395
##$DBL= (0..7)
120 120 120 11 120 120 24 19 
##$DBP= (0..7)
150 150 150 150 150 150 150 150 
##$DBP07= 0
##$DBPNAM0= <>
##$DBPNAM1= <>
$$ [...]
##$SUBNAM3= <"">
##$SUBNAM4= <"">
##$SUBNAM5= <"">
##$SUBNAM6= <"">
##$SUBNAM7= <"">
##$SUBNAM8= <"">
##$SUBNAM9= <"">
##$SW= 400.765351723535
##$SWIBOX= (0..15)
0 1 3 0 0 0 0 0 0 0 0 0 0 0 0 0 
##$SW_h= 32467.5324675325
##$TD= 32768
##$TD0= 1
##$TE= 0
##$TE2= 300
##$TE3= 300
##$TEG= 300
##$TL= (0..7)
0 120 53 12 22 120 120 120 
##$TP= (0..7)
150 150 150 150 150 150 150 150 
##$TP07= 0
##$TPNAME0= <>
##$TPNAME1= <>
##$TPNAME2= <>
##$TPNAME3= <>
##$TPNAME4= <>
##$TPNAME5= <>
##$TPNAME6= <>
##$TPNAME7= <>
##$TPOAL= (0..7)
0.5 0.5 0.5 0.5 0.5 0.5 0.5 0.5 
##$TPOFFS= (0..7)
0 0 0 0 0 0 0 0 
##$TUNHIN= 0
##$TUNHOUT= 0
##$TUNXOUT= 0
##$USERA1= <user>
##$USERA2= <user>
##$USERA3= <user>
##$USERA4= <user>
##$USERA5= <user>
##$V9= 5
##$VALIST= <valist>
##$VCLIST= <CCCCCCCCCCCCCCC>
##$VD= 0
##$VDLIST= <DDDDDDDDDDDDDDD>
##$VPLIST= <PPPPPPPPPPPPPPP>
##$VTLIST= <TTTTTTTTTTTTTTT>
##$WBST= 1024
##$WBSW= 4
##$XGAIN= (0..3)
0 0 0 0 
##$XL= 0
##$YL= 0
##$YMAX_a= 8920
##$YMIN_a= -24281
##$ZGOPTNS= <>
##$ZL1= 120
##$ZL2= 120
##$ZL3= 120
##$ZL4= 120
##$ABSF1= 198.0616
##$ABSF2= -202.7028
##$ABSG= 5
##$ABSL= 3
##$ALPHA= 0
##$AQORDER= 0
##$ASSFAC= 0
##$ASSFACI= 0
##$ASSFACX= 0
##$ASSWID= 0
##$AUNMP= <proc_1d>
##$AZFE= 0.1
##$AZFW= 0.5
##$BCFW= 0
##$BC_mod= 2
##$BYTORDP= 0
##$COROFFS= 0
##$CY= -3
##$DATMOD= 1
##$DC= 0
##$DFILT= <>
##$DTYPP= 0
##$F1P= 0
##$F2P= 0
##$FCOR= 1
##$FTSIZE= 65536
##$FT_mod= 6
##$GAMMA= 0
##$GB= 0
##$INTBC= 1
##$INTSCL= 9.790993e-09
##$ISEN= 30
##$LB= 1.5
##$LEV0= 0
##$LPBIN= 0
##$MAXI= 10000
##$MC2= 0
##$MEAN= 0
##$ME_mod= 0
##$MI= 50
##$NCOEF= 0
##$NC_proc= -9
##$NLEV= 6
##$NOISF1= 182.463
##$NOISF2= 159.3651
##$NSP= 0
##$NTH_PI= 0
##$NZP= 0
##$OFFSET= 198.0616
##$PC= 4
##$PHC0= 1124.52
##$PHC1= 870.499
##$PH_mod= 1
##$PKNL= yes
##$PPARMOD= 0
##$PSCAL= 0
##$PSIGN= 0
##$REVERSE= no
##$SF= 81.0140089999434
##$SI= 65536
##$SIGF1= 159.3651
##$SIGF2= -187.1042
##$SINO= 113.3802
##$SIOLD= 16384
##$SREGLST= <1H.CDCl3>
##$SSB= 0
##$STSI= 65536
##$STSR= 0
##$SW_p= 32467.5324675325
##$SYMM= 0
##$S_DEV= 0
##$TDeff= 32768
##$TDoff= 0
##$TI= <>
##$TILT= no
##$TM1= 0
##$TM2= 0
##$TOPLEV= 0
##$USERP1= <user>
##$USERP2= <user>
##$USERP3= <user>
##$USERP4= <user>
##$USERP5= <user>
##$WDW= 1
##$XDIM= 65536
##$YMAX_p= 534612557
##$YMIN_p= -45008509
$$ End of Bruker specific parameters
$$ ---------------------------------
##NTUPLES= NMR SPECTRUM
##VAR_NAME=  FREQUENCY,     SPECTRUM/REAL,   SPECTRUM/IMAG
##SYMBOL=    X,             R,               I
##VAR_TYPE=  INDEPENDENT,   DEPENDENT,       DEPENDENT
##VAR_FORM=  AFFN,          ASDF,            ASDF
##VAR_DIM=   65536,         65536,           65536
##UNITS=     HZ,            ARBITRARY UNITS, ARBITRARY UNITS
##FACTOR=    0.49542278885378, 1,            1
##FIRST=     16045.7642231865, 0,            0
##LAST=      -16421.768244346, 0,            0
##MIN=       -16421.768244346, -45008509,    0
##MAX=       16045.7642231865, 534612557,    0
$$ Real data points
##PAGE= N=1
##DATA TABLE= (X++(R..R)), XYDATA
$$ [...]
##PAGE= N=2
##DATA TABLE= (X++(I..I)), XYDATA
7389b237769m15950J844970J945096J019826J801255L167445K711982Q42752r00996
7380I778611k099594k214632j004656p74878l294587m773860o44846M909264L039452
7371B920274n104104q074274j516219N074404M123670J391282L877773O591904
7363I284710J800044o318559p869440l010869j27356j392764j179072K373476
7355f439830M279858J680040k180897l838062l370453k092944j349073k602989
7347a5914350m456232k224368M649084Q688815M235236k963194l695537J132874
7339a0547672L879063L633421N599059Q850276O420959j784658p214091n855887
7331B980470l215646l537385l643063r58481J129860k6900j859461k244211k311032
$$ y = [-2237769, -2653719, -808749, 1136347, 2156173, 3957428, 7124873, 9836855, 10679607, 9778611, 7679017, 5464385, 4459729, 3684851, 390264, -4383596, -5028442, -119178, 2920274, -2183830, -10258104, -11774323, -6699919, -2576249, -1184967, 2692806, 9284710, 11084754, 4766195, -3103245, -6114114, -6241470, -7634234, -8813306, -6439830, -2159972, -479932, -2660829, -6498891, -9869344, -11962288, -13311361, -15914350, -20370582, -22594950, -17945866, -9257051, -5021815, -7985009, -11680546, -10547672, -6668609, -3035188, 2563871, 11414147, 17835106, 16050448, 8836357, 2980470, -235176, -3772561, -7415624, -8374105, -7244245, -7271145, -9130606, -11374817, -13685849]
7322a3685849r03522N291180J2755261J1767749J132529p007745l794462L546331
7314I101472L706724j724465l490232j158204k585409q918874j1387855m645381
7306b1102224N136699Q562523M034487k236674l921758k71265M176997M711468
7298i09747J634112p45276m94923l11895j992980k871064r78737K34140k991522
7289i427892p797593q101240l215565J918004M075074M422032M152301K272591
7281a1702288j183679l307977j562776K567058M376890O92593n681252p349012
7273b3150443p78668P474525P667108L01093l726356J198535O882911L761555
7265c69740m699100p679598k496557M171785P593462Q371648N959569j460096
$$ y = [-13685849, -14589371, -9298191, 3457070, 15224819, 16357348, 9349603, 5555141, 9101472, 12808196, 11083731, 7593499, 6435295, 3849886, -5068988, -16456843, -21102224, -15965525, -7403002, -3368515, -5605189, -9526947, -9798212, -5621215, -909747, 724365, -20911, -515834, -827729, -2820709, -5691773, -6670510, -6436370, -9427892, -17225485, -25326725, -28542290, -26624286, -22549212, -18127180, -13974879, -11702288, -12885967, -16193944, -17756720, -15189662, -10812772, -10120179, -15801431, -23150443, -23929111, -16454586, -8787478, -8486385, -12212741, -11014206, -4131295, -369740, -5068840, -12748438, -15244995, -11073210, -3479748, 4891900, 10851469, 9391373]
7257I391373r744819j0579785l254064K995731J840749j734391j73187N268573
7249e989820P267082K952760l412719o528604n021872j271951J244150J172477
7241i588497R31986L637183P953866Q771170M071596j864796l812396j532636
7233H567476J409433K314553R50258j401941k679035j493313Q83912J717588O05247
7224A0874178l19687m21819j403039l032940k101929K061051M869357K522631
7216A3047803k400764n000879m872581m673340m203669r74625M212684P197257
7208B331886O289574M055014K660472J299881o80416j743774r80385M5731J78757
7199A3456740P30893K534894L505171J881407k82309l15792m8946l395931r080575
$$ y = [9391373, -353446, -10933231, -14187295, -11191564, -9350815, -11085206, -11258393, -5989820, 1277262, 4230022, 817303, -5711301, -10733173, -12005124, -10760974, -9588497, -8656511, -5019328, 2934538, 11705708, 15777304, 13912508, 10100112, 8567476, 9976909, 12291462, 13241720, 11839779, 9160744, 7667431, 8551343, 10268931, 10874178, 10554491, 10132672, 8729633, 5696693, 3594764, 5655815, 10525172, 13047803, 10647039, 5646160, 773579, -3899761, -8103430, -9078055, -4865371, 2331886, 8621460, 12676474, 15336946, 16636827, 15956411, 14212637, 13232252, 13277983, 13456740, 14187633, 16722527, 20227698, 22109105, 21826796, 21511004, 21462058, 18066127, 8985552]
7190H985552j0585841n013703K123600L857084L57977k954013l352871k354173
7182h936388q22067K095805M898120L877999r01312m271280l039941m12462l37725
7173g849251j193377Q81856N169632P401396N962504K869809k51715l055820m213849
7164E721185k481686K77546J050788M08110J264304L080538J987756k427164n153327
7155C728050k763905J356260J748664j558247l349935k69159M856251O252484
7147A0000463J934987l728021n046950j972746M24321l47128j057752O62594J499006
7138B368774j353658l742597r66395K762369k63294p796708r039066m25096R054677
7129i400994J0814489O557348J851312j997811n142960n708686m242459m947550
$$ y = [8985552, -1600289, -6613992, -4490392, -633308, -275331, -3229344, -6582215, -8936388, -9758455, -7662650, -2764530, 1113469, 212157, -4059123, -7099064, -7511526, -7849251, -9042628, -8160772, -2991140, 4410256, 10372760, 13242569, 12990854, 9935034, 5721185, 3239499, 3517045, 4567833, 4975943, 6240247, 9320785, 11308541, 8881377, 3728050, 964145, 2320405, 4069069, 2510822, -839113, -1108272, 3747979, 10000463, 11935450, 8207429, 3160479, 1187733, 1612054, 1264926, 207174, 869768, 2368774, 1015116, -2727481, -3693876, -931507, -1194801, -8991509, -18030575, -18455671, -9400994, 1413495, 7970843, 9822155, 7824344, 2681384, -3027302, -7269761, -12217311]
7121a2217311p511742m990356M309808J0678428O493838j372064k027657K805505
7113c831551L563498n41605k004823M80345R40971q97957J368255P088424O770132
7104A2935689j804357p766812l922012J404826k022345r452825q571800J207056
7096a7992580Q002340M825305j979566l278346J107603M500584K910146j138176
7088c042690k880170q92176K054019K880600J708331O72696M35418j13556j280698
7079d58226k068933j958696r83314J087804L064079J764804k778514l978151K984932
7070c324215J1067692Q361969m194839j2134581p732944n26084j432599o380638
7062a6296239n120150J583571N067705L962089M069969N721843L543236j579783
$$ y = [-12217311, -19729053, -24719409, -20409601, -9731173, -3237335, -4609399, -6637056, -3831551, -268053, -809658, -2814481, -2334136, -1393165, -2291122, -922867, 6165557, 12935689, 11131332, 3364520, -557492, 847334, -1175011, -10627836, -19199636, -17992580, -9990240, -5164935, -7144501, -10422847, -9315244, -4814660, -1904514, -3042690, -5922860, -6815036, -4761017, -1880417, -172086, 500610, 936028, 822472, -458226, -2527159, -4485855, -5469169, -4381365, -1317286, 447518, -2330996, -6309147, -3324215, 7743477, 16105446, 11910607, -223974, -7956918, -8483002, -9915601, -16296239, -21416389, -19832818, -14765113, -10803024, -6733055, -1011212, 2532024, 952241]
7054I52241k214902K482864M504148O88299j890334J394229M408265P16727n666402
7045E375135p005250l365158n50045r66932k744140m288332m159201O1626P325413
7036a0316884J0945438O528676q92096l367039r65912r6495k920880n005966l069726
7027i160884O39588K220278K99252l770933o826337n734655r57011L301250M656017
7018a5333435N024668M947268Q58244o933490r714636j978936P509462O746881
7010h873974p90080r11243Q672462J4323255P700583k441870n378649l350133
7002H950351l539851n276352m586671l542146n236194n670272m09455N834341
6994a3476249O042045K786496L120563N455509K695903l927031n849909j462358
$$ y = [952241, -1262661, 1220203, 5724351, 6412650, 4522316, 5916545, 10324810, 11041537, 5375135, -1630115, -4995273, -5545318, -6512250, -9256390, -13544722, -17703923, -17642297, -10316884, 628554, 7157230, 6265134, 2898095, 1932183, 1835688, -1085192, -6091158, -9160884, -8521296, -6301018, -6001766, -9772699, -16599036, -22333691, -23290702, -19989452, -15333435, -10308767, -5361499, -4503255, -11436745, -21151381, -23130317, -15620855, -8873974, -9664054, -10575297, -1902835, 12420420, 20121003, 17679133, 12300484, 8950351, 5410500, 134148, -4452523, -7994669, -13230863, -18901135, -19310590, -13476249, -7434204, -4647708, -1527145, 3928364, 6624267, 2697236, -3152673, -4615031]
6986d615031J969240J387935J712399M397193L364735l458499q423899n578225
6978i244152K38325J619769p67035j707181j9337K119367L764323M013146P11758
6969G28983m902239p000674l498564n10603k950477o034105l117919K739027L493787
6960b1052784p36255k388606R25657L642919K675296K054117M827915P577026
6952b474715O428047L006423R98040J183160K774950N424980O953936L493316
6944B7788137m333026r283457o134906N87540K655857k92195j293465K458833
6936A2153318N418804K883835j697921k826232j837002l711638p318914o014039
6928b949789J334034O813214M339287j408403j961492K872876N980288L770060
$$ y = [-4615031, -2645791, -1257856, 454543, 4851736, 8216471, 4757972, -3665927, -9244152, -9005827, -7386058, -8153093, -9860274, -9879611, -7760244, -3995921, 17225, 728983, -4173256, -11173930, -14672494, -15183097, -18133574, -24167679, -27285598, -24546571, -21052784, -21789039, -24177645, -23251988, -19609069, -16933773, -14879656, -10051741, -2474715, 3953332, 6959755, 7957795, 9140955, 11915905, 17340885, 24294821, 27788137, 23455111, 14171654, 8036748, 8624288, 11280145, 10987950, 9694485, 12153318, 17572122, 20455957, 18758036, 15931804, 14094802, 10383164, 3064250, -2949789, -1615755, 5197459, 9536746, 8128343, 6166851, 9039727, 15020015, 18790075]
6920A8790075n56222l977335p142495r770779q724314l130361L280809P090441
6912d140181Q127636O148347J93575o494877p307018j854395J448345k565183
6904f443751p135478l497553N625312J0293864P434371K237198j947712n945331
6896F20920p919904l717415M589126Q688827M911696j541476n024901n331536
6888d724663l268604K193055Q959431J0737995N221188k066319n854925p453461
6880C743697r032889p897201k152640L306403L259934O06861J398632M698180
6872b069023M936711K158936J672736M010781L583576j277446m636119k342092
6864F038060J406622J087497j743003k144345k20233j89118k860648m555511l288775
$$ y = [18790075, 18233853, 14256518, 7114023, -2656756, -11381070, -14511431, -11230622, -4140181, 3987455, 10135802, 10329377, 3834500, -3472518, -5326913, -3878568, -6443751, -13579229, -17076782, -11451470, -1157606, 6276765, 8513963, 6566251, 620920, -7298984, -11016399, -6427273, 2261554, 7173250, 5631774, 606873, -4724663, -7993267, -5800212, 3159219, 13897214, 19118402, 17052083, 11197158, 3743697, -5289192, -13186393, -15339033, -12032630, -8772696, -8165835, -6767203, -2069023, 2867688, 5026624, 6699360, 10710141, 14293717, 13016271, 8380152, 6038060, 7444682, 8532179, 6789176, 4644831, 4424598, 4235480, 1374832, -3180679, -6469454]
6855f469454j146822K32324K040946M418847M378366P94326j764622J296520O696635
6846A0477066O307840j424506q173196o327184J031139M489243K91912o164731
6838E07583q005077m279225O50152K341363P4935l048020l467028j193550N80553
6829a5838314O02267J631224N151016P175695L647553k126227k899373K286508
6821c69651O813315N738206R97135l378710n640869m512674R65288P040671O456964
6812A4109675j872906r113985p100638J043965N758895L491688r90333k809843
6804B516518k134189j473870k029320l112095k824746Q7439L416867K737740k013095
6795d828751m207460J068329Q749887R407714K123582m159195k897632J992507
$$ y = [-6469454, -7616276, -7383952, -5343006, -924159, 3454207, 4248533, 2483911, 3780431, 10477066, 16784906, 15360400, 7187204, 860020, 1891159, 6380402, 6672314, 507583, -7497494, -11776719, -11126567, -8785204, -8710269, -11758289, -15225317, -16418867, -15838314, -15236047, -13604823, -8453807, -1278112, 2369441, 243214, -2656159, -369651, 6443664, 12181870, 13179005, 9800295, 4159426, -353248, 612040, 7652711, 14109675, 12236769, 3122784, -3977854, -2933889, 2825006, 6316694, 5326361, 2516518, 382329, -1091541, -3120861, -6232956, -9057702, -8970263, -5553396, -2815656, -4828751, -9036211, -7967882, 782005, 10189719, 12313301, 8154106, 5256474, 7248981]
6787G248981K855968j151905m135143k276540J294796J224027k741391n432960
6779c114167l347651M65982R34451j434702j743928P39528Q47317l536178o536243
6770a6725591k881337L143861L554964j338792l767915l96313L590731L144849
6762a1675543j55392k476112l449608m382204m379308j713327K814155O471716
6754a8945623P519453N964201K531927j614331m729074n299895l416201j335685
6746a9325228j988852n446992p213752k883007M934635Q361116M917207J587539
6738a7057334M236444Q038404N103564k214848m532922n66606R13230m107598
6730a0187666p767020k639180O513459R606394M798377j096314k574922j71956
$$ y = [7248981, 10104949, 8953044, 4817901, 2541361, 3836157, 5060184, 2318793, -3114167, -6461818, -5995836, -5061385, -6496087, -8240015, -7500487, -6653170, -10189348, -16725591, -19606928, -16463067, -12908103, -14246895, -18014810, -18411123, -14820392, -11675543, -11830935, -14307047, -17756655, -22138859, -26518167, -28231494, -25417339, -18945623, -11426170, -5461969, -2930042, -4544373, -9273447, -14573342, -17989543, -19325228, -21314080, -26761072, -33974824, -36857831, -31923196, -23562080, -18644873, -17057334, -12820890, -4782486, 321078, -1893770, -6426692, -6993298, -6080068, -10187666, -17954686, -20593866, -14080407, -4474013, 324364, -771950, -3346872, -3518828]
6722c518828K770578L218814l06815n636802p420073l121039L035293N501320
6714e477552M835658N545762Q037926P817353K901770k654449m309756k768161
6706A3928551j895047k868952k933528K21444M580322N446800R60600n016163
6698A2424027o564185j954055M825162Q430508O753730J655077l015775m306665
6690A8247824k917545k689113n395289p280024m048872J938227M349320K468774
6682D673302J991283M983513N953955J369604l528031k860127L99763j75457l709288
6673I098517m373027j886281j314833l164568k116350L194146O860950M809504
6665A1108058O55264r49165j148762k847567m446767k640076J401997L475180
$$ y = [-3518828, -748250, 2470564, 2163749, -3473053, -10893126, -14014165, -10978872, -5477552, -641894, 4903868, 12941794, 20759147, 23660917, 21006468, 16696712, 13928551, 12033504, 9164552, 6231024, 6452468, 11032790, 16479590, 17440190, 12424027, 5859842, 3905787, 8730949, 17161457, 23915187, 25570264, 22554489, 18247824, 15330279, 12641166, 7245877, -34147, -4083019, -2144792, 2204528, 4673302, 6664585, 11648098, 17602053, 18971657, 15443626, 12583499, 12983262, 12807805, 9098517, 4725490, 2839209, 1524376, -1640192, -3756542, -562396, 6298554, 11108058, 11763322, 10814157, 9665395, 6817828, 2371061, -269015, 1132982, 4608162]
6657D608162K507694J207484J254627J273509m54974l724383o846597p726211
6649g900689n025393J01184M014768L948102R79750j444800j127823J854579O334242
6640A733920J0290695J0820953O249478j486698p878044r368616n498270J101565
6632E964983N645957M028766k717602p961352o470272j156346O79488k425409
6624d411787m187051k87289M751435M040040j594845m829165j922588L134615
6616e306635M900488K883436K77228o90126k71044J18044p33366k592017l337567
6607d751559j327082J617865K006020j3188k89015K910219N544545L587732q42965
6598H442572k866908k091038j951627l030608k200668J161680L075673R85222
$$ y = [4608162, 7115856, 8323340, 9577967, 10851476, 10396502, 6672119, -174478, -7900689, -12926082, -12824898, -8810130, -4862028, -3882278, -5327078, -6454901, -4600322, 1733920, 12024615, 22845568, 29095046, 27608348, 19730304, 10361688, 4863418, 5964983, 11610940, 15639706, 12922104, 4960752, -1509520, -2665866, -1986378, -4411787, -8598838, -8886127, -4134692, -94652, -1689497, -6518662, -8441250, -5306635, -406147, 2477289, 2754517, 2064391, 1793347, 1911391, 1178025, -1413992, -4751559, -6078641, -4460776, -2454756, -2467944, -2756959, 153260, 5697805, 9285537, 8442572, 5575664, 3484626, 1532999, -1497609, -3698277, -2536597, 539076, 1524298]
6590A524298k071935k076817O0402M62621j465480k187600N81622M286303M472870
6581C586284K17857m563912n311800j664253K536044L810966K436083R85218J024270
6572C056757K230293L354499K781768l33129l950051m060025O1232L493405J603787
6563H238536l359346n299661k590215R16837K368515K525902J975578r813j937031
6554B829302o41248K980859L835442M55624k037880J82392L517715K614722j651472
6545A2085456m142404k588098J148376M490547N285195K028366l475537o120275
6537H711626l639952j09556J98760q40966N35546K803588K118087k3067J068270
6528A0822336M507246M412786k17925l164088o46105K712985J024822m329160
$$ y = [1524298, -547637, -2624454, -2564052, -2101431, -3566911, -5754511, -5172889, -886586, 3586284, 3804141, -759771, -6071571, -7735824, -5199780, -1388814, 1047269, 2032487, 3056757, 5287050, 8641549, 11423317, 11090188, 7140137, 3080112, 3141344, 6634749, 8238536, 4879190, -420471, -3010686, -2093849, 274666, 2800568, 4776146, 4766333, 2829302, 2188054, 5168913, 9004355, 9459979, 7422099, 7604491, 11122206, 13736928, 12085456, 7943052, 5354954, 6503330, 10993877, 16279072, 18307438, 14831901, 8711626, 5071674, 4962118, 5160878, 4319912, 4855458, 7659046, 9777133, 9754066, 10822336, 15329582, 19742368, 19524443, 16360355, 15714250, 18427235, 19452057, 15122897]
6520A5122897p407792o129321l870136l683438m274225k293040K988562Q314344
6512a232149R847665P372763L923095J349730j350802m366550n019799k098686
6504H425267P04952l48254k950469k215360J277150K388253n8093j584384J21987
6495E761049J434928p57372l665893l088913J24723J765923M78593r33706K46095
6486A365427L140521M046096M52911n124111o452057r44696N539181N130527j262358
6477E891441m711971r20977L592093J321517n064052o685418r45564N655277O777662
6468D910008L335871J86858m90175k68651r95015k581894l752443l401443j227098
6459d283982J801244L407353J793966j662619k889324q0519K983361J455824l346242
$$ y = [15122897, 7715105, 1585784, -2284352, -5967790, -10242015, -12535055, -9546493, -1232149, 8615516, 15988279, 19911374, 21261104, 19910302, 15543752, 10523953, 8425267, 9130219, 8781965, 5831496, 3616136, 4893286, 7281539, 7223446, 5639062, 5761049, 7195977, 6438605, 2772712, -316201, -191478, 1574445, 2053038, 1119332, 1365427, 4505948, 8552044, 9004955, 3880844, -2571213, -3515909, 2023272, 7153799, 5891441, 1179470, 258493, 3850586, 5172103, 108051, -6577367, -7522931, -1867654, 4910008, 8245879, 8432737, 7942562, 7673911, 6678896, 4097002, 344559, -3056884, -4283982, -2482738, 924615, 2718581, 1055962, -1833362, -1913881, 1069480, 2525304, -820938]
6450h20938n318916k723752q40828l058338m755730p40849N843050Q365526P031689
6441B980914O818924P204412K795499n559924r318034m637220J446480J243546
6433B974597l486365o204509n128522l019241j268217P63743K779748L785763
6425h803003L570411J612713k792077p217043o584266P5640O726353P303254K503931
6416c604087l003892o287886n993872r94555O377515R546434N091773j949260
6408h17830m607755k634871m6447K154770M793345N237646M97984n868761o950312
6399h242231k254914J991246K291202J449927K149416K893062J774840n46515
6391A506033k820070l979185j747652M612020R985522P745103m48843n342261
$$ y = [-820938, -6139854, -8863606, -9704434, -12762772, -17518502, -18259351, -12416301, -4050775, 2980914, 9799838, 17004250, 19799749, 14239825, 4921791, 284571, 1731051, 2974597, -511768, -6716277, -11844799, -14864040, -16132257, -15368514, -12588766, -8803003, -5232592, -3619879, -6411956, -13628999, -20213265, -20137625, -13411272, -6108018, -3604087, -6607979, -12895865, -18889737, -19884292, -13506777, -3960343, 1131430, -817830, -5425585, -8060456, -8106903, -5952133, -1158788, 4078858, 4576842, -1291919, -8242231, -10497145, -8505899, -6214697, -4764770, -2615354, 277708, 2052548, 1506033, -1314037, -5293222, -7040874, -2428854, 7556668, 15301771, 14852928, 9510667]
6383I510667k717667R10473j360512o708395p874881m065252n35561J24385J72107
6374a2544636R06849K75373k599683m541624k112566L619478P814675O896888
6366b285246K229613j249307l17956K767563K967523r68889m719010m329832j538794
6357g444335n37742j216201L16351M506952O261783K449601k140776o72358N548740
6348G072015P972957K548102m558441n694659j828519N08719p56235k085746j785717
6339A392476k061263l078405j456768L070361N359306K589519r27000q75536j04055
6330C908635l329011q473763r434855n067451O51485N542209R818381J0984119
6322D599749N586881l095992o126557l20459O773895O392473j078092q208195
$$ y = [9510667, 6793000, 7703473, 6342961, -365434, -8240315, -12305567, -12841128, -12716743, -12544636, -11637787, -11362414, -13962097, -18503721, -20616287, -16996809, -9182134, -2285246, -55633, -1304940, -1622896, 1144667, 4112190, 3143301, -1575709, -5905541, -7444335, -7982077, -9198278, -8881927, -4374975, 1886808, 4336409, 2195633, 1523275, 7072015, 15044972, 17593074, 13034633, 7339974, 5511455, 6020174, 5263939, 3178193, 1392476, -668787, -3747192, -5203960, -2133599, 3225707, 5815226, 4888226, 4012690, 3908635, 579624, -7894139, -17328994, -22396445, -21744960, -16202751, -6384370, 4599749, 10186630, 7090638, 964081, 643622, 7417517, 13809990, 12731898, 4523703]
6314D523703r468012m966376J831171O654774O393479J691023k786089k559787
6306A313886K204902O990223P093645J678112n039373p042566k865014J805613
6298F139428M71339n601270q701425n081989N5341O8964m083027n638685j103111
6289b3474435N686951Q233271M014076l475307p971347n901340L74310M870209
6281a7643612M134953P69681P3586L377540N912427K534025m685231p062589K68875
6272a2320345J0428146J1691359K357480o668104o229131j66442K141070o58539
6264E75494k466921o72934J283645J373776J455240J678818n89428m608080n386536
6255g356926j350101K809290L668957L989908O576611Q221173M580454k123934
$$ y = [4523703, -4944309, -9910685, -8079514, -1424740, 4968739, 6659762, 3873673, 1313886, 3518788, 10509011, 17602656, 19280768, 14241395, 7198829, 4333815, 6139428, 6610767, 1009497, -7691928, -12773917, -12718576, -12649612, -16732639, -22371324, -23474435, -17787484, -9554213, -5540137, -9015444, -16986791, -22888131, -22513821, -17643612, -13508659, -12738978, -12665392, -9287852, -3375425, -841400, -5526631, -12589220, -12320345, -1892199, 9799160, 12156640, 5488536, -740595, -907037, 1234033, 575494, -1891427, -2564361, -1280716, 93060, 1548300, 3227118, 2637690, -1970390, -7356926, -8707027, -5897737, -2228780, 1761128, 8337739, 16558912, 21139366, 19015432]
6247A9015432n288822k688603P92825n49406o187235r344473m424472N343453
6239c331301R884196M110035m977889p168329k340583J280230L29488l76030K020974
6230e69209L803766K693718K152418L850931L572753o23409l462648j307782R26131
6221A1036669j684284m900930k414712L039253M066623L40696k552734l224693
6213C705888m784780o680542m897480p7503K512154J738660K115825N384753P270964
6204F287939M709300P83310l1749K396110M758028M010357o21387o598962r047200
6195F645746n684637k95859J706404P7665j303512o66036P17351K387001M712245
6186H296368O056565M677750K453452J987720J558053j576113m630407k852135
$$ y = [19015432, 13726610, 11038007, 11830832, 11281426, 5094191, -4250282, -8674754, -3331301, 6552895, 10662930, 5685041, -1483288, -3823871, -2543641, -2214153, -2590183, -569209, 3234557, 5928275, 8080693, 11931624, 15504377, 14880968, 11418320, 10110538, 11036669, 9352385, 4451455, 2036743, 5075996, 9142619, 9483315, 6930581, 3705888, -1078892, -7759434, -12656914, -12734417, -10222263, -8483603, -6367778, -983025, 6287939, 10997239, 11780549, 11748800, 14144910, 18902938, 22913295, 22291908, 15692946, 6645746, 961109, 665250, 2371654, 2449319, 1145807, 479771, 1197122, 3584123, 8296368, 14352933, 19030683, 21484135, 23471855, 25029908, 23453795, 18823388, 15971253]
6178A5971253J518760J619062k706369m193203J3658M212214M211028L169765
6170B3816168L687999K186279l491952p892400n829407r95516R8663j491540n5625
6161A0032669M220627N002501m01805o961242q360863l643120K939807N987798
6153H816372L178298k384978m919117k763399m74820j954436m290895k223264
6145g016239L285010N728586K175583k557307k296866K489120N142189R63930
6137G914006o294258p755387k98342Q051894P280734j215431o036069j435500
6129B11647N145571M683971p95912l263700j362898j73771j024028j83881K484160
6120E721159J936496k969353n980016k614961K717512L119506j220757m377734
$$ y = [15971253, 17490013, 19109075, 16402706, 12209503, 12223161, 16435375, 20646403, 23816168, 27504167, 29690446, 26198494, 18306094, 12476687, 11481171, 11579834, 10088294, 10032669, 14253296, 19255797, 18853992, 11892750, 3531887, -111233, 2828574, 8816372, 11994670, 9609692, 4690575, 1927176, 1452356, -502080, -4792975, -7016239, -3731229, 1997357, 4172940, 1615633, -681233, 1807887, 6950076, 7914006, 1619748, -6135639, -6433981, 1617913, 8898647, 7683216, 1647147, 211647, 5357218, 10041189, 9245277, 5981577, 4618679, 4444908, 3420880, 3236999, 5721159, 7657655, 4688302, -1291714, -3906675, -1189163, 1930343, 709586, -3668148]
6112c668148l051092P81555M119902N761042N268503K681998k16714r48392N50304
6103A1278958J693517P80523r29699j538112j254233j306179j246479M50700L161710
6094A1090706L809137Q97052k967772m362863l444279k657423k151813K759K924782
6085C140286K486559k171964n398923j975691M956047P201576J911433n496183
6077D653140q817559p266584l338232J115845M271191L504321j087157m531375
6069a1496410k332963L083119N189981K220342r78262m74341J792279K413478
6061e82777J667449J179788J00510k114690k050232K992208Q344338O564293j263911
6052A4836976n799655k786144J063116p03810m158105k442389K166800K116798
$$ y = [-3668148, -6719240, -5937685, -1817783, 3943259, 9211762, 11893760, 11677046, 10728654, 11278958, 12972475, 13752998, 12823299, 11285187, 10030954, 8724775, 7478296, 7928996, 11090706, 14899843, 15796895, 12829123, 8466260, 5021981, 2364558, 212745, 215504, 3140286, 5626845, 3454881, -1944042, -3919733, 1036314, 8237890, 10149323, 4653140, -4164419, -11431003, -14769235, -13653390, -9382199, -5877878, -6965035, -11496410, -13829373, -10746254, -5556273, -3335931, -4314193, -4788534, -2996255, -582777, 1084672, 2264460, 2364970, 250280, -1799952, 1192256, 9536594, 16100887, 14836976, 9037321, 6251177, 7314293, 6610483, 2452378, 9989, 2176789, 4293587]
6044D293587k330780l118398K384079O770450L684488l402760p115984n662566
6036d497884k480343k62854P12271P03948J74907q5338k36439j036888j478384
6027h487004L90266L482525M170912J998134O57632J404633L18461m691023q779777
6018i535241o559968j25748M088780L899623K139645R51543J12745l22493j22960
6009e474074n26912j866802j120237L734190Q400621O538553j111961p037427
6001A535951o698593l170535j247997j488344j696055o37614J530933L924772
5993g947482M840210L166158K75591j654193k685757l614170k570338K433697
5985g756284P974662P635046R33194n361970o417405m582953l427239k408302
$$ y = [4293587, 1962807, -1155591, 1228488, 7998938, 11683426, 8280666, 1164682, -4497884, -6978227, -7241081, -6528810, -5824862, -5649955, -5735293, -5971732, -7008620, -8487004, -8096738, -4614213, -443301, 1554833, 2212465, 3617098, 3935559, -755464, -9535241, -16095209, -16220957, -12132177, -8232554, -6092909, -5141366, -5028621, -5351114, -5474074, -6000986, -7867788, -8988025, -5253835, 3146786, 9685339, 8573378, 1535951, -5162642, -8333177, -9581174, -11069518, -12765573, -13403187, -11872254, -7947482, -3107272, 58886, 334477, -1319716, -4005473, -7619643, -10189981, -7756284, 218378, 7853424, 8786618, 3424648, -2992757, -7575710, -11002949, -13411251]
5977a3411251q85538j498662m463589l844979L724511J0764733P732056k078890
5969c961609n760027P81996P311878N292135J12210Q60956N262220M189189k532013
5960A1556935n331286j81585N038871K956522k497030l489830p08363q71424m760269
5951A712541n827548r85870M283132M040324j43693k759097k299289j727208k813639
5942f520347l671847j940487J769555M303750L428643O77460j44986J807604K442955
5933B152300j362294n594679l602989L435206O478485J078005n849167n554520
5925h819653R12510N507773M174456k72409l871965m843389k680824J210093L115590
5916e567818J569226N59847L402968N722035J085765p631071j0373843m218354
$$ y = [-13411251, -14296789, -15795451, -20259040, -24104019, -20379508, -9614775, -1882719, -3961609, -9721636, -8939640, -1627762, 3664373, 3776583, 4637539, 9899759, 14088948, 11556935, 6225649, 6044064, 11082935, 14039457, 11542427, 8052597, 7344234, 6472810, 1712541, -4115007, -5100877, -817745, 3222579, 3078886, 319789, -1979500, -3706708, -6520347, -10192194, -12132681, -10363126, -6059376, -2630733, -1953273, -2098259, -290655, 2152300, 790006, -4804673, -8407662, -4972456, 1506029, 2584034, -3265133, -8819653, -7907143, -2399370, 1775086, 1502677, -2369288, -7212677, -9893501, -8683408, -5567818, -3998592, -3438745, -35777, 5686258, 6772023, -859048, -11232891, -15451245]
5908a5451245K282576J791809j960489j520194K911602N357725L764854J674724
5900a148638J456880J184996j097805l523701k398845L046521Q773358R297792
5892A5590558L596709l144763n293495l181301j080581j49049J952767M548985
5884A2839830L067218l122026p535633n051786Q69916L797491L279689K999700
5876A1144399L059267L63155m507568o914352n069036k296501j407432j125465
5868f753533M55957K530963L486154L314535K483359Q38400p90076k56107K658362
5859G968014M596994K592699j479857k929414m66466K065508J037856j867264
5851A1518070k052220J130984K787340q42276o441165p380843k450403K898867
$$ y = [-15451245, -13168669, -11376860, -13337349, -14857543, -11945941, -6588216, -2823362, -1148638, 308242, 1493238, 395433, -3128268, -5527113, -2480592, 6292766, 15590558, 19187267, 16042504, 10749009, 7567708, 6487127, 6338078, 8290845, 12839830, 15907048, 12785022, 5249389, 197603, 1067519, 4865010, 8144699, 11144399, 14203666, 14566821, 10059253, 3144901, -1924135, -4220636, -5628068, -6753533, -6297576, -3766613, -280459, 3034076, 5517435, 6355835, 5565759, 5309652, 7968014, 12565008, 15157707, 13677850, 10748436, 10281970, 12347478, 13385334, 11518070, 9465850, 10596834, 13384174, 12541898, 6100733, -1280110, -3730513, -831646]
5843h31646M319280L422270L132440K425698o11916l516405k124263K624279N212872
5834A4052609K889327j537074m495998n204619l702947L03392M742702N167171
5826A2214563K50829n472062p088781n060599k674368l93055L291263P062397
5818B130187P466244M236833Q56510o55048j751185l421159m177589l473984l316157
5809b105348m259474l452390M16192L795761L790469L592090O989093R978402
5801A8744795N120721n801624j1242892m848795N470297P903459J319609n880665
5793A0784905q002116o833429n473681l552911J55424M354537O270699M422222
5785B125650j3149l486092k738909J188656L209889N65316l171045l357935j070662
$$ y = [-831646, 3487634, 6909904, 10042344, 12468042, 11856126, 8339721, 6215458, 8839737, 14052609, 16941936, 15404862, 10908864, 5704245, 2001298, 2304690, 7047392, 12214563, 12465392, 6993330, -95451, -5156050, -7830418, -8223473, -4932210, 2130187, 9596431, 13833264, 14689774, 14034726, 12283541, 8862382, 4684793, 1210809, -2105348, -6364822, -9817212, -9401020, -5605259, -1814790, 1777300, 8766393, 18744795, 23865516, 18063892, 6821000, 1972205, 7442502, 15345961, 16665570, 10784905, 2782789, -4050640, -9524321, -13077232, -12921808, -8567271, -2296572, 2125650, 2112501, -1373591, -4112500, -2923844, 286045, 851361, -2319684, -5677619, -6748281]
5776f748281l91766r62580J245258O316255R265303P262823K939897o41080l479755
5767A4806074n534445m819553j013560K673520L478232K030775n0357k266326
5759I304360l774765l391831k226818k583865l388295j233575K979443L944496
5751c70850M13175k205566o34904J088109o47668k203728Q60321N707329O833803
5742H840021M448042J796813j727453p367979j0312143m882523N044407R304559
5734E143744N116784k96641j302508k59411o23949j138146j47796L22701j358009
5725E456769k856672j988933o54713j159612j720201O52914M778168O317009L530170
5716A2354899n20327j840002l55114L7480l126488o305995l656501M037718Q412447
$$ y = [-6748281, -7140047, -8102627, -6857369, -541114, 8724189, 15987012, 18926909, 18285829, 14806074, 9271629, 4452076, 3438516, 6112036, 9590268, 11621043, 11570686, 9304360, 5529595, 2137764, -89054, -2672919, -6061214, -7294789, -4315346, -370850, 42325, -2163241, -2798145, -1710036, -2357704, -4561432, -3701111, 2006218, 8840021, 13288063, 15084876, 13357423, 5989444, -4322699, -9205222, -4160815, 5143744, 10260528, 9963887, 8661379, 8401968, 7778019, 6639873, 6492077, 6814778, 5456769, 2600097, 611164, -43549, -1203161, -2923362, -2270448, 2507720, 8824729, 12354899, 11834572, 9994570, 9639456, 9676936, 6550448, 244453, -3412048, 625670, 9038117]
5707I038117M420949k260447l598198q01159o30098l287648k908222Q95870J767704
5698B636868j843070l501414k67069J814222j588256n313633l759999l53457p09158
5689a2884966k403091K98573N937521Q342238O518009M199057K056550j642849
5681A0421042m508223k596259J320062O12833l865085m046429K193000O894163
5673F425104M429171J06922J255375O061012P480014L887821n06162l140531m963293
5664B1035433o175136n494791l351386j498294K81396L171380N466517M079438
5656A7514557J38034j420636R90419L114175J460900j577454k091767o75773l24334
5647A7128121r75860o38434k17396k046446m202611k109124L101901L757796l696466
$$ y = [9038117, 13459066, 11198619, 7600421, 6799262, 6169164, 2881516, -26706, 869164, 2636868, 793798, -2707616, -2974685, -1160463, -2748719, -8062352, -11822351, -12175808, -12884966, -15288057, -14989484, -9051963, -709725, 5808284, 10007341, 12063891, 10421042, 5912819, 3316560, 4636622, 5249455, 1384370, -2662059, -469059, 6425104, 10854275, 10961197, 12216572, 18277584, 25757598, 29645419, 29139257, 25998726, 21035433, 14860297, 9365506, 6014120, 4515826, 4797222, 7968602, 13435119, 17514557, 17652591, 16231955, 17222374, 20336549, 21797449, 20219995, 18128228, 17452455, 17128121, 16152261, 15513827, 15296431, 13249985, 9047374, 6938250, 10040151, 13797947, 10101481]
5638A0101481j2151808j2496001n308075J252582K788805K061355K145357K507529
5630i098775K756718M594998P640973P655100J971505o039374j0411092q550443
5622i480390k426728L601639M816018o72791q408945j0188038l023102O776276
5614a9006061J1198380R758385P785859P656163O283049J157932n110504p754276
5606A1968927n413143j494011l70130k465895l599984m11830M202995M011937
5598F428866j775141o532594m963604J08459K852374K647744K787404L831292
5590E384800L554472J992104J326678J536329J082038J186281M011484O788138
5582B6862324L791114m705802j1113810j0197501n164875j893522j718581k502130
$$ y = [10101481, -2050327, -14546328, -19854403, -18601821, -15813016, -13751661, -11606304, -9098775, -6342057, -1747059, 5893914, 13549014, 15520519, 9481145, -929947, -9480390, -11907118, -8305479, -3489461, -4162252, -12571197, -22759235, -25782337, -19006061, -7807681, 1950704, 9736563, 17392726, 23675775, 24833707, 19723203, 11968927, 6555784, 5061773, 4691643, 2225748, -1374236, -1786066, 2416929, 6428866, 4653725, -1878869, -6842473, -6734014, -3881640, -1233896, 1553508, 5384800, 8939272, 10931376, 12258054, 13794383, 14876421, 16062702, 20074186, 26862324, 30653438, 25947636, 14833826, 4636325, -528550, -2422072, -4140653, -6642783]
5574f642783k513162m86347M008917P525642M710979l284017p412708k489739
5566f583218M470443L911602k302116m505513n12550J975718j216992m162487
5558h925113j319777K925389J102052n614128q844303m227517M058364R355392
5550a1489641Q925031M375725p73147l347187k678187r23441J19720J563485M605488
5541C77846O549145L573589k397986m068195J748356Q447788P115660j904718
5533A9441485q870948o313647K427530P848017N222379j447505n575108n352924
5525G379279l882860l681970l568663j561980J144809J396703r62012j871547
5517e608241J652018O662248P405771L101621n26715R09551L824945J399335o115209
$$ y = [-6642783, -9155945, -9642292, -5633375, 1892267, 6603246, 3319229, -4093479, -6583218, -2112775, 1798827, -503289, -5008802, -5521352, -3545634, -4762626, -8925113, -10244890, -7319501, -6217449, -11831577, -20675880, -24903397, -20845033, -11489641, -2564610, 1811115, 1037968, -2309219, -4987406, -5910847, -5791127, -4227642, 377846, 6926991, 10500580, 8102594, 4034399, 5782755, 14230543, 21346203, 19441485, 10570537, 4256890, 6684420, 14532437, 19754816, 18307311, 12732203, 7379279, 3496419, -185551, -3754214, -5316194, -4171385, -2774682, -3736694, -5608241, -3956223, 2706025, 10111796, 13213417, 12686702, 13596253, 17421198, 18820533, 12705324]
5508A2705324j0585067p000160p54073N3788l613930l686500K089272O234273
5500d557073K905155l140717l813345N71044K979327N11670k993752m164229l384078
5491a5085998r39635L446370O345456K947688m163467n787341O60669N867099
5483f709159K066451m863995m334680L000042P341518M946699J431818M11273
5475C289967j374603n634035p881726m963441n06045J227721J420408K517564
5467a1904190K867513K16746l118617l198702j23560K956440M257121L733503
5459d313746J631816k47265J334409O151158Q391390L463536n070847r409827
5451A930624o922718j824319J418182K466176L213782M709614O222340N737674
$$ y = [12705324, 2120257, -4879903, -5633976, -5580188, -9194118, -12880618, -10791346, -4557073, -1651918, -4792635, -8605980, -8034936, -5055609, -4543939, -7537691, -11701920, -15085998, -16025633, -12579263, -6233807, -3286119, -7449586, -13236927, -12576258, -6709159, -4642708, -9506703, -13841383, -10841341, -3499823, 1446876, 2878694, 3289967, 1915364, -3718671, -11600397, -16563838, -17069883, -15842162, -14421754, -11904190, -9036677, -8819931, -11938548, -15137250, -15260810, -12304370, -8047249, -4313746, -2681930, -2929195, -1594786, 4556372, 12947762, 16411298, 11340451, 1930624, -4992094, -6816413, -5398231, -2932055, 281727, 4991341, 11213681, 16951355]
5443A6951355K137172k116722k749776K97072J912473m95602k340183Q48616N320811
5434A9765216M464582k31723r51775M128114P720531M250908k602009o014067
5426C0529777m538758j184881J913535M015478L624006k96409n838822r398751
5418A8825175r055055n631837j363359J643044K625693K405663J666675l63679
5410A0752320l757019n430936k106232M234270P403074M577921k93801k040842
5402A3338755l73925J260858N03330k147081m602902m675621j737713K039784
5394C605485L491055J932907q45511l755033o633380p344415k865378N221145
5386g193125J0311897Q335641K519776j744510l346590l836985k958306J5948
$$ y = [16951355, 19088527, 16971805, 14222029, 14519101, 16431574, 15935972, 13595789, 14444405, 19765216, 24229798, 23998075, 23046300, 27174414, 34894945, 39145853, 36543844, 30529777, 25991019, 24806138, 26719673, 30735151, 34359157, 34062748, 28223926, 18825175, 9770120, 4138283, 2774924, 4417968, 7043661, 9449324, 11115999, 10752320, 6995301, 1564365, -541867, 3692403, 11095477, 15673398, 15379597, 13338755, 12964830, 14225688, 14729018, 12581937, 7979035, 3303414, 1565701, 3605485, 7096540, 9029447, 8183936, 4428903, -2204477, -9548892, -12414270, -7193125, 3118772, 11454413, 13974189, 12229679, 8883089, 5046104, 2087798, 2103746]
5378B103746K989283L514348K832900L175201K731351j581397p158878p328290
5370A278264q75814N344265N532317K129548O76333J285123q9733l743726m892765
5361F643812j033148L578885L342925j198339m417745l277437o54877m16919k193247
5352C73910l001198j919734m54821N26677J318098J467471M39737l5112K279786
5343I94814N663712N538047J234820k231467j255027J278684J013583j232238
5335A1004928j872633r50829j328239k892649k533802K20373J888158o5331m340444
5326h70468p992509q449459l962836L950287R004591O118520p85911k629089K014287
5317c602587M561740k80460o053873m805148O30618K429656J055550K800824O325209
$$ y = [2103746, 5093029, 8607377, 11440277, 14615478, 17346829, 15765432, 8606554, 1278264, 402450, 5746715, 11279032, 13408580, 14084913, 15370036, 15280303, 11536577, 6643812, 5610664, 9189549, 12532474, 11334135, 6916390, 3638953, 2984076, 2567157, 373910, -2627288, -4547022, -5001843, -4475166, -3157068, -1689597, -1249860, -1284972, 994814, 6658526, 12196573, 13431393, 11199926, 9944899, 11223583, 12237166, 11004928, 9132295, 8181466, 6853227, 3960578, 1426776, 1647149, 3535307, 3469976, -870468, -8862977, -17312436, -21275272, -17324985, -8320394, -2201874, -2987785, -5616874, -3602587, 959153, 678693, -5375180, -10180328, -9549710, -7120054, -6064504, -3263680, 3061529]
5308C061529L180733o693034j1325478l782233O540449P276823M67049k764261
5300d038423R0810J479839j708035l526659o12154J724209n79021k666943P68533
5291i067844N624717M452904j376137l375830J393837O443530N450055J59744
5283I704976l193512j462518L462586P577251P724839L371534k915464p381526
5275A6888166q061579n532412j418490K527360M510012L748750J485037l58558
5267A3788286j255200j719247j764397j319258j300683k358564l256742k457970
5259a643775o17380N16178Q62827J414995J717434O27626q25433j22132L013491
5250D943831N740128N225963J332357l271813m671381j169743L333466K383246
$$ y = [3061529, 6242262, -450772, -11776250, -15558483, -9018034, -1741211, -1274162, -4038423, -3947613, -2467774, -4175809, -7702468, -8314622, -6590413, -7169434, -9836377, -9067844, -3443127, 1009777, -366360, -3742190, -2348353, 4095177, 9545232, 9704976, 6511464, 5048946, 8511532, 16088783, 23813622, 27185156, 24269692, 16888166, 8826587, 3294175, 1875685, 4403045, 8913057, 12661807, 14146844, 13788286, 12533086, 10813839, 9049442, 7730184, 6429501, 4070937, 814195, -1643775, -2261155, -1744977, -882150, 532845, 2250279, 2877905, 2052472, 1930340, 4943831, 10683959, 15909922, 17242279, 13970466, 9299085, 8129342, 11462808, 13846054]
5242A3846054m006867p217034j380249P043655P689287J305372k163530P03072
5234A5819760K848445k15126l465626k298755k86181j410769k304836J071987
5226I758899N316722N186477K033619l89820l433102q955971j1811094o130059
5218h424329L721748P848757M887395K039587J981124p436m814699n809955M1969
5209A464161O176103O251648K698852M88583r21241l619775n141748l108241j337571
5200B950771l954739o842820l096449M820994P138603J511038k860908J054088
5192G20578P540835O691539j219380o429268k936810M993607R873765R433217
5184B8668083O143999K189110j857177n052109n892897m131438j104625J726581
$$ y = [13846054, 9839187, 2622153, 1241904, 8285559, 15974846, 17280218, 15116688, 15819760, 18668205, 18453079, 14987453, 12688698, 12402517, 10991748, 8686912, 9758899, 15075621, 20262098, 22295717, 21905897, 18472795, 9516824, -2294270, -8424329, -4702581, 3146176, 8033571, 10073158, 12054282, 12046846, 7232147, 1422192, 1464161, 7640264, 13891912, 16590764, 17079347, 16158106, 12538331, 7396583, 4288342, 2950771, -1003968, -7846788, -10943237, -6122243, 1016360, 2527398, -333510, 720578, 8261413, 14952952, 13733572, 7304304, 4367494, 9361101, 19234866, 28668083, 34812082, 37001192, 35144015, 30091906, 24199009, 20067571, 18962946, 20689527]
5176B0689527L413614L057906K39860l793072o425204n800770k587359L82666
5168I177168N86668j205369q63243M152468R713998Q319201q05129q792886q135314
5159A2147562l154792l586696r637646j1154986k741149P885234J0370338M703963
5151D831828j170644k446466p23112J078409J646820L46915k128834k846294m7478
5142a458856L351368L179559O123j943570j123748l8560n45100j719054k739542
5133c031380m104890m976120k789446K633854P119877O534219J856941k099492
5125A143563k610315j914112l443014o251520n360325J296322Q333009Q372414
5117d33978J437242m747128m322864O35989M828353O264030N643007L162962m12567
$$ y = [20689527, 24103141, 27161047, 27400907, 23607835, 17182631, 11381861, 8794502, 9177168, 9763836, 8558467, 7695224, 11847692, 21561690, 29880891, 29075762, 20282876, 12147562, 8992770, 5406074, -4231572, -15386558, -18127707, -10242473, 127865, 4831828, 3661184, 1214718, 491606, 1570015, 3216835, 3563750, 1434916, -1411378, -1458856, 1892512, 5072071, 5078194, 3134624, 2010876, 1972316, 1427216, -291838, -3031380, -7136270, -12112390, -14901836, -12267982, -5148105, 1386114, 3243055, 1143563, -1466752, -3380864, -6823878, -13075398, -18435723, -17139401, -8806392, -433978, 1003264, -3743864, -8066728, -7430739, -2602386, 3661644, 9304651, 12467613, 12055046]
5108A2055046k317428j133113M45475o12173l170831m179926l129936j245610
5100c288496J181634L442488L323898R15125J10130K187964J997342l809165q840090
5091b779170m933477M659289Q913417M858825L48054L24821L55605k875881m195909
5082D675574P69956O273807M249899l029648o224678k870599j62946l265109p774451
5073g358195o925551j514366K051631J543723J486073N072624Q273648N768296
5065H397883q7257j721594K627431O303511M322192K38198n78732P49143K38377
5056B0489152j066179P31320M443596M552487l92536n452660n794026j616379
5048A5894775L320909M887284J200797m684810o137496m65057O650594P832412
$$ y = [12055046, 9737618, 8604505, 9049980, 8437807, 5266976, 1087050, -2042886, -3288496, -2106862, 1335626, 4659524, 5574649, 5684779, 7872743, 9870085, 6060920, -2779170, -7712647, -3053358, 5860059, 10718884, 11066938, 11391759, 11747364, 8871483, 4675574, 5445530, 11719337, 15969236, 12939588, 6714910, 3844311, 3681365, 416256, -7358195, -14283746, -15798112, -13746481, -12202758, -10716685, -5644061, 2629587, 8397883, 8310626, 6589032, 9216463, 15519974, 19842166, 20080364, 19501632, 20250775, 20489152, 19422973, 20154293, 24597889, 29150376, 28757840, 23305180, 17511154, 15894775, 19215684, 24102968, 25303765, 20618955, 14481459, 14016402, 20666996, 28499408]
5040B8499408K984316k223084m161706l163527n78437J172918j305333p017832
5032A4206723q875739l077674M141374N821231M992579P340224Q841024K566648
5024C5956390o198068n693539K747098N480179k176847j0096382j1336460j0980073
5016b297702j2247999q811359J383857Q100360M251055j900284k39755N304361
5008f457466N382585J402473J123127M119428L724623n3997p25859L030420N332844
4999A6878178K606847k068237m336936l244344p99868j2485j914608k979405Q36557
4990D965699O230710M885117l686019q989092l790735N662673R283175O232029
4982B0793557K061818q45420k922190k912577p61564m79083l963959o647696m832723
$$ y = [28499408, 31483724, 29260640, 25098934, 21935407, 21356970, 22529888, 21224555, 14206723, 5330984, 2253310, 6394684, 12215915, 17208494, 24548718, 33389742, 35956390, 29758322, 24064783, 26811881, 32292060, 30115213, 20018831, 8682371, -2297702, -14545701, -23357060, -21973203, -13872843, -9621788, -11522072, -11761827, -6457466, -1074881, 327592, 1450719, 5570147, 9294770, 9240773, 8514914, 11545334, 16878178, 19485025, 17416788, 13079852, 9835508, 9035640, 9023155, 7108547, 4129142, 4965699, 11196409, 16081526, 12395507, 3406415, -384320, 5278353, 14561528, 20793557, 22855375, 22009955, 19087765, 16175188, 15413624, 14934541, 10970582, 4322886, -509837]
4973e09837j900003j563621j183974J870587L768449J285791j067570J261692
4965A961514M158969K020436k041947j698816J897658L198966J464924p29678
4957A0232026l332537o010490n071721k52120J849553j628848l391997J681151
4949e924983O437916L523330j313089M06970M535701K345159l424654m381721
4941B204629j809114j844551j502366N062375J1548943P252712l680161p190325
4933A0042142j297666K881413O10957j921998j959244l442687n523829k491631
4925c102543L928862N624032J870208m01429O73305J333469K252363N901201O836372
4916B4915840q26323r471656p343104J375840K915840k707723l297422K833830
$$ y = [-509837, -2409840, -3973461, -5157435, -3286848, 481601, 1767392, 699822, 1961514, 6120483, 8140919, 6098972, 4400156, 6297814, 9496780, 10961704, 10232026, 6899489, 888999, -4182722, -4434842, -2585289, -4214137, -7606134, -5924983, 512933, 4036263, 2723174, 3130144, 7665845, 10011004, 6586350, 2204629, 395515, -1449036, -2951402, 2110973, 13659916, 20912628, 17232467, 10042142, 8744476, 11625889, 12236846, 10314848, 8355604, 4912917, -610912, -3102543, 826319, 6450351, 8320559, 7919130, 8592435, 9925904, 12178267, 18079468, 24915840, 24089517, 14617861, 7274757, 8650597, 11566437, 8858714, 5561292, 8395122]
4908H395122N663221L874124N906617J0603694P768694j024997l263150J526690
4900C9450015J041072n919584o918736M99867M924172L168089L764896O676684
4892D6686475L141439l096929L10702Q754222O591250j750075K176987J4178487
4884G6992558J2650872Q10807K560373J4353981R167529o711101K508173L1249347
4876A43582539L2742546J0012197K5281608P6622606N5818863r1408861k38527343
4869A4124155k20652803o1254734O0584375N3097074J010794J285923L1300031
4862a20505185K8720539L953425J798578J5616933J0734132o830394o800303P480121
4854f5832154J0360826K781565M049476J1103309P030934k982079j255055P930531
$$ y = [8395122, 14058343, 17932467, 23839084, 34442778, 42211472, 41186475, 37923325, 39450015, 40491087, 34571503, 27652767, 28152634, 33076806, 36244895, 40009791, 46686475, 49827914, 46730985, 47041687, 55795909, 62387159, 60637084, 62814071, 76992558, 89643430, 90454237, 93014610, 107368591, 116536120, 109825019, 112333192, 143582539, 176325085, 186337282, 211618890, 288241496, 344060359, 252651498, 14124155, -206528648, -267783382, -207199007, -154101933, -153091139, -151805216, -120505185, -91784646, -87831221, -86032643, -70415710, -59681578, -66511972, -73312275, -65832154, -55471328, -52689763, -48640287, -37536978, -30506044, -33488123, -34743178, -26812647]
4846b6812647P072845j245382j129641N274147L015392o093659p162073q2311
4838b7163329K083460j923282k052201J606724K68570m023439j190129P277435
4830b5116191J0308931N978265J480352j372760m722996m469663K389775O903291
4822h620996J171222n511072j234793O319700K433707p619777o805079L540454
4814a6326634N774417l508635q504112j389474O839304O292548N80472m317475
4806a4559589p441156o513283P49038P591215N231454j121125R42812Q973543
4798f147091Q424797j964539p104937r65248M455618R44723l730443k582182j043453
4789i712755l402134l457669J902646M180565j689827o689649k487730M550971
$$ y = [-26812647, -19739802, -20985184, -22114825, -16840678, -13825286, -19918945, -27081018, -27163329, -25079869, -27003151, -29055352, -27448628, -27180058, -31203497, -32393626, -25116191, -14807260, -8828995, -7348643, -8721403, -13444399, -17914062, -15524287, -8620996, -7449774, -12960846, -14195639, -7875939, -5442232, -13062009, -19867088, -16326634, -10552217, -14060852, -22564964, -23954438, -17115134, -10822586, -10242114, -14559589, -22000745, -28514028, -27764990, -20173775, -14942321, -16063446, -15120634, -6147091, 2277706, 313167, -6791770, -7757018, -3301400, -2356677, -6087120, -8669302, -9712755, -13114889, -16572558, -14669912, -10489347, -12179174, -18868823, -21356553, -16805582]
4781a6805582M625801j93378k212377r34647K72355K514927O697508P393291R13877
4772B271775o090016m907153K834208Q504897P908481K932329l567765q276298
4764A610458p304460j496928K267513P2013l349259k472019R05527K417498K344215
4755e005442K513875J382544j964932l921209k229724p59638k543629l254821
4747a5782976J661396Q005824Q393033L375500k88203k3154Q81945M05745K0069
4738F649179J29445j384325n563295j0462059j2608282q968915K64325R342869
4730b2601058J1056592N446371L86501R93365L386135K324666n08031p27113J150503
4721I07931J901546J418417R93112l35862k479251j716555K702676M147478j937340
$$ y = [-16805582, -12179781, -12373159, -14585536, -15520183, -15247828, -12732901, -6035393, 1357898, 2271775, -3818241, -8725394, -5891186, 2613711, 10522192, 13454521, 9886756, 1610458, -5694002, -7190930, -4923417, -4851404, -8200663, -10672682, -9767155, -7349657, -5005442, -2491567, -1109023, -3073955, -6995164, -9224888, -9984526, -12528155, -15782976, -14121580, -6115756, 2277277, 5652777, 5364574, 5341420, 6223365, 6629110, 6649179, 6778624, 5394299, -168996, -10631055, -23239337, -32208252, -31943927, -22601058, -11544466, -6098095, -5711594, -4718229, -1332094, 992572, 484541, -242572, 907931, 2809477, 4227894, 5221006, 4885144, 2405893, 689338, 3392014, 7539492, 5602152]
4712E602152q552953o000271K786780N748280m06671o088926l942025J650126
4704i203508L690394K907426L636191N333651M351959R56073r66431q0510O73958
4695A1299203j376194n001463o595430m189009N91957M514852O360646P567970
4687A3172532Q991689Q864191N415282k00142n531635r676319j2154903j0913043
4679b032348m874314K666318O830362O765762N115088K866817q46775m117508
4671A2373402k902092K025635L734356j997635j0079548j2246335p418379j752751
4663a8263347L96273J013940L431292O837140P974603N910339K510868o55430
4655I155678l257029m365255k497366J570488M286387L324484O62254j08605J620532
$$ y = [5602152, -2950801, -8951072, -6164292, -416012, -822683, -6911609, -10853634, -9203508, -5513114, -2605688, 1030503, 6364154, 10716113, 11672186, 10705755, 10625245, 11299203, 9923009, 4921546, -1673884, -5862893, -5270936, -756084, 5604562, 13172532, 22164221, 31028412, 36443694, 36243552, 30711917, 21035598, 8880695, -2032348, -6906662, -4240344, 2590018, 9355780, 14470868, 17337685, 16490910, 12373402, 9471310, 11496945, 15231301, 13233666, 3154118, -9092217, -16510596, -18263347, -17867074, -16853134, -13421842, -6584702, 1389901, 7300240, 9811108, 9155678, 5898649, 1533394, -963972, 606516, 4892903, 8217387, 8879641, 8771036, 10391568]
4646A0391568L469180L524403J476296k672483p946728j0816018p902001j073732
4638a1549515L450484K532939k25449Q596K893463M439826K912312M99004O1864
4629E023524K215669M893850M602929m91955p410364j0133853o408770r77673
4621h686643K25335k680919m935119m224747k521087j237365J073845M720550
4613a8266150O260551K993122j893971k363159K395470O385494M664487k24859
4605d9015k476786j401717j180816k929941k553718J798316N533793M463372J180841
4596B384329j92864j328673n304489q370076m460899L411004N415985n55762n461845
4587a4463290k645146L602246O600771O320713N062404J712413l611790n777262
$$ y = [10391568, 13860748, 17385151, 18861447, 16188964, 8242236, -2573782, -10475783, -11549515, -8099031, -5566092, -5791541, -5782945, -2889482, 1550344, 4462656, 4961660, 5023524, 7239193, 12133043, 16735972, 16244017, 8833653, -1300200, -7708970, -8686643, -8461308, -11142227, -16077346, -20302093, -22823180, -24060545, -22986700, -18266150, -12005599, -9012477, -10906448, -13269607, -10874137, -4488643, 175844, -49015, -2525801, -3927518, -5108334, -8038275, -10591993, -8793677, -3259884, 1203488, 2384329, 2191465, 862792, -4441697, -12811773, -17272672, -13861668, -8445683, -9001445, -14463290, -17108436, -13506190, -6905419, -584706, 4477698, 6190111, 2578321, -3198941]
4579c198941k217879J413844N1238j950375J520608P127712P388937K814804p38646
4570A2211302l048407p308161r933454m708316L904845M519781k936387n844272
4562a3143069J004271P192383M452368j08755K500562P408328N181170j213864
4554A3273394j881661K305979J095637p348947j2933533r655427l859986k579053
4546b1583597l086097J24662M983672N474840J677195n45196J370923L353329
4538h230269J076440l890566n952018k160540M323424P700104N932877K471984
4530A271436J251185K038052K533335K852962M448392N817639L674285j471122
4522B2416164n142680n161847m004334l725481k926455p63356M74497k82823j31079
$$ y = [-3198941, -5416820, -4002976, -3951738, -5902113, -4381505, 2746207, 10135144, 12949948, 12211302, 9162895, 1854734, -8078720, -12787036, -8882191, -4362410, -7298797, -13143069, -12138798, -4946415, -494047, -602802, 1897760, 9306088, 14487258, 13273394, 11391733, 13697712, 14793349, 7444402, -5489131, -15144558, -19004544, -21583597, -24669694, -24545032, -19561360, -14086520, -12409325, -12954521, -11583598, -8230269, -7153829, -11044395, -16996413, -19156953, -14833529, -7133425, -1200548, 1271436, 2522621, 4560673, 7094008, 9946970, 14395362, 20213001, 23887286, 22416164, 17273484, 12111637, 8107303, 4381822, 1455367, 692011, 1166508, 883685, 752606]
4513G52606K493128L613001m42998o034705o471106j381130L607879N310931N504064
4504F951670N551393M272053J642989n15161k178589m616465o068044l550235
4496A489611N39733K58658l954709m548746R99419N127444K227172j824389N60009
4487H74202N626406M327734k365847m488754J363474P139998N593512n74442m616294
4478A2879989m404162j894167J157904L476018L525599J279791j254186k482085
4470A2284701k245529n56781J812225K067479j538254n929025o747312m891948
4462e744444m362112m453105r44347M645125N111607o69846m121437M03671O515862
4453c619026N334073j579984n749839m148167p79484J571302L855722N651435
$$ y = [752606, 3245734, 6858735, 6415737, 381032, -6090074, -7471204, -3863325, 1447606, 6951670, 12503063, 16775116, 18418105, 17902944, 15724355, 11107890, 5039846, 1489611, 2029344, 2288002, -1666707, -6215453, -5216034, -88590, 2138582, 314193, 874202, 6500608, 10828342, 8462495, 3973741, 5337215, 12477213, 18070725, 17496283, 12879989, 8475827, 6581660, 7739564, 11215582, 14741181, 16020972, 14766786, 12284701, 10039172, 9482391, 11294616, 13362095, 11823841, 5894816, -852496, -5744444, -10106556, -14559661, -15504008, -10858883, -5747276, -6417122, -10538559, -10134888, -3619026, 1715047, 135063, -5614776, -9762943, -10542427, -8971125, -5115403, 536032]
4445E36032M033291j300444o175909o607846k856774J573913L301179J825686
4437e670872J36043J321581L831790K856876k101297m842476o88845O436716R268709
4428A0548225O786803L910977L488874L446951J288254k664784o409486p701773
4420A2694041n065461k9681K882483J215170j878617k166197n73838j172032m362978
4411A542890o280904m517926p00087K601317M345754M370970L016794J615401
4403E994209J398113J987552K174113J341789o84683l353446m087922k35943O053892
4394A0587674Q315356L569049l546034o886312n531385j953853K061927M254164
4386A0870586J439707n184706q592554m671440J712405M241772L847830M098120
$$ y = [536032, 4569323, 3268879, -2907030, -9514876, -12371650, -10797737, -7496558, -5670872, -5534829, -4213248, -381458, 2475418, 374121, -4468355, -5157200, 1279516, 10548225, 17335028, 21246005, 24734879, 28181830, 29470084, 26805300, 20395814, 12694041, 7628580, 7598899, 10481382, 11696552, 9817935, 7651738, 7077900, 5905868, 1542890, -4738014, -9255940, -9956027, -7354710, -3008956, 1362014, 4378808, 5994209, 7392322, 9379874, 11553987, 12895776, 12211093, 8857647, 4769725, 4533782, 10587674, 18903030, 22472079, 18926045, 12039733, 6508348, 4554495, 6616422, 10870586, 12310293, 7125587, -1466967, -6138407, -4426002, -184230, 3663600, 7761720]
4378G761720L311331j079249m784997k002396M522808P137857M285850k20239
4370A8932685n436181j1468226j2885446n076414M855158N401050j906554m509132
4362a2093060J638175P429141O911357M715122L944307K36983o739777q643675
4354b601427k260658L461531J727178j487346O72112L851059J815711j640967
4346C537193q19905J70574m407978q874278m122324N887714Q744317K601816j838609
4337H78520J616496O776827O054910K22364n403411p568018n528753l41268M339325
4328A046992M707288J068309l110370n594638n877614l493880J42185P64209k982521
4319a3330040n251510q8855R116501J3207221Q972351J567199l574474n386103
$$ y = [7761720, 11073051, 9993802, 5208805, 3206409, 7729217, 14867074, 19152924, 18932685, 13496504, 2028278, -10857168, -15933582, -11078424, -5677374, -7583928, -12093060, -10454885, -3025744, 3885613, 8600735, 12545042, 12782025, 6042248, -2601427, -4862085, -1400554, 326624, -1160722, -488610, 3362449, 5178160, 3537193, 2717288, 2887862, -1520116, -10394394, -14516718, -8629004, 115313, 2717129, 878520, 2495016, 9271843, 15326753, 15549117, 10145706, 2577688, -2951065, -3292333, 1046992, 5754280, 6822589, 3712219, -1882419, -7760033, -11253913, -11111728, -10347519, -13330040, -18581550, -18670405, -9553904, 3653317, 12625668, 14192867, 10618393, 5232290]
4311E232290m566734k220407r36851k190917l162700p96743K337064J597004j737801
4302f445795k102238J579090M952008N592303N094397M108860J717767j90509
4294A4305883J519572M881910M618175Q46207r72224K19084r35062o111813q908501
4285I463231m615804K048144L885005Q88606j988253k689615k591485k097734
4277B302095o34943N70331k24729k079949k405511m65070K137840L433511K189798
4268D823373j330926m423282l696340P96707N058345N892096L951938J144025
4260A2215936j981417m621563m774016k402019o74286j153097n48039L995378
4252E6877Q733256P401350O91212l616534j056981L710565M067818N51848j258481
$$ y = [5232290, 665556, -1554851, -2491702, -4682619, -7845319, -8642062, -6304998, -4707994, -6445795, -8548033, -6968943, -2016935, 3575368, 8669765, 12778625, 14496392, 14305883, 15825455, 20707365, 25325540, 26171747, 25199523, 25418607, 24483545, 18371732, 9463231, 4847427, 6895571, 10780576, 11669182, 9680929, 6991314, 4399829, 2302095, 1667152, 2237483, 2012754, -67195, -2472706, -2937776, -799936, 2633575, 4823373, 3492447, -930835, -4627175, -3830468, 1227877, 7119973, 11071911, 12215936, 10234519, 5612956, 838940, -1563079, -2237365, -3390462, -3938501, 56877, 8790133, 16191483, 16882695, 13266161, 12209180, 15919745, 19987563, 20539411, 19280930]
4243A9280930L11007J268772r54642l664068l967783l437515m543130n757320
4235a463749m317525j504315m57451k92722K318992O423740P429711M738965K683088
4226A5558734K708147J059486l361882n299698j227088M319839N093730J481786
4218B0333054j907345l040032k516751o29835J286951J36448m169535o808562
4210B684393m723678j117969L88891J067064K359267J722220j604930k829774
4202b054516L63115K516266m2410j691867J921095L713199l165446j0428330n342609
4193a4211503Q021787J3198762N341151l802113n060065j846359O08037K613315
4185D863012L744229J219571k399232p19654N086711P129340M170127K314785
$$ y = [19280930, 19591937, 20860709, 19906067, 16241999, 12274216, 8836701, 4293571, -1463749, -5781274, -7285589, -7743040, -8035762, -5716770, 706970, 8136681, 12875646, 15558734, 18266881, 19326367, 15964485, 10664787, 9437699, 13757538, 18851268, 20333054, 18425709, 15385677, 12868926, 12239091, 13526042, 13662490, 9492955, 2684393, -2039285, -3157254, -2768363, -1701299, 657968, 2380188, 775258, -2054516, -1691401, 824865, 782455, -909412, 1011683, 4724882, 1559436, -8868894, -14211503, -6189716, 7009046, 12350197, 8548084, 3488019, 1641660, 2249697, 4863012, 8607241, 9826812, 7427580, 6707926, 11794637, 18923977, 23094104, 25408889]
4177B5408889J654687l870147j1428793r647968J883817R054358M916055m65202
4169A7505696J250713L763285O72034k337713l03268K40461n230087q265123k211418
4160E084580M613064L247574n06398J737897N296707L021672M685K972369O341775
4151C1813925L881592K205715O848237Q859113L473373N407676K1089099K2640264
4143A06218994j6238247o8269940p6505603l1271154J5726175K2730629N917297
4136d1691849J70290O924798O780003j462724l980456M10266J964816O89283L463876
4127b6731697P151102L830331k622294k706111J021980p26538n499300l102312
4119b9384839M761612N861587k038460p674546m509179J364015L602182L677965
$$ y = [25408889, 27063576, 23193429, 11764636, 2116668, 4000485, 13054843, 17970898, 17505696, 18756409, 22519694, 23191728, 20854015, 20550747, 20791208, 15561121, 7295998, 5084580, 9697644, 12945218, 12438820, 14176717, 19473424, 22495096, 22499781, 25472150, 31813925, 35695517, 37901232, 44749469, 53608582, 57081955, 62489631, 83578730, 106218994, 89980747, 21710807, -54794796, -86065950, -70339775, -47609146, -41691849, -41521559, -34596761, -27816758, -29279482, -33259938, -32849672, -30884856, -30195573, -26731697, -19580595, -15750264, -18372558, -21078669, -20056689, -20783227, -26282527, -29384839, -24623227, -18761640, -20800100, -28474646, -32983825, -31619810, -28017628, -24339663]
4111b4339663L945719L202116J853172K580730L978934J791122k470664k666375
4103a2124909J253445K492735j201340m236872l329921k296460l806429m442384
4095b7692135j643828J501148K286600L005212N651179P506221N930831K907176
4087e47596J206050R7748j926775l887343m572952m566780l701597k32041N118677
4078a3012609Q102103O508427L269022J516200Q1095l294832p428079r344950
4070a3603623q069125m416178O36837N388320P669996P469109O896882O373964
4062H346182M081904N46078l44496K728253N571749M535475J712044N07930k13943
4053B7471176k909127n316269l288999J798976M060056J379503k222159l086828
$$ y = [-24339663, -20393944, -17191828, -15338656, -12757926, -8778992, -6987870, -9458534, -12124909, -10871464, -8378729, -9580069, -13816941, -17146862, -19443322, -23249751, -27692135, -29335963, -27834815, -25548215, -22543003, -16891824, -9385603, -3454772, -547596, 658454, 756202, -1170573, -5057916, -9630868, -14197648, -17899245, -18131286, -13012609, -4910506, 1597921, 4866943, 6383143, 6464238, 3169406, -4258673, -13603623, -21672748, -26088926, -25452089, -20063769, -12393773, -4924664, 1972218, 8346182, 12428086, 12974164, 12629668, 15357921, 20929670, 25465145, 27177189, 27685119, 27471176, 24562049, 19245780, 15956781, 17755757, 21815813, 23195316, 20973157, 17886329]
4045A7886329k318746k339843k808373k074764k81821R13970L30533k081934n198441
4036B026910o672657m562600R6493L657745L570808O64389k530670m156081l274235
4027a1179898K51621M822443P501604O854292M509197K746847J626159l2012j828363
4018A5271890k048806o14747J92261j328796l770890l912754l67363M257110N094312
4009A2772217m1179o961921q135260j341146O214310N719725j897483o823912
4001d94649l514817K074235J704678l299055n182263k066211J89815j464404k359796
3992a4412467J286297N132336L233067k194725l457469J814845P942078R051843
3984H395805N154311l7788l346830l171362K52933M005143M330598Q16337l045077
$$ y = [17886329, 15567583, 13227740, 10419367, 8344603, 8062782, 8976752, 9307285, 7225351, 2026910, -4645747, -9208347, -9111854, -5454109, -1883301, -1218912, -3749582, -7905663, -11179898, -10928277, -6105834, 1395770, 8250062, 12759259, 15506106, 17132265, 17100253, 15271890, 13223084, 12608337, 12800598, 11471802, 7700912, 3788158, 3420795, 7677905, 12772217, 12731038, 5769117, -2366143, -3707289, 2507021, 8226746, 6329263, -494649, -4009466, -1935231, -230553, -3529608, -8711871, -10778082, -10588267, -12052671, -14412467, -13126170, -7993834, -4760767, -6955492, -10412961, -8598116, -656038, 8395805, 13550116, 13512328, 10165498, 6994136, 7247069, 11252212, 15582810, 16399147, 13354070]
3975A3354070m291698l482525k525174k009264k063954l415436n500248n489184
3967a5423413j808545K578951L276749M91527q96627K045330O104264O060733
3959B428969J566496k433578k091933P44817J613775m00319j966192p83570J241418
3950h0117J411388L70856L16149Q18334q2512j248808R57356O461175R669472
3941A8593293O230452j063626n745213n074978j416418J899688K989738J097235
3933A7510171k610921m548659k483299M75769o42223n088387o576073k256137
3925f219759K867084L061993l52845j962079j91797J945745K377369J788016N08556
3916C822283k093787m792335m978062k837330j508388j853911n99317M282482
$$ y = [13354070, 9062372, 5579847, 3054673, 1045409, -1018545, -4433981, -9934229, -15423413, -17231958, -14653007, -11376258, -10884731, -11781358, -9736028, -3631764, 2428969, 3995465, 1561887, -530046, 214771, 1828546, 1428227, -537965, -1321535, -80117, 1331271, 1702127, 2018276, 2836610, 2754098, 1505290, 2462646, 8923821, 18593293, 24823745, 23760119, 18014906, 12939928, 11523510, 13423198, 16412936, 17510171, 14899250, 10350591, 7867292, 8343061, 7700838, 2612451, -3963622, -6219759, -3352675, -290682, -643527, -2605606, -2797403, -851658, 1525711, 3313727, 3822283, 1728496, -3063839, -8041901, -10879231, -12387619, -14241530, -14840847, -10558365]
3908a0558365R291626R235631L651696k871983n681592l805746M3769J974744
3900A279780P16956m91515K041336O219303N795567k11377m597987k073090K491927
3891A1170900J572582l115139l814886K56539K041671p98480j806867K617311
3883H123631O107374K477136l940712n256159k333157k054466n206265n639598
3875g722216j017875L520059L860751K503602L133930M746343M241646J308067
3867A4574307k057591m416854n284373m745567l916982l650832k317606K159792
3859i655706P644408R039610N287735Q63460j301984l459900o946289p843677
3851f372343l280702K485370L911399K436582K611660L241640K42259l571835
$$ y = [-10558365, -1266739, 7968892, 11620588, 8748605, 3067013, -738733, -694964, 1279780, 1996736, 1505221, 3546557, 9765860, 15561427, 15350050, 10752063, 8678973, 11170900, 12743482, 9628343, 5813457, 6069996, 8111667, 7313187, 5506320, 8123631, 14231005, 16708141, 12767429, 7511270, 5178113, 3123647, -2082618, -7722216, -8740091, -5220032, -1359281, 1144321, 4278251, 9024594, 13266240, 14574307, 12516716, 8099862, 2815489, -1930078, -5847060, -9497892, -11815498, -9655706, -2011298, 7028312, 12316047, 13179507, 11877523, 8417623, 1471334, -6372343, -9653045, -7167675, -3256276, -819694, 1791966, 5033606, 5275865, 1704030]
3843A704030q86374P220861J0209143L201388n197511n378084j1271J761715j848828
3834A0775069m828902l619877m08995K452466M701435N301467L116386K75432
3826A7764481l09146k98645l345423p672338p591170k875145J77012j235903k078950
3817g465227J680696N993904N022636J5987k935822j096416L060087N901670N218731
3808A5396246R95386l525326l878046P7503L349036K652025M42048l51812j096650
3799A4060410l281152m115898j129948K624371L003119R66257n48507j982879
3791I595773l968892l438850L01462N40814p037402j3874440q812955L769898
3783b2924592Q659912K312036k907774O04640M825738J867141k364914M11730
$$ y = [1704030, 817656, 8038517, 18247660, 21449048, 16251537, 10873453, 10862182, 12623897, 10775069, 5946167, 2326290, 1917295, 4369761, 9071196, 14372663, 17489049, 17764481, 17455335, 17156690, 13811267, 6138929, -1452241, -4327386, -4150374, -5386277, -7465227, -5784531, 209373, 5232009, 5247996, 2312174, 1215758, 4275845, 10177515, 15396246, 16391632, 12866306, 8988260, 9065763, 12414799, 15066824, 15508872, 15157060, 14060410, 10779258, 6663360, 5533412, 8157783, 11160902, 12127159, 11578652, 9595773, 5626881, 2188031, 2489493, 3030307, -4007095, -17881535, -26694490, -22924592, -14264680, -11952644, -14860418, -14255778, -9430040, -7562899, -9927813, -9516083]
3775i516083N977981N312875J33831q90454K771696L580541o39289l736301k057823
3766I36974N96670M95597o80938l66063M43350j57940j492023j527874N00696
3757a251551L517647N171992L490019m12670k626266j396578K57391o47603k251731
3748C850650j412211L56577q80452m573336n696502j652425M387896P228848M434427
3739F043472j916443o361126m628051R61563L309052K9740k832416k40990L409381
3730b225818J280678m398428n623856j411298J224139q65491k490919M03919M111304
3721i995770L661434N47691k93730K094576M172425L360243J251071J239454L704942
3712I742336M451310j14013o397714o531538K97344N048572J560886m016767l274950
$$ y = [-9516083, -3538102, 1774773, 1908604, 1018150, 3789846, 7370387, 6731098, 2994797, 936974, 1533644, 2029241, 1348303, 982240, 1425590, 1267650, -224373, -1752247, -1251551, 2266096, 7438088, 10928107, 10515437, 7889171, 6492593, 6749984, 6102381, 3850650, 2438439, 2795016, 1914564, -2658772, -8355274, -10007699, -5619803, 1609045, 6043472, 4127029, -2234097, -6862148, -5900585, -2591533, -2561793, -5394209, -5635199, -2225818, -945140, -5343568, -10967424, -12378722, -11154583, -12020074, -14510993, -14107074, -9995770, -6334336, -5786645, -6080375, -3985799, 186626, 3546869, 4797940, 6037394, 9742336, 14193646, 14079633, 7681919, 1150381, 1447725, 6496297, 8057183, 4040416, 765466]
3703G65466P83527l52531n351967n260803O32711L661296J139946J51260L277608
3694e53487L339950k504959n526329K69196P016912N110669k005555m617661j455816
3685i27080J981639M089106O187763N395509j256952q434208q106481j946889
3677c017593J103261j270669k371051J760464O673852P149595L685077l05988
3669A3406948k354333j150693K101230K492827l112734r664462q939884j079300
3661h300401N213008M618979P83668j323580j693414j333167J367137O184482
3653E516712Q068579L384452m036039p210026m238937R16705L887488L287525
3645I576459L52949k248430k350731o56891J01188q21300j216514N7392R85202
$$ y = [765466, 1548993, 1196462, -4155505, -9416308, -8783597, -5122301, -3982355, -3831095, -553487, 2786463, 281504, -5244825, -4975629, 2041283, 7151952, 5146397, 528736, -927080, 1054559, 5143665, 11331428, 16726937, 15469985, 7035777, -1070704, -3017593, -1914332, -3185001, -5556052, -3795588, 2878264, 10027859, 13712936, 13406948, 11052615, 9901922, 12003152, 14495979, 11383245, 1718783, -7221101, -8300401, -3087393, 1531586, 2315254, 991674, -701740, -2034907, -667770, 5516712, 13585291, 16969743, 12933704, 5723678, 1484741, 2401446, 6288934, 9576459, 9929408, 7680978, 5330247, 4673356, 4774544, 3953244, 2736730, 2794122, 3779324]
3636C779324J539j282553j268653j415794l067378l728533l83142M935526P011398
3627D581734M475108J079329k50622o39486j360862o90024K615164N537007M081353
3618A9428701j057474n561127p408426q001452p596573m155819J798708N486158
3610g067304L899322K59994p49645P89774K245159L760603O440086P566837L597150
3601B0741976l053077o098431l918019l53389K322056M582614M316682j376967
3593A7163445q079955o951405J523589O184924J790516l165756j520770L01709
3585G246297n201523j1219882o764637L953580O852709N5519m032280Q52584O428184
3576a829449N240144J839610K802416N676907M924078J560043l2273K58868j29374
$$ y = [3779324, 3780863, 2498310, 1229657, -186137, -3253515, -6982048, -7365190, -2429664, 4581734, 9056842, 10136171, 9885549, 9246063, 7885201, 7195177, 9810341, 15347348, 19428701, 18371227, 12810100, 5401674, -2599778, -10196351, -14352170, -12553462, -7067304, -3167982, -2907988, -3657633, -2867859, -622700, 3137903, 9577989, 17144826, 20741976, 17688899, 11590468, 7672449, 7319060, 9641116, 14223730, 18540412, 17163445, 9083490, 2132085, 3655674, 9840598, 11631114, 8465358, 6944588, 7246297, 2044774, -9175108, -15939745, -11986165, -5133456, -5077937, -9110217, -8257633, -1829449, 3410695, 5250305, 8052721, 13729628, 18653706, 20213749, 20181476, 20440344, 20310970]
3567B0310970j016332o89926M04276J031782J517695J921700Q86368j446118k766155
3558B0154260k724861l756453n877127n252413n05434M006648M092105Q40835
3550A0977560k662408n341098o318608m039028k91126p8107l918801n467022r81311
3541a8119949M185176L790942M10762N46844L944657M898213J883934j056694
3533D83885j529478j148010r20381L05046K489624L836451L737865K844332Q10884
3524A0910218k508380m596599k908179P15527K002025j3741k700144m303823m914677
3515h317773l874874l57796L834751N790458N362206M101913J499354l413018
3507D625221p673276o792683j679709J872722J382477M66326K096733L910211
$$ y = [20310970, 19294638, 18604712, 19008988, 20040770, 21558465, 23480165, 24366533, 22920415, 20154260, 17429399, 13672946, 7795819, 2543406, 2037972, 6044620, 10136725, 10977560, 8315152, 2974054, -3344554, -7383582, -7674708, -7752815, -11671616, -17138638, -18119949, -13934773, -10143831, -9733069, -9186225, -5241568, -343355, 1540579, 483885, -1045593, -2193603, -3113984, -2808938, -319314, 3517137, 7255002, 10099334, 10910218, 8401838, 3805239, 897060, 1612587, 3614612, 3600871, 900727, -3403096, -8317773, -12192647, -12550443, -8715692, -2925234, 2436972, 6538885, 8038239, 4625221, -3048055, -9840738, -11520447, -9647725, -8265248, -7798922, -5702189, -1791978]
3499a791978K649936o46034k780925k860604j872788j6675K790246N059745M802612
3490E333535K043708j152137k888785k929765k286616j669602m40624K107291
3482a882995M231640K613321k570771n753115k363271M369457O933106L247282
3474H824654j407669k357652q33789P3782L84385J417442K174027P94684j986262
3465G083602l521344k588762k98941J538183J682409M4945j896565k173929o41077
3456g71479P74706O34249n30235j698451k524466k328644n5854L468397N219991
3447B188214L670486J235827J108104K837592L121192L06902l741825n930537
3439D795955m642981o50294L271309M154056J815375l61681P79137L900516M539785
$$ y = [-1791978, 857958, 211924, -2569001, -5429605, -7302393, -7319068, -4528822, 530923, 5333535, 7377243, 6225106, 3336321, 406556, -1880060, -3549662, -3990286, -1882995, 2348645, 4961966, 2391195, -3361920, -5725191, -1355734, 5577372, 8824654, 7416985, 5059333, 4225544, 4299326, 4683711, 6101153, 8275180, 9069864, 7083602, 3562258, 973496, 674555, 2212738, 3895147, 3940092, 2043527, -130402, -771479, 3227, 637476, 107241, -1591210, -4115676, -6444320, -6500174, -3031777, 2188214, 5858700, 7094527, 8202631, 11040223, 14161415, 14468317, 10726492, 4795955, 152974, -497320, 2773989, 6928045, 8743420, 8381739, 9160876, 13061392, 17601177]
3430A7601177Q06535m216429o295622m465403q00178K349381L410294J513370
3422I903125k397681n192697m607909k313883j556203k051522m63844L492824
3414e187790N356420K481230j330386j284988J202644J350740q86575j080780
3406F20515J791456L558074J957004O3606N49986J468933N62687o64424n07043
3397I400794o88530k651521l832658j889622N64419K06985q16370J502823N136420
3388F932740L942703k709471q082601p067472k305750N86062K47957l66447J051998
3379g770281L445743M112481K144014k05657l09022Q97589j1751l376445n252458
3370f325787l530848j389931j634105j665433J484056M902097M366439K285348
$$ y = [17601177, 18407712, 14191283, 7895661, 3430258, 2630080, 4979461, 8389755, 9903125, 7505444, 2312747, -2295162, -4609045, -6165248, -8216770, -8680614, -5187790, 168630, 2649860, 1319474, 34486, 1237130, 2587870, 1701295, 620515, 2411971, 5970045, 7927049, 7990655, 8540641, 10009574, 10572261, 9907837, 9400794, 8712264, 6060743, 2228085, 338463, 902882, 1109867, 293497, 1796320, 6932740, 10875443, 8165972, 83371, -6984101, -9289851, -8703789, -8455832, -8822279, -7770281, -4324538, -212057, 1931957, 1726300, 1417278, 2314867, 2303116, -1073329, -6325787, -9856635, -11246566, -12880671, -14546104, -13062048, -8159951, -3793512, -1508164]
3362a508164M412674J0254287J3425173J0698046M349090l361860j0936378j3857634
3354A3475234q515047l15508R39907m629565o325376P51671Q073044P004360Q40911
3345A1299631k736213l400717m768157n534033k501466J750647K333070L64169
3337c193069N91239L028665L718608J845870k01504j875968l496704k569168K370370
3328B18339O448958M094996j828632l991462k060707j871408m202000l953594
3320g145510r95515j422857n391480m310838M575739J0556637M272034p368860
3312g230650j0487052l380445L664837M761900L873892M070625K099172l183079
3304e810800o039399k868198Q97647p36443m279374k615811K848682M625918K086101
$$ y = [-1508164, 2904510, 13158797, 26583970, 37282016, 41631106, 38269246, 27332868, 13475234, 4960187, 4644679, 5584586, 955021, -5370355, -4618684, 3454360, 10458720, 11299631, 8563418, 5162701, 394544, -5139489, -7640955, -5890308, -3557238, -3193069, -2601830, 426835, 4145443, 5991313, 5789809, 3913841, 417137, -2152031, 218339, 6667297, 10762293, 8933661, 4942199, 2881492, 1010084, -3191916, -7145510, -8141025, -9563882, -14955362, -19266200, -14690461, -4133824, 138210, -7230650, -17717702, -21098147, -17433310, -12671410, -8797518, -4726893, -2627721, -5810800, -11850199, -14718397, -13820750, -14557193, -18836567, -21452378, -18603696, -13977778, -11891677]
3295a1891677K148772N910710N058464l440254q659423o28369J2620542J4202271
3287A5321036J962876q782136o860341J521344M777208J391004k578259l863292
3279B889440k937152l2109L128650K004674m058027q010685m521658J092442R26652
3270i517773k522345p67294N600844O885646r9487o472464m311389L056953P686237
3261d61072P093343L504686j147738m869023m815508j336100O86775j736191n183923
3252h264751n004478j587375J884639M450760O384715O405174L999261J941555
3244A0209500K446387L082367N35969l682016n502990m439813l072857j948913
3236b372366K26753K253572J425196j106377r96040K281250L816320O30196l464421
$$ y = [-11891677, -9742905, -3832195, 1226269, -2213985, -10873408, -11501777, 1118765, 15321036, 17283912, 8501776, 1641435, 3162779, 7939987, 9330991, 6752732, 2889440, -47712, -79821, 3048829, 5053503, 995476, -7015209, -11536867, -10444425, -9517773, -12040118, -12807412, -7206568, -320922, -420409, -6892873, -11204262, -8147309, -461072, 6632271, 10136957, 8989219, 4120196, -695312, -2031412, -1344637, -3080828, -8264751, -13269229, -14856604, -12971965, -8521205, -2136490, 4268684, 8267945, 10209500, 12655887, 15738254, 16274223, 12592207, 7089217, 2649404, -423453, -2372366, -2145613, 107959, 1533155, 426778, -569262, 1711988, 5528308, 6158504, 2694083]
3227B694083l290042M03597K507329P56299j976802k116433O41460L951234N232716
3218H803441L082034j691434n595146m893413j2595L877119K583016j823294l872021
3209D57707k252258j117906l109437m852241k109810L331258N771080L428075
3201d53532K98900J37412J965642K500800N37691k273189l486530j962667J125181
3192a610292L344692L719833L359333K531033l48090m432774m411753K541147
3184D693129J0079424R273057J255575l680983n38529M134935L046027j922977
3176B6339658m985533n430031n556415m447766l74847L696107L467491L25750
3168A3034414q62448M69557P49140q02022j300780j56032k45775k421792l855671
$$ y = [2694083, -595959, -192362, 2314967, 3071266, 1094464, -1021969, -380509, 3570725, 8803441, 11885475, 10194041, 4598895, -294518, -307113, 3570006, 6153022, 4329728, 457707, -1794551, -2912457, -6021894, -10874135, -12983945, -9652687, -3881607, -453532, -154632, -17220, 1948422, 4449222, 4986913, 2713724, -772806, -2735473, -1610292, 1734400, 5454233, 8813566, 11344599, 10996509, 6563735, 2151982, 4693129, 14772553, 24045610, 25301185, 21620202, 21081673, 25216608, 28262635, 26339658, 21354125, 15924094, 10367679, 5919913, 5545066, 9241173, 12708664, 13034414, 12171966, 12641523, 13390663, 12588641, 11287861, 11131829, 10886054, 8464262, 4608591]
3159D608591l032901j932039j779473p08160K393047M974268L986870j17343m106708
3150D286152n214321l002322L88629J556863r00716m423657n404295l500095j051394
3141a7265156P42527K242310K889647J808955N04217J264679K939741K264330
3133b608750k65477k01229L920834P622721O596988K321690r71549k186188l314748
3124A0914292n135346n702879k979369K289320O481090O271970K562457l2394
3116A4669141Q20530J655589j408647n952136o527130l234049j178288j597769
3108b752759k71850L826025N312390J143882l613079l313713L45R85416m36793
3099H79864n42230R43826P33102k104003m675217m249720p78594L478393M952871
$$ y = [4608591, 1575690, -356349, -2135822, -2843982, -450935, 4523333, 8510203, 8392860, 4286152, -928169, -3930491, -3541862, -1984999, -2885715, -7309372, -12713667, -16213762, -17265156, -16522629, -14280319, -11390672, -9581717, -9077500, -7812821, -4873080, -2608750, -2874227, -3075456, 845378, 8468099, 15065087, 17386777, 16415228, 14229040, 10914292, 5778946, 76067, -2903302, -613982, 5867108, 12139078, 14701535, 14669141, 15489671, 17145260, 15736613, 9784477, 3257347, 23298, -1154990, -2752759, -3024609, 801416, 6113806, 7257688, 3644609, 330896, 331241, 1316657, 879864, 337634, 1281460, 2014562, -89441, -4764658, -9014378, -9792972, -6314579, -1361708]
3090a361708J796847k329736j307881M292003O346648J208101l698835j397549
3082C547890K887175M33598n536586m665951K496742M285737k738394p054960
3074f344749n6211J0149856J0731463K202388m461515m061393j567204k090128
3066D502507m331363m725948k780164q43604j298864m318030o776612m414834
3058b4986912K965967R739573J0025415M027845k813789n692477m007104o88193
3050a1429675N64837j155921k390384N44805N495996O145131Q62956m474313m691173
3041a0527741j710840L36625J503533L126768L201591M33118q52638L418033Q939368
3032G867817Q101294J672268k346369j224472o44232l891021o014454k489455
$$ y = [-1361708, 435139, -1894597, -3202478, 1089525, 7436173, 8644274, 4945439, 3547890, 6435065, 6868663, 1332077, -3333874, -837132, 3448605, 710211, -6344749, -6400960, 3748896, 14480359, 16682747, 12221232, 8159839, 6592635, 4502507, 171144, -4554804, -7334968, -8178572, -9477436, -13795466, -20572078, -24986912, -22020945, -12281372, -2255957, 1771888, -1041901, -6734378, -10741482, -11429675, -10864838, -12020759, -14411143, -13866338, -8370342, -2225211, -1362255, -5836568, -10527741, -12238581, -11901956, -10398423, -7271655, -4070064, -3636946, -4489584, -1071551, 7867817, 15969111, 17641379, 15295010, 14070538, 13426306, 9535285, 3520831, 1031376]
3024A031376K871613L683006J20312k870439l476297l974710n209179m835927
3016a2660245j463219K613218L979586K100088j09554L79020L096520M658316
3008B593730L393279J742526K416068M004822L253159K46224k253064l533324
3000A1863420m690786m386514j96424N365086O003332P22288l749159k514568
2992H416675N74651n33036m882135o586762l339831J631552M408822L627430M97358
2983C814724j534960P91643N746098O945995J727755l969493l343738J547546
2975A1725570L162544l44145l385139k060751Q24381J069322j255778l368476
2967F367528l774297k852595j367460M25904L021766O612650Q890840N904401
$$ y = [1031376, 3902989, 7585995, 7706307, 4835868, 1359571, -2615139, -7824318, -12660245, -14123464, -11510246, -7530660, -5430572, -5540126, -5161106, -2064586, 2593730, 5987009, 7729535, 10145603, 14150425, 17403584, 17649808, 15396744, 11863420, 7172634, 2786120, 2589696, 7954782, 13958114, 14680402, 10931243, 8416675, 8991326, 8458290, 3576155, -3010607, -6350438, -4718886, -310064, 3317366, 3814724, 2279764, 3071407, 8817505, 15763500, 17491255, 13521762, 10178024, 11725570, 14888114, 14543969, 11158830, 9098079, 9922460, 10991782, 9736004, 6367528, 2593231, -259364, -1626824, -1200920, 1820846, 8433496, 17324336, 23228737]
2959B3228737k500670j0166956j0967965o134910j724787n12056n98758m17975
2951i795340j4086J610274M880963O009353J089288o150177p454380j947953K197667
2942i574391K26390k446098J52965N044554N979645L193781J117793L90083j107099
2933B977623k024571O03797M500351L854269j801417o111084m445955N89411L597078
2924A739502K717915M4950j570628q27083J121556J601124k70623j871540q47456
2915A837717O04837j303577n320060n880931j251820L442398L400580O00266j4053
2906c884643K013031K940284J291115r2609J099395L090114K922415P34235r66103
2897I147234j102425p96964o65762J93703J853285K445023R09641q93147p70483
$$ y = [23228737, 20728067, 10561111, -406854, -6541764, -8266551, -8778607, -9377365, -9795340, -9809426, -8199152, -3318189, 2691164, 3780452, -2369725, -9824105, -11772058, -9574391, -9348001, -11794099, -11641134, -6596580, -616935, 2576846, 3694639, 4084722, 2977623, 953052, 1556849, 6057200, 9911469, 8110052, 1998968, -2446987, -1857576, 1739502, 4457417, 4502367, 2931739, 2104656, 3226212, 4827336, 4556713, 2685173, 1837717, 2442554, 1138977, -4181083, -10062014, -11313834, -7871436, -4470856, -3870590, -3884643, -1871612, 1068672, 2359787, 2267178, 3366573, 6456687, 9379102, 10113337, 9147234, 8044809, 7247845, 6582083, 6775786, 8629071, 11074094, 11983735, 11090588, 10320105]
2888A0320105N03426P69743J69723M22657J216877N83297j382046k572764k654933
2879G376085l149295l657064k336091n90928k014314n266253m104908K592142
2871a1150626P240882M552673j14078K95747L012740J282699k672691r19138N775289
2862G303497P885610K401656k546447j355451Q51542j232205l403591M6727N603437
2853A5554775N985522J592655j678135k748407n152073q306924p408078k226544
2845d387209J471609P62568n25979J127180L479671L016923N64324q08393l79370
2836D321324O98085K060706L546357L774440J981887R6974O48312L264794N057712
2827B5450591L993939N21285l569877o592268p712962p397761o825851o151716
$$ y = [10320105, 10823531, 11593274, 11762997, 12185654, 13402531, 13985828, 12603782, 10031018, 7376085, 4226790, 569726, -1766365, -2357293, -4371607, -9637860, -13742768, -11150626, -3909744, 642929, 528851, 824598, 3837338, 5120037, 2447346, 1528208, 7303497, 15189107, 17590763, 15044316, 13688865, 14540407, 13308202, 9904611, 9951338, 15554775, 21540297, 23132952, 21454817, 18706410, 13554337, 5247413, -2160665, -4387209, -2915600, -2153032, -2679011, -1551831, 1927840, 4944763, 5509087, 4700694, 4321324, 5019409, 7080115, 10626472, 14400912, 16382799, 16479773, 17128085, 20392879, 25450591, 29444530, 29965815, 26395938, 19803670, 12090708, 4692947, -2132904, -8284620]
2819h284620m040585R1285M118306N034980K785908Q78968K384665N968727O931258
2810A5868892K420227n025520r713146q255132k146046M579320Q740052R016886
2802A5485533N776389J281271j518258k074849k721723m371710l905690R96535
2794H947498O246405N318130j385451o295497m952332j255379p4323j61403J198140
2785G585788J434500k789893p288927m491885M389905R106087M333864k901602
2777I377837l538735J304909L624165M65568l232102k506040J915693N989819
2769A3401114O761425L695293j706909o637125q758911p749615m643568n93072
2761f231368K786396L438842J065367j863530k959180k406816j070166J619399
$$ y = [-8284620, -12325205, -12233920, -8115614, -3080634, -294726, 584242, 2968907, 8937634, 15868892, 18289119, 13263599, 3550453, -4704679, -6850725, -2271405, 6468647, 15485533, 21261922, 22543193, 21024935, 18950086, 16228363, 11856653, 7950963, 8947498, 15193903, 20512033, 19126582, 12831085, 7878753, 6623374, 6549051, 6387648, 7585788, 9020288, 6230395, -1058532, -5550417, -1160512, 7945575, 12279439, 9377837, 5839102, 7144011, 10768176, 11233744, 8001642, 5495602, 7411295, 13401114, 20162539, 23857832, 22150923, 15513798, 6754887, -994728, -5638296, -6231368, -3444972, -6130, 1059237, -804293, -3763473, -6170289, -7240455, -5621056]
2753e621056N342357O832734L747330j117140l324217k906406k627434j877780
2745a551612J897322O307570N337602j150886n655778l352898J563262L189650
2737F584232K239660K663439M233029L596186J02567l888521o646442p414239
2729A469911n134326k95652L723914M150663J897501q63797l240783l697357n7184
2720b047110N339826N696718l50731m483553p16360M045626L41585p556993p146960
2711f877952K279000P687651K047815n948845o300397j350039J295423R47430
2703f219914J407743K624147K362705J852787L027945L790140K172541J540714
2695A2558808N144425Q756182N830450k211508p915487q518350p557693o487600
$$ y = [-5621056, -278699, 6554035, 10301365, 9184225, 5860008, 2953602, 326168, -1551612, 345710, 6653280, 11990882, 10839996, 5184218, 1831320, 3394582, 6584232, 8823892, 11487331, 15720360, 19316546, 19419113, 15530592, 8884150, 1469911, -3664415, -3960067, -236153, 3914510, 5812011, 4948214, 1707431, -1989926, -2047110, 3292716, 8989434, 8638703, 4155150, 3438790, 7484416, 7826001, 269008, -6877952, -4598952, 3088699, 5136514, -812331, -7112728, -8462767, -7167344, -6219914, -4812171, -2188024, 174681, 2027468, 5055413, 8845553, 11018094, 12558808, 17703233, 26459415, 32289865, 30078357, 22162870, 13644520, 6086827, -400773]
2687d00773k438225M377192P974158M375830k628251o388449m728010k79650L368649
2678C232471L788585P01011l033201l496097n03932J614300m06777m336291n421776
2669g861707k307457J939703L767166K266224j151285m347156n349724l073703
2661a6117939J549681N376563N366289J909289j110968p71892J359620J972677
2653d66680J150489J621798L292585K824281k60431j730013M67030J919115j557045
2644G261129o635047p056588k802902J161932L458003O717251R734110O811377
2636A8649265k672712j0519907r604340k918575J568088J430004L00470M35662
2628c332045L37933p75051j206440l72756p5827o05140Q71036N414643Q506769
$$ y = [-400773, -2838998, 1538194, 9512352, 13888182, 11259931, 4871482, 143472, -136178, 3232471, 7021056, 7722067, 4688866, 1192769, 688837, 2303137, 1896360, -2439931, -7861707, -10169164, -8229461, -4462295, -2196071, -3347356, -7694512, -13044236, -16117939, -14568258, -9191695, -3825406, -1916117, -3027085, -3798977, -2439357, -466680, 683809, 2305607, 5598192, 8422473, 8162042, 6432029, 6899059, 8818174, 7261129, 626082, -6430506, -9233408, -8071476, -4613473, 2103778, 11837888, 18649265, 15976553, 5456646, -4147694, -7066269, -5498181, -4068177, -3767707, -3332045, -2994112, -3769163, -4975603, -5348359, -5424186, -6029326, -5158290, 256353, 8763122]
2619H763122M898775l563550q815648o146344K32530L054975R65576j195680L38007
2610a468237L992660N792100L851163m83864l930869l619131j57741J994967l15640
2601E655408m154362m316984j285103n25979l446668m811095j251988L325038
2593a0811733M205056K574280J711640J326307L86170R29562L662767M248025
2585H232074J29847l342296p93376L385456J747326l193272k900235K176473L037822
2576H479819k179754m910244j047238K637695J528783J285051O102394R107752
2568B1004258L577935m347647m593911R22597K230934k301477m618885j026160
2560A0847644K821089K167194n04565j826535k745146m060979k994973J591683
$$ y = [8763122, 13661897, 10098347, 1282699, -4863645, -4631115, -1576140, -610564, -1806244, -1468237, 2524423, 8316523, 12167686, 11683822, 7752953, 4133822, 3976081, 5971048, 5655408, 1501046, -2815938, -4101041, -4627020, -8073688, -12884783, -14136771, -10811733, -6606677, -4032397, -2320757, -994450, -608280, 321282, 3984049, 8232074, 8361921, 5019625, 4226249, 7611705, 9359031, 6165759, 3265524, 5441997, 8479819, 6300065, 1389821, 342583, 2980278, 4509061, 5794112, 11896506, 21004258, 24582193, 20234546, 15640635, 16563232, 18794166, 16492689, 11873804, 10847644, 13668733, 15835927, 15331362, 13504827, 10759681, 6698702, 3703729, 5295412]
2552E295412N081128K828323k589442m155896M55792O003115O290638J278988
2544B0488058l711041m704799k921807j518901q50181N80498J908887N19411l023142
2535F766983m708007k863194k46785J152823K952500N611171N626202J266909
2527A5558602l181340l532897k296830l850141o298840m341730J939419P484838
2519A481081R900846J0206684P221766j159266j0648529j2329276m401000M082127
2511D354433M616207n63202l369892r57226K329556J986179j339157l315174j133248
2502B608476K777332K891986k234201o690843m347624K270064N007727J435610
2494C718527k465806j708130J488964K875002K007318L591l430863o966929o042432
$$ y = [5295412, 10376540, 13204863, 10615421, 6459525, 6915317, 12918432, 19209070, 20488058, 16777017, 12072218, 9150411, 7631510, 6781329, 7361827, 9270714, 9790125, 6766983, 2058976, -804218, -1051003, 101820, 3054320, 8665491, 14291693, 15558602, 12377262, 8844365, 6547535, 2697394, -3601446, -7943176, -6003757, 1481081, 11381927, 21588611, 28810377, 27651111, 17002582, 4673306, 272306, 4354433, 8970640, 8407438, 5037546, 4080320, 6409876, 8396055, 7056898, 3741724, 2608476, 5385808, 8277794, 6043593, -647250, -4994874, -2724810, 2282917, 3718527, 1252721, -455409, 1033555, 3908557, 5915875, 5919466, 2488603, -4478326, -10520758]
2485a0520758J167895R180018J0903899N945385k03343l309552l576080l356817
2477F230647m402474o103734n253781o7585N036681L454806l098989m507871L294323
2468e417977J0554797P036441k781940o764614l169529q30621k912586k437959
2460f723988L944474Q811937N579008j441691m581162l497026k053077n85068
2452e46593J642297J211232m300814r376022o947021M24807M094465K723940K862309
2443h211400N884375M811120k346465o182309J38643Q441225O646538k630245
2435F551482n829545N55691M699020j797398j0656010r615573p60828L472633
2427a3380528j015811n588348l306439J810652L376815K675027M243595O653338
$$ y = [-10520758, -9352863, -172845, 10731054, 16676439, 16473096, 13163544, 9587464, 6230647, 1828173, -4275561, -9529342, -9596927, -4560246, -1105440, -4204429, -8712300, -5417977, 5136820, 12173261, 9391321, 2626707, -542822, -1373443, -4286029, -6723988, -2779514, 6032423, 11611431, 10169740, 5588578, 2091552, 38475, -546593, 1095704, 2306936, -1993878, -11369900, -18316921, -17892114, -13797649, -11073709, -8211400, -2327025, 2484095, 137630, -6044679, -5906036, 2535189, 9181727, 6551482, 721937, 1277628, 5976648, 4179250, -6476760, -16092333, -16853161, -13380528, -14396339, -19984687, -23291126, -21480474, -18103659, -15428632, -11185037, -4531699]
2419d531699M849027n33374l097224k6936M140765M176829j801n389129r304653
2410i718195r008595k565818O881734J1675078Q295445K334716Q03522K648851
2402A1346738K131725j022363j786324N92099Q07903l131341n943495l781573
2394g86631m32567j51174j57729L378719O544323K920897m745022o744087l83191
2385e56462O218677O005390J400533k028658l617778m930713m497920p75740L093391
2376C10720K869421m80613k666509k547463k251519k158833m53352K625615M284099
2367d68434L358664J716829R82922N61430n60586k087311k797922j437040K056205
2358A324757N064311L995874m64435k388154J728801O795975N363312j570461
$$ y = [-4531699, 317328, -216046, -3313270, -3340206, 800559, 4977388, 4975587, -413542, -9718195, -18726790, -21292608, -14410874, -2735796, 5559649, 7894365, 8697887, 11346738, 13478463, 12456100, 10669776, 11261875, 12069778, 8938437, 2994942, -786631, -1219198, -1370372, -1528101, 1850618, 8394941, 11315838, 6570816, -173271, -556462, 5662215, 11667605, 13068138, 11039480, 7421702, 2490989, -2006931, -2782671, 310720, 3180141, 2699528, 33019, -2514444, -4765963, -6924796, -7378148, -4752533, -468434, 2890230, 4607059, 5589981, 6151411, 5590825, 3503514, 705592, -731448, 1324757, 6389068, 10384942, 9920507, 7532353, 9261154, 16057129, 21420441, 19849980]
2350A9849980n635202k715886K327918L534477Q73129k511726m974003n568876
2342E179811l049016J101043K368089o47624l128324p61202L480223L650398k91356
$$ y = [19849980, 14214778, 11498892, 13826810, 17361287, 18234416, 15722690, 10748687, 5179811, 2130795, 3231838, 5599927, 4952303, 1823979, 1062777, 4543000, 8193398, 7902042]
$$ [...]
##END NTUPLES=NMR SPECTRUM
##END=
