##TITLE=31Pdec_DE-105_m
CDCl3, 24 sc
 8.8.2025
##JCAMPDX= 6.0         $$ Bruker NMR JCAMP-DX V2.0
##DATA TYPE= NMR SPECTRUM
##DATA CLASS= NTUPLES
##ORIGIN= UXNMR, Bruker Analytische Messtechnik GmbH
##OWNER= root
$$ XWIN-NMR		Version 3.5
$$ Fri Aug  8 15:44:20 2025 Russian Standard Time (UT+4h)  she@DPX200
##.OBSERVE FREQUENCY= 81.013821
##.OBSERVE NUCLEUS= ^31P
##.ACQUISITION MODE= SIMULTANEOUS
##.ACQUISITION SCHEME= undefined
##.AVERAGES= 64
##.DIGITISER RES= 17
##SPECTROMETER/DATA SYSTEM= spect
##.PULSE SEQUENCE= zgpg30
##.SOLVENT NAME= CDCl3
##.SHIFT REFERENCE= (INTERNAL, CDCl3, 0, 198.062)
##AUDIT TRAIL= $$ (NUMBER, WHEN, WHO, WHERE, WHAT)
$$ ##TITLE= Audit trail, XWIN-NMR		Version 3.5
$$ ##JCAMPDX= 5.01
$$ ##ORIGIN= Bruker BioSpin GmbH
$$ ##OWNER= she
$$ F:/spectra/data/she/nmr/P31/2/pdata/1/auditp.txt
$$ ##AUDIT TRAIL=  $$ (NUMBER, WHEN, WHO, WHERE, WHAT)
(   1,<2025-08-08 15:43:18.06 +0400>,<she>,<DPX200>,
      <created by zg, POWCHK disabled, PULCHK disabled
       configuration hash MD5:
       00 E9 B6 7A A2 85 ED C7 34 08 36 98 17 FE 4E 26
       data hash MD5: 32K
       0C E3 C4 2E B0 C7 C8 C3 1E CF 68 55 B4 85 CF 7E>)
(   2,<2025-08-08 15:43:20.46 +0400>,<she>,<DPX200>,
      <Start of raw data processing
       efp BC_mod = 2 LB = 1.5 FT_mod = 6 PKNL = 1 PHC0 = 2286.16 PHC1 = -1135.501 SI = 64K 
       data hash MD5: 64K
       B5 BD 5C F5 12 13 F2 02 F0 FB 31 FB B6 11 29 FE>)
(   3,<2025-08-08 15:43:29.89 +0400>,<she>,<DPX200>,
      <abs ABSG = 5 
       data hash MD5: 64K
       CC 8D 98 1E 8F 0A 7B 90 BA D1 AD 03 BB 05 43 0F>)
(   4,<2025-08-08 15:43:53.96 +0400>,<she>,<DPX200>,
      <pk PHC0 = -24.03629 PHC1 = 0 
       data hash MD5: 64K
       20 F8 C8 6A 6C D7 51 9C 6F 35 01 A9 CB 9A E1 19>)
$$ ##END=
$$ 
$$ hash MD5
$$ 72 D5 F4 5A 74 97 1C D4 A9 9B 05 81 85 C8 46 09
##$RELAX= 
##$RELAX= 
##$RELAX= 
##$RELAX= 
##$RELAX= 
##$RELAX= 
##$RELAX= 
##$RELAX= 
$$ Bruker specific parameters
$$ --------------------------
##$DU= <F:/spectra>
##$EXPNO= 2
##$NAME= <P31>
##$PROCNO= 1
##$TYPE= <nmr>
##$USER= <she>
##$AMP= (0..31)
100 100 100 100 100 100 100 100 100 100 100 100 100 100 100 100 100 100 
100 100 100 100 100 100 100 100 100 100 100 100 100 100 
##$AQSEQ= 0
##$AQ_mod= 1
##$AUNM= <au_zg>
##$AUTOPOS= <>
##$BF1= 81.014009
##$BF2= 200.13
##$BF3= 200.13
##$BF4= 200.13
##$BF5= 200.13
##$BF6= 200.13
##$BF7= 200.13
##$BF8= 200.13
##$BYTORDA= 1
##$CFDGTYP= 0
##$CFRGTYP= 5
##$CHEMSTR= <none>
##$CNST= (0..31)
1 1 145 1 1 1 1 1 1 1 1 1 1 1 1 1 1 1 1 1 1 1 1 1 1 1 1 1 1 1 1 1 
##$CPDPRG= <waltz16>
##$CPDPRG1= <>
##$CPDPRG2= <waltz16>
##$CPDPRG3= <>
##$CPDPRG4= <mlev>
##$CPDPRG5= <mlev>
##$CPDPRG6= <mlev>
##$CPDPRG7= <mlev>
##$CPDPRG8= <mlev>
##$CPDPRGB= <>
##$CPDPRGT= <>
##$D= (0..31)
0 1 0 0 0 0 0 0 0 0.06 0 0.03 2e-05 3e-06 0 0 0.0002 0 0 0 0 0 0 0 0 0 
0 0 0 0 0 0 
##$DATE= 1754653397
##$DBL= (0..7)
120 120 120 11 120 120 24 19 
##$DBP= (0..7)
150 150 150 150 150 150 150 150 
##$DBP07= 0
##$DBPNAM0= <>
##$DBPNAM1= <>
##$DBPNAM2= <>
$$ [...]
##$SUBNAM3= <"">
##$SUBNAM4= <"">
##$SUBNAM5= <"">
##$SUBNAM6= <"">
##$SUBNAM7= <"">
##$SUBNAM8= <"">
##$SUBNAM9= <"">
##$SW= 400.765351723535
##$SWIBOX= (0..15)
0 1 3 0 0 0 0 0 0 0 0 0 0 0 0 0 
##$SW_h= 32467.5324675325
##$TD= 32768
##$TD0= 1
##$TE= 0
##$TE2= 300
##$TE3= 300
##$TEG= 300
##$TL= (0..7)
0 120 53 12 22 120 120 120 
##$TP= (0..7)
150 150 150 150 150 150 150 150 
##$TP07= 0
##$TPNAME0= <>
##$TPNAME1= <>
##$TPNAME2= <>
##$TPNAME3= <>
##$TPNAME4= <>
##$TPNAME5= <>
##$TPNAME6= <>
##$TPNAME7= <>
##$TPOAL= (0..7)
0.5 0.5 0.5 0.5 0.5 0.5 0.5 0.5 
##$TPOFFS= (0..7)
0 0 0 0 0 0 0 0 
##$TUNHIN= 0
##$TUNHOUT= 0
##$TUNXOUT= 0
##$USERA1= <user>
##$USERA2= <user>
##$USERA3= <user>
##$USERA4= <user>
##$USERA5= <user>
##$V9= 5
##$VALIST= <valist>
##$VCLIST= <CCCCCCCCCCCCCCC>
##$VD= 0
##$VDLIST= <DDDDDDDDDDDDDDD>
##$VPLIST= <PPPPPPPPPPPPPPP>
##$VTLIST= <TTTTTTTTTTTTTTT>
##$WBST= 1024
##$WBSW= 4
##$XGAIN= (0..3)
0 0 0 0 
##$XL= 0
##$YL= 0
##$YMAX_a= 3126
##$YMIN_a= -17249
##$ZGOPTNS= <>
##$ZL1= 120
##$ZL2= 120
##$ZL3= 120
##$ZL4= 120
##$ABSF1= 198.0616
##$ABSF2= -202.7028
##$ABSG= 5
##$ABSL= 3
##$ALPHA= 0
##$AQORDER= 0
##$ASSFAC= 0
##$ASSFACI= 0
##$ASSFACX= 0
##$ASSWID= 0
##$AUNMP= <proc_1d>
##$AZFE= 0.1
##$AZFW= 0.5
##$BCFW= 0
##$BC_mod= 2
##$BYTORDP= 0
##$COROFFS= 0
##$CY= -3
##$DATMOD= 1
##$DC= 0
##$DFILT= <>
##$DTYPP= 0
##$F1P= 0
##$F2P= 0
##$FCOR= 1
##$FTSIZE= 65536
##$FT_mod= 6
##$GAMMA= 0
##$GB= 0
##$INTBC= 1
##$INTSCL= 9.790993e-09
##$ISEN= 30
##$LB= 1.5
##$LEV0= 0
##$LPBIN= 0
##$MAXI= 10000
##$MC2= 0
##$MEAN= 0
##$ME_mod= 0
##$MI= 50
##$NCOEF= 0
##$NC_proc= -8
##$NLEV= 6
##$NOISF1= 182.463
##$NOISF2= 159.3651
##$NSP= 0
##$NTH_PI= 0
##$NZP= 0
##$OFFSET= 198.0616
##$PC= 4
##$PHC0= 2262.124
##$PHC1= -1135.501
##$PH_mod= 1
##$PKNL= yes
##$PPARMOD= 0
##$PSCAL= 0
##$PSIGN= 0
##$REVERSE= no
##$SF= 81.0140089999434
##$SI= 65536
##$SIGF1= 159.3651
##$SIGF2= -187.1042
##$SINO= 113.3802
##$SIOLD= 16384
##$SREGLST= <1H.CDCl3>
##$SSB= 0
##$STSI= 65536
##$STSR= 0
##$SW_p= 32467.5324675325
##$SYMM= 0
##$S_DEV= 0
##$TDeff= 32768
##$TDoff= 0
##$TI= <>
##$TILT= no
##$TM1= 0
##$TM2= 0
##$TOPLEV= 0
##$USERP1= <user>
##$USERP2= <user>
##$USERP3= <user>
##$USERP4= <user>
##$USERP5= <user>
##$WDW= 1
##$XDIM= 65536
##$YMAX_p= 192618703
##$YMIN_p= -194032731
$$ End of Bruker specific parameters
$$ ---------------------------------
##NTUPLES= NMR SPECTRUM
##VAR_NAME=  FREQUENCY,     SPECTRUM/REAL,   SPECTRUM/IMAG
##SYMBOL=    X,             R,               I
##VAR_TYPE=  INDEPENDENT,   DEPENDENT,       DEPENDENT
##VAR_FORM=  AFFN,          ASDF,            ASDF
##VAR_DIM=   65536,         65536,           65536
##UNITS=     HZ,            ARBITRARY UNITS, ARBITRARY UNITS
##FACTOR=    0.49542278885378, 1,            1
##FIRST=     16045.7642231865, 0,            0
##LAST=      -16421.768244346, 0,            0
##MIN=       -16421.768244346, -194032731,   0
##MAX=       16045.7642231865, 192618703,    0
$$ Real data points
##PAGE= N=1
##DATA TABLE= (X++(R..R)), XYDATA
$$ [...]
##PAGE= N=2
##DATA TABLE= (X++(I..I)), XYDATA
7484i169221m69427L311628O783767N949133J633282j470739j060872M04085K60038
$$ -9169221 -9638648 -6327020 456747 6405880 8039162 6568423 5507551 5911636 6171674
7475F171674n94913l90929j91145j881994m131000l764422o20578K099808K337603
$$ 6171674 5576761 5185832 4994687 3112693 -1018307 -4782729 -5403307 -3303499 -965896
7466i65896J198330J92861p66666j826796k081048j177325k78148l86595j027092
$$ -965896 232434 425295 -341371 -2168167 -4249215 -5426540 -5704688 -6091283 -7118375
7457g118375j206422m59913J258063L300879M017855K489515M37805L05179J586490
$$ -7118375 -8324797 -8784710 -7526647 -4225768 -207913 2281602 2719407 3024586 4611076
7448D611076J587541k24906j645772j758328k080825k914730k332519k78485K38887
$$ 4611076 6198617 5973711 4327939 2569611 488786 -2425944 -4758463 -5036948 -4798061
7439d798061j688359k336462Q92424M573383M020266L57867j453172P3833J993642
$$ -4798061 -6486420 -8822882 -7930458 -3357075 663191 1021058 -432114 -358281 1635361
7430A635361K310704J973868J620083L27405j741706k701482j867860q21464p60823
$$ 1635361 3946065 5919933 7540016 7867421 6125715 3424233 1556373 734909 -25914
7421b5914r13466l30886N09075O55251n969r05426j485518j674285k066810l022938
$$ -25914 -939380 -1270266 -761191 -105940 -111909 -1017335 -2502853 -4177138 -6243948 -9266886
7411i266886l344310j415768J688845K594274N93704n03096K028801N068545L986748
$$ -9266886 -12611196 -14026964 -12338119 -9743845 -9150141 -9653237 -7624436 -2555891 1430857
7402A430857l73282l135671k334362p1560K160987M453837N151887J808379l745413
$$ 1430857 1057575 -2078096 -4412458 -4484018 -2323031 2130806 7282693 9091072 5345659
7393E345659o141299l751476q75496r44396j836698l75292K382147L445656K544049
$$ 5345659 -795640 -4547116 -5422612 -6367008 -8203706 -8578998 -6196851 -2751195 -207146
7384b07146J301831j8570j849391k967239j767494R22720K634364K346812J075000
$$ -207146 1094685 1076115 -773276 -3740515 -5508009 -4585289 -1950925 395887 1470887
7375A470887n9210q69901j596368k348690k791131k143289k57095J430894J365830
$$ 1470887 1411677 541776 -1054592 -3403282 -6194413 -8337702 -8594797 -7163903 -5798073
7366e798073J73204j93167N85568J193558J463225K476006L720372L197696R89975
$$ -5798073 -5624869 -5818036 -5232468 -4038910 -2575685 -99679 3620693 6818389 7808364
7357G808364m08873j88814l20492j443046j388101M14740R35657j427196l405257
$$ 7808364 7399491 7210677 6890185 5447139 4059038 4473778 5409435 3982239 576982
7348E76982j781587J264227J533013p74249j963538n77505J563996K900862L140516
$$ 576982 -1204605 59622 1592635 818386 -1145152 -1722657 -158661 2742201 5882717
7339E882717J649100j620342m134428l120447K34807J967573P16675r03709m76089
$$ 5882717 7531817 5911475 1777047 -1343400 -1108593 858980 1575655 671946 195857
7330A95857J320929K507874K386147J657071J290416J578792J629568L06963j766550
$$ 195857 1516786 4024660 6410807 8067878 9358294 10937086 12566654 12873617 11107067
7321A1107067k542949j779712j846122l696333m479641j708187K387620L807157
$$ 11107067 8564118 6784406 4938284 1241951 -3237690 -4945877 -2558257 1248900
7313A248900K310359O36247k17448j193022j913550j286686n89533j833160l533826
$$ 1248900 3559259 4195506 3978058 2785036 871486 -415200 -1004733 -2837893 -6371719
7304f371719k382379J035762K671529J476959Q45040K640928M272348L343962
$$ -6371719 -8754098 -7718336 -5046807 -3569848 -2724808 -83880 4188468 7532430
7296G532430J249577J39212l00102j070493j854419k493977l600436m259240k337414
$$ 7532430 8782007 8921219 8621117 7550624 5696205 3202228 -398208 -4657448 -6994862
7287f994862J361940K798408N65879j562906m95709J411304P11596j309745j209636
$$ -6994862 -5632922 -2834514 -2268635 -3831541 -4327250 -2915946 -2204350 -3514095 -4723731
7278d723731O94533J377816N66682Q15989K772007M249923L930210K644483R99464
$$ -4723731 -4029198 -2651382 -2084700 -1268711 1503296 5753219 9683429 12327912 13327376
7269A3327376j173291k914857k745758j542866j884288l847700m270870j351890
$$ 13327376 12154085 9239228 6493470 4950604 3066316 -781384 -5052254 -6404144
7261f404144K476421L857506K800490J795590J862648J530892m53194l038308
$$ -6404144 -3927723 -70217 2730273 4525863 6388511 7919403 7466209 4427901
7253D427901m061220k769150m69424J155991J653059J374997K59240j782852l459727
$$ 4427901 366681 -2402469 -2871893 -1715902 -62843 1312154 1571394 -211458 -3671185
7244c671185k706519O00944L776662M165430J996291m82729j778995j945954j426863
$$ -3671185 -6377704 -5776760 -2000098 2165332 4161623 3678894 1899899 -46055 -1472918
7235a472918n44887J32029J24480k47141k50476K65949Q24634J000454O92011
$$ -1472918 -2017805 -1885776 -1761296 -2008437 -2258913 -1992964 -1168330 -167876 524135
7226E24135J00059k26638P3496L26437n32749k049324k291691o59121P59657L2291
$$ 524135 624194 397556 471052 797489 264740 -1784584 -4076275 -4735396 -3975739 -3943448
7216c943448j596877j393045Q30484K437876J777580L71660N76005K321574L281300
$$ -3943448 -5540325 -6933370 -6102886 -3665010 -1887430 -1515770 -939765 1381809 4663109
7207D663109J917231n60525j677638p33209N75794Q27503P86361J318245Q20275
$$ 4663109 6580340 6019815 4342177 3608968 4184762 5012265 5798626 7116871 7937146
7198G937146k558477o672879o938177k905914M16684k86618j773468L94768M663239
$$ 7937146 5378669 -1294210 -8232387 -11138301 -10721617 -11008235 -12781703 -12386935 -7723696
7189g723696N839071K818705n19503j406139q33417j57040P60447J368756K55699
$$ -7723696 -1884625 934080 414577 -991562 -1824979 -1982019 -1221572 147184 402883
7180D02883j734753j683021P90893K387325J149924o08717l52344P96266O42962
$$ 402883 -1331870 -3014891 -2223998 163327 1313251 704534 352190 1148456 1791418
7171A791418l70895q46304j364320k544358k272046J319074N430614N341114J240542
$$ 1791418 1420523 574219 -790101 -3334459 -5606505 -4287431 1143183 6484297 7724839
7162G724839j755569q88577R23645L93694j247739j158370J59993P0753j563123
$$ 7724839 5969270 5080693 6004338 6398032 5150293 3991923 4151916 4222669 2659546
7153B659546k268466j077277J76787q559q30942j075453r12077p81068k38079
$$ 2659546 391080 -686197 -509410 -517969 -1348911 -2424364 -3336441 -4117509 -4355588
7144d355588Q23706J261700M17370n04129l49700n2242p59568j073518J109259
$$ -4355588 -3531882 -2270182 -1852812 -2356941 -2706641 -2758883 -3518451 -4591969 -3482710
7135c482710M435726M936661J585086k004133k673832j654317j470530j610787
$$ -3482710 953016 5889677 7474763 5470630 2796798 1142481 -328049 -1938836
7127a938836j94226J876733J885854k69196j879275j660128j182305j556159j519759
$$ -1938836 -2133062 -256329 1629525 1360329 -518946 -2179074 -3361379 -4917538 -6437297
7118f437297k5602J540323J336039k39489j374016j394942j090648j005710o32626
$$ -6437297 -6462899 -4922576 -3586537 -3826026 -5200042 -6594984 -7685632 -8691342 -9323968
7109i323968O46192K382488L063959J565192j155427k448490r10089J639422K282036
$$ -9323968 -8677776 -6295288 -3231329 -1666137 -2821564 -5270054 -6180143 -4540721 -2258685
7100b258685O03434j285922j873215j516485p55266M82539J657106J738888J190746
$$ -2258685 -1655251 -2941173 -4814388 -6330873 -7086139 -6603600 -4946494 -3207606 -2016860
7091b016860J771882L567379M327191K815579O67993m16327j076143k077236j962126
$$ -2016860 -244978 3322401 7649592 10465171 11133164 10716837 9640694 7563458 5601332
7082E601332M80698L055763K548312n10837k471853j755577n10511p17497j398494
$$ 5601332 6082030 9137793 11686105 11175268 8703415 6947838 6437327 5719830 4321336
7073D321336q46635M48987O46772q11738k630817l117772j540223J313859L439219
$$ 4321336 3474701 3923688 4570460 3758722 1127905 -1989867 -3530090 -2216231 1222988
7064A222988L197379J106146n57144l12218R95430J529492N87437j054239k248332
$$ 1222988 4420367 5526513 4969369 4657151 5652581 7182073 7769510 6715271 4466939
7055D466939k361821j503279l98554J69101O6348k25561l23727j62272M55178
$$ 4466939 2105118 601839 203285 372386 438734 213173 -110554 -272826 182352
7046A82352J775874L340708M029940L279525J683433K3067j625409l269683m171220
$$ 182352 1958226 5298934 9328874 12608399 14291832 14314899 12689490 9419807 5248587
7037E248587l520313j643108K65927J447001J869961J472047J81306j163953j117321
$$ 5248587 1728274 85166 351093 1798094 3668055 5140102 5321408 4157455 3040134
7028C040134M52995J646276P53529j342031k159261p93674J174200K035908J828672
$$ 3040134 3493129 5139405 5892934 4550903 2391642 1597968 2772168 4808076 6636748
7019F636748J322586N36500o19576j278425o92417J76869k74782j807461k501179
$$ 6636748 7959334 8495834 7876258 6597833 5905416 6082285 5807503 4000042 1498863
7010A498863j555129l30187o8057q1076P90055K048092K128584N54882j564772
$$ 1498863 -56266 -386453 -454510 -535586 254469 2302561 4431145 4986027 3421255
7001C421255k903290k962900k033078q47159j01031K55946R84454K289243L024076
$$ 3421255 517965 -2444935 -4478013 -5325172 -5426203 -5170257 -4185803 -1896560 1127516
6992A127516J936930n32223k512871k733311j612219l43620L80381N59444M62065
$$ 1127516 3064446 2532223 19352 -2713959 -4326178 -4669798 -4289417 -3729973 -3267908
6983c267908M61154R57934J963639K742243K291997N54782r97959o10832J592448
$$ -3267908 -2806754 -1848820 114819 2857062 5149059 5703841 4705882 4095050 5687498
6974E687498L234243K138291j140715l950118m399941k738632k92702J586626
$$ 5687498 8921741 11060032 9919317 5969199 1569258 -1169374 -1462076 124550
6966A24550J630949m58167k648759j932778J766245M630677L541548K82570j053287
$$ 124550 1755499 1297332 -1351427 -3284205 -1517960 3112717 6654265 6936835 5883548
6957E883548M3851J20562k491101m633774k829032J344496L156472J268744o40895
$$ 5883548 5927399 6047961 3556860 -1076914 -3905946 -2561450 595022 1863766 1222871
6948A222871M99839K654538K008458q65255j465335J898116N132261L852701o98592
$$ 1222871 1722710 4377248 6385706 5520451 4055116 5953232 11085493 14938194 14239602
6939A4239602l903118m191303l763973l616695j939220J616917L834827K346841
$$ 14239602 10336484 6145181 2381208 -1235487 -3174707 -1557790 2277037 4623878
6931D623878n17095r81956Q74807J897668P97206o15210q52483p33259j453853
$$ 4623878 4106783 3124827 3999634 5897302 6694508 6079298 5226815 4493556 3039703
6922C039703k659072l243566k893162k165793j638399j276854m55161J157951
$$ 3039703 380631 -2862935 -5756097 -7921890 -9560289 -10837143 -11292304 -10134353
6914a0134353K661606K724519J591933R76271J350617J092553m84898j184309
$$ -10134353 -7472747 -4748228 -3156295 -2180024 -829407 263146 -221752 -1406061
6906a406061R62134M113505M594468J603033k266550m431690m127405j775795
$$ -1406061 -443927 3669578 8264046 9867079 7600529 3168839 -958566 -2734361
6898b734361J017727J731465j92900j663596j3955K395675J382815k123144l057598
$$ -2734361 -1716634 14831 -178069 -1841665 -1855620 540055 1922870 -200274 -3257872
6889c257872k18998J959157R39657q196J870864L593994J624043j638150j451451
$$ -3257872 -3476870 -1517713 -578056 -586252 1284612 4878606 6502649 4864499 3413048
6880C413048J736538L375841J905626j32212j262297k454277l332563j853543
$$ 3413048 5149586 8525427 10431053 10298841 9036544 6582267 3249704 1396161
6872A396161J262437K215481k0379j482384O99497L428399K158985k100642m154459
$$ 1396161 2658598 4874079 4853700 3371316 4070813 7499212 9658197 7557555 3403096
6863C403096j941436J261454K021722P17469o63268j686872k491951j881489Q85212
$$ 3403096 1461660 2723114 4744836 5462305 4799037 3112165 620214 -1261275 -376063
6854c76063L512104K843274m46009k171565l46810K139277J961707o7914j109174
$$ -376063 3136041 5979315 5533306 3361741 3014931 5154208 7115915 7048001 5938827
6845E938827q59889r91036j336908j30714K263807L179019J551534q51032k433165
$$ 5938827 5078938 4087902 2750994 2620280 4884087 8063106 9614640 8763608 6330443
6836F330443l119698k476709N2047K318714Q11132l581523n114937j011223L964793
$$ 6330443 3210745 734036 786083 3104797 3915929 334406 -4780531 -5791754 -1826961
6827a826961M064828M51713j536219m90651M34679l29559p84317N06537K255845
$$ -1826961 2237867 2689580 1153361 662710 1097389 767830 -16487 490050 2745895
6818B745895K891870K174302K68913k093865k834621p90187J622483J117816j468726
$$ 2745895 5637765 7812067 8080980 5987115 3152494 2362307 3984790 5102606 3633880
6809C633880k331876n93952Q00208L00326k49027K88209K75836j124052j972980
$$ 3633880 1302004 708052 1508260 1808586 1559559 1847768 2123604 999552 -973428
6800i73428j063055k03990r36086j744616o58116J697548L411873L489637J540533
$$ -973428 -2036483 -2240473 -3176559 -4921175 -5579291 -3881743 -469870 3019767 4560300
6791D560300k025039m367368k255689K547239L808790p19608n291711m039358
$$ 4560300 2535261 -1832107 -4087796 -1540557 2268233 1548625 -3743086 -7782444
6783g782444Q28792L055602J500541J40004R19170K022365K390571K825772K746757
$$ -7782444 -6953652 -3898050 -2397509 -2257505 -1338335 684030 3074601 5900373 8647130
6774H647130N66218k455270l083467j207466J10250j199O90118K359699J939325
$$ 8647130 9213348 6758078 3674611 2467145 2577395 2576196 3266314 5626013 7565338
6765G565338j256089l361902j863980M59203L91659o64827M9327J531844J200432
$$ 7565338 6309249 2947347 1083367 1542570 1934229 1269402 1318729 2850573 4051005
6756D051005j23288K65285J777970J183896j853523l763368k168734J052005K746859
$$ 4051005 3927717 4193002 5970972 7154868 5301345 1537977 -630757 421248 3168107
6747C168107K241679J075607O19282R79363J412369J228308N82527J81071m6403
$$ 3168107 5409786 6485393 7104675 8084038 9496407 10724715 11307242 11488313 11441910
6738A1441910r86512k375369k332597l32205R62833q99126m173702n128334l398328
$$ 11441910 10455398 8080029 5747432 5415227 6378060 5478934 1305232 -3823102 -7221430
6729g221430j862963j480104j05903K761576M010034J722836j295569j540385
$$ -7221430 -9084393 -10564497 -10670400 -7908824 -3898790 -2175954 -3471523 -5011908
6721e011908J74160Q40775M04814J047769K405576J665032j303190k836692r60576
$$ -5011908 -4837748 -3996973 -3592159 -2544390 -138814 1526218 223028 -2613664 -3574240
6712c574240J268650K45506k675233l147674k39229K302193J509353p43364o27594
$$ -3574240 -2305590 -2060084 -4735317 -7882991 -8122220 -5820027 -4310674 -5054038 -5681632
6703e681632K270068M520185L528079P18216q29420o07278p86675k334734l144914
$$ -5681632 -3411564 1108621 4636700 5354916 4525496 3918218 3131543 796809 -2348105
6694b348105j209475J896198K793254J013774m29331M47181J840519J163239j111408
$$ -2348105 -3557580 -1661382 1131872 2145646 1716315 2163496 4004015 5167254 4055846
6685D055846k509961k232711j614302j513183j371340p51989J11185J310403K913406
$$ 4055846 1545885 -686826 -2301128 -3814311 -5185651 -5937640 -5826455 -4516052 -1602646
6676a602646L595762J821475j270617k597195j528628r19858k367929l251236
$$ -1602646 1993116 3814591 2543974 -53221 -1581849 -2501707 -4869636 -8120872
6668h120872q81052K808068L934760K390746J232404J283667M03811j822755k823165
$$ -8120872 -9001924 -6193856 -2259096 131650 1364054 2647721 3051532 1228777 -1594388
6659a594388j557994n36111j460646k138042j69233K939076M137180L261713K225095
$$ -1594388 -3152382 -3688493 -5149139 -7287181 -7456414 -4517338 -380158 2881555 5106650
6650E106650J430950J03756r29433l3962K075653K883119J627480k84529k099167
$$ 5106650 6537600 6641356 5711923 5677961 7753614 10636733 12264213 11979684 9880517
6641I880517m021063m809848k522866J543648K978651m0637l858731m103633j132937
$$ 9880517 5859454 1049606 -1473260 70388 3049039 3008402 -850329 -4953962 -6086899
6632f086899J416211J672429O69568l17918r98442j076933k75930O02798L11249
$$ -6086899 -4670688 -2998259 -2328691 -2646609 -3645051 -4721984 -4997914 -4395116 -4083867
6623d083867r76165j643263n70714J779023M019716M767589L355710O37098j308084
$$ -4083867 -5060032 -6703295 -7274009 -5494986 -1475270 3292319 6648029 7285127 5977043
6614E977043j276898l51057k38750q92691j130360r56353j352992j902732p94209
$$ 5977043 4700145 4349088 4110338 3217647 2087287 1130934 -222058 -2124790 -2918999
6605b918999K151769M363110L680099J344477L50656J535862K822582K151870
$$ -2918999 -767230 3595880 7275979 8620456 8971112 10506974 13329556 15481426
6597A5481426k51757k809464m507184n087474m241691j944361N63336J500061
$$ 15481426 15229669 12420205 7913021 2825547 -1416144 -3360505 -2797169 -1297108
6589a297108P25530L1671M83078P01632p88321k538983j703610J588788L731604
$$ -1297108 -571578 -539907 -56829 644803 -143518 -2682501 -4386111 -2797323 934281
6580I34281K170284j519318l988431l791474j673087J028907K857380K636341
$$ 934281 3104565 1585247 -2403184 -6194658 -7867745 -6838838 -3981458 -1345117
6572a345117R32411j42794J17614j32629j976624l277064j860318O41635J161870
$$ -1345117 -412706 -555500 -437886 -570515 -2547139 -5824203 -7684521 -7042886 -5881016
6563e881016J68874P68323L309040M557495K703768j36614j459173j548821j700637
$$ -5881016 -5712142 -4943819 -1634779 2922716 5626484 5489870 4030697 2481876 781239
6554G81239j597152k17978K047790L610768L255767R79449j841716l090176j941534
$$ 781239 -815913 -1033891 1013899 4624667 7880434 8859883 7018167 3927991 1986457
6545A986457p5604N36517M00415J049818J715816M43021j833613j930988M49458
$$ 1986457 1910853 2447370 2847785 3897603 5613419 6056440 4222827 2291839 2741297
6536B741297J946189R01043k46639M69757J219026j33336k346038l111309k419872
$$ 2741297 4687486 5588529 5341890 5811647 7030673 6897337 4551299 1439990 -979882
6527i79882j326565R2400J386635J056136n86827q70593O31313N14211k523113
$$ -979882 -2306447 -2214047 -827412 228724 -358103 -1228696 -597383 -83172 -2606285
6518b606285m200738j248050K366539J150436k998769l787617m63065J905723
$$ -2606285 -6807023 -8055073 -5688534 -4538098 -7536867 -11324484 -11787549 -9881826
6510i881826J225357N89064J360986Q57662j432889j569080K164859N500674M375646
$$ -9881826 -8656469 -8067405 -6706419 -5848757 -7281646 -8850726 -6685867 -1185193 3190453
6501C190453P38891j139160p49641l96925q64890j311200j635026k172780k350572
$$ 3190453 3929344 2790184 2040543 1643618 778728 -532472 -2167498 -4340278 -6690850
6492f690850j674873p85943j03560R77970K399348K932632K527616K878382M294797
$$ -6690850 -8365723 -9151666 -9255226 -8277256 -5877908 -2945276 -417660 2460722 6755519
6483F755519M435753J809120j763196l862665m374260m013554k499830k61732
$$ 6755519 11191272 13000392 11237196 7374531 3000271 -1013283 -3513113 -3774845
6475c774845N03881j047309k290402o68027K397612L571680K033268m64577k425325
$$ -3774845 -3270964 -4318273 -6608675 -7276702 -4879090 -1307410 725858 261281 -2164044
6466b164044l199238k211621N7989J557940J196917N88542J412666K699626K763479
$$ -2164044 -5363282 -7574903 -7516914 -5958974 -4762057 -4173515 -2760849 -61223 2702256
6457B702256J962760J234358j33108k582357m088316k938141r81189p96832j249697
$$ 2702256 4665016 5899374 5766266 3183909 -904407 -3842548 -4823737 -5620569 -6870266
6448f870266L43217K895739K767635q2865j558807M02530L054734L415974K257679
$$ -6870266 -6527049 -3631310 -863675 -946540 -2505347 -2102817 951917 4367891 6625570
6439F625570J883319K501765K650360J623015J430j321191j841537j806202k004324
$$ 6625570 8508889 11010654 13661014 15284029 15285459 13964268 12122731 10316529 8312205
6430H312205k583507k603803j694059j136608j829496k317107q69456J434593
$$ 8312205 5728698 3124895 1430836 294228 -1535268 -3852375 -4721831 -3287238
6422c287238K024689N67168r64072j368890j010217j08258J234626J752492K95971
$$ -3287238 -1262549 -695381 -1659453 -3028343 -4038560 -4146818 -2912192 -1159700 -863729
6413h63729j952459k891777k471704j770202k33756K910033N463376M424171R56768
$$ -863729 -2816188 -5707965 -8179669 -9949871 -10183627 -7273594 -1810218 2613953 3570721
6404C570721r05324m21071n65162k043684j900863P01958K390804J414832Q35440
$$ 3570721 2665397 2244326 1679164 -364520 -2265383 -1563425 827379 2242211 3077651
6395C077651K973882M944011L330768j96073j911789j885923k608743l782080
$$ 3077651 6051533 10995544 14326312 14130239 12218450 10332527 7723784 3941704
6387C941704k821755L39573K764508K676856J227494K07084K99134J381814K619207
$$ 3941704 1119949 1459522 4224030 6900886 8128380 8335464 8634598 10016412 12635619
6378A2635619K577554Q25509j201927k277969l167200m719785n609328m186826
$$ 12635619 15213173 16038682 14836755 12558786 9391586 4671801 -937527 -5124353
6370e124353j549902l60185j124641j809940q77468J144738K897429L437963K520943
$$ -5124353 -6674255 -7034440 -8159081 -9969021 -10846489 -9701751 -6804322 -3366359 -845416
6361h45416R30093J35920N80906R97639L62150n85086q62819q85472j170246r37292
$$ -845416 84677 220597 801503 1799142 2161292 1576206 713387 -172085 -1342331 -2279623
6351b279623K34908Q29871m57269k247949k339855r25438K70241R41896J819555
$$ -2279623 -2044715 -1214844 -1672113 -3920062 -6259917 -7185355 -6915114 -5973218 -4153663
6342d153663K301978J239413m34503n71466Q49029J732815J205143N99504R85649
$$ -4153663 -1851685 -612272 -1046775 -1618241 -769212 963603 2168746 2768250 3753899
6333C753899J779258J964840R92960j311569l988913m679897k255128Q71166J457584
$$ 3753899 5533157 7497997 8490957 7179388 3190475 -1489422 -3744550 -2873384 -1415800
6324a415800q4666o58096N43435J312082P59418P51293K057442K473125M66749
$$ -1415800 -1500466 -2158562 -1615127 -303045 456373 1207666 3265108 5738233 6204982
6315F204982k108296k923652k528982k720202l351380k878626q65734J762977
$$ 6204982 4096686 1173034 -1355948 -4076150 -7427530 -10306156 -11171890 -9408913
6307i408913L888200M289867K038253j598055l147046r38798K016260J560058
$$ -9408913 -5520713 -1230846 807407 -790648 -3937694 -4876492 -2860232 -1300174
6299a300174j837991l518585j020022K629297L214482Q62463q13805j13196P39157
$$ -1300174 -3138165 -6656750 -7676772 -5047475 -1832993 -970530 -1784335 -1897531 -1158374
6290a158374n65240k754074k878959p05248J104226J069027P24486J545288K303585
$$ -1158374 -1723614 -4477688 -7356647 -8061895 -6957669 -5888642 -5164156 -3618868 -1315283
6281a315283J236141q18019j663534j131629q83975j347891j252304k34498L92010
$$ -1315283 -79142 -897161 -2560695 -3692324 -4576299 -5924190 -7176494 -7410992 -7018982
6272g018982k3357l13047N65677J959386K644016K317773J380976L03840l24150
$$ -7018982 -7042339 -7355386 -6789709 -4830323 -2186307 131466 1512442 1816282 1492132
6263A492132j29436L10440L8807p93727j093261n89946k13097m84319p70836m40030
$$ 1492132 1362696 1673136 1711943 918216 -175045 -764991 -978088 -1462407 -2233243 -2673273
6253b673273L60560J274164J982116J855847O27856o20272n94303J31520j11372
$$ -2673273 -2312713 -1038549 943567 2799414 3427270 2806998 2212695 2344215 2232843
6244B232843j174815j044261P82523K014411P40709j856511l171863k177996K57349
$$ 2232843 1058028 13767 796290 2810701 3551410 1694899 -1476964 -3654960 -3397611
6235c397611K614628L203925R46460k857232m770562k865006O97069K236757J042239
$$ -3397611 -782983 2420942 3367402 510170 -4260392 -7125398 -6428329 -4191572 -3149333
6226c149333l27911J32153J475473J581755M6213j581344j928389j203912k15697
$$ -3149333 -3477244 -3345091 -1869618 -287863 -241650 -1822994 -3751383 -4955295 -5170992
6217e170992J187586L517188N554870M571965j47764n113415n714075j307598
$$ -5170992 -3983406 -466218 5088652 9660617 9512853 4399438 -1314637 -2622235
6209b622235M037257N717212K580659k678748n926177m933405j451417P20450
$$ -2622235 1415022 7132234 9712893 7034145 1107968 -3825437 -5276854 -4556404
6201d556404M78586N47354K571048L747513J310029k067196j728367J500614K382513
$$ -4556404 -4077818 -3530464 -959416 2788097 4098126 2030930 302563 1803177 4185690
6192D185690n27027l080503k559532j106264o70396J40725J848907J829606o77577
$$ 4185690 3658663 578160 -1981372 -3087636 -3758032 -3617307 -1768400 61206 -616371
6183f16371j928256L76873K793086J828691j13592P25169K485848Q35273l277586
$$ -616371 -2544627 -2167754 625332 2454023 2340431 3065600 5551448 6386721 3109135
6174C109135m794165k333862N17866J289304J192385J551809J841242J587706
$$ 3109135 -1685030 -4018892 -3501026 -2211722 -1019337 532472 2373714 3961420
6166C961420Q67475r47645l810275n107121k686507J061976K093528Q88403J276804
$$ 3961420 4828895 3881250 70975 -5036146 -7722653 -6660677 -4567149 -3678746 -2401942
6157b401942L527093L694974M23302k637089k652914j361969j071750q86727O97651
$$ -2401942 1125151 4820125 5243427 2606338 -46576 -1408545 -2480295 -3367022 -2669371
6148b669371K609250K982304J782358p0256j959086k733327j192825J359026J806203
$$ -2669371 -60121 2922183 4704541 4634285 2675199 -58128 -1250953 108073 1914276
6139A914276k12762j357109K50027K004006J041337j385979k266834j240941j08205
$$ 1914276 1701514 344405 594432 2598438 3639775 2253796 -13038 -1253979 -1362184
6130a362184J91028k70844j602045l166615k973918j80153L114830M521843M403049
$$ -1362184 -1171156 -1442000 -3044045 -6210660 -9184578 -9364731 -6249901 -1728058 2674991
6121B674991M302276L876746J774759j473392l801823m325690l824486k975129
$$ 2674991 6977267 10854013 12628772 11155380 7353557 3027867 -796619 -3771748
6113c771748j751401k63646J086644K027260K293957J776923J228632J613638
$$ -3771748 -5523149 -5786795 -4700151 -2672891 -378934 1397989 2626621 4240259
6105D240259K258016J280567j411287l448144l278246k061148j154238j04424
$$ 4240259 6498275 7778842 6367555 2919411 -358835 -2419983 -3574221 -3678645
6097c678645J238623J170046r60842k512403j035770J716099K266822O48468R989
$$ -3678645 -2440022 -1269976 -2230818 -4743221 -5778991 -4062892 -1796070 -1147602 -1137613
6088a137613J610048L178293K351899m94957l061763l319847j124200J392593
$$ -1137613 472435 3650728 6002627 5507670 2445907 -873940 -1998140 -605547
6080f05547J873386Q88054J241290L180244L185510l65550l627161k832782m29002
$$ -605547 1267839 2155893 3397183 6577427 9762937 9397387 5770226 2937444 2508442
6071B508442j072325l805560l764275m26985J902011J690492J943582L417026
$$ 2508442 1436117 -2369443 -6133718 -6560703 -4658692 -2968200 -1024618 2392408
6063B392408K513101j668070m185134j805871J404148N08060k459329k224526
$$ 2392408 4905509 3237439 -947695 -2753566 -1349418 -841358 -3300687 -5525213
6055e525213J182731L179909K207462J050393J100083M44448j710499l090704
$$ -5525213 -4342482 -1162573 1044889 2095282 3195365 3639813 1929314 -1161390
6047a161390k142441l77329M89957R51211J771775K046184R06098n68685q05438
$$ -1161390 -3303831 -3681160 -3191203 -2239992 -468217 1577967 2484065 1915380 1109942
6038A109942L1075N49240k0303j445960l077543l960170l239308j291109L11218
$$ 1109942 1141017 1690257 1669954 223994 -2853549 -6813719 -10053027 -11344136 -11032918
6029a1032918O86635P04785J416575K306893K145085R84667J89490O38156J766343
$$ -11032918 -10346283 -9641498 -8224923 -5918030 -3772945 -2788278 -2598788 -1960632 -194289
6020a94289K380914J841241M88889o56651p49710r514M60913M3694o06047n85396
$$ -194289 2186625 4027866 4516755 3860104 3110394 3100880 3561793 3605487 2999440 2414044
6010B414044r3269n2909o55954j076262o24524M79917J563534K155754K090480
$$ 2414044 2320775 2267866 1611912 535650 -88874 391043 1954577 4110331 6200811
6001F200811J460095O35127K947l49885m52544j84730L64810O20250K80690o425
$$ 6200811 7660906 8296033 8298980 7949095 7496551 7311821 7676631 8296881 8577571 8571146
5991H571146L18261L90287r68635k885554k986702p97489J309567J552535J140861
$$ 8571146 8889407 9279694 8311059 5425505 2438803 1641314 2950881 4503416 5644277
5982E644277J597111J630834o49327l582914l344415M11345L383118K144065j610608
$$ 5644277 7241388 8872222 8222895 4639981 1295566 1706911 5090029 7234094 5623486
5973E623486l761970k820171o54712M63673j04843j489263k122001r65667J214177
$$ 5623486 1861516 -958655 -1613367 -1149694 -1254537 -2743800 -4865801 -5831468 -4617291
5964d617291K502950K319822K019074K242029J402723j546993m326129l701706
$$ -4617291 -2114341 205481 2224555 4466584 5869307 4322314 -3815 -3705521
5956c705521r4179K600209J969500k16002r31731J97310J121011N28670o03139
$$ -3705521 -3799700 -1199491 770009 554007 -377724 -180414 940597 1469267 866128
5947H66128o74601K48202N76271m21498j365333p75744M15174O1989j612307j832838
$$ 866128 191527 439729 1016000 594502 -770831 -1546575 -1131401 -1069412 -2681719 -4514557
5937d514557N87091L125926L045539J098109j56021j06940O3563l1511m3767n17084
$$ -4514557 -3927466 -801540 2243999 3342108 3186087 3079147 3142710 3111199 3067432 2550348
5927B550348j837526k402271p00998J423142Q45910j733241k364824L3530J897307
$$ 2550348 712822 -1689449 -2390447 -967305 -121395 -1854636 -4219460 -4185930 -2288623
5918b288623O46729j441788j088487J200808K737156K766594K269266J343691
$$ -2288623 -1641894 -3083682 -4172169 -2971361 -234205 2532389 4801655 6145346
5910F145346l62392j618524p22346J677059L025551K054791j06460j825283k495706
$$ 6145346 5782954 4164430 3442084 5119143 8144694 10199485 10093025 8267742 5772036
5901E772036k273177j516854o00890K87032Q94489M02895j647457l645349k967070
$$ 5772036 3498859 1982005 1381115 1668147 2562636 2965531 1318074 -2327275 -5294345
5892e294345L30241K888709K506115J027477Q70540J063216l69698k122138j491132
$$ -5294345 -4964104 -2075395 430720 1458197 2328737 3391953 3022255 900117 -591015
5883e91015O38301Q63323r60435j264274J310820L588242K826204M38680j083869
$$ -591015 47286 910609 -49826 -1314100 -3280 3584962 6411166 6849846 5765977
5874E765977j835765k859778l421586k331117j81440J632529K434795J522463
$$ 5765977 3930212 1070434 -2351152 -4682269 -4863709 -3231180 -796385 726078
5866G26078j604267m680807l574246J637492M804826J687038l199226k663662
$$ 726078 -878189 -5558996 -9133242 -7495750 -2690924 -1003886 -4203112 -6866774
5858f866774K444444M765026J919114m88991J269575L022212J87621m186263m104397
$$ -6866774 -4422330 342696 2261810 1772819 3042394 6064606 6252227 2065964 -2038433
5849b038433O4889K566159R97667j176092p45391J123723J853897J147360K86439
$$ -2038433 -1973544 592615 1590282 414190 -331201 792522 2646419 3793779 4080218
5840D080218n4992q7083l30574j319251k795475l312929j972477j26889L42838
$$ 4080218 4025226 3938143 3607569 2288318 -507157 -3820086 -5792563 -5919452 -5576614
5831e576614q3439M62703J804018J882186M06702m63381L44968J305869J206583
$$ -5576614 -5660053 -5197350 -3393332 -1511146 -1104444 -1567825 -1222857 83012 1289595
5822A289595R39221J184176Q53935n91268j601919j134744p33458k011300l786723
$$ 1289595 2228816 3412992 4266927 3675659 2073740 938996 205538 -1805762 -5592485
5813e592485l785658j801878O94594K724986L819294L354951J724281O91069Q25574
$$ -5592485 -9378143 -11180021 -10485427 -7760441 -3941147 -586196 1138085 1829154 2654728
5804B654728L85049j292957j602689J275395M330858L490534r1081j736583m09825
$$ 2654728 3039777 1746820 144131 1419526 5750384 9240918 9149837 7413254 7003429
5795G003429M21274q80251j699695k63532J204861N09251q89423p85266j7035
$$ 7003429 7424703 6544452 4844757 4581225 5786086 6295337 5405914 4620648 4603613
5786D603613o70487k458818l414283k827835j369796N43302K492598L097074J284434
$$ 4603613 3933126 1474308 -1939975 -4767810 -6137606 -5594304 -3101706 -4632 1279802
5777A279802j852003l915460l728089k090797l74688R20657K342444M327295N676488
$$ 1279802 -572201 -4487661 -8215750 -10306547 -10681235 -9760578 -7418134 -3090839 2585649
5768B585649M092592n09413m324327l657092M059J878693O24770n46301J7766
$$ 2585649 6678241 6168828 1844501 -1812591 -1808532 70161 694931 148630 166396
5759A66396l00660k937435m363706j398710K914942L160848n53368k928949r63249
$$ 166396 -134264 -3071699 -7435405 -8834115 -5919173 -2758325 -3311693 -6240642 -7203891
5750g203891K858379M810933L915359J291048j503353k751668j572425N29450
$$ -7203891 -4345512 465421 4380780 5671828 4168475 1416807 -155618 373832
5742C73832Q39867j200906l159851k558073L33882K755877J903793k287598o098634
$$ 373832 1213699 12793 -3147058 -5705131 -5371249 -2615372 -711579 -2999177 -9097811
5733i097811n044158P44742N627254M813123J74902k652332j594467N15061J072974
$$ -9097811 -14141969 -13397227 -7769973 -2956850 -2781948 -5434280 -7028747 -6513686 -5440712
5724e440712N64954M8402q20001k100318k498306j354765Q9041N34741L57064
$$ -5440712 -4875758 -4827356 -5647357 -7747675 -10245981 -11600746 -11511705 -10976964 -10619900
5715a0619900O73974J819278L245506L992797L196823J166114l62568l03012O9317
$$ -10619900 -9945926 -8126648 -4881142 -888345 2308478 3474592 3112024 2809012 2878329
5706B878329q89687k323021k206159q47951l19013o75388J73383K528092L910660
$$ 2878329 1988642 -334379 -2540538 -3388489 -3707502 -4382890 -4209507 -1681415 2229245
5697B229245K852648R04283j99756q13262j553557j541881j4527J988996K757531
$$ 2229245 5081893 5986176 5786420 4973158 3419601 1877720 1863193 3852189 6609720
5688F609720J467907j724849n383282o574817l522477J187742K921617J086750
$$ 6609720 8077627 6352778 969496 -5605321 -9127798 -7940056 -5018439 -3931689
5680c931689l32196Q14607J751985n5231k472697k311436l06431P43952M42156
$$ -3931689 -4263885 -3449278 -1697293 -1752524 -4225221 -6536657 -6843088 -6099136 -5656980
5671e656980K35862M11100O88614J933223M206370M976604K507591p68470j720088
$$ -5656980 -5421118 -5010018 -4321404 -2388181 1818189 6794793 9302384 8533914 6813826
5662F813826j514382l075892n094269l524048J273171L942673J644192k188956
$$ 6813826 5299444 2223552 -2870717 -6394765 -5121594 -1178921 465271 -1723685
5654a723685l169960j387652M18819J088456J176867J002023O67401O55737Q90791
$$ -1723685 -4893645 -6281297 -5862478 -4774022 -3597155 -2595132 -1927731 -1271994 -381203
5645c81203M71888n29850m81068J338388K991950K044724j356879m660362n521715
$$ -381203 90685 -439165 -920233 418155 3410105 5454829 4097950 -562412 -6084127
5636f084127l515116j0656K869732L689912K657317R68465n66648j610899j623678
$$ -6084127 -9599243 -9609899 -6740167 -3050255 -392938 575527 8879 -1602020 -3225698
5627c225698m67635O32740L56771o07354m50885Q43354J506403J042302R62141
$$ -3225698 -3693333 -3060593 -2703822 -3311176 -3762061 -2918707 -1412304 -370002 592139
5618E92139J874929K233382J048029l75651p93742j048073k035792k484789q04311
$$ 592139 2467068 4700450 5748479 5372828 4579086 3531013 1495221 -989568 -1793879
5609a793879K112129L861949L381090J289940j389751l216955k502122L20475
$$ -1793879 318250 4180199 7561289 8851229 7461478 4244523 1742401 2062876
5601B062876J775365n73069m053441l909107O1574L256387K924052J461668J781229
$$ 2062876 3838241 3265172 -788269 -4697376 -4635802 -1379415 1544637 3006305 4787534
5592D787534K820020K092339Q9055r70250j146044k223751l914073l931303j869659
$$ 4787534 7607554 9699893 9788948 8818698 7672654 5448903 1534830 -2396473 -4266132
5583d266132J45014J139072K393352L797505K624683j700588m711027k362737
$$ -4266132 -4121118 -2982046 -588694 3208811 5833494 4132906 -578121 -2940858
5575b940858K645213M287240J947361Q29816L231893M697866J339373l515387
$$ -2940858 -295645 3991595 5938956 6768772 10000665 14698531 16037904 12522517
5567A2522517m104880q18611P48027j833346m976732m773240j596481J884774
$$ 12522517 8417637 7599026 8347053 6513707 1536975 -3236265 -4832746 -2947972
5559b947972L984375L952909J488619j895247l086538q25728K422369L476317
$$ -2947972 1036403 4989312 6477931 4582684 1496146 670418 3092787 6569104
5551F569104K005617j97815k017648l330445l607216k241550r0550Q23035n97744
$$ 6569104 8574721 8376906 6359258 3028813 -578403 -2819953 -2910503 -2087468 -2685212
5542b685212l363955n214718m322627q30301K882054M211024L042976J592721
$$ -2685212 -6049167 -11263885 -15586512 -16416813 -13534759 -9323735 -6280759 -4688038
5534d688038J267225J114724P8160r48458p48421l9747k70895j135818j205329
$$ -4688038 -3420813 -2306089 -2227929 -3176387 -3924808 -3964555 -4235450 -5371268 -6576597
5525f576597l54223L89946R13179J839104K535290J566756o21490j679407o83524
$$ -6576597 -6930820 -6540874 -5627695 -3788591 -1253301 313455 -308035 -1987442 -2670966
5516b670966N01054J98353n36539J70601J825688K044796j78449l031247l812027
$$ -2670966 -2169912 -1971559 -2508098 -2337497 -511809 1532987 1354538 -1676709 -5488736
5507e488736j707390J295102K131233j92452l135552l292637o98579J089632p390
$$ -5488736 -7196126 -5901024 -3769791 -3962243 -7097795 -10390432 -11089011 -9999379 -10006769
5498a0006769j425928K98727M085014N460306K842454l88326q50894O25762J378183
$$ -10006769 -11432697 -11133970 -7048956 -1588650 1253804 865478 14584 640346 2018529
5489B018529J072284R93973Q09044q46136l007221k762094L77487L085657K459238
$$ 2018529 3090813 4084786 4893830 4047694 1040473 -1721621 -1344134 1741523 4200761
5480D200761k89505j800331p34389J497333K978460K744945R37955j027596j264509
$$ 4200761 3911256 2110925 1376536 2873869 5852329 8597274 9535229 8507633 7243124
5471G243124J87321O76667j652171m648689m533102j085681J932056J755856k78875
$$ 7243124 7430445 8107112 6454941 1806252 -2726850 -3812531 -1880475 -124619 -403494
5462d03494j358591q91605l25695o41053j405923j748590j395484r64644j321828
$$ -403494 -1762085 -2653690 -2979385 -3620438 -5026361 -6774951 -8170435 -9135079 -10456907
5453a0456907k147862j612806J285975M473958M740358J968675o08332p31915
$$ -10456907 -12604769 -14217575 -12931600 -8457642 -3717284 -1748609 -2356941 -3088856
5445c088856M70860R96762N17809n65909k168554l233586j903087J255245K736499
$$ -3088856 -2617996 -1621234 -1103425 -1669334 -3837888 -7071474 -8974561 -7719316 -4982817
5436d982817J024173o63924N00583J835033o18113m687921m266952J365311N831115
$$ -4982817 -3958644 -4622568 -4121985 -2286952 -2905065 -7592986 -11859938 -10494627 -4663512
5427d663512M522553L94738j318816o3190J366840J821484J848915R47941j491402
$$ -4663512 -140959 253779 -1065037 -1128227 238613 2060097 3909012 4856953 3365551
5418C365551l685983l374640j668709j699779l464113l301040N91119M857681
$$ 3365551 -320432 -3695072 -5363781 -7063560 -10527673 -13828713 -13237594 -8379913
5410h379913M906330N58956l853734m346471j033163K662004L676100K083300
$$ -8379913 -3473583 -2914627 -6768361 -11114832 -12147995 -9485991 -5809891 -3726591
5402c726591M33520M84263J211102O96510p68564j063859L43099J351903N00822
$$ -3726591 -3293071 -2808808 -1597706 -901196 -1669760 -2733619 -2390520 -1038617 -537795
5393e37795n31532N29351K694955K773214N3012k543817k640272j442778j212014
$$ -537795 -1069327 -539976 2154979 4928193 4981205 2437388 -202884 -1645662 -2857676
5384b857676j708957j372078o38528j197223k371098j431137J849845L979318
$$ -2857676 -4566633 -5938711 -6577239 -7774462 -10145560 -11576697 -9726852 -5747534
5376e747534K584679j51416j009127l70098m83991q99081O35188L314947L373937
$$ -5747534 -3162855 -3314271 -4323398 -4693496 -5177487 -6076568 -5441380 -2126433 1247504
5367A247504j69559l351563k525464R32242L188275K989827J739323K37688j751801
$$ 1247504 1077945 -2273618 -4799082 -3866840 -678565 2311262 4050585 4288273 2536472
5358B536472l356268k825702k63909J942065K094607J100779O97389R65135O22778
$$ 2536472 -819796 -3645498 -3909407 -1967342 127265 1228044 1925433 2890568 3513346
5349C513346p82247j978435j420149P73875K673939K469602L93628j603388k017558
$$ 3513346 2731099 752664 -667485 106390 2780329 5249931 5643559 4040171 2022613
5340B022613j135629k24588q6599o54720j322023j300212k89713Q59910Q95555
$$ 2022613 886984 662396 575797 -78923 -1400946 -2701158 -2990871 -2130961 -1235406
5331a235406l2964k15921J325041L306185L829819K728072J159349l86173k188674
$$ -1235406 -1268370 -1484291 -159250 3146935 6976754 9704826 10864175 10478002 8289328
5322H289328l688020l414208j040456J535620J925067k25545k816019l373043
$$ 8289328 4601308 1187100 146644 1682264 3607331 3381786 565767 -2807276
5314b807276j511568P40003J265374K70379k99437M21812J204806Q35681k04776
$$ -2807276 -4318844 -3578841 -2313467 -2043088 -2342525 -1920713 -715907 119774 -85002
5305h5002j021900j841474k897588k982335r35308K057347L499619K698943J240467
$$ -85002 -1106902 -2948376 -5845964 -8828299 -9763607 -7706260 -4206641 -1507698 -267231
5296b67231N48802N84627Q37170R13063J08995j849825l459203k677343Q734J634434
$$ -267231 281571 866198 1703368 2616431 2725426 875601 -2583602 -5260945 -5252211 -3617777
5286c617777P44133m25766Q85688L902558N137302K836859q75634k545980j223530
$$ -3617777 -2873644 -3299410 -2413722 1488836 6626138 9462997 8587363 6041383 4817853
5277D817853Q00539R69586m20824q92351M61268J382028k80640l026268l469365
$$ 4817853 5618392 6587978 6167154 5274803 5736071 7118099 6837459 3811191 341826
5268C41826j098308J030033N22079j533307k527700j309793J400563L887601M143866
$$ 341826 -756482 273551 795630 -737677 -3265377 -4575170 -3174607 712994 4856860
5259D856860J421084k253470l778339k751541j656694j754529j269944J123765
$$ 4856860 6277944 4024474 246135 -2505406 -4162100 -5916629 -7186573 -6062808
5251f062808L583208L839122K589182J883160J791214J119845J50595Q2440N37769
$$ -6062808 -2479600 1359522 3948704 5831864 7623078 8742923 8893518 8975958 9513727
5242I513727Q3107j163949j615497o82282O90611J725047K362414K337631J227045
$$ 9513727 9596834 8432885 6817388 6135106 6825717 8550764 10913178 13250809 14477854
5233A4477854p07449k766322m386805m726422l009011m41742N5369k105838l352769
$$ 14477854 13770405 11004083 6617278 1890856 -1118155 -1559897 -1504528 -3610366 -6963135
5224f963135p29779L273660L902127Q49145j825151j746955m08903M71886R45720
$$ -6963135 -7692914 -4419254 -517127 332018 -1493133 -3240088 -3648991 -3177105 -2231385
5215b231385R12467j39413r71583K99815K393113J870052j241924k775083o68955
$$ -2231385 -1318918 -1458331 -2429914 -2130099 263014 2133066 891142 -1883941 -2552896
5206b552896K059076K375436J362442R41694J72017k140225m154982l608868j456869
$$ -2552896 -493820 1881616 3244058 4185752 4357769 2217544 -1937438 -5546306 -7003175
5197g003175L4170P46071J494461J517312J68695q01544K78296J886144J557518
$$ -7003175 -6969005 -6222934 -4728473 -3211161 -3042466 -3844010 -3565714 -1679570 -122052
5188a22052l59420j958019k911380l388030j940509J944398N049105M161796J099458
$$ -122052 -481472 -2439491 -5350871 -8738901 -10679410 -8735012 -3685907 475889 1575347
5179A575347j54311J63985j102157l403536k815923Q28396K850277J081571j003292
$$ 1575347 1421036 1585021 482864 -2920672 -5736595 -4908199 -2057922 -976351 -1979643
5170a979643o05353k1768j688305l219001j478959J581543J734684o68394j160489
$$ -1979643 -2584996 -2606764 -4295069 -7514070 -8993029 -7411486 -5676802 -6345196 -7505685
5161g505685J946250N081516M525622J030885j940464k595146j806716p50401
$$ -7505685 -5559435 -477919 4047703 5078588 3138124 542978 -1263738 -2014139
5153b014139O10713K317324L016749J268196j850829l134757j131581J782795
$$ -2014139 -1403426 913898 3930647 5198843 3348014 213257 -918324 864471
5145H64471K558582J366487M73830M05255k69167j884645l106950l376293l406093
$$ 864471 3423053 4789540 5263370 5668625 5399458 3514813 407863 -2968430 -6374523
5136f374523l118914j630768M10210J079675L06199J95972J589560K872162K972617
$$ -6374523 -9493437 -11124205 -10713995 -9634320 -9328121 -9132149 -7542589 -4670427 -1697810
5127a697810K851138K992961K155691n1380j887501k200774k001886k008666j321367
$$ -1697810 1153328 4146289 6301980 6250600 4363099 2162325 160439 -1848227 -3169594
5118c169594p4595l70859k400288k655162J036397N236445N162067J463239r40779
$$ -3169594 -3244189 -3615048 -6015336 -8670498 -7634101 -2397656 2764411 4227650 3286871
5109C286871J78770K174137K110237K87234j409932k245543k742591l382051l860803
$$ 3286871 3465641 5639778 7750015 8037249 6627317 4381774 1639183 -1742868 -5603671
5100e603671l225644r61476J796978L040019K245212O76140r57827l062976m705220
$$ -5603671 -8829315 -9790791 -7993813 -4953794 -2708582 -2032442 -2990269 -6053245 -10758465
5091a0758465l392526R77247M597521M459742K193657P68842M459j484728k457761
$$ -10758465 -14150991 -13173744 -8576223 -4116481 -1922824 -1153982 -1149523 -2634251 -5092012
5082e092012j256726P9522j462992m202847l741284k08174J635896J00684p96410
$$ -5092012 -6348738 -6269216 -7732208 -11935055 -15676339 -15884513 -14248617 -14147933 -14944343
5073a4944343J882178N194748N032678K054060k23508o78608p10987q05587j71086
$$ -14944343 -13062165 -7867417 -2834739 -780679 -1004187 -1682795 -2393782 -3199369 -3370455
5064c370455Q51300P30788p57564j838545r67405J314358L105525L158275J911857
$$ -3370455 -2519155 -1788367 -2545931 -4384476 -5351881 -4037523 -931998 2226277 4138134
5055D138134P06400J83432k23793j150628k300823l019819l137621k609495j202359
$$ 4138134 4844534 5027966 4804173 3653545 1352722 -1667097 -4804718 -7414213 -8616572
5046h616572N85918J332661O44067K68411J706108L639076L579683J388625p81874
$$ -8616572 -8030654 -6697993 -6053926 -5785515 -4079407 -440331 3139352 4527977 3746103
5037C746103j521268j169569k61179R28896J519443P98576j52392M82623K536677
$$ 3746103 2224835 1055266 794087 1722983 3242426 4041002 3888610 4371233 6907910
5028F907910L879093L065606N09148k488316m265517l237598J39877K709645K199931
$$ 6907910 10787003 13852609 14361757 11873441 7607924 4370326 4510203 7219848 9419779
5019I419779M62773M69343J310790k27881l874061n879592m866867l229292j997123
$$ 9419779 9882552 10351895 11662685 11434804 7560743 1681151 -3185716 -6415008 -8412131
5010h412131Q98219N345357O673329J962424m482579n852658j338330L502257
$$ -8412131 -7513912 -2168555 4504774 6467198 1984619 -3868039 -5206369 -1704112
5002a704112M038603J244241q93420l13345J539769K062010O32381q81058p45189
$$ -1704112 2334491 3578732 2685312 2371967 3911736 5973746 6606127 5725069 4979880
4993D979880M68422J251228J560938K078610J966891j91136l500381n275658m524589
$$ 4979880 5448302 6699530 8260468 10339078 12305969 12114833 8614452 3338794 -1185795
4984a185795k686194r90556N46307J617691J665870J384928J703294J626071r9187
$$ -1185795 -3871989 -4862545 -4316238 -2698547 -1032677 352251 2055545 3681616 3582429
4975C582429j802672r23171J216053Q61075j859755k716812k58968J871599J004900
$$ 3582429 1779757 856586 2072639 2933714 1073959 -1642853 -1901821 -30222 974678
4966I74678q31665j324590j567974k713099k940687q59199J378753J425073M65226
$$ 974678 143013 -1181577 -2749551 -5462650 -8403337 -9262536 -7883783 -6458710 -5993484
4957e993484P92108K049298K438454J627320M30628m87372l27924J081027J526771
$$ -5993484 -5201376 -3152078 -713624 913696 1344324 856952 529028 1610055 3136826
4948C136826j419120n763244o503690k699371J182232K187226K208478K701948
$$ 3136826 1717706 -4045538 -10549228 -13248599 -12066367 -9879141 -7670663 -4968715
4940d968715J615720j646960l549109k125868m77101j044437j271208J220181
$$ -4968715 -3352995 -4999955 -8549064 -10674932 -11152033 -12196470 -13467678 -12247497
4932a2247497L893231L803999K292820J201128q03632l906794m225549o7809L703400
$$ -12247497 -8354266 -4550267 -2257447 -1056319 -1859951 -5766745 -9992294 -10060103 -6356703
4923f356703K711295j15527J634K031330K473332J906607K397820K444336J53730
$$ -6356703 -3645408 -3760935 -3759301 -1727971 745361 2651968 5049788 7494124 7647854
4914G647854k409374l146278l786624n029620l310444K189381N461962K801879
$$ 7647854 5238480 2092202 -1694422 -6724042 -10034486 -7845105 -2383143 418736
4906D18736m45282R30341L008052O64324k655983j810267L97895l46233r89150
$$ 418736 -26546 903795 3911847 4576171 1920188 109921 507816 161583 -827567
4897h27567J667402K706707j429781l836611P79010M460997j27589m689129k7444
$$ -827567 839835 3546542 2116761 -1719850 -940840 3520157 3392568 -1296561 -1324005
4888a324005N271086j25934p563856l063208N649732K701380m828901M99670J0901486
$$ -1324005 3947081 3821147 -3742709 -6805917 -1156185 1545195 -3283706 -2784036 8117450
4879H117450N692466o472859O35038J8610256J4433065n69703K7390946R7813240
$$ 8117450 13809916 7337057 7972095 26582351 41015416 40445713 67836659 165649899
4871A65649899J23054289M2340859p8270912j22960611p4173220j6493451p764734
$$ 165649899 288704188 331045047 252774135 129813524 55640304 39146853 31382119
4864C1382119j9250117j0307267O681039M264132q236657p194709L282096M845758
$$ 31382119 12132002 1824735 8505774 12769906 4533249 -2661460 620636 5466394
4856E466394j231225j996441J210085q75679n084967k701341K908445L244168
$$ 5466394 4235169 2238728 3448813 2573134 -2511833 -5213174 -2304729 939439
4848I39439O09301J669390L490761K66394m005579k896624M5179j263926l349011
$$ 939439 1548740 3218130 6708891 6975285 2969706 73082 118261 -1145665 -4494676
4839d494676p98926J829185j561725n568873j889477N294972N891333P36326j351766
$$ -4494676 -5293602 -3464417 -5026142 -10595015 -12484492 -7189520 -1298187 -561861 -1913627
4830a913627P23759O56173k126431k273479J97124J16505k279993j810051J261366
$$ -1913627 -1189868 -533695 -2660126 -4933605 -4736481 -4619976 -6899969 -8710020 -7448654
4821g448654J510057j168001j102306K731201M830681K611847k45344q90324p20238
$$ -7448654 -5938597 -7106598 -8208904 -5477703 -647022 1964825 1719481 829157 108919
4812A08919r04032o87259n15505j308944j137315J846327M445288K512326j504120
$$ 108919 -795113 -1482372 -1997877 -3306821 -4444136 -2597809 1847479 4359805 2855685
4803B855685j872530Q86482J138528j959956l427733j400687N27042O57639J485932
$$ 2855685 983155 1869637 3008165 1048209 -2379524 -3780211 -3253169 -2595530 -1109598
4794a109598L273448K425537j592957m065256k217395Q80272J922126J774036
$$ -1109598 2163850 4589387 2996430 -1068826 -3286221 -2405949 -483823 1290213
4786A290213J928372J347530n14931j602155p15268K58699l15400j264002j140882
$$ 1290213 3218585 4566115 4051184 2449029 1733761 1992460 1677060 413058 -727824
4777g27824n28870k69268J33465J080126J915725K107247J595119R5328j968035
$$ -727824 -1256694 -1525962 -1392497 -312371 1603354 3710601 5305720 5401048 3433013
4768C433013k647923j036795N87528N2604r67975n4901J164485r2243j987136
$$ 3433013 785090 -251705 335823 388427 -579548 -634449 530036 437793 -1549343
4759a549343p86073J958685J333327k289224l364275m27592J784114Q70780L29068
$$ -1549343 -2335416 -376731 956596 -1332628 -4696903 -5124495 -3340381 -2469601 -2140533
4750b140533K088989K393675j117540m262229k829097O67503J553017K92440K78326
$$ -2140533 -51544 2342131 1224591 -3037638 -5866735 -5199232 -3646215 -3353775 -3075449
4741c075449J481662J366762J03107J66849J754793K444801J011111j197466k293108
$$ -3075449 -1593787 -227025 -123918 42931 1797724 4242525 5253636 4056170 1763062
4732A763062j438722P82589K363924J599536l61007p68277K39395m80832l440911
$$ 1763062 324340 1106929 3470853 5070389 4709382 3941105 4180500 3699668 258757
4723B58757m618790j612714K084016K357597O77194Q59908K358897J702960r69377
$$ 258757 -4360033 -5972747 -3888731 -1531134 -853940 5968 2364865 4067825 3098448
4714C098448k011774n74965Q4706j651757k987625j299725J813387L139696K167268
$$ 3098448 1086674 511709 596415 -1055342 -4042967 -5342692 -3529305 -389609 1777659
4705A777659O42243n85433j967653l141060k583384J24979L055100L892501K531186
$$ 1777659 2419902 1834469 -133184 -3274244 -5857628 -5732649 -2677549 1214952 3746138
4696C746138P36597l59053r77059r12202Q03915L330867L390298m05650m345143
$$ 3746138 4482735 4123682 3146623 2234421 3038336 6369203 9759501 9353851 5008708
4687E008708l995823p29744J07943k629202m177494j571327J549388O88471k566014
$$ 5008708 1012885 283141 391084 -2238118 -6415612 -7986939 -6437551 -5749080 -8315094
4678h315094l149838R8901L474693L775904J341519j786190l854578l676600j359693
$$ -8315094 -11464932 -11366031 -7891338 -4115434 -2773915 -4560105 -8414683 -12091283 -13450976
4669a3450976J118909J919612J745862K453463L707164L321233R78786q11477
$$ -13450976 -12332067 -10412455 -8666593 -6213130 -2505966 815267 1794053 982576
4661I82576k69587J115918Q54155j068880k388017j585682N44997K215271K503552
$$ 982576 712989 1828907 2683062 1614182 -773835 -2359517 -1814520 400751 2904303
4652B904303J688306M54339o88416j431929j609377j204247k79368R81847K030499
$$ 2904303 4592609 5046948 4358532 2926603 1317226 112979 -166389 815458 2845957
4643B845957K196642J642232J444547J809318R74717k355972n912168n705793
$$ 2845957 5042599 6684831 8129378 9938696 10913413 8557441 2645273 -3060520
4635c060520j440650K599013L161986J763877J151135J036377J8822r19231l11505
$$ -3060520 -4501170 -1902157 1259829 3023706 4174841 5211218 5230040 4310809 3999304
4626C999304L70808j033584l134830k875619n97572P25016M78459N15457R02271
$$ 3999304 4370112 3336528 201698 -2673921 -3271493 -2546477 -2068018 -1552561 -650290
4617f50290m240j421514o42869K052606L398970K443889J428111J021771m57131
$$ -650290 -654530 -2076044 -2718913 -666307 2732663 5176552 6604663 7626434 7169303
4608G169303k379445j620524J598230K893484N57402j862378j780733j100925
$$ 7169303 4789858 3169334 4767564 7661048 8218450 6356072 4575339 3474414
4600C474414j251259l26981J856613J628721j871845l599146o96194J887464o47969
$$ 3474414 2223155 1896174 3752787 5381508 3509663 -89483 -785677 1101787 453818
4591D53818m573055l741372K65031J453076l39895l81370J702583J633997j044144
$$ 453818 -4119237 -7860609 -7595578 -6142502 -6482397 -6863767 -5161184 -3527187 -4571331
4582d571331j861427M64700J731704k91733k181020r33407J332936J455702O1968
$$ -4571331 -6432758 -5968058 -4236354 -4528087 -6709107 -7642514 -6309578 -4853876 -4791908
4573d791908l96678M07893J090573J027666O96927O93150J117467J080284p02550
$$ -4791908 -5188586 -4780693 -3690120 -2662454 -1965527 -1272377 -154910 925374 222824
4564B22824l521164m216051j257902K294495K783001J287397J378919K937175
$$ 222824 -3298340 -7514391 -8772293 -6477798 -3694797 -2407400 -1028481 1908694
4556A908694K617449p3343j787798p61675R39237J289027P19898k7347j027742
$$ 1908694 4526143 4452800 2665002 1903327 2842564 4131591 4851489 4824142 3796400
4547C796400j497649k57497J605416J693346J84855n53164l13511j202396l094720
$$ 3796400 2298751 2041254 3646670 5340016 5524871 4971707 4658196 3455800 361080
4538C61080l084713m80722J575253Q81231r00564j495090j008357l47552L92707
$$ 361080 -2723633 -3204355 -1629102 -747871 -1648435 -3143525 -4151882 -4499434 -4106727
4529d106727P95483J21273p72663l12699O74930J6604j465937o01783K638794
$$ -4106727 -3311244 -3189971 -3962634 -4275333 -3600403 -3583799 -5049736 -5651519 -3012725
4520c012725M566081L514561J713292M35774j745091m292933l662958N05239L224872
$$ -3012725 1553356 5067917 6781209 7216983 5471892 1178959 -2483999 -1978760 1246112
4511A246112J440359j175884l68070K091844K137214K2350j289990j340471j358968
$$ 1246112 2686471 1510587 1142517 3234361 5371575 5393925 4103935 2763464 1404496
4502A404496p99505J013048J987343J49414k573150l344395l048249l825779m170318
$$ 1404496 604991 1618039 3605382 3754796 1181646 -2162749 -5210998 -9036777 -13207095
4493a3207095j214571L541633N601521L888760J452689K15886q19618k211393
$$ -13207095 -14421666 -10880033 -5278512 -1389752 62937 278823 -540795 -2752188
4485b752188k765177j891864k58398J829297M008965M521337K273059n85513j307787
$$ -2752188 -5517365 -7409229 -7667627 -5838330 -1829365 2691972 4965031 4379518 3071731
4476C071731p39501j314448k104814l47063K755979K895760k87469k167707m53796
$$ 3071731 2332230 1017782 -1087032 -1434095 1321884 4217644 3930175 1762468 1308672
4467A308672J428477M75953r66920L66396K975806L156394Q06403j120406j426998
$$ 1308672 2737149 3213102 2246182 2612578 5588384 8744778 9551181 8430775 7003777
4458G003777j314352j056477M22336K579818K949555O37331k125332k939239k051045
$$ 7003777 5689425 4632948 5055284 7635102 10584657 11221988 9096656 6157417 4106372
4449D106372j165416r30554r67839j266984j808097j412750R43642L570907L077732
$$ 4106372 2940956 2010402 1042563 -224421 -2032518 -3445268 -2501626 1069281 4147013
4440D147013j023479m731687m331154j156938O70408m053q03829l39629J92184
$$ 4147013 3123534 -1608153 -5939307 -7096245 -6425837 -6429890 -7233719 -7573348 -7381164
4431g381164K43851J181383L055141L356745R58581j437266j106849P09166J158121
$$ -7381164 -7137313 -5955930 -2900789 455956 1414537 -22729 -1129578 -420412 737709
4422G37709K24198L1551R95208J459994N53447r17904k007202k214724j088491
$$ 737709 961907 993458 1988666 3448660 4002107 3084203 1077001 -1137723 -2226214
4413b226214J062206K617083K328731R66033K9702l06857p31615j274779j518318
$$ -2226214 -1164008 1453075 3781806 4747839 4777541 4470684 3739069 2464290 945972
4404I45972j375189p30411M56938J075021k17200k302903k401987n13687J85231
$$ 945972 -429217 -1159628 -702690 372331 155131 -2147772 -4549759 -5063446 -4878215
4395d878215j123478r73195K190741M226873J721121j741518r15051K595942L107712
$$ -4878215 -6001693 -6974888 -4784147 -557274 1163847 -577671 -1492722 1103220 4210932
4386D210932o59k302049k277693k570695l421023j614881K851790N243875L263854
$$ 4210932 4210273 1908224 -369469 -2940164 -6361187 -7976068 -5124278 119597 3383451
4377C383451M91384L73267J459593J083836l91931j568309k575847l217678j936241
$$ 3383451 3874835 4248102 5707695 6791531 6399600 4831291 2255444 -962234 -2898475
4368b898475R95919K441214Q93054r98594o92617L89640k65122k157167l017499
$$ -2898475 -1902556 538658 1431712 433118 -259499 130141 -134981 -2292148 -5309647
4359e309647k011271L40472L297742N198990L928011j53481l893300n286254n242963
$$ -5309647 -7320918 -6980446 -3682704 1516286 5444297 5290816 1397516 -3888738 -9131701
4350i131701m466592j975098J714082L686056L123044K996404M729806N091787
$$ -9131701 -13598293 -15573391 -13859309 -10173253 -7050209 -4053805 676001 5767788
4342E767788J671829k358818k982599j485049j368209k047793p21680J676811
$$ 5767788 7439617 5080799 2098200 613151 -755058 -2802851 -3524531 -1847720
4334a847720J860968K28890J07646J593241J492052o17557j580635n53173m63758
$$ -1847720 13248 242138 349784 1943025 3435077 2817520 1236885 683712 219954
4325B19954k193849k358531P11209L256003J664440j734123k306519j17299R05052
$$ 219954 -1973895 -4332426 -3621217 -365214 1299226 -434897 -2741416 -2858715 -1953663
4316a953663m26358j120551N70784K165280J003244j505711k121365o72770P5362
$$ -1953663 -2380021 -3500572 -2929788 -764508 238736 -1266975 -3388340 -4061110 -3985748
4307c985748r75235j684471m60137R99365N63435o76505r7793K264804L945987
$$ -3985748 -4960983 -6645454 -7105591 -6106226 -5542791 -6219296 -6317089 -4052285 -106298
4298a06298L856112K952404J331776j984746n742547o356939k747591J504755
$$ -106298 3749814 6702218 8033994 6049248 306701 -6050238 -8797829 -7293074
4290g293074K750823J698042J249821K074725K666445K200912J024144n44495
$$ -7293074 -4542251 -2844209 -1594388 480337 3146782 5347694 6371838 5827343
4282E827343j925746j890042k08400J395644J455689O31336l933p97119j954751
$$ 5827343 3901597 2011555 1803155 3198799 4654488 5285824 5281891 4484772 2530021
4273B530021k114336o43368M87923l79996j539987o15528J185745P78895j744596
$$ 2530021 415685 -227683 260240 -119756 -1659743 -2275271 -1089526 -310631 -2055227
4264b055227l100951j587523J091720K754398K854396J654293k17639j257136
$$ -2055227 -5156178 -6743701 -5651981 -2897583 -43187 1611106 1393467 136331
4256A36331m00913J050000R10676o08026j330785o58245j40204m03430k40149
$$ 136331 -264582 785418 1696094 1088068 -242717 -900962 -1041166 -1444596 -1684745
4247a684745O21026N30396j053043j866990q223K789098L170649Q09420j089955
$$ -1684745 -1063719 -533323 -1586366 -3453356 -3461579 -672481 2498168 3307588 2217633
4238B217633l04002J236142L78854k074334j859494K208470N127881K095209l981917
$$ 2217633 1913631 3149773 3528627 1454293 -405201 1803269 6931150 9026359 5044442
4229E044442n749561j708847J832855K27484l298349l571276q95725J359297K704350
$$ 5044442 -705119 -2413966 -581111 -353627 -3651976 -7223252 -8118977 -6759680 -4055330
4220d055330M266729M410078R15676l923329n319910k469909J150563L203484
$$ -4055330 211399 4621477 5537153 1613824 -3706086 -6175995 -5025432 -1821948
4212a821948M048715L582976J014694k144853k962453j382082j62360l47859k71630
$$ -1821948 2226767 5809743 6824437 4679584 1717131 335049 172689 -175170 -446800
4203d46800P23206J082170Q8647j015567j491723j902891k107053j077449R99120
$$ -446800 276406 1358576 1447223 431656 -1060067 -2962958 -5070011 -6147460 -5148340
4194e148340K712028L408275L178693J710363n24234j229030P63485K931515K527645
$$ -5148340 -2436312 971963 4150656 5861019 5336785 4107755 4871240 7802755 10330400
4185A0330400R08081R08381J826555J184290l01341j54070R58118N49565q76612
$$ 10330400 11238481 12146862 13973417 15157707 14856366 14702296 15660414 16209979 15333367
4176A5333367j192249j130279k264592k576873J53774K832005J530995r70279
$$ 15333367 14141118 13010839 10746247 8169374 8323148 11155153 12686148 11715869
4168A1715869K07120K425911k97649n423486m846708R02848K969054o11706k099477
$$ 11715869 11922989 14348900 14051251 8627765 3781057 4683905 7652959 7041253 4941776
4159D941776J523090L721026J272770m15345J113036J044725j040746J286976
$$ 4941776 6464866 10185892 11458662 11043317 12156353 13201078 12160332 13447308
4151A3447308P038924O229589r96143r83205Q782893J1714503K404926K349818
$$ 13447308 20486232 26715821 25719678 24736473 33519366 45233869 47638795 49988613
4143D9988613K3219040L5204621M559272m8883503o9075895l8260971J917158
$$ 49988613 73207653 108412274 112971546 64088043 -4987852 -43248823 -41331665
4136d1331665J1483875J14825k239920O905651R315150J659138k665616Q87078
$$ -41331665 -29847790 -29732965 -31972885 -25067234 -15752084 -14092946 -16758562 -15871484
4128a5871484L497299J336799K77960K598679L420342J017078p76987q65893j947572
$$ -15871484 -12374185 -11037386 -10759426 -8160747 -4740405 -3723327 -4500314 -5366207 -7313779
4119g313779l312970j402555K461348L003269k35040k435600j849256j532175
$$ -7313779 -10626749 -12029304 -9567956 -6564687 -6799727 -9235327 -11084583 -12616758
4111a2616758k503189k000536N63864J965124O44707j225253j987619k224613
$$ -12616758 -15119947 -17120483 -16556619 -14591495 -13946788 -15172041 -17159660 -19384273
4103a9384273j710592Q61076M433789N953363M809194L270308K217619K01306
$$ -19384273 -21094865 -20233789 -15800000 -9846637 -5037443 -1767135 450484 651790
4095F51790k796195m322210l086617p56135N94672N63816k22719p68673O5706
$$ 651790 -2144405 -6466615 -9553232 -10309367 -9714695 -9150879 -9373598 -10142271 -10076565
4086a0076565K106589L316192K485121J140757P53639M1833k204796l833613k422281
$$ -10076565 -7969976 -4653784 -2168663 -1027906 -274267 -232434 -2437230 -6270843 -8693124
4077h693124K54399Q47314j28777J48257J218021K03002k526522l667225k780377
$$ -8693124 -8438725 -7591411 -7720188 -7571931 -6353910 -6150908 -8677430 -12344655 -15125032
4068a5125032k600692l201327j211467L819477P261069N763713J724651q27107
$$ -15125032 -17725724 -20927051 -22138518 -18319041 -11057972 -5294259 -3569608 -4396715
4060d396715j218609o81415P45752K978819L976308K045096j209330k531096r56610
$$ -4396715 -5615324 -6296739 -5550987 -2572168 1404140 3449236 2239906 -291190 -1247800
4051a247800J334610J609152o94421l291477l131611k8401K468524J423313j210720
$$ -1247800 86810 1695962 1001541 -2289936 -5421547 -5449948 -2981424 -1558111 -2768831
4042b768831j155472K009151M373176L365664N12459j982692l885501m926442
$$ -2768831 -3924303 -1915152 2458024 5823688 6336147 4353455 467954 -4458488
4034d458488l496172N84244M383663N008177K820680J01075j839504k905492l179755
$$ -4458488 -7954660 -7370416 -2986753 2021424 4842104 4943179 3103675 198183 -2981572
4025b981572k940010k564058j783462l32268O67345K6560q54289N38877L391139
$$ -2981572 -5921582 -8485640 -10269102 -10601370 -9934025 -9907465 -10761754 -10222877 -6831738
4016f831738M002470J643133J56905J795820L286805J108216k557248l098837
$$ -6831738 -2829268 -1186135 -1029230 766590 4053395 5161611 2604363 -494474
4008d94474n10802J141571J48228j220689j310205j213806j548855p19838J885821
$$ -494474 -1005276 136295 284523 -936166 -2246371 -3460177 -5009032 -5728870 -3843049
3999c843049L680336K168104j085644k179030j07927J911421R23212j615850j696358
$$ -3843049 -162713 2005391 919747 -1259283 -1367210 544211 1467423 -148427 -1844785
3990a844785J780352N287674N108388J915265o68637j155010j595284l729351
$$ -1844785 -64433 5223241 10331629 12246894 11578257 10423247 8827963 5098612
3982E098612n884388n047308j038290K762776K967066r8802k713245k149780j65861
$$ 5098612 -785776 -5833084 -6871374 -4108598 -1141532 -1240334 -3953579 -6103359 -6269220
3973f269220n76187l364043l964236P034M303669L686695k03279j240574J864156
$$ -6269220 -6845407 -10209450 -14173686 -14166652 -9862983 -6176288 -6379567 -7620141 -5755985
3964e755985L999439K024747p30637n43028R34487M17967j155608o44665J692978
$$ -5755985 -1756546 268201 -462436 -1005464 -70977 346990 -808618 -1453283 239695
3955B39695K662998J131274q32002j339581n58291N27600J166240R31885K40192
$$ 239695 2902693 4033967 3201965 1862384 1304093 1831693 2997933 3929818 4170010
3946D170010J90952Q18932O24743j014206k424842j970814l08843R69370J274016
$$ 4170010 4360962 5179894 5804637 4790431 2365589 394775 85932 1055302 2329318
3937B329318M42463j599671l279155k178347Q20848J311743k267462n395724l886818
$$ 2329318 2771781 1172110 -2107045 -4285392 -3464544 -2152801 -4420263 -9815987 -13702805
3928a3702805j78610J010695J63084P86317K215080R10417k181262k249178J145544
$$ -13702805 -13881415 -12870720 -12707636 -11921319 -9706239 -8795822 -10977084 -13226262 -12080718
3919a2080718K854552M30773k291511j847176J23702J249741K358275L993722
$$ -12080718 -9226166 -8795393 -11086904 -12934080 -12810378 -11560637 -9202362 -5208640
3911e208640L806146J056792n37770J432165L246502O39894l926700m777470j619865
$$ -5208640 -1402494 -345702 -883472 548693 3795195 4435089 508389 -4269081 -5888946
3902e888946Q26128N82088J96340Q62691K49578k527029m459767l333689j192636
$$ -5888946 -5062818 -4480730 -4284390 -3421699 -3172121 -5699150 -10158917 -13492606 -14685242
3893a4685242o50285o89359R82893L510112M008262K090928L09316K99796J116791
$$ -14685242 -15335527 -16024886 -15041993 -11531881 -7523619 -5432691 -5123375 -4823579 -3706788
3884c706788J689999K430909L360593K812205j45911l367134l922951k103395
$$ -3706788 -2016789 414120 3774713 6586918 6441007 3073873 -849078 -2952473
3876b952473p57832p71141j4061K330813L370131O96633l205489l873801j088311
$$ -2952473 -3710305 -4481446 -4495507 -2164694 1205437 1902070 -1303419 -5177220 -6265531
3867f265531J143452N64180p66690m87968O97033J107369Q99314R02790O37115
$$ -6265531 -5122079 -4557899 -5324589 -5812557 -5115524 -4008155 -3108841 -2206051 -1568936
3858a568936n04945j574250j494506r66951j061905r87662O48158L044921L835212
$$ -1568936 -2073881 -3648131 -5142637 -6109588 -7171493 -8159155 -7510997 -4466076 -630864
3849f30864K332646K49266r20361j461635j955016j820997l72609J501926J840817
$$ -630864 1701782 1951048 1030687 -430948 -2385964 -4206961 -4579570 -3077644 -1236827
3840a236827j15599k707350l363513j372424J267062K099864Q67378p33024j422780
$$ -1236827 -1352426 -4059776 -7423289 -8795713 -7528651 -5428787 -4561409 -5294433 -6717213
3831f717213j332309q42395J12714J277590J820995J291213L960j482812k285782
$$ -6717213 -8049522 -8891917 -8779203 -7501613 -5680618 -4389405 -4385445 -5868257 -8154039
3822h154039j165693J607169K915298J05621m237859m229679J450331P035813
$$ -8154039 -9319732 -7712563 -4797265 -4691644 -8929503 -13159182 -11708851 -4673038
3814d673038P003658K679979j124008k862108l916678m106000k225668J59915
$$ -4673038 2330620 5010599 3886591 1024483 -2892195 -6998195 -9223863 -9063948
3806i063948J63970j457647j134335J566491L104258J741923j03270n26383r41733
$$ -9063948 -8899978 -10357625 -11491960 -9925469 -6821211 -5079288 -5182558 -5708941 -6650674
3797f650674k220446j974144J343003M682671M179344O94375j659288j183258
$$ -6650674 -8871120 -10845264 -9502261 -4819590 -640246 54129 -1605159 -2788417
3789b788417K55345Q33143O06530Q5379m96891n02739M95982J487301J153123
$$ -2788417 -2533072 -1699929 -1093399 -1008020 -1504911 -2007650 -1511668 -24367 1128756
3780A128756j8958n51944n57038j369913k649616k209315N86886L325238L617112
$$ 1128756 1109798 557854 816 -1369097 -4018713 -6228028 -5641142 -2315904 1301208
3771A301208K158019J324058J699938J570639l16511k773647l499960j928287
$$ 1301208 3459227 4783285 6483223 8053862 7737351 4963704 1463744 -464543
3763d64543q6115k81564k231619l287363j724652J153083K905675K975736K518774
$$ -464543 -550658 -832222 -3063841 -6351204 -8075856 -6922773 -4017098 -1041362 1477412
3754A477412J886946J66339k557586m208563k953297N06217L671328M660963L380270
$$ 1477412 3364358 3530697 973111 -3235452 -6188749 -5682532 -2011204 2649759 6030029
3745F030029J037843q22189j368098j213726j729626l227901m389356l919114
$$ 6030029 7067872 6245683 4877585 3663859 1934233 -1293668 -5683024 -9602138
3737i602138k081739j9261J711083L108898L876096L594629K442517R14665q04710
$$ -9602138 -11683877 -11703138 -9992055 -6883157 -3007061 587568 3030085 3944750 3140040
3728C140040k394971k873583j644728K65037J203462Q85546K12777m68094j284641
$$ 3140040 745069 -2128514 -3773242 -3508205 -2304743 -1419197 -1206420 -1674514 -2959155
3719b959155j304938O66054L352603L529036N11761k101311j067402J958836K891538
$$ -2959155 -4264093 -3598039 -245436 3283600 3795361 1694050 626648 2585484 5477022
3710E477022Q44380j534696k621301l512293m906418n281132l337849q0624K758511
$$ 5477022 6321402 4786706 2165405 -1346888 -6253306 -11534438 -14872287 -14952911 -12194400
3701a2194400M568051N024228L326475j55958l010345l346605k148949j381006
$$ -12194400 -7626349 -2602121 724354 568396 -2441949 -5788554 -7937503 -9318509
3693i318509q41763R61672L409798L739514R52945k126466j921682J597102M803704
$$ -9318509 -10160272 -9198600 -5788802 -2049288 -1096343 -3222809 -5144491 -3547389 1256315
3684A256315M575244J782669k259Q89228K095210O24578k699314m241710k720479
$$ 1256315 5831559 7614228 7611969 8501197 10596407 11220985 8521671 4279961 1559482
3675A559482p60637o39759j270583j025891q88656k187984l284831j791358J139475
$$ 1559482 798845 159086 -1111497 -2137388 -3026044 -5214028 -8498859 -10290217 -9150742
3666i150742K171341Q05537m16086m83167r41470j917167j032752K274069M807453
$$ -9150742 -6979401 -6173864 -6589950 -7073117 -8014587 -9931754 -10964506 -8690437 -3882984
3657c882984M033953J602926K57009j35117q86970j242750j6893J227311J66510
$$ -3882984 150969 1753895 2010904 1875787 988817 -253933 -270826 956485 1122995
3648A122995k013755j894552P90515K489169J129588j048451j206632J80480R07001
$$ 1122995 -890760 -2785312 -1994797 494372 1623960 575509 -631123 -450643 456358
3639D56358N69191L93183O43880L14022q86997j899116j820615r32185n1887K46222
$$ 456358 1025549 1418732 2062612 2376634 1489637 -409479 -2230094 -3162279 -3214166 -2967944
3629b967944l66900j831000l131967k654468J01638L376663M445270K278607j354226
$$ -2967944 -3334844 -5165844 -8297811 -10952279 -10850641 -7473978 -3028708 -750101 -2104327
3620b104327l507607k570730O83812L937727M975678L132162j84737k480065k193692
$$ -2104327 -5611934 -8182664 -7498852 -3561125 1414553 4546715 4361978 1881913 -311779
3611c11779N8825K221682K537507O56328k221209l971510l204796j007049j55912
$$ -311779 -252954 1968728 4506235 5162563 2941354 -1030156 -4234952 -5242001 -5397913
3602e397913j609530k760059p57469L195829N045594L239282M81225l57156L59274
$$ -5397913 -7007443 -9767502 -10524971 -7329142 -2283548 955734 1436959 1079803 1439077
3593A439077Q47258P71839M14990j077762m037945n968996l800649J575617N544649
$$ 1439077 2286335 3058174 3473164 2395402 -1642543 -7611539 -11412188 -9836571 -4291922
3584d291922N157686K281595M79899N21260M49452r84134k761018l366729k661055
$$ -4291922 865764 3147359 3627258 4148518 4597970 3613836 852818 -2513911 -5174966
3575e174966j414923P9774J929700L446945L249398J121997j080616j405400k26099
$$ -5174966 -6589889 -6510115 -4580415 -1133470 2115928 3237925 2157309 751909 525810
3566E25810M97477J68119K09685J439318K421404J509531o35779j898514j397151
$$ 525810 1023287 1191406 1401091 2840409 5261813 6771344 6135565 4237051 2839900
3557B839900p3908R23537J161380M60781j136910k750364l081746j913300m98893
$$ 2839900 2765992 3689529 4850909 5311690 4174780 1424416 -1657330 -3570630 -4069523
3548d069523m3864l05713j90491N98528J208543J074021R94188J963568L222944
$$ -4069523 -4113387 -4419100 -4609591 -4011063 -2802520 -1728499 -734311 1229257 4452201
3539D452201K797000M01125j629514j429975k93101n49479j873558k060143q79239
$$ 4452201 7249201 7650326 6020812 4590837 4297736 3748257 1874699 -185444 -1064683
3530a064683l65625j186422j587799o13839L44847J75588l69349p40489j527911
$$ -1064683 -1430308 -2616730 -4204529 -4818368 -4473521 -4297933 -4667282 -5407771 -6935682
3521f935682k156279p11578K278617L178556O38789j666937o40521J211991J86397
$$ -6935682 -9091961 -9803539 -7524922 -4346366 -3707577 -5374514 -6015035 -4803044 -4616647
3512d616647k103473j370731K131838M122668L010816J168155k9993j517251k865809
$$ -4616647 -6720120 -8090851 -5959013 -1836345 1174471 2342626 2312633 795382 -2070427
3503b070427k173789j78235J51166j071513l81581K823791M532152K394709o98414
$$ -2070427 -4244216 -4422451 -4271285 -5342798 -5724379 -2900588 1631564 4026273 3327859
3494C327859j644397j598106k587845l296526j574008J435050K785809J586647
$$ 3327859 1683462 85356 -2502489 -5799015 -7373023 -5937973 -3152164 -1565517
3486a565517q44970k830386k754091l9948K795572J955403k113169m339937k155366
$$ -1565517 -2410487 -5240873 -7994964 -8034912 -5239340 -3283937 -5397106 -9737043 -11892409
3477a1892409Q41791R70724k2089O88751J258756j133789l994397k794096J314825
$$ -11892409 -11050618 -10079894 -10101983 -9413232 -8154476 -9288265 -13282662 -16076758 -14761933
3468a4761933L055354J456374P44100K609918L425336P11675k546383k517800
$$ -14761933 -11706579 -10250205 -9506105 -6896187 -3470851 -2759176 -5305559 -7823359
3460g823359O3479J668852Q92332n86261o98677P94325K244916J943856L70450
$$ -7823359 -7759880 -6091028 -5198696 -5784957 -6483634 -5689309 -3444393 -1500537 -1130087
3451a130087k53242N65126N01693j416996k115726Q53515M298797L511616k08505
$$ -1130087 -1383329 -818203 -316510 -1733506 -3849232 -2995717 1303080 4814696 4606191
3442D606191j420819P96933J914547L686j488754o45048o15334l261783m783617
$$ 4606191 3185372 3982305 5896852 5900538 4411784 3766736 3151402 -110381 -4893998
3433d893998j843207K344015K789674L53590l33518J645746K979018J927580J64902
$$ -4893998 -6737205 -4393190 -1603516 -1249926 -1583444 62302 3041320 4968900 5133802
3424E133802q36533j435076j748788j131422k8335J55073p39522j553404j824201
$$ 5133802 4297269 2862193 1113405 -18017 -46352 108721 -630801 -2184205 -4008406
3415d008406j970794j790114p26346O32714J155070R18121O84164K73059o46584
$$ -4008406 -5979200 -7769314 -8495660 -7862946 -6707876 -5789755 -5105591 -4832532 -5479116
3406e479116r29555N68640K455284K329969O39433K60100J977710L151235J744108
$$ -5479116 -6408671 -5840031 -3384747 -1054778 -415345 -155245 1822465 4973700 6717808
3397F717808p71399j865615j384271r90315j490019k198656k218526j248463L11098
$$ 6717808 5946409 4080794 2696523 1706208 216189 -1982467 -4200993 -5449456 -5138358
3388e138358J305601N81835j431416k606624j514310N62540J050397o29349k231376
$$ -5138358 -3832757 -3250922 -4682338 -7288962 -8803272 -8240732 -7190335 -7819684 -10051060
3379a0051060j459833J223706L303119L333115K261182J391568L92763j391730
$$ -10051060 -11510893 -10287187 -6984068 -3650953 -1389771 1797 394560 -997170
3371i97170k632741j236584K035200L554516J508912j479389k122641j090155
$$ -997170 -3629911 -4866495 -2831295 723221 2232133 752744 -1369897 -2460052
3363b460052j413932l283398l396431J53711M764862O291888L803548K51353j016662
$$ -2460052 -3873984 -7157382 -10553813 -10400102 -5635240 656648 4460196 4711549 3694887
3354C694887L86242J905514J119995j411869k866761j754113K99121J048723O42945
$$ 3694887 4081129 5986643 7106638 5694769 2828008 1073895 1373016 2421739 3064684
3345C064684O72875J148708M59046j749022l518108k905867j62908K742551L829495
$$ 3064684 3737559 4886267 5345313 3596291 78183 -2827684 -2990592 -248041 3581454
3336C581454K280271j010674l882638m728362l859715k461573q59959J031884
$$ 3581454 5861725 4851051 968413 -3759949 -7619664 -10081237 -10941196 -9909312
3328i909312K383954K350892J788713K054298K456850J283689p44631r14370J037044
$$ -9909312 -7525358 -5174466 -3385753 -1331455 1125395 2409084 1664453 750083 1787127
3319A787127J949695J0116k410644k633345j717757j993712k737613j633912P41788
$$ 1787127 3736822 3746938 1336294 -1297051 -3014808 -5008520 -7746133 -9380045 -8638257
3310h638257J467096k8771j149318l50591Q22204O83203l16026j333882k628783
$$ -8638257 -7171161 -7199932 -8349250 -8699841 -7877637 -7194434 -7510460 -8844342 -11473125
3301a1473125l830697l064716J95655L259246L486217J990619J589766K246703
$$ -11473125 -15303822 -18368538 -18172883 -14913637 -11427420 -9436801 -7847035 -5600332
3293e600332J610096l88261r30755J106562L243198L474722L272243M301469M749335
$$ -5600332 -3990236 -4378497 -5309252 -4202690 -959492 2515230 5787473 10088942 14838277
3284A4838277K072531k238641m248714l317909k640823l859911m741687l308926
$$ 14838277 16910808 14672167 10423453 7105544 4464721 604810 -4136877 -7445803
3276g445803j006991P3398L84577J081655J292579j00259j653400j215518N31502
$$ -7445803 -8452794 -8379396 -7994819 -6913164 -5620585 -5720844 -7374244 -8589762 -8058260
3267h058260J233287P63237R77021J984601J859153K79424o91123k67371l75999
$$ -8058260 -6824973 -6061736 -5084715 -3100114 -1240961 -961537 -1652660 -1920031 -2296030
3258b296030j999883k799245n46676K965292L894756J264979k194334l575745
$$ -2296030 -4295913 -7095158 -7641834 -4676542 -781786 483193 -1711141 -5286886
3250e286886k336859L02712K618025K917250N60405k803181m101163j917280J671253
$$ -5286886 -7623745 -7321033 -4703008 -1785758 -1225353 -4028534 -8129697 -10046977 -8375724
3241h375724L114092J259678j418188j807633J84489J879759J581781N93633O94620
$$ -8375724 -5261632 -4001954 -5420142 -7227775 -7043286 -5163527 -3581746 -2988113 -2293493
3232b293493J123593k1588k137501k355054K23008K820555K679377O78047l35069
$$ -2293493 -1169900 -1191488 -3328989 -5684043 -5461035 -2640480 38897 716944 381875
3223C81875L90690J019789K79032p53285m23417J143116K256955J781054L00389
$$ 381875 772565 1792354 2071386 1318101 894684 2037800 4294755 6075809 6376198
3214F376198r24333j596584k302811k948189k419970m63744J138205N23188j684887
$$ 6376198 5451865 3855281 1552470 -1395719 -3815689 -4279433 -3141228 -2618040 -4302927
3205d302927l111267k569239q97232P54489J865482K048683J421223J304980K555475
$$ -4302927 -7414194 -9983433 -10880665 -10126176 -8260694 -6212011 -4790788 -3485808 -930333
3196i30333L376671J329057k370808l673459j644700j35143j699287l299642j096887
$$ -930333 2446338 3775395 1404587 -2268872 -3913572 -4048715 -5748002 -9047644 -10144531
3187a0144531L233427M857638K820680O13964L42922L96309p16346j880154j874187
$$ -10144531 -6911104 -2053466 767214 1381178 1724100 2120409 1404063 -476091 -2350278
3178b350278j425742j323924p97776O66652J716248R83788o78581j260192q8519
$$ -2350278 -3776020 -5099944 -5897720 -5231068 -3514820 -2531032 -3209613 -4469805 -4558324
3169d558324J767891K842157K202190j09537k658754l323930j359626J572947
$$ -4558324 -2790433 51724 2253914 2144377 -514377 -3838307 -5197933 -3624986
3161c624986L052490K294988N72921l36232J72088R96845L58162k114024m339824
$$ -3624986 -572496 1722492 2295413 1959181 2131269 3128114 3486276 1372252 -2967572
3152b967572l713756l21801K678784K458384l53382k539485j876796P37886K591699
$$ -2967572 -6681328 -7003129 -4324345 -1865961 -2219343 -4758828 -6635624 -5897738 -3306039
3143c306039K142041M97074j55759O54654J232907L35185r14970q57170r5308
$$ -3306039 -1163998 -666924 -822683 -168029 1064878 1400063 485093 -372077 -467385
3134d67385n88591k174292k198042O40821L892816M166227J235678k038446l224200
$$ -467385 -1055976 -3230268 -5428310 -4787489 -894673 3271554 4507232 2468786 -755414
3125g55414k374681q95915J96500O02175M19442J90145O72914J809128K189857
$$ -755414 -3130095 -4026010 -3829510 -3227335 -2807893 -2617748 -1944834 -135706 2054151
3116B054151N15079k214084l076583p82794J992980J522629j915427l996120k014881
$$ 2054151 2569230 355146 -2721437 -3504231 -1511251 11378 -1904049 -5900169 -7915050
3107g915050J604760K967354J837218P28591L59325p78090k674532l009813r18373
$$ -7915050 -6310290 -3342936 -1505718 -777127 -417802 -1195892 -3870424 -6880237 -7798610
3098g798610J256086J387929N39841P88623J798665J579402l23207k288255k845752
$$ -7798610 -6542524 -5154595 -4614754 -3826131 -2027466 -448064 -771271 -3059526 -5905278
3089e905278j906770o368K259431L912089L857240K014476k81014j426932j116699
$$ -5905278 -7812048 -7818416 -5558985 -1646896 2210344 4224820 3943806 2516874 1400175
3080A400175o41533j399007k977333l204028o70366L190492N387056M524967J831040
$$ 1400175 758642 -640365 -3617698 -6821726 -7492092 -4301600 1085456 5610423 7441463
3071G441463o85042j966847j960329j280000j050716j918790k951850k566092
$$ 7441463 6756421 4789574 2829245 1549245 498529 -1420261 -4372111 -6938203
3063f938203p12859R53648J220160M87559k62223m29496K96277J622763K256213
$$ -6938203 -7651062 -6697414 -5477254 -4989695 -5251918 -5681414 -5385137 -3762374 -1506161
3054a506161J324206R0622M42497J783479J696745j52437j380037o86924M30954
$$ -1506161 -181955 -91333 351164 2134643 3831388 3678951 2298914 1611990 2042944
3045B042944O02656L48661q4971j413238k410802j04114M758868O380257J684576
$$ 2042944 2645600 2994261 2909290 1496052 -914750 -1018864 3740004 10120261 11804837
3036A1804837m071372m148449n7966J186239k036402m200249j976768R51218M32647
$$ 11804837 7733465 3585016 3527050 4713289 2676887 -1523362 -3500130 -2548912 -2116265
3027b116265j976094k459517q15497M62303M60064J23133m0499J09299J418356
$$ -2116265 -4092359 -6551876 -7367373 -6905070 -6445006 -6321873 -6362372 -6253073 -4834717
3018d834717M067555O061249N195164J968755j092778k439763k430806j935428
$$ -4834717 -767162 5294087 10489251 12458006 11365228 8925465 6494659 4559231
3010D559231j460443j301218j382556j167134m65452J17589J56252J40628N36812
$$ 4559231 3098788 1797570 415014 -752120 -1217572 -1099983 -943731 -803103 -266291
3001b66291Q14277J90658j204531k518719k964161k041836J33357K188541K182778
$$ -266291 547986 738644 -465887 -2984606 -5948767 -7990603 -7857246 -5668705 -3485927
2992c485927j73394k650698k671272j8446K967263L471883N99488l362787m235910
$$ -3485927 -3659321 -6310019 -8981291 -8999737 -6032474 -2560591 -1961103 -5323890 -9559800
2983i559800n4434N884985P852015M175025r20144k815902j742927r66687j710242
$$ -9559800 -9614234 -3729249 4122766 8297791 7377647 4561745 2818818 1852131 141889
2974A41889k340227j677820o20978l54815o42227l11051J339277L608657M543641
$$ 141889 -2198338 -3876158 -4497136 -4851951 -5494178 -5805229 -4465952 -857295 3686346
2965C686346K709754p11846k675996j839793r8368L52747j09052k7777L65831
$$ 3686346 6396100 5684254 3008258 1168465 1070097 1422844 1313792 1286015 1651846
2956A651846r8752j148680j539169j133515o32843j08563L27559m20638k453798
$$ 1651846 1553094 404414 -1134755 -2268270 -2901113 -3009676 -2682117 -3102755 -5556553
2947e556553l305470j239057J123076J24477k728667k311879K154501N456702
$$ -5556553 -8862023 -10101080 -8978004 -8853527 -11582194 -13894073 -11739572 -6282870
2939f282870M100891J035300K16662P73010J48274n06710J347747M171980M039862
$$ -6282870 -2181979 -1146679 -930017 -157007 -8733 -515443 832304 5004284 9044146
2930I044146R02883j272989n11727J014660J130916K56271p93464k101178k796801
$$ 9044146 9947029 8674040 8162313 9176973 10307889 10564160 9770696 7669518 4872717
2921D872717j331677J068467O49995l214723n857962l503567J122513K745862
$$ 4872717 3541040 4609507 5259502 2044779 -3813183 -7316750 -6194237 -3448375
2913c448375J085042M30660K526492M078953K086120j721946l393626j628123
$$ -3448375 -2363333 -1932673 593819 4672772 6758892 5036946 1643320 15197
2905A5197J393035K782138J428402j375164l011202j989900L13309J240658K16741
$$ 15197 1408232 4190370 5618772 4243608 1232406 -757494 -444185 796473 1013214
2896A013214q03684m31340L24583L417j131507j850081j562275k58729J768948
$$ 1013214 209530 -221810 102773 106190 -1025317 -2875398 -4437673 -4696402 -2927454
2887b927454L202268K301400m74985k086130p68882J320384J306641j68478n31132
$$ -2927454 274814 2576214 2101229 15099 -753783 566601 1873242 1704764 1173632
2878A173632J85725k99951k056359k394456l52563J533616J202950L7842J75607
$$ 1173632 1359357 1059406 -996953 -3391409 -3743972 -2210356 -1007406 -969564 -793957
2869g93957J103691R08707o59852k217751k705885j864759R8986J992837K048378
$$ -793957 309734 1218441 558589 -1659162 -4365047 -6229806 -6130820 -4137983 -2089605
2860b089605K49665j053869l55143O39519k86729k173144k277316k50929J676217
$$ -2089605 -1839940 -2893809 -3248952 -2609433 -2896162 -5069306 -7346622 -7597551 -5921334
2851e921334K284759K466109K599480J503472j065512k996881k316158J77029
$$ -5921334 -3636575 -1170466 1429014 2932486 1866974 -1129907 -3446065 -3269036
2843c269036K016610K044284J221792Q71889R98866N16297j131559k946955l478322
$$ -3269036 -1252426 791858 2013650 2885539 3884405 4400702 3269143 322188 -3156134
2834c156134k815376k365536k304179r37730K153715M158197K554576o72815j407582
$$ -3156134 -5971510 -8337046 -10641225 -11578955 -9425240 -5267043 -2712467 -3385282 -4792864
2825d792864N15326J161592j114183k977123j579846P53904L14436k009824k285972
$$ -4792864 -4277538 -3115946 -4230129 -7207252 -8787098 -8033194 -7718758 -9728582 -12014554
2816a2014554J39410J838095R00190l84596L06745J566145Q62942j147173j653348
$$ -12014554 -11875144 -10037049 -9136859 -9521455 -9214710 -7648565 -6785623 -7932796 -9586144
2807i586144j40517R53980J93270p43945K1184J480020J356487l01403j233947
$$ -9586144 -9726661 -8772681 -8579411 -9323356 -9302172 -7822152 -6465665 -6767068 -8001015
2798h001015l66053R24649J182843O46249J9982p17504j263917m30426J930849
$$ -8001015 -8367068 -7442419 -6259576 -5613327 -5593345 -6310849 -7574766 -8005192 -6074343
2789f074343L809683L458889J750434M53715m84419j774420k207459k09873K621586
$$ -6074343 -2264660 1194229 2944663 3398378 2913959 1139539 -1067920 -1277793 1343793
2780A343793K824278Q6136k244287k250026j677656j863547r97084K130597M588509
$$ 1343793 4168071 4254207 2009920 -240106 -1917762 -3781309 -4778393 -2647796 1940713
2771A940713K863165j727813m541083l759976j933460j523178j868433j266731
$$ 1940713 4803878 3076065 -1465018 -5224994 -7158454 -8681632 -10550065 -11816796
2763a1816796K58123J519317K131063K661532L331794L429276K138650k26290
$$ -11816796 -11558673 -10039356 -7908293 -5246761 -1914967 1514309 3652959 3426669
2755C426669k102595k196885r49656K52915J100163K272224L299810K397091p59373
$$ 3426669 1324074 -872811 -1822467 -1569552 -469389 1802835 5102645 7499736 6740363
2746F740363l829802m559316l240681j387183K35341R21496m66645l268847m302606
$$ 6740363 2910561 -1648755 -4889436 -6276619 -6041278 -5119782 -5586427 -8855274 -13157880
2737a3157880j901412J064620J061348q59599j088368O16367J309680L60093L15157
$$ -13157880 -15059292 -13994672 -12933324 -13792923 -14881291 -14264924 -12955244 -12595151 -12279994
2728a2279994J933091K714177J505766N18483J109547J329275k03896j421943
$$ -12279994 -10346903 -7632726 -6126960 -5608477 -4498930 -3169655 -3373551 -4795494
2720d795494l77081J254195J061786j73503l62036K01314K6772m64796o4542M86934
$$ -4795494 -5172575 -3918380 -2856594 -3030097 -3392133 -3190819 -3164047 -3628843 -3693385 -3206451
2710c206451p2116o56427M85291K317208K474718J293797J012304J615311J111615
$$ -3206451 -3278567 -3934994 -3449703 -1132495 1342223 2636020 3648324 5263635 6375250
2701F375250l42090n01177N26069k9938k494095l382511r27217J801611J815418
$$ 6375250 6033160 5531983 6058052 6028114 3534019 151508 -775709 1025902 2841320
2692B841320Q59904J784609K969677O94542m163087o282100l122370J701345L460670
$$ 2841320 3701224 5485833 8455510 9150052 4986965 -1295135 -4417505 -2716160 744510
2683G44510J780961o01633k101350k878605k633416o79763J828692K243218m6570
$$ 744510 2525471 1923838 -177512 -3056117 -5689533 -6369296 -4540604 -2297386 -2343956
2674b343956k168992j307164J448745K613431J185361j69389P30987K384809K030812
$$ -2343956 -4512948 -5820112 -4371367 -1757936 -572575 -741964 -10977 2373832 4404644
2665D404644k28394j765207j204950K54541J222957J723325J905591J041336j092632
$$ 4404644 4176250 2411043 1206093 1460634 2683591 4406916 6312507 7353843 6261211
2656F261211l081305l307053j841194j11744O70437J96955r65218j458650j81671
$$ 6261211 3179906 -127147 -1968341 -2080085 -1409648 -1212693 -2177911 -3636561 -3818232
2647c818232J951131K360745J5175k684784k625682J21010K632631K841641J244382
$$ -3818232 -1867101 493644 508819 -2175965 -4801647 -4680637 -2048006 793635 2038017
2638B038017p51511k210727k248435l30180K151784K413447k55441k916113k472739
$$ 2038017 1286506 -924221 -3172656 -3502836 -1351052 1062395 806954 -2109159 -4581898
2629d581898K75135J983537J550321J140032K117868K513575J91262l195617l883823
$$ -4581898 -4306763 -2323226 -772905 367127 2484995 4998570 5189832 1994215 -1889608
2620a889608j143397J710919J876289M02036j97068K48368J21426p72294r90706
$$ -1889608 -3033005 -1322086 554203 956239 759171 1007539 1128965 356671 -634035
2611f34035k50183o8603j047843j545802j76477J876272K367135P91375j518552
$$ -634035 -884218 -952821 -2000664 -3546466 -3722943 -1846671 520464 1311839 -206713
2602b06713l193939l486878j966106R37440L471221L987798K691684J055874J6809
$$ -206713 -3400652 -6887530 -8853636 -7916196 -4444975 -457177 2234507 3290381 3307190
2593C307190k19150N80635K013995K273916O4115k934082l660864j818195r5028
$$ 3307190 3088040 3668675 5682670 7956586 8020701 5086619 1425755 -392440 -487468
2584d87468Q8978L27142J613218J860333p34730m049733m636359k637155j080602
$$ -487468 -398490 -71348 1541870 3402203 2667473 -1382260 -6018619 -8655774 -9736376
2575i736376r65261k97445J805586L235070K249377K05798o61585l96643n55688
$$ -9736376 -10701637 -10999082 -9193496 -5958426 -3709049 -3503251 -4164836 -4561479 -5117167
2566e117167j518975k207486j769474k79822J629551K855687K375000P75728K69744
$$ -5117167 -6636142 -8843628 -10613102 -10892924 -9263373 -6407686 -4032686 -3256958 -2987214
2557b987214J820601L217522J807098j483287k988496j160211J511435J945332
$$ -2987214 -1166613 2050909 3858007 2374720 -613776 -1773987 -262552 1682780
2549A682780K0585k126906k783400j599963Q09581K960523L143851J224922q60416
$$ 1682780 1703365 -423541 -3206941 -4806904 -3997323 -1036800 2107051 3331973 2471557
2540B471557j409915r70552r69139j284313p67024M35250R33885L73363j46161
$$ 2471557 1061642 91090 -878049 -2162362 -2929386 -2494136 -1560251 -1186888 -1333049
2531a333049j46842n45327j798324k858510k796849k085327j300105J42972K661358
$$ -1333049 -1479891 -2025218 -3823542 -6682052 -9478901 -11564228 -12864333 -12721361 -10060003
2522a0060003M907913N001742K881015J93851j726965k594159k353554j096919
$$ -10060003 -5152090 -150348 2730667 2924518 1197553 -1396606 -3750160 -4847079
2514d847079L20623R19034R18542J255666J803590J441295O3566r66253q82297
$$ -4847079 -4526456 -3607422 -2688880 -1433214 370376 1811671 1875237 908984 26687
2505B6687o39829j200716j946313j813797r89911k99239L13876J400895K594492
$$ 26687 -613142 -1813858 -3760171 -5573968 -6563879 -6863118 -6549242 -5148347 -2553855
2496b553855K904846K292648J756710J727477J347745l08581k868518m738221
$$ -2553855 350991 2643639 4400349 6127826 7475571 7166990 4298472 -439749
2488d39749m308480j310534K551296M598244L489159M89901j977885k716682k175995
$$ -439749 -4748229 -6058763 -3507467 1090777 4579936 5069837 3091952 375270 -1800725
2479a800725j180860l54840m26102j671926k928644k489414l99840J332423J386079
$$ -1800725 -2981585 -3336425 -3762527 -5434453 -8363097 -10852511 -11252351 -9919928 -8533849
2470h533849Q54756J499511L171536M000126K691895j56931k698370l215017j392737
$$ -8533849 -7679093 -6179582 -3008046 992080 3683975 3527044 828674 -2386343 -3779080
2461c779080J109672J876695K84433j627737j631335j32431N51986n85511k057719
$$ -3779080 -2669408 -792713 -508280 -2136017 -3767352 -3899783 -3347797 -3933308 -5991027
2452e991027k059074o21299R25895J729511J874489J554124O16988r27475k298528
$$ -5991027 -8050101 -8671400 -7745505 -6015994 -4141505 -2587381 -1970393 -2897868 -5196396
2443e196396k165956J64190L574595N552580M443671J235386j538603k631589
$$ -5196396 -7362352 -7198162 -3623567 1929013 6372684 7608070 6069467 3437878
2435C437878k968994l538467l573352j806835J164764L135839K954914J772277
$$ 3437878 468884 -3069583 -6642935 -8449770 -7285006 -4149167 -1194253 578024
2427E78024J215115J358028J320078J016765R78231P76452o56629k720390k904297
$$ 578024 1793139 3151167 4471245 5488010 6466241 7242693 6586064 3865674 961377
2418I61377j75903K684542K122467j347617l552051k080081R59213K419674K133160
$$ 961377 785474 3470016 5592483 4244866 692815 -1387266 -428053 1991621 4124781
2409D124781J795482J603220L52750j869558l354247l056539j516038L60921J793960
$$ 4124781 5920263 7523483 7876233 6006675 2652428 -404111 -1920149 -1559228 234732
2400B34732J655917n13666k915338k940117o60528J055201N23758o50109l88477
$$ 234732 1890649 1376983 -1538355 -4478472 -5139000 -4083799 -3560041 -4210150 -4598627
2391d598627Q67689J311315L50633j308543k755860k798846m03283L243945M763701
$$ -4598627 -3730938 -2419623 -2068990 -3377533 -6133393 -8932239 -9335522 -6091577 -1327876
2382a327876K627298l03067m92283J402480K034377N57982r09970j440455k292204
$$ -1327876 1299422 996355 504072 1906552 3940929 4498911 3588941 2148486 -143718
2373a43718l492886l023171n18103J423593J202030O48866J629275K837397K298673
$$ -143718 -3636604 -6659775 -7177878 -5754285 -4552255 -3903389 -2274114 563283 2861956
2364B861956Q47492M53148P87579K49190q66022j050069n18715o29018j047755
$$ 2861956 3709448 4162596 4950175 5199365 4333343 3283274 2764559 2135541 1087786
2355A087786m53434L65965o49104k807808k894898k48035J680803M29688j706250
$$ 1087786 634352 1000317 351213 -2456595 -5351493 -5599528 -3918725 -3489037 -5195287
2346e195287j306070R59641J520746p98418l332138l250818o87383K045504L036973
$$ -5195287 -6501357 -5541716 -4020970 -4819388 -8151526 -11402344 -12089727 -10044223 -7007250
2337g007250K277083J288947J362071J998475J667068K04920p55432l06783K87302
$$ -7007250 -4730167 -3441220 -2079149 -80674 1586394 1791314 1035882 729099 1016401
2328A016401k56529j154558j142378p18578q37582o60559Q27257J844143l36867
$$ 1016401 759872 -394686 -1537064 -2255642 -3093224 -3753783 -2926526 -1082383 -1419250
2319a419250m497894n774229k019265K914373M080262J516132p35865k31042J632969
$$ -1419250 -5917144 -11691373 -13710638 -10796265 -6716003 -5199871 -5935736 -6166778 -4533809
2310d533809K385311J364569k99505j143685n25576Q35619J400336M17748j253691
$$ -4533809 -2148498 -783929 -1083434 -2227119 -2752695 -1917076 -516740 -98992 -1352683
2301a352683k355277k591805k117569o07124J871366L697967L096007O92688q20597
$$ -1352683 -3707960 -6299765 -8417334 -9024458 -7153092 -3455125 -359118 333570 -487027
2292d87027L3222J789049K100267N06103j495205k310195j439215N83008K550953
$$ -487027 -453805 1335244 3435511 3941614 2446409 136214 -1303001 -719993 1830960
2283A830960L117313J745790p31612k884170l970277m060393l058425n53907K789021
$$ 1830960 4948273 6694063 5962451 3078281 -891996 -4952389 -8010814 -8564721 -5775700
2274e775700M565540K822433j010887k973082j232341J493796J632613m06702
$$ -5775700 -1210160 1612273 601386 -2371696 -3604037 -2110241 -477628 -884330
2266h84330j393646n38571m36009k269848l417331j652505J035818J484007K04872
$$ -884330 -2277976 -2816547 -3252556 -5522404 -8939735 -10592240 -9556422 -8072415 -7867543
2257g867543J16015J711258K826797K627069K398417K279521O00925k644705m658951
$$ -7867543 -7751528 -6040270 -3213473 -586404 1812013 4091534 4692459 2047754 -2611197
$$ [...]
##END NTUPLES=NMR SPECTRUM
##END=
