##TITLE=31Pdec_DE-105K
CDCl3, 24 sc
 5.8.2025
##JCAMPDX= 6.0         $$ Bruker NMR JCAMP-DX V2.0
##DATA TYPE= NMR SPECTRUM
##DATA CLASS= NTUPLES
##ORIGIN= UXNMR, Bruker Analytische Messtechnik GmbH
##OWNER= root
$$ XWIN-NMR		Version 3.5
$$ Tue Aug  5 16:05:43 2025 Russian Standard Time (UT+4h)  she@DPX200
##.OBSERVE FREQUENCY= 81.013821
##.OBSERVE NUCLEUS= ^31P
##.ACQUISITION MODE= SIMULTANEOUS
##.ACQUISITION SCHEME= undefined
##.AVERAGES= 128
##.DIGITISER RES= 17
##SPECTROMETER/DATA SYSTEM= spect
##.PULSE SEQUENCE= zgpg30
##.SOLVENT NAME= CDCl3
##.SHIFT REFERENCE= (INTERNAL, CDCl3, 0, 198.062)
##AUDIT TRAIL= $$ (NUMBER, WHEN, WHO, WHERE, WHAT)
$$ ##TITLE= Audit trail, XWIN-NMR		Version 3.5
$$ ##JCAMPDX= 5.01
$$ ##ORIGIN= Bruker BioSpin GmbH
$$ ##OWNER= she
$$ F:/spectra/data/she/nmr/P31/2/pdata/1/auditp.txt
$$ ##AUDIT TRAIL=  $$ (NUMBER, WHEN, WHO, WHERE, WHAT)
(   1,<2025-08-05 16:04:43.46 +0400>,<she>,<DPX200>,
      <created by zg, POWCHK disabled, PULCHK disabled
       configuration hash MD5:
       00 E9 B6 7A A2 85 ED C7 34 08 36 98 17 FE 4E 26
       data hash MD5: 32K
       A7 E7 28 B6 F6 8C C9 CB 97 5B 40 A2 A3 ED 4F 83>)
(   2,<2025-08-05 16:04:45.71 +0400>,<she>,<DPX200>,
      <Start of raw data processing
       efp BC_mod = 2 LB = 1.5 FT_mod = 6 PKNL = 1 PHC0 = 1464.477 PHC1 = -44.50122 SI = 64K 
       data hash MD5: 64K
       A5 6C B9 BD 9C C8 75 CC 10 0C 30 32 04 3E 7E FB>)
(   3,<2025-08-05 16:05:07.20 +0400>,<she>,<DPX200>,
      <pk PHC0 = 329.8246 PHC1 = 0 
       data hash MD5: 64K
       7A F3 E4 1C DB 90 D4 A9 95 F2 17 CA EA CA 82 79>)
$$ ##END=
$$ 
$$ hash MD5
$$ AD 55 D0 FD 54 DE AD A0 76 21 5E B1 03 B3 AA EE
##$RELAX= 
##$RELAX= 
##$RELAX= 
##$RELAX= 
##$RELAX= 
##$RELAX= 
##$RELAX= 
##$RELAX= 
$$ Bruker specific parameters
$$ --------------------------
##$DU= <F:/spectra>
##$EXPNO= 2
##$NAME= <P31>
##$PROCNO= 1
##$TYPE= <nmr>
##$USER= <she>
##$AMP= (0..31)
100 100 100 100 100 100 100 100 100 100 100 100 100 100 100 100 100 100 
100 100 100 100 100 100 100 100 100 100 100 100 100 100 
##$AQSEQ= 0
##$AQ_mod= 1
##$AUNM= <au_zg>
##$AUTOPOS= <>
##$BF1= 81.014009
##$BF2= 200.13
##$BF3= 200.13
##$BF4= 200.13
##$BF5= 200.13
##$BF6= 200.13
##$BF7= 200.13
##$BF8= 200.13
##$BYTORDA= 1
##$CFDGTYP= 0
##$CFRGTYP= 5
##$CHEMSTR= <none>
##$CNST= (0..31)
1 1 145 1 1 1 1 1 1 1 1 1 1 1 1 1 1 1 1 1 1 1 1 1 1 1 1 1 1 1 1 1 
##$CPDPRG= <waltz16>
##$CPDPRG1= <>
##$CPDPRG2= <waltz16>
##$CPDPRG3= <>
##$CPDPRG4= <mlev>
##$CPDPRG5= <mlev>
##$CPDPRG6= <mlev>
##$CPDPRG7= <mlev>
##$CPDPRG8= <mlev>
##$CPDPRGB= <>
##$CPDPRGT= <>
##$D= (0..31)
0 1 0 0 0 0 0 0 0 0.06 0 0.03 2e-05 3e-06 0 0 0.0002 0 0 0 0 0 0 0 0 0 
0 0 0 0 0 0 
##$DATE= 1754395482
##$DBL= (0..7)
120 120 120 11 120 120 24 19 
##$DBP= (0..7)
150 150 150 150 150 150 150 150 
##$DBP07= 0
##$DBPNAM0= <>
##$DBPNAM1= <>
##$DBPNAM2= <>
##$DBPNAM3= <>
##$DBPNAM4= <>
##$DBPNAM5= <>
##$DBPNAM6= <>
##$DBPNAM7= <>
##$DBPOAL= (0..7)
0.5 0.5 0.5 0.5 0.5 0.5 0.5 0.5 
##$DBPOFFS= (0..7)
$$ [...]
##$SUBNAM3= <"">
##$SUBNAM4= <"">
##$SUBNAM5= <"">
##$SUBNAM6= <"">
##$SUBNAM7= <"">
##$SUBNAM8= <"">
##$SUBNAM9= <"">
##$SW= 400.765351723535
##$SWIBOX= (0..15)
0 1 3 0 0 0 0 0 0 0 0 0 0 0 0 0 
##$SW_h= 32467.5324675325
##$TD= 32768
##$TD0= 1
##$TE= 0
##$TE2= 300
##$TE3= 300
##$TEG= 300
##$TL= (0..7)
0 120 53 12 22 120 120 120 
##$TP= (0..7)
150 150 150 150 150 150 150 150 
##$TP07= 0
##$TPNAME0= <>
##$TPNAME1= <>
##$TPNAME2= <>
##$TPNAME3= <>
##$TPNAME4= <>
##$TPNAME5= <>
##$TPNAME6= <>
##$TPNAME7= <>
##$TPOAL= (0..7)
0.5 0.5 0.5 0.5 0.5 0.5 0.5 0.5 
##$TPOFFS= (0..7)
0 0 0 0 0 0 0 0 
##$TUNHIN= 0
##$TUNHOUT= 0
##$TUNXOUT= 0
##$USERA1= <user>
##$USERA2= <user>
##$USERA3= <user>
##$USERA4= <user>
##$USERA5= <user>
##$V9= 5
##$VALIST= <valist>
##$VCLIST= <CCCCCCCCCCCCCCC>
##$VD= 0
##$VDLIST= <DDDDDDDDDDDDDDD>
##$VPLIST= <PPPPPPPPPPPPPPP>
##$VTLIST= <TTTTTTTTTTTTTTT>
##$WBST= 1024
##$WBSW= 4
##$XGAIN= (0..3)
0 0 0 0 
##$XL= 0
##$YL= 0
##$YMAX_a= 4096
##$YMIN_a= -19461
##$ZGOPTNS= <>
##$ZL1= 120
##$ZL2= 120
##$ZL3= 120
##$ZL4= 120
##$ABSF1= 0
##$ABSF2= 0
##$ABSG= 0
##$ABSL= 0
##$ALPHA= 0
##$AQORDER= 0
##$ASSFAC= 0
##$ASSFACI= 0
##$ASSFACX= 0
##$ASSWID= 0
##$AUNMP= <proc_1d>
##$AZFE= 0.1
##$AZFW= 0.5
##$BCFW= 0
##$BC_mod= 2
##$BYTORDP= 0
##$COROFFS= 0
##$CY= -3
##$DATMOD= 1
##$DC= 0
##$DFILT= <>
##$DTYPP= 0
##$F1P= 0
##$F2P= 0
##$FCOR= 1
##$FTSIZE= 65536
##$FT_mod= 6
##$GAMMA= 0
##$GB= 0
##$INTBC= 1
##$INTSCL= 9.790993e-09
##$ISEN= 30
##$LB= 1.5
##$LEV0= 0
##$LPBIN= 0
##$MAXI= 10000
##$MC2= 0
##$MEAN= 0
##$ME_mod= 0
##$MI= 50
##$NCOEF= 0
##$NC_proc= -11
##$NLEV= 6
##$NOISF1= 182.463
##$NOISF2= 159.3651
##$NSP= 0
##$NTH_PI= 0
##$NZP= 0
##$OFFSET= 198.0616
##$PC= 4
##$PHC0= 1794.302
##$PHC1= -44.50122
##$PH_mod= 1
##$PKNL= yes
##$PPARMOD= 0
##$PSCAL= 0
##$PSIGN= 0
##$REVERSE= no
##$SF= 81.0140089999434
##$SI= 65536
##$SIGF1= 159.3651
##$SIGF2= -187.1042
##$SINO= 113.3802
##$SIOLD= 16384
##$SREGLST= <1H.CDCl3>
##$SSB= 0
##$STSI= 65536
##$STSR= 0
##$SW_p= 32467.5324675325
##$SYMM= 0
##$S_DEV= 0
##$TDeff= 32768
##$TDoff= 0
##$TI= <>
##$TILT= no
##$TM1= 0
##$TM2= 0
##$TOPLEV= 0
##$USERP1= <user>
##$USERP2= <user>
##$USERP3= <user>
##$USERP4= <user>
##$USERP5= <user>
##$WDW= 1
##$XDIM= 65536
##$YMAX_p= 436729129
##$YMIN_p= -465034371
$$ End of Bruker specific parameters
$$ ---------------------------------
##NTUPLES= NMR SPECTRUM
##VAR_NAME=  FREQUENCY,     SPECTRUM/REAL,   SPECTRUM/IMAG
##SYMBOL=    X,             R,               I
##VAR_TYPE=  INDEPENDENT,   DEPENDENT,       DEPENDENT
##VAR_FORM=  AFFN,          ASDF,            ASDF
##VAR_DIM=   65536,         65536,           65536
##UNITS=     HZ,            ARBITRARY UNITS, ARBITRARY UNITS
##FACTOR=    0.49542278885378, 1,            1
##FIRST=     16045.7642231865, 0,            0
##LAST=      -16421.768244346, 0,            0
##MIN=       -16421.768244346, -465034371,   0
##MAX=       16045.7642231865, 436729129,    0
$$ Real data points
##PAGE= N=1
##DATA TABLE= (X++(R..R)), XYDATA
$$ [...]
##PAGE= N=2
##DATA TABLE= (X++(I..I)), XYDATA
7142a0859673j1679235r642755P003800K7224838K6228551N172578j0496591r607713
$$ -10859673 -22538908 -32181663 -25177863 2046975 28275526 33448104 22951513 13343800
7134A3343800l857371j206965j25195o397720k2998426k7127241L680837M2664457
$$ 13343800 9486429 8279464 8154269 1756549 -21241877 -48369118 -44688281 -2023824
7126b023824L7175036r873527l1842867O087006N1331508L9840749j2128972l8748739
$$ -2023824 35151212 25277685 -6565182 -478176 50853332 90694081 78565109 39816370
7118C9816370k0512999K159830k77863j2070422j0961586R1840J0049517J7331383
$$ 39816370 19303371 21463201 21185338 9114916 -1846670 -1754830 8294687 25626070
7110B5626070J9458994R833142n877003j1576170o821493j0410110k9648904m6046482
$$ 25626070 45085064 54918206 49041203 37465033 30643540 20233430 -9415474 -55461956
7102e5461956m1746144k2570680m420080O886691J1518913P545130m0239M325878
$$ -55461956 -97208100 -119778780 -124198860 -117312169 -105793256 -98248126 -98288365 -93962487
7094i3962487K7301915N3083514O1001782M7950117K4237776r82706j8975730
$$ -93962487 -66660572 -13577058 47424724 95374841 119612617 118629911 99654181
7087I9654181j9548085n648598R06506j4032580l3154826k9664694o617193P510591
$$ 99654181 80106096 74457498 75364004 61331424 28176598 -1488096 -8105289 -594698
7079e94698J09554j1841978j1698327l768737L245046J1524090J9948383J3204911
$$ -594698 -485144 -12327122 -24025449 -27794186 -24549140 -13025050 6923333 20128244
7071B0128244j6404536m7367148m8769986j8406232J4283606K2705417Q451975
$$ 20128244 3723708 -43643440 -92413426 -110819658 -96536052 -73830635 -65378660
7064f5378660p601058q415303O612887K3549126K6240254J2160764m326460r282413
$$ -65378660 -72979718 -81395021 -74782134 -51233008 -24992754 -12831990 -17158450 -26440863
7056b6440863n957113o024783q437438p02310J8012096L0011309K2074678L554542
$$ -26440863 -32397976 -38422759 -46860197 -47562507 -29550411 460898 22535576 26090118
7048B6090118p775200q621535p541984o564558l31806Q004502N924251p912459
$$ 26090118 18314918 9693383 2151399 -4413159 -4744965 3259537 9183788 1271329
7040A271329j4820368J324461K8973183L9181795K1593604j278234k613892J3004338
$$ 1271329 -13549039 -12224578 16748605 55930400 77524004 76245770 73631878 86636216
7032H6636216J4483195j3549720m4884732l9232130P271484N2030997N2001007
$$ 86636216 101119411 87569691 42684959 3452829 10724313 62755310 114756317
7025A14756317J0449235l1588209m3812653l2494386j9444215j3518664j1548829
$$ 114756317 125205552 93617343 49804690 17310304 -2133911 -15652575 -27201404
7018b7201404j2070275j1862598J725979L4121700O1481161M8824822k639064
$$ -27201404 -39271679 -51134277 -49408298 -15286598 46194563 95019385 92380321
7011I2380321m7230965m7533709j8396914k61059l258588l674193J0373151K0216656
$$ 92380321 45149356 -2384353 -20781267 -21042326 -24300914 -27975107 -17601956 2614700
7003B614700J0101920o397404q051354L704580J2767847J4455422J5949627J7715938
$$ 2614700 12716620 6319216 -1732138 1972442 14740289 29195711 45145338 62861276
6995F2861276J2010574j324708j1601520j1452188m713838R67476K181277P1225
$$ 62861276 74871850 73547142 61945622 50493434 45779596 46747072 48928349 48999574
6987D8999574j850500j105397j281709r157898k1315262k1152533k08192K3249181
$$ 48999574 47149074 46043677 44761968 35604070 14288808 -6863725 -7071917 16177264
6979A6177264K2372322j852254j8804880q591059J0582596P860094j5958811k6527192
$$ 16177264 38549586 36697332 17892452 9301393 19883989 27744083 11785272 -14741920
6971a4741920j063400L8247238M8088321J7191161j9466328k5314678o653291
$$ -14741920 -15805320 22441918 70530239 87721400 68255072 42940394 36287103
6964C6287103K875356p741632j7191978j2240241q464822j7575491k1409101l047227
$$ 36287103 39162459 31420827 14228849 1988608 -6476214 -24051705 -45460806 -48508033
6956d8508033J6764179O889181k1542509k6065055M442226L4110803L4643956
$$ -48508033 -31743854 -24854673 -46397182 -72462237 -68020011 -33909208 734748
6949G34748K0904679J6284493J4278731l16769j5968016j1599696M056708K613497
$$ 734748 21639427 37923920 52202651 51885882 35917866 24318170 28374878 30988375
6941C0988375j8061710k8059338r799333J7700664K9303421K7534405K9943926
$$ 30988375 12926665 -15132673 -24932006 -7231342 22072079 49606484 79550410
6934G9550410L6551183K9877616M348853k1690787k8326334j8082337j0723776
$$ 79550410 116101593 145979209 150328062 128637275 100310941 82228604 71504828
6927G1504828j9078944l5665087m0840645k1151041J6191913M3952888L7626902
$$ 71504828 52425884 16760797 -24079848 -45230889 -29038976 14913912 52540814
6920E2540814M729536j7687757o877620J4510579J1177440j0269656j1593519
$$ 52540814 57270350 39582593 32704973 47215552 58392992 48123336 36529817
6913C6529817J2568192K2354946J52418j4590037Q571288L1122298L073914m8252872
$$ 36529817 49098009 71452955 71605373 57015336 65586624 96708922 99782836 51529964
6905E1529964n0941767J631609M2376920L5533219J9062672K2942418J6963435
$$ 51529964 588197 2219806 44596726 80129945 99192617 122135035 139098470
6898A39098470k0683743m6182542j7766296K6276591K0801371k6258333n1719360
$$ 139098470 118414727 72232185 54465889 80742480 101543851 75285518 23566158
6891B3566158l5047112j3433872q382570j775404J3049586J6996373J1677653
$$ 23566158 -11480954 -24914826 -33297396 -35072800 -22023214 -5026841 6650812
6884F650812K3875383M8350738M0767760q543837m3804011j9349650L4608203
$$ 6650812 30526195 78876933 119644693 111100856 67296845 47947195 82555398
6877H2555398N7817644L8803381J0083975q630017k1179590k6231432j8676327
$$ 82555398 140373042 179176423 189260398 180630381 159450791 133219359 114543032
6870A14543032j1627396k1026888l2658734j8446116J5168933K8862395N802393
$$ 114543032 102915636 81888748 49230014 30783898 45952831 74815226 80617619
6863H0617619k5895396l7305314l6481264m2458623m3953464j3664631M2544314
$$ 80617619 54722223 17416909 -19064355 -61522978 -105476442 -119141073 -76596759
6856g6596759P9967248O7535138K6058274j814004o811514j4871728l6497840
$$ -76596759 3370489 70905627 96963901 95149897 88338383 73466655 36968815
6849C6968815m3899876j4274176K6758082L3011762M41521k7319990j7841476
$$ 36968815 -6931061 -21205237 5552845 38564607 39006128 11686138 -6155338
6842f155338J2292136K7294148J7695791K428942Q4606J0766579J7879726K099155
$$ -6155338 6136798 33430946 51126737 53555679 53640285 64406864 82286590 84385745
6834H4385745l5522625o2544317m5274624M680838L5491900J7446195k1175381
$$ 84385745 48863120 -13681197 -58955821 -54274983 -18783083 -1336888 -22512269
6827b2512269l4945036j6395962Q843602K1582186J9000650J028471k5256395
$$ -22512269 -57457305 -73853267 -65009665 -43427479 -24426829 -23398358 -48654753
6820d8654753l7673736k2444489J677483Q487699M860851J6336814L9193153M3385844
$$ -48654753 -86328489 -108772978 -107095495 -98607796 -93746945 -77410131 -38216978 5168866
6812E168866K4378788J3239915K4331776K9791390N860171k6636493l4300236
$$ 5168866 29547654 42787569 67119345 96910735 102770906 76134413 41834177
6805D1834177k0216987j2074113j7270312j9690958j2674062p080347q683603
$$ 41834177 21617190 9543077 -7727235 -27418193 -40092255 -47172602 -55856205
6798e5856205j0706282q689874l874883O167185K1378464K7391979J2294692o781214
$$ -55856205 -66562487 -75252361 -79127244 -72960059 -51581595 -24189616 -11894924 -18676138
6790a8676138k93938K7669110L9067828J7036944q764519r599311j588170j4363619
$$ -18676138 -18970076 8699034 47766862 64803806 56039287 46439976 44851806 30488187
6782C0488187l8376588m0026930j7873560l925198r357752q852503J0749470K3559004
$$ 30488187 -7888401 -47915331 -65788891 -69714089 -79071841 -87924344 -77174874 -53615870
6774e3615870P355565j6904786j6330455M199840J4477488P769942M607183J3158239
$$ -53615870 -46260305 -63165091 -79495546 -75295706 -60818218 -53048276 -48441093 -35282854
6766c5282854J8153509J2072418Q311550J4520396J7172547N188921j0171665
$$ -35282854 -17129345 -5056927 3254623 17775019 34947566 40136487 29964822
6759B9964822j2650696l453769O383523J2956077J5710639Q909469p837403j9663456
$$ 29964822 17314126 13860357 20243880 33199957 48910596 57820065 49982662 30319206
6751C0319206j3291363J990744O068350k736805o539453L680158J4320481R116216
$$ 30319206 17027843 19018587 25086937 22350132 15810679 19490837 33811318 42927534
6743D2927534q724476k1736934j8792112l938987J1143432J7322568J1988781
$$ 42927534 34203058 12466124 -6325988 -10264975 878457 18201025 30189806
6736C0189806j748905j7249740k6743870k4617446j1778984L007518J0135289
$$ 30189806 28440901 11191161 -15552709 -40170155 -51949139 -48941621 -38806332
6729c8806332R560543J0019290J4405956J1544307q804873l4710814l8163234
$$ -38806332 -29245789 -19226499 -4820543 6723764 -2081109 -36791923 -74955157
6722g4955157q720016K7829585L6088062J3444205p691037k754687J4909748J7842074
$$ -74955157 -83675173 -55845588 -19757526 -6313321 -14004358 -16759045 -1849297 15992777
6714A5992777N615291K093186J5298800K3765760J0125313j2209406k0089201
$$ 15992777 21608068 23701254 39000054 62765814 72891127 60681721 40592520
6707D0592520j3268606q589065j1492082j2133864n472509J566890J693688o428194
$$ 40592520 27323914 18734849 7242767 -4891097 -10363606 -8796716 -7103028 -13531222
6699a3531222j9896930k8170729j5665440J6709357M1111683L4192591J1863624
$$ -13531222 -33428152 -61598881 -77264321 -60554964 -19443281 14749310 26612934
6692B6612934P756578K1821181K2013868l07089j2967199M127988K1922990M547909
$$ 26612934 34369512 56190693 78204561 77897472 64930273 69058261 90981251 95529160
6684I5529160l4496270n0550192l0945496q043002r228710k1468056j5902319
$$ 95529160 61032890 10482698 -20462798 -28505800 -37734510 -59202566 -75104885
6677g5104885J0010382L0586830K7234974J1533411O542004J2990350R371280
$$ -75104885 -65094503 -34507673 -7272699 4260712 10802716 23793066 33164346
6670C3164346j1835890k7269865j6483294M381824O544927o142719o911415N370523
$$ 33164346 21328456 -5941409 -22424703 -18042879 -11497952 -17640671 -24552086 -19181563
6662a9181563M592079j3362035j9486246q01251J8310869K1267619K6980455M7509992
$$ -19181563 -14589484 -27951519 -47437765 -48239016 -29928147 -8660528 18319927 65829919
6654F5829919N4932066K4153277k0687340l9194407l0486398j9651009j0882311
$$ 65829919 120761985 144915262 124227922 85033515 54547117 34896108 24013797
6647B4013797N587425J8347954J0480748k165251P338825K5385617J3267226k9044144
$$ 24013797 29601222 47949176 58429924 56264673 63603498 88989115 102256341 73212197
6639G3212197n9619270n6355975l8289931k1386950J567841K6939575L0478008
$$ 73212197 13592927 -42763048 -81052979 -102439929 -100872088 -73932513 -43454505
6632d3454505Q852203p317353j076100M926705r294508k5589194j8854111L825430
$$ -43454505 -34602302 -41919655 -42995755 -38069050 -47363558 -72952752 -91806863 -87981433
6624h7981433K0595375K8499352L4551910L2556900J4851372o172571j1593120
$$ -87981433 -67386058 -38886706 -4334796 28222104 43073476 36900905 25307785
6617B5307785k474860M771209J798541o086857r543577j447164J6269204K7169827
$$ 25307785 22832925 27604134 29402675 23315818 13772241 12325077 28594281 55764108
6609E5764108J6652062l413146p986035q06931j3039834m8059022o1892346k3531376
$$ 55764108 72416170 69003024 61016989 60210058 47170224 -888798 -62781144 -86312520
6601h6312520L3791018N3503240K7969621k982684j1449908n309104j66247O6449
$$ -86312520 -52521502 981738 28951359 25968675 14518767 9209663 9043416 9109865
6593I109865m718676j1836075q952765J1160252L0493020K3411618n640679k4925252
$$ 9109865 4391189 -7444886 -16397651 -5237399 25255621 48667239 43026560 18101308
6585A8101308j8467180m803321p036968k2492909l0320241j6885260J2273872
$$ 18101308 -365872 -5169193 -12206161 -34699070 -65019311 -81904571 -69630699
6578f9630699L6642670L4985259N513834k6986304l4012910j3738560J0505006
$$ -69630699 -32988029 1997230 7511064 -19475240 -53488150 -67226710 -56721704
6571e6721704J9589566J3959514J553769j2948674k2553298j6877876L324050
$$ -56721704 -37132138 -23172624 -21618855 -34567529 -57120827 -73998703 -70674653
6564g0674653J9388252J3314523r326609k2926699r638095K0124550L7692016
$$ -70674653 -51286401 -37971878 -47298487 -70225186 -79863281 -59738731 -22046715
6557b2046715K6511817j46375j4483476n073503J2669906J6641636K512580j3846218
$$ -22046715 4465102 4318727 -10164749 -15238252 -2568346 14073290 16585870 2739652
6549B739652j3741064O243613L0294922L7917744K5370880Q772871J258236m706382
$$ 2739652 -11001412 -4757799 25537123 63454867 88825747 97598618 98856854 94150472
6541I4150472k1553780m1934517m7110292l5297204k1891439j3382189k507035
$$ 94150472 72596692 30662175 -16448117 -51745321 -73636760 -87018949 -89525984
6534h9525984J0687010J6888291J9193506L0833080M5751805L9446195Q873431
$$ -89525984 -78838974 -61950683 -42757177 -11924097 33827708 73273903 82147334
6527H2147334j6884843j8927638j2766436j4290576j2149584L735259J5468022
$$ 82147334 65262491 46334853 33568417 19277841 7128257 10863516 26331538
6520B6331538O963207m976389j07521P721843l124204j8072838p764504J9365210
$$ 26331538 33294745 28318356 28210835 35932678 32808474 14735636 6971132 26336342
6512B6336342K6160123L279925k0198038k2139046j1017130k781728j174634j892364
$$ 26336342 52496465 55776390 35578352 13439306 2422176 -359552 -1534186 -3426550
6504c426550M591527K7639480N2811829M0578098j9100483o9338838m9152450
$$ -3426550 1164977 28804457 81616286 122194384 103093901 33755063 -15397387
6497a5397387J6718858M4422924P386887l2557149k3774972N209026M981977j6641508
$$ -15397387 1321471 45744395 53131282 20574133 -3200839 2008187 6990164 -9651344
6489i651344j9919583j784828Q481151K562015k138220j672406r877942k4997089
$$ -9651344 -29570927 -31355755 -22874604 -20312589 -22450809 -24123215 -34001157 -58998246
6481e8998246k5842493o040065J4203159J7468579R813347M471608J733712m607646
$$ -58998246 -84840739 -90880804 -76677645 -59209066 -49395719 -44924111 -43190399 -47798045
6473d7798045j2014931j2472868p171251p258642j6809985k1864986n486821K6037665
$$ -47798045 -59812976 -72285844 -79457095 -86715737 -103525722 -125390708 -130877529 -104839864
6465a04839864M3001587K6139772o982197k0541631j232549L0610321M7287929
$$ -104839864 -61838277 -35698505 -42680702 -63222333 -64454882 -33844561 13443368
6458A3443368L9119135J5579031o276261j3585978p085480J026104L348726M884743
$$ 13443368 52562503 68141534 61865273 48279295 41193815 42219919 45568645 50453388
6450E0453388Q063064L271219j1949276j8244183P0191K5334708K7131512O206710
$$ 50453388 58516452 61787671 49838395 31594212 31664403 56999111 84130623 90337333
6442I0337333q499849m051343K108040o505736k4095469l6186703l4564096j7694691
$$ 90337333 81837484 77786141 79894181 73388445 49292976 13106273 -21457823 -39152514
6434c9152514N508391J5707031O017070l551851K886363O243527j5126465l8277702
$$ -39152514 -33644123 -17937092 -11920022 -15471873 -12585510 -6341983 -21468448 -59746150
6426e9746150k5717211Q073149J4907882m407890R92715L9588347N2531287R835038
$$ -59746150 -85463361 -77390212 -62482330 -66890220 -65897505 -26309158 26222129 36057167
6418C6057167l3412579k1442186J6428130J9106019j0304052k3442155j1943374
$$ 36057167 2644588 -18797598 -2369468 16736551 6432499 -17009656 -28953030
6411b8953030q759822j8403553q523194K7489029N2213439L9761106J0934029
$$ -28953030 -37712852 -56116405 -64639599 -37150570 15062869 54823975 65758004
6404F5758004k00329J1654129K4748517J7381036j1030491l6676264l4360130
$$ 65758004 65557675 77211804 101960321 119341357 108310866 71634602 37274472
6397C7274472j0285994M147516j18659M420886L0813938M5530754J8536313k4217609
$$ 37274472 26988478 31135994 31017335 35438221 66252159 111782913 130319226 106101617
6389A06101617l8219059k6687683k4994533l6963132l5278648j5460673j415278
$$ 106101617 67882558 41194875 16200342 -20762790 -56041438 -71502111 -72917389
6382g2917389p26152J513190O559068K316963k598141J1077080L0218704K2430797
$$ -72917389 -73643541 -72130351 -65571283 -63254320 -65852461 -54775381 -24556677 -2125880
6374b125880n873847j2912256J0013702K3092254M923437j2923923N79964K9459901
$$ -2125880 -7999727 -20911983 -10898281 12193973 17117410 4193487 4773451 34233352
6366C4233352M2025699L3617538J4897003j0363125l2548268l1092779n665362
$$ 34233352 76259051 109876589 124773592 114410467 81862199 50769420 45104058
6359D5104058J4247346J2097856Q271366J8582282J9504702j3791259n8465492
$$ 45104058 59351404 71449260 79720626 98302908 117807610 104016351 45550859
6352D5550859o8693546l6885259R69564J5028896J0698985R482788K0091930L0959717
$$ 45550859 -23142687 -60027946 -59058382 -44029486 -33330501 -23847713 -3755783 27203934
6344B7203934K3705111l483927k5965881j8708817P534889J6181849n113967k8682369
$$ 27203934 50909045 47425118 21459237 2750420 10285309 26467158 21353191 -7329178
6336g329178k9408130j6092850o860833j263008L660660l830152k5810677l5057551
$$ -7329178 -36737308 -52830158 -59690991 -60953999 -57293339 -61123491 -86934168 -121991719
6328a21991719q907789L2283520M8228646K8896503l376850k9475991m3073233
$$ -121991719 -130899508 -98615988 -50387342 -21490839 -24867689 -54343680 -97416913
6321i7416913l4615659J127538M1396067M9253607J9501192j0371926n245453
$$ -97416913 -132032572 -130905034 -89508967 -40255360 -20754168 -31126094 -36371547
6314c6371547K5881084M3457971K5161729r164848k1313270l77661K2343137J1839445
$$ -36371547 -10490463 32967508 58129237 48964389 27651119 27273458 49616595 61456040
6306F1456040k3125341l8739699j4270764J9919205K3573981k782874k5272618
$$ 61456040 38330699 -409000 -14679764 5239441 28813422 26030548 757930
6299G57930k2154615l449820R213595P452349J559202P170329K3194084K4857010
$$ 757930 -21396685 -24846505 -15632910 -8180561 -6621359 548970 23743054 48600064
6291D8600064p419908n2510767o4065239k8263969J7853130L6932576L3337930
$$ 48600064 41180156 -11330611 -75395850 -103659819 -85806689 -48874113 -15536183
6284a5536183K6725040J2420097k1010518n3791317n0675137r291412L6050461
$$ -15536183 11188857 23608954 2598436 -51192881 -101868018 -111159430 -75108969
6277g5108969N6701715N2172945L3968801J1992479k000386M87455J1074843J0577215
$$ -75108969 -18407254 33765691 67734492 79726971 77726585 78214040 89288883 99866098
6269I9866098q261572l3086031m4604063l0089278O573077L8863723L5456225
$$ 99866098 91604526 58518495 13914432 -16174846 -9601769 29261954 64718179
6262F4718179j376750k9898308j9663228P802786J2653197m680531j0415465N711948
$$ 64718179 63341429 33443121 13779893 21582679 34235876 29555345 19139880 24851828
6254B4851828J6500882K257071k2291798l4278381l0276094j8043087j922061
$$ 24851828 41352710 43609781 21317983 -12960398 -43236492 -61279579 -63201640
6247f3201640J3192016J9595846J7165827J3658960J0482670J501185j1043100
$$ -63201640 -50009624 -30413778 -13247951 411009 10893679 12394864 1351764
6240A351764j4064725j911371J4693477K1753445J5042920J56147j0957528o301882
$$ 1351764 -12712961 -14624332 69145 21822590 36865510 37021657 26064129 19762247
6232A9762247J2081907K4129838J4031542q260811k0449055j6076349m969694
$$ 19762247 31844154 55973992 70005534 61744723 41295668 25219319 20249625
6225B0249625N875974J4105758J2705749j315284j5496162j8085217j6884197
$$ 20249625 26125599 40231357 52937106 51621822 36125660 18040443 1156246
6218A156246k2044207k3000627q136035O793079K325232n608735J0368315L5946310
$$ 1156246 -20887961 -43888588 -52024623 -45231544 -42906312 -48515047 -38146732 -2200422
6210b200422L2833045N788220j671809J6124408J3466458k5619581n2175222l0736517
$$ -2200422 30632623 36420843 34749034 50873442 64339900 38720319 -13454903 -44191420
6202d4191420R72860m918466k8746767k2001370R907130K2460618R131355L851474
$$ -44191420 -43218560 -48137026 -76883793 -98885163 -88978033 -66517415 -57386060 -53534586
6194e3534586J4905736J4463842l198473o913338J5241987L1373810J6720621
$$ -53534586 -38628850 -24165008 -27363481 -34276819 -19034832 12338978 29059599
6187B9059599q487792j4299827l542335M403666O847901R309422L811098j6355555
$$ 29059599 20571807 6271980 2729645 7133311 13981212 23290634 27101732 10746177
6179A0746177l2598847j9882331J4924943L8674116L6119428K4846952K0919044
$$ 10746177 -21852670 -41735001 -26810058 11864058 47983486 72830438 93749482
6172I3749482J3837785q304401k7120545j4248002K0541036L0792312n613255
$$ 93749482 107587267 99282866 72162321 57914319 78455355 109247667 103634412
6165A03634412n0586248n3328071j8452431L606211r919505k5387074q847487
$$ 103634412 53048164 -279907 -18732338 -15126127 -25045632 -50432706 -59280193
6158e9280193K0590196J9495202j5364282m1345021k5906855J5964047M4930131
$$ -59280193 -38689997 -19194795 -34559077 -75904098 -101810953 -85846906 -40916775
6151d0916775M1045690J6836507l123399p062382k446536k306882r105593j5559406
$$ -40916775 128915 16965422 13842023 6779641 4333105 2026223 -7079370 -22638776
6143b2638776j7605556j6499422q501914J3028732L9927852M8412329K6451211
$$ -22638776 -40244332 -56743754 -65245668 -52216936 -12289084 36123245 62574456
6136F2574456r097641l2571189l5578201k3886452l843927J3125241Q071438k1330967
$$ 62574456 53476815 20905626 -14672575 -38559027 -42402954 -29277713 -21206275 -42537242
6128d2537242m4075077k7674726J7538098M9312895M6597822K7475796J3391538
$$ -42537242 -86612319 -114287045 -96748947 -47436052 -838230 26637566 40029104
6121D0029104K882208r863700j4622258l54161K3338648L5437711K6476167K718506
$$ 40029104 42911312 33047612 18425354 18071193 41409841 76847552 103323719 106042225
6113A06042225k3508613l8847330l4606461j8283315j0674209k0427892l0194122
$$ 106042225 82533612 43686282 9079821 -9203494 -19877703 -40305595 -70499717
6106g0499717k1031408j838686L586124n608464n031209J4826425K8832165J3151991
$$ -70499717 -91531125 -93369811 -89783687 -95392151 -100423360 -85596935 -56764770 -43612779
6098d3612779j5191948j8220501R143271L1499065K4544895Q135345J0600799
$$ -43612779 -58804727 -77025228 -67881957 -36382892 -11837997 -3702652 6898147
6091F898147K1361865Q677171k3726762l2723917L159133M7888950N2159540J4696780
$$ 6898147 28260012 36937183 13210421 -19513496 -16354363 31534587 83694127 98390907
6083I8390907k2207340k6980003o579408J4267015J9711403P879932j2118644
$$ 98390907 76183567 49203564 42624156 56891171 76602574 84482506 72363862
6076G2363862k3190482j3514311P827200J8079591P428596j0462867j7807916
$$ 72363862 49173380 35659069 43486269 61565860 68994456 58531589 40723673
6069D0723673j3494013r633426j4803678k6715717l6887308l7428146k6180712
$$ 40723673 27229660 17596234 2792556 -23923161 -60810469 -98238615 -124419327
6062a24419327r152411M362433J1979413K0539551L3789881M0088108K0994133
$$ -124419327 -133571738 -129209305 -117229892 -96690341 -62900460 -22812352 -1818219
6055a818219k2778495o0409362n8248678j9911220J3937196J4049904k260997
$$ -1818219 -24596714 -85006076 -143254754 -163165974 -149228778 -135178874 -137439871
6048a37439871R3430K1733945L1337788J8278174J0999088L0320028N2129600
$$ -137439871 -137346441 -115612496 -84274708 -65996534 -54997446 -24677418 27452182
6041B7452182M0795688L189793j8375584k537963K5531906K8381997N17245k8005028
$$ 27452182 68247870 71437663 53062079 50524116 76056022 104438019 104955264 76950236
6033G6950236k6715290o84861J2029777j2902937m7230742m0513722P300087L5886198
$$ 76950236 50234946 49550085 61579862 48676925 1446183 -39067539 -31767452 4118746
6025D118746O099558m0925585m1083406Q93494K4226295O164773j0381890Q940938
$$ 4118746 10218304 -30707281 -71790687 -70897193 -46670898 -40506125 -50888015 -41947077
6017d1947077L8168497L7083430J0930294o681766m757166K985949J0280270K0904922
$$ -41947077 -3778580 33304850 44235144 37553378 32796212 35782161 46062431 66967353
6009F6967353K6871604J3076288j5684658l4882887l1393508j7097284o243110
$$ 66967353 93838957 106915245 91230587 56347700 24954192 7856908 1613798
6002A613798M779982K3950923M0153728L0865842l311934k7011027r054154L2093757
$$ 1613798 6393780 30344703 70498431 101364273 98052339 71041312 61987158 94080915
5994I4080915M4099903Q295100l2332567l0476876J567508J4497518n648804k5996215
$$ 94080915 138180818 146475918 114143351 83666475 85233983 99731501 94082697 68086482
5986F8086482k5576129k3394574l4878770l8230233j0160860L0468502M4408654
$$ 68086482 42510353 19115779 -15762991 -53993224 -64154084 -33685582 10723072
5979A0723072K3726278m206305j6332489j4161716p795891n45762P613918J4341333
$$ 10723072 34449350 30243045 13910556 -251160 -8047051 -8592813 -978895 13362438
5971A3362438J6637344J3146616N281228j718012l015345p55348l13616p87865
$$ 13362438 29999782 43146398 48427626 46709614 43694269 42938921 42625305 41837440
5963D1837440J573566L014171j192907l324205M762148R410977q402213l3227486
$$ 41837440 43411006 46425177 45232270 41908065 46670213 56081190 47678977 14451491
5955A4451491k5527213J7324739M6020942K5704190j5781975l3024923k5040563
$$ 14451491 -11075722 6249017 52269959 77974149 62192174 29167251 4126688
5948D126688j7234291r034602J5596294M1893988L7036941N263686j4120990o562284
$$ 4126688 -13107603 -22142205 -6545911 35348077 72385018 77648704 63527714 56965430
5940E6965430O86620j1353815k4596246j8570885j403287J0001461J3995689J2311044
$$ 56965430 57652050 46298235 21701989 3131104 1727817 11729278 25724967 38036011
5932C8036011k229738k8310431m4587881l2686789j11753L0258823M1747599K9770751
$$ 38036011 35806273 7495842 -37092039 -69778828 -69890581 -39631758 2115841 31886592
5924C1886592L306147j2776005L787187M1659888O0928585L9425590k618598l2997753
$$ 31886592 35192739 22416734 26203921 67863809 128792394 168217984 165599386 132601633
5916A32601633m2687233l8756925k3751920j117428J4051827R373489q319293
$$ 132601633 89914400 51157475 27405555 26288127 40339954 49713443 41394150
5909D1394150k4123608l2264527l1511222j8528708L39088O556680m457770r880616
$$ 41394150 17270542 -14993985 -46505207 -65033915 -64694827 -58138147 -62595917 -72476533
5901g2476533Q792240L5295295M1532978K6986510J0331411m833409k4594058
$$ -72476533 -63684293 -28388998 13143980 40130490 50461901 45628492 21034434
5894B1034434l3867903q947343L6424030N4685403K7005898r504309j5600756
$$ 21034434 -12833469 -21780812 14643218 69328621 96334519 86830210 71229454
5887G1229454k911745o841526k7021821k8993169j85188K7874873K1864065j0415069
$$ 71229454 68317709 61476183 34454362 5461193 5276005 33150878 55014943 44599874
5879D4599874l2768334k4147814L942633K7572901L4302223K6045230R266146
$$ 44599874 11831540 -12316274 -8373641 19199260 53501483 79546713 88812859
5872H8812859r911315k4409936k8094631k1576756j2732597r000086j0715076
$$ 88812859 78901544 54491608 26396977 4820221 -7912376 -16912462 -27627538
5865b7627538j3101923j2402457q281372k263511M144652J0580881J7111703K0809385
$$ -27627538 -40729461 -53131918 -61413290 -63676801 -59532149 -48951268 -31839565 -11030180
5857a1030180J5618744J367065r387973m310820P276099K78680l0133817n2173548
$$ -11030180 4588564 5955629 -3432344 -7743164 -467065 -188385 -30322202 -82495750
5849h2495750l3070351J7485187N8218297O5816049N2219165L3715241J0012883
$$ -82495750 -115566101 -98080914 -39862617 25953432 78172597 111887838 121900721
5842A21900721j6125650k4479853m070842K1891235K2040835o80721j6469231
$$ 121900721 105775071 81295218 77224376 99115611 121156446 120475725 104006494
5835A04006494j3693717r968308j6611585k0154934j0506875l118955j4124839
$$ 104006494 90312777 80344469 63732884 43577950 33071075 29952120 15827281
5828A5827281l0666353k8459629q500366P156677J0864944J5797864K6259455
$$ 15827281 -14839072 -43298701 -51799067 -44642390 -33777446 -17979582 8279873
5821H279873K7156381J2009308p86096M706197J4844485O512128j5471846k3824885
$$ 8279873 35436254 47445562 46659466 51365663 66210148 72722276 57250430 33425545
5813C3425545j0484880k09501j3678608l4109983k7828413P802622L5870697K5543191
$$ 33425545 22940665 22731164 9052556 -25057427 -52885840 -45083218 -9212521 16330670
5805A6330670p272520j9582458K866611K8299587K3954941L78905p056373R834820
$$ 16330670 9058150 -10524308 -7657697 20641890 44596831 44975736 37919363 47754183
5797D7754183K3008112J0874121j4414418k9793653k9687328j9944114l535625
$$ 47754183 70762295 81636416 67221998 37428345 7741017 -12203097 -15738722
5790a5738722J2015243J1410775m641578r273080J3107644L4751996K0861287
$$ -15738722 -3723479 7687296 3045718 -6227362 6880282 41632278 62493565
5783F2493565j2535425j5460705K0636865M5081282J9245921l0422520n4184550
$$ 62493565 49958140 34497435 55134300 100215582 119461503 89038983 34854433
5776C4854433m5247350l3301839l0159151j7513301J3939235M3159835M4445275
$$ 34854433 -10392917 -43694756 -73853907 -91367208 -77427973 -34268138 10177137
5769A0177137J7417725j5373016l0826876k2215993j506171J3407671J7549556
$$ 10177137 27594862 12221846 -18605030 -40821023 -42327194 -28919523 -11369967
5762a1369967K1647508L2314341L8400397K6690426L110542j4453797j8661481
$$ -11369967 10277541 42591882 80992279 107682705 110793247 96339450 77677969
5755G7677969j4832195o358742O269529J5540920J3220741N624028N574557R201657
$$ 77677969 62845774 56487032 62756561 78297481 91518222 97142250 102716807 111918464
5747A11918464l91082k3756646l9673838l5666628k4310547j9649373j7063428
$$ 111918464 111527382 87770736 48096898 12430270 -11880277 -31529650 -48593078
5740d8593078r547130l944849k961336R167356L7544953N0150393J5947447l7711522
$$ -48593078 -58140208 -62085057 -65046393 -55879037 -18334084 31816309 47763756 10052234
5732A0052234m7493322n82742M2830297L2908152l138161j0775146Q221035J0291069
$$ 10052234 -37441088 -38023830 4806467 37714619 34576458 23801312 32022347 42313416
5724D2313416r295638q767737K2970622L8947068Q482776k8883611k2609330J0712745
$$ 42313416 33017778 24250041 47220663 86167731 94650507 65766896 43157566 53870311
5716E3870311J6593431j0241763k1396376N445747L3525836K6524748r76522j4489474
$$ 53870311 70463742 60221979 38825603 44271350 77797186 104321934 103345412 88855938
5708H8855938r615715m804697n214100r56512Q723357J1633004J30678j9931508
$$ 88855938 79240223 74435526 69221426 68264914 76988271 88621275 88751953 68820445
5700F8820445l4012472k7627602m80909K4088202J9710470o260612j6159509P257575
$$ 68820445 34807973 7180371 6699462 30787664 50498134 44237522 28078013 35335588
5692C5335588L5622551L6482158J6923495K846271l847471j6465595k6936343
$$ 35335588 70958139 107440297 124363792 127210063 123362592 106896997 79960654
5685G9960654j4218540J5019832K8056186J1276836j4452074k7196062k6638749
$$ 79960654 65742114 80761946 108818132 120094968 105642894 78446832 51808083
5678E1808083j9206186o837602K218911m014876j8567912j7426506O421974L1615453
$$ 51808083 32601897 25764295 27983206 23968330 5400418 -12026088 -5604114 26011339
5670B6011339L9912858L6911119L0724781J3908134j7201615m5664321n4885875
$$ 26011339 65924197 102835316 133560097 147468231 130266616 84602295 29716420
5663B9716420m9609181l8929813j6909374J8366124M3423841L4811041O535866
$$ 29716420 -19892761 -58822574 -75731948 -57365824 -13941983 20869058 27404924
5656B7404924n738837N793515J4503922L446474j0877042q109160M113216L102807
$$ 27404924 21666087 27459602 41963524 45409998 34532956 26423796 30537012 33639819
5648C3639819j5858558l4129385l3629138j6088974J724249O407315m97966p886852
$$ 33639819 17781261 -16348124 -49977262 -66066236 -64341987 -57934672 -58432638 -66319490
5640f6319490r045012o536407m002405J35980Q041118J7759432K6377338L1297453
$$ -66319490 -75364502 -81900909 -85903314 -85767334 -77726216 -59966784 -33589446 -2291993
5632b291993K6496613Q504833r664527o191067J7145472K7013793J764690l1579687
$$ -2291993 24204620 32709453 23044926 16853859 33999331 61013124 62777814 31198127
5624C1198127l0167551K521938J9818360m79544k5983614k1628642p15299K019955
$$ 31198127 1030576 3552514 23370874 22891330 -3092284 -24720926 -25436225 -23416270
5616b3416270j2843593j2775349J3863324M0263140M0378969K0038749n28959
$$ -23416270 -36259863 -49035212 -35171888 5091252 45470221 65508970 64980011
5609F4980011j4776107k6695651l3823223k9410810j5123084J110467J5881161
$$ 64980011 50203904 23508253 -10314970 -39725780 -54848864 -53738397 -37857236
5602c7857236K8634013L3809638K6479940J3320969N640573K277475p003701j9481957
$$ -37857236 -9223223 24586415 51066355 64387324 70027897 72305372 65301671 45819714
5594D5819714j6790624P755729L2966228L4126321J4523780k602765q021116j4045024
$$ 45819714 29029090 36784819 69751047 103877368 118401148 115798383 107777267 93732243
5586I3732243k7653898l5726855k6392477j0095171m499347o707257J900410K3533258
$$ 93732243 66078345 30351490 3959013 -6136158 -10635505 -17342762 -15442352 8090906
5578H090906L3781467J2042954k8025603n0320621l5862422p53217K5330495K8644951
$$ 8090906 41872373 53915327 25889724 -24430897 -60293319 -61046536 -35716041 -7071090
5570g071090J6130847R05078p969742p008913l50320J485143n822661j1043644
$$ -7071090 9059757 9964835 1995093 -5013820 -5364140 -3878997 -9701658 -20745302
5562b0745302j312525J6851901K4955272K0666963J9345762K2857637J0641317
$$ -20745302 -22057827 -5205926 19749346 40416309 59762071 82619708 93261025
5555I3261025k3634543m9370314l7807560p555731m99332j9921847k7140100k242430
$$ 93261025 69626482 20256168 -17551392 -25107123 -25606455 -45528302 -72668402 -74910832
5547g4910832K6121088K4974273L089783p520620K147865J1931659L440004j9979979
$$ -74910832 -48789744 -23815471 -20725688 -28246308 -26098443 -14166784 -10726780 -30706759
5539c0706759l9580918l6463764o420363L1129568M5633267K6021647o317479
$$ -30706759 -70287677 -106751441 -113171804 -82042236 -36408969 -10387322 -16704801
5532a6704801k1724288j3082247L124270Q904401J381633p089970j702331J6903860
$$ -16704801 -38429089 -51511336 -48387066 -39482665 -38101032 -45191002 -46893333 -29989473
5524b9989473K9462383K2300007Q791019Q832892J2882789n003852l7170144m1651885
$$ -29989473 -527090 21772917 30563936 39396828 52279617 47275765 10105621 -31546264
5516c1546264n065418K9962863K4769544K79106J29326K3804016L5414786K2536108
$$ -31546264 -36611682 -6648819 18120725 18399831 18529157 42333173 77747959 100284067
5508A00284067N525495l698604j3219524k3709237k5059940k1399865k7065796
$$ 100284067 105809562 102110958 88891434 65182197 40122257 18722392 -8343404
5501h343404l5826643k5800496J369860J7316451R058807m479621n158342K409108
$$ -8343404 -44170047 -69970543 -68600683 -51284232 -42225425 -46705046 -51863388 -49454280
5493d9454280R255096J6178589K0616098J3640757r26991o190810K159333J0918561
$$ -49454280 -40199184 -24020595 -3404497 10236260 9309269 3118459 5277792 16196353
5485A6196353J3849338J7854236K2343257J8414481J0529719J0446596R145411
$$ 16196353 30045691 47899927 70243184 88657665 99187384 109633980 118779391
5478A18779391j0898044l4226230k5318729R868434K2584020l433278k5239885
$$ 118779391 107881347 73655117 48336388 58204822 80788842 77355564 52115679
5471E2115679j2559726N148388l080170j4798327k000226J1216751p112751l1816831
$$ 52115679 39555953 44704341 41624171 26825844 24825618 36042369 28929618 -2887213
5463b887213k0414430R944814J0500797j2820618j0113726K2696578L4529254
$$ -2887213 -23301643 -13356829 -2856032 -15676650 -25790376 -3093798 31435456
5456C1435456N243744k4092477k2184093j0356053j3203658j8267868j0857473
$$ 31435456 36679200 12586723 -9597370 -19953423 -33157081 -51424949 -62282422
5449f2282422m792812j0963059j2847448O83919J2665110J2596518J9048178M1150925
$$ -62282422 -67075234 -78038293 -90885741 -90201822 -77536712 -64940194 -45892016 -4741091
5441d741091N1409009K7948634n619866j5463141p176499o202463j0904804k200403
$$ -4741091 46667918 74616552 68996686 53533545 46357046 40154583 29249779 27049376
5433B7049376J5261878J8065869K358339j3692676k0364608k3089313k4098368
$$ 27049376 42311254 60377123 62735462 49042786 28678178 5588865 -18509503
5426a8509503k0573535j5498276j0732740J615873K1643993K8835703R983060
$$ -18509503 -39083038 -54581314 -65314054 -63698181 -42054188 -13218485 -3235425
5419c235425j4174064j7319161q802768j4393753k7185403j6336565J8456306
$$ -3235425 -17409489 -34728650 -43531418 -57925171 -85110574 -101447139 -82990833
5412h2990833M1362388L4352881J9146208J4820950R676980o803502j5885029
$$ -82990833 -41628445 -7275564 11870644 26691594 36368574 29565072 13680043
5405A3680043O26852K4130475K0883434j0406830l6862850l4650088j5529420
$$ 13680043 14306895 38437370 59320804 48913974 12051124 -22598964 -38128384
5398c8128384p536203j9874048l2770353k2340698O582708K1820653O231268j3021918
$$ -38128384 -45664587 -65538635 -98308988 -120649686 -114066978 -92246325 -86015057 -99036975
5390i9036975K147034M4074654O4095097L7984863k663836j7408016p647747P85327
$$ -99036975 -96889941 -52815287 11279810 49264673 46600837 29192821 21545074 22330401
5382B2330401K384556R752613J9672718J3442618r836983k6427332j9228300K511959
$$ 22330401 24714957 34467570 54140288 67582906 57745923 31318591 12090291 14602250
5374A4602250J8648223J8114321J391962k1235040l0756036j4576811J3995986
$$ 14602250 33250473 51364794 52756756 31521716 765680 -13811131 184855
5367A84855K5581911J0355521r428385r881514M509704J1112960j273549k3652873
$$ 184855 25766766 36122287 26693902 16812388 21322092 32435052 31161503 7508630
5359G508630l8997224l3415363m747624K8368146L6144249J1847230j2273535
$$ 7508630 -31488594 -64903957 -69651581 -41283435 -5139186 6708044 -5565491
5352e565491k694527K8097603L7034638J2413793j0137968l676462R444572l838649
$$ -5565491 -8260018 19837585 56872223 69286016 59148048 55471586 64916158 61077509
5344F1077509l2859548m0049170j7976947O525814J9444392L1958041M2801122
$$ 61077509 28217961 -11831209 -29808156 -23282342 -3837950 28120091 70921213
5337G0921213K9427417q104251l2094161k0504243l174373j3996188l5086670
$$ 70921213 100348630 92244379 60150218 39645975 36471602 22475414 -12611256
5330a2611256k8118146p89014N217875j5632547k4148621k006836K1256110K0671649
$$ -12611256 -40729402 -41518416 -36300541 -51933088 -76081709 -78088545 -56832435 -36160786
5322c6160786J2049797J4006966J2493130p190341k4689905j6062040K548018
$$ -36160786 -24110989 -10104023 2389107 -4801234 -29491139 -45553179 -43005161
5315d3005161M12204j4802204r368608J9196638L7432921K9841723K0179382K8954365
$$ -43005161 -42592957 -57395161 -66763769 -47567131 -10134210 19707513 39886895 68841260
5307F8841260M0428224K8162118o939180l9666301m9632837l7081038j7701466
$$ 68841260 109269484 137431602 130492422 90826121 41193284 4112246 -13589220
5300a3589220o498725j152352J4301159L9341763M3319005N355499m2399424m6672359
$$ -13589220 -20087945 -21240297 -6939138 32402625 75721630 81077129 38677705 -7994654
5292g994654p879067J7522978m51867k4176366j3075953J2951763J3418845k519666
$$ -7994654 -15873721 1649257 1197390 -22978976 -36054929 -23103166 -9684321 -12203987
5284a2203987L867872K8579134K8178643n278693k5421148k080596L3073143L5174673
$$ -12203987 -8336115 20243019 48421662 43142969 17721821 15641225 48714368 83889041
5276H3889041P631691j3211103j2504450o226515p323026r309326k504290J1144908
$$ 83889041 91520732 78309629 65805179 59578664 52255638 42946312 40442022 51586930
5268E1586930K1410419J9467089N733791p756690q503790J5300K166902p079039
$$ 51586930 72997349 92464438 98198229 90441539 81937749 81953049 84119951 77040912
5260G7040912j6608119k0573500k7450100l8365238l6352614j3947584N946046
$$ 77040912 60432793 39859293 12409193 -25956045 -62308659 -76256243 -70310197
5253g0310197n48468j9743169j6565820J5892334M7480566N1398821L1671572
$$ -70310197 -70858665 -90601834 -107167654 -91275320 -43794754 7604067 39275639
5246C9275639Q070889o271765p421822J697613R610906N484717n219825n987731
$$ 39275639 47346528 41074763 33652941 35350554 44961460 50446177 45226352 39238621
5238C9238621P185126J9663129J7494804L91987k4763733m8041033n3328716l0002576
$$ 39238621 46423747 66086876 83581680 83973667 59209934 11168901 -42159815 -72162391
5230g2162391O849565K5608722J5313264j955200l294331O574270Q087505o997867
$$ -72162391 -65312826 -39704104 -24390840 -26346040 -29640371 -23066101 -14978596 -21976463
5222b1976463l1310483m9450164m3113096o899815L2719042L6845607N926754
$$ -21976463 -53286946 -102737110 -145850206 -152750021 -120030979 -83185372 -77258618
5215g7258618j2752067J0669283M2542409L3711505p344874k8102143q213853
$$ -77258618 -90010685 -79341402 -36798993 -3087488 -10432362 -38534505 -46748358
5208d6748358J9672913K5635823J8177070J3821027P414399p938619j8547562
$$ -46748358 -27075445 -1439622 16737448 30558475 37972874 30034255 11486693
5201A1486693j0226896P176055J5222393J3359159J2492698J3914488J1972575
$$ 11486693 1259797 8435852 23658245 37017404 49510102 63424590 75397165
5194G5397165Q690090R132102Q666209j42618j2916693j9478170k0331151k3797056
$$ 75397165 84087255 93219357 101885566 101742948 88826255 69348085 49016934 25219878
5186B5219878k9392205k7269498j4564396j610719L66661q661892j8515379j8043358
$$ 25219878 -4172327 -31441825 -46006221 -47616940 -47250279 -55912171 -74427550 -92470908
5178i2470908n515280O518376J480481k0097622l4535660j8796420K1294166N4346627
$$ -92470908 -97986188 -91467812 -89987331 -110084953 -144620613 -163417033 -142122867 -87776240
5170h7776240N5297560K8660534j43656j1702222q739967o892032j2080750j2359647
$$ -87776240 -32478680 -3818146 -3961802 -15664024 -24403991 -31296023 -43376773 -55736420
5162e5736420L464337K4953173K9157175J0007164j3928312k3490620j7891531
$$ -55736420 -52272083 -27318910 1838265 11845429 -2082883 -25573503 -43465034
5155d3465034n719162Q157808J8888252J9278364J1902263J0504695J7596548
$$ -43465034 -49184196 -41026388 -22138136 -2859772 9042491 19547186 37143734
5148C7143734J4973969p926419l0307387k5234169J884858K3025864K7931030
$$ 37143734 52117703 44191284 13883897 -11350272 -9465414 13560450 41491480
5141D1491480K8661877K8042418J3909866j1138291k3650025j3874909j254022
$$ 41491480 70153357 98195775 112105641 100967350 77317325 63442416 62188394
5134F2188394j773911l470683P539892J7849362P465200j4664133k1722589q357620
$$ 62188394 60414483 56943800 64483692 82333054 89798254 75134121 53411532 45053912
5126D5053912N432817O850184L676496M091374M260180M14532m713435j2203488
$$ 45053912 50486729 57336913 61013409 65104783 69364963 69779495 65066060 52862572
5118E2862572k5867157l5092291j8913190K0892504M9063328L7191206K213173
$$ 52862572 26995415 -8096876 -27010066 -6117562 42945766 80136972 82350145
5111H2350145j5601610m716892J0401860J0482887L752052J856594j390270j3367022
$$ 82350145 66748535 62031643 72433503 82916390 86668442 88525036 87134766 73767744
5103G3767744k4512425k5223719k5777204l7297600m3604053j9002531K8504825
$$ 73767744 49255319 24031600 -1745604 -39043204 -82647257 -101649788 -73144963
5096g3144963N9601788N4116682L3353576K2660998J7703379M775156q891247
$$ -73144963 -13543175 40573507 73927083 96588081 114291460 119066616 110175369
5089A10175369j0068630q201829j9807460l3243286k0894680J3861611L3340227
$$ 110175369 100106739 91904910 72097450 38854164 17959484 31821095 65161322
5082F5161322J7459859q369231j1591443L275133P352452j0728921l5017093m5505199
$$ 65161322 82621181 74251950 62660507 65935640 73288092 62559171 27542078 -17963121
5074a7963121l4473699o092848K4468305L5896902K0088689m575047j1889792
$$ -17963121 -52436820 -58529668 -34061363 1835539 21924228 17349181 5459389
5067E459389J213791J3662686Q623504r394986k5763856l1365440k4384211p901514
$$ 5459389 6673180 20335866 28959370 19564384 -6199472 -37564912 -61949123 -69850637
5059f9850637R054697J5779550J0044587l43950o995761o390434K417391J5770550
$$ -69850637 -60795940 -45016390 -34971803 -35315753 -42311514 -48701948 -46284557 -30514007
5051c0514007K1276449Q743051j1063233j3001827Q371863K5115379J1130210
$$ -30514007 -9237558 -494507 -11557740 -24559567 -16187704 8927675 20057885
5044B0057885j8450881k2832263J0854328M8772026N0948682J5716967k5124087
$$ 20057885 1607004 -21225259 -10370931 38401095 89349777 105066744 79942657
5037G9942657m3683938l6689910j6477497M217443J7932727K2836026K1625287
$$ 79942657 36258719 -431191 -16908688 -12691245 5241482 28077508 49702795
5030D9702795J7855207J3561736J1087026J2275296J2779711M278866j1332667
$$ 49702795 67558002 81119738 92206764 104482060 117261771 121540637 110207970
5023A10207970j7870968n303424J2455984J4180206J638164l764605N382926J0934277
$$ 110207970 92337002 87033578 99489562 113669768 115307932 111543327 116926253 127860530
5015A27860530l177177k8208764m3775578m0186967k0509252M702022J6828710
$$ 127860530 124683353 96474589 52699011 12512044 -7997208 -3295186 13533524
5008A3533524J497498k6240768k8321389P117590M2024120L7715414R953701K304453
$$ 13533524 15031022 -11209746 -39531135 -32413545 9610575 47325989 57279690 59584143
5000E9584143J6922061J3835177j9926220m4989996k9776161J883484R846962
$$ 59584143 76506204 90341381 70415161 25425165 -4350996 -2467512 7379450
4993G379450m298586j1055948n651217r071400k2675408j9619133R548677L2087178
$$ 7379450 3080864 -7975084 -13626301 -22697701 -45373109 -64992242 -55443565 -23356387
4985b3356387J3093936l4508996o0142853l3717728K0297477N1091326L6039299
$$ -23356387 -10262451 -44771447 -104914300 -138632028 -118334551 -67243225 -31203926
4978c1203926l836j7148580k753968K2432589L1846027J7870304n793766j6187675
$$ -31203926 -31207762 -48356342 -51110310 -28677721 3168306 21038610 15244844 -942831
4970i42831M45463L0620244L9082381Q744560k8611934k4578670K0425332N0747570
$$ -942831 -497368 30122876 69205257 77949817 49337883 24759213 45184545 95932115
4962I5932115K6092665k7408555n6468596m8436695l1711070k3047115q878678
$$ 95932115 122024780 94616225 38147629 -10289066 -42000136 -65047251 -73925929
4955g3925929K0920905N0268387N7313677L9127086Q119392k1482058l6557775
$$ -73925929 -53005024 -2736637 54577040 93704126 101823518 80341460 43783685
4948D3783685k8245373k547677J9593101K1486114P336869m301853j301788R993105
$$ 43783685 15538312 12990635 32583736 54069850 61406719 57104866 55803078 65796183
4940F5796183J1924995n624570l2851046m8372393m0485002j6615085P811536
$$ 65796183 77721178 72096608 39245562 -9126831 -49611833 -66226918 -58415382
4933e8415382K2739169K4936241J5814234J693513j1476743k4725728l7333311
$$ -58415382 -35676213 -10739972 5074262 6767775 -4708968 -29434696 -66768007
4926f6768007l4264558j862091M1814132N7641850L6151322J1271912Q841220
$$ -66768007 -101032565 -102894656 -61080524 -3438674 32712648 43984560 52825780
4919E2825780J0805886o337566k7689078k8425592k0747099k9708933l9628081
$$ 52825780 63631666 57294100 29605022 1179430 -19567669 -49276602 -88904683
4912h8904683j3959493L7153876N9470515L0350122j2929333l0857142k6020325
$$ -88904683 -102864176 -65710300 -6239785 24110337 11181004 -19676138 -45696463
4905d5696463j5488163Q77064K2499337L0784586J4650194q369758j5500790n162318
$$ -45696463 -61184626 -60307562 -37808225 -7023639 7626555 -743203 -16243993 -21406311
4897b1406311J1828482K6624514K8301945Q803923j8820707l0952513k8066272
$$ -21406311 -9577829 17046685 45348630 54152553 35331846 4379333 -23686939
4890b3686939l0816250l7986887k4962431Q203538K9099787K6025002K3757385
$$ -23686939 -54503189 -92490076 -117452507 -109248969 -80149182 -54124180 -30366795
4883c0366795L0359643J9234210j3130803k7897973j3531973j3455959m3029977
$$ -30366795 -7152 19227058 6096255 -21801718 -35333691 -48789650 -91819627
4876i1819627m8226861p058475K250127p4256767j36181201m7148659J44224994
$$ -91819627 -140046488 -147104963 -144854836 -219111603 -355292804 -402441463 -258216469
4869b58216469K38065242J49303307J0427492l1221746K445489Q511529k6774554
$$ -258216469 -20151227 129152080 139579572 108357826 110803315 119314844 92540290
4862I2540290m3451938k8397949j8156247j3314763J7407799N8796428N6027287
$$ 92540290 49088352 20690403 2534156 -10780607 6627192 65423620 121450907
4855A21450907M125839l6132089k4194745J1524813K5917795J4286401j037148
$$ 121450907 125576746 89444657 65249912 76774725 102692520 116978921 115941773
4848A15941773p447039n989813m47359K712727k834144j3552856k0235356k1907396
$$ 115941773 108494734 102504921 102057562 104770289 101936145 88383289 68147933 46240537
4840D6240537k3118361k1103839j0586510K644146P794802M042158l279489j2487585
$$ 46240537 23122176 2018337 -8568173 -5924027 1870775 5912933 2633444 -9854141
4832i854141j8162588q151216J4496384K4405671J2032939P951330L5772476O0997668
$$ -9854141 -28016729 -36167945 -21671561 2734110 14767049 22718379 58490855 119488523
4824A19488523L3389462k9869396n8304835k9410472J249228j0054950l0221841
$$ 119488523 152877985 123008589 64703754 35293282 36542510 26487560 -3734281
4817c734281r933951L4610965M8346612J9659321j2636978k2474050k1206609
$$ -3734281 -13668232 20942733 69289345 88948666 76311688 53837638 32631029
4810C2631029k1250467j6652007p325328q259629k1539792k5952501r399282R837059
$$ 32631029 11380562 -5271445 -12596773 -20856402 -42396194 -68348695 -77747977 -67910918
4802f7910918J0526901k60630j636462Q480626J5632913J5970025J9255085K5917417
$$ -67910918 -57384017 -57644647 -59281109 -50800483 -35167570 -19197545 57540 25974957
4794B5974957K2481910N536001p938648m359458P060307J1481824J1323845J3817830
$$ 25974957 48456867 53992868 46054220 41694762 48755069 60236893 71560738 85378568
4786H5378568O909922k5481721o5022270o5915707j3170635M9291892O7717219
$$ 85378568 92288490 66806769 1784499 -64131208 -77301843 -28009951 39707268
4779C9707268L9627003N837303n335337j747350k014456j1099762k1947575k2994717
$$ 39707268 79334271 85171574 79836237 78088887 76074431 64974669 43027094 20032377
4771B0032377m718415K4547921L4130237M582656l7669245m7023804k1182525
$$ 20032377 15313962 39861883 73992120 78574776 40905531 -6118273 -27300798
4764b7300798m083128j7184444k4552615R586547N9224243O8656160L0086149
$$ -27300798 -31383926 -48568370 -73120985 -63534438 -4310195 64345965 94432114
4757I4432114q747036j1140884Q352474J5643347J024498k0283003l2459131l1741336
$$ 94432114 85685078 74544194 82896668 98540015 99564513 79281510 46822379 15081043
4749A5081043k5721126k6798947l6860419l6988789p236064L9661000O2337858
$$ 15081043 -10640083 -37439030 -74299449 -111288238 -118524302 -78863302 -16525444
4742a6525444L8723095m863824k5052058r712270J8552801L5107828L1182297
$$ -16525444 22197651 17333827 -7718231 -17430501 1122300 36230128 67412425
4735F7412425P440434k7258072n0455264m1430615q972258J3814074J1388140
$$ 67412425 74852859 47594787 -2860477 -44291092 -53263350 -39449276 -28061136
4728b8061136N247030J8278012L6776636L0707430K766086j0745185Q981391L6369335
$$ -28061136 -22814106 -4536094 32240542 62947972 65714058 54968873 63950264 100319599
4720A00319599L6546868P525771k6923254m9289665n4304055l6862687M57389
$$ 100319599 136866467 144392238 117468984 68179319 13875264 -22987423 -22530034
4713b2530034L2379893K9519858l490262k9075954k2653810N86485J2652803P737936
$$ -22530034 9849859 39369717 35879455 6803501 -15850309 -15263824 -2611021 5126915
4705E126915k752029j3962510k7700463l7241551l0798905r102044J3807328K7431781
$$ 5126915 2374886 -11587624 -39288087 -76529638 -107328543 -116430587 -102623259 -75191478
4697g5191478L2668628L3628026L0514233K0793642K135907k2617551l8862843
$$ -75191478 -42522850 -8894824 21619409 42413051 44548958 21931407 -16931436
4690a6931436k7604780R510740M0727962L6385553P071337q956961L262623J8008431
$$ -16931436 -44536216 -35025476 5702486 42088039 49159376 40202415 43465038 61473469
4682F1473469R066710j3921322k4489767j8585231j3392404j4846221j0200378
$$ 61473469 70540179 56618857 32129090 13543859 151455 -14694766 -24895144
4675b4895144N386996J6817857J3166932O832820J3991496K7587047K7981214
$$ -24895144 -19508148 -2690291 10476641 17309461 31300957 58888004 86869218
4668H6869218J4371330M680849M577078N20861r092285k731281K4417075L3600504
$$ 86869218 101240548 105921397 110498475 111019336 101927051 99195770 123612845 157213349
4660A57213349r169283o9008333p0721360L42557O7596553N6637742j3769763
$$ 157213349 148044066 79035733 8314373 8656930 76253483 132891225 119121462
4653A19121462o6097717o3650621l4785655j2267661L563179J7963067K1643443
$$ 119121462 53023745 -10626876 -45412531 -57680192 -54117013 -36153946 -14510503
4646a4510503J3282956R747167J6124937J2749910r609556k7921145k2382402
$$ -14510503 -1227547 8519620 24644557 37394467 27784911 -136234 -22518636
4639b2518636r114735r965487j1582959J0153583L9299927L5199074k770495k7084131
$$ -22518636 -31633371 -41598858 -53181817 -43028234 -3728307 31470767 28700272 1616141
4631A616141r646567J8119810J2966076j9351780l6923226j9420965J2969083
$$ 1616141 -8030426 10089384 23055460 3703680 -33219546 -52640511 -39671428
4624c9671428L1519448K7763126J1963315M16927M900686K1219221K8374194J1446981
$$ -39671428 -8151980 19611146 31574461 31991388 36892074 58111295 86485489 97932470
4616I7932470j6013083k6375204j3864402J063618N777108J2669693L0792117
$$ 97932470 81919387 55544183 41679781 42743399 48520507 61190200 91982317
4609I1982317M0522210J9634203j5708626k4788288k1282J6392197j1678865o1940351
$$ 91982317 132504527 152138730 136430104 111641816 111620534 128012731 116333866 54393515
4601E4393515q0318915n0527044j0960961m97151j2049156j2550064Q721148L1584317
$$ 54393515 -25925400 -76452444 -87413405 -87910556 -99959712 -112509776 -103788628 -72204311
4593g2204311L7564843L0597371K2390093J3455218j106035j5080385j2834296
$$ -72204311 -34639468 -4042097 18347996 31803214 30697179 15616794 2782498
4586B782498J0865948L9230154M6145360K0498058k2687310n4247494n3569673
$$ 2782498 13648446 52878600 99023960 119522018 96834708 42587214 -10982459
4579a0982459k2849200J5298630L3338061J9490345r601487k0746559J492360
$$ -10982459 -33831659 -18533029 14805032 34295377 24693890 3947331 5439691
4572E439691L3236870L5303222P08333l4976521l7189891j2715211N470906J805858
$$ 5439691 38676561 73979783 74688116 39711595 2521704 -10193507 -4722601 -2916743
4564b916743j1301942j9657975k1751947j5837991M872495L4153406M7676397
$$ -2916743 -14218685 -33876660 -55628607 -71466598 -66594103 -32440697 15235700
4557A5235700L1292638L650901n344730P570253J8887518J3611049K989351K487572
$$ 15235700 46528338 50179239 44834509 52404762 71292280 84903329 87892680 90380252
4549I0380252P594002L519365r245928j4164083m015305O438366J134724j2768806
$$ 90380252 97974254 101493619 92247691 78083608 74068303 80506669 81641393 68872587
4541F8872587j4056337J468543J4626686J1668602L023318J745334j285298j9718749
$$ 68872587 54816250 56284793 70911479 82580081 85603399 87348733 86063435 66344686
4533F6344686l8551204k7089363J2199212L6206725J5790825k5073927m3065260
$$ 66344686 27793482 704119 12903331 49110056 64900881 39826954 -3238306
4526c238306k9810986j0043911j79469L748780M051434l451907j1371335m314021
$$ -3238306 -33049292 -43093203 -43272672 -39523892 -35472458 -38924365 -50295700 -54609721
4518e4609721J4173098K1638851J0425302j848820m064128q290784k0181789j9106413
$$ -54609721 -40436623 -18797772 -8372470 -10221290 -14285418 -22576202 -42757991 -61864404
4510f1864404P699264L2153752J9113937j7720311k9406377j119587K7288634
$$ -61864404 -54165140 -22011388 -2897451 -20617762 -50024139 -51143726 -23855092
4503b3855092K0481855m013830p436983J2538694K3153059O694436j6370027j6847653
$$ -23855092 -3373237 -7387067 -14824050 -2285356 20867703 27562139 11192112 -5655541
4495e655541P394910L0862576K7742990k255519l0971057k7882926M980906L0826917
$$ -5655541 1739369 32601945 60344935 58089416 27118359 -764567 4216339 35043256
4487C5043256K0849321q391430j6686168M943644K3083680R823321k0346273l4159932
$$ 35043256 55892577 47501147 30814979 35758623 58842303 68665624 48319351 14159419
4479A4159419k2823449m499329M926042M932384M68279l494591n64209Q643620
$$ 14159419 -8664030 -13163359 -8237317 -3304933 -2836654 -6331245 -6895454 1748166
4471A748166J0050730o223200k5702931k5710085r187627l26902n704968n440770
$$ 1748166 11798896 5575696 -20127235 -45837320 -55024947 -55351849 -61056817 -66497587
4463f6497587J0222471K2667012J7069670P223741Q330671Q208373q412321k6283081
$$ -66497587 -56275116 -33608104 -16538434 -9314693 -984022 7224351 -1187970 -27471051
4455b7471051k1857120m789407q87490k550734K0451601N9044815O1687536J1465896
$$ -27471051 -49328171 -54117578 -55005068 -57555802 -37104201 21940614 83628150 95094046
4447I5094046l6625887k7569733J6718224L2435445M976030k1325145j7967236
$$ 95094046 58468159 30898426 47616650 80052095 85028125 63702980 45735744
4440D5735744q463481j8678747l2211912k0342549J0538904L0431772K9230146
$$ 45735744 37272263 18593516 -13618396 -33960945 -23422041 7009731 36239877
4433C6239877K0438372J0021295q573189k8003205k5197681L081255K5925104
$$ 36239877 56678249 66699544 58126355 30123150 4925469 8006724 33931828
4426C3931828J6047898j4629689l5039223l6181674l0001842j8648587N403218
$$ 33931828 49979726 35350037 310814 -35870860 -65872702 -84521289 -79118071
4419g9118071L1053599L2694671R448778j0185344j4211847k4398232m7759260
$$ -79118071 -48064472 -15369801 -5921023 -16106367 -30318214 -54716446 -102475706
4412a02475706m7025360L656801O1254929O1621266J2277709j6235234P001733
$$ -102475706 -149501066 -145844265 -84589336 -22968070 -10690361 -26925595 -19923862
4405a9923862L4662703K1704785p948973q791747J2054579J2057717j6577440
$$ -19923862 14738841 36443626 28494653 19702906 31757485 43815202 27237762
4398B7237762l6705410k0379960J8862112M7141785M2104553P302516k8330352
$$ 27237762 -9467648 -29847608 -10985496 36156289 78260842 85563358 57233006
4391E7233006l2839715q016831Q769090m518486k1050735o611320K5499582L5339557
$$ 57233006 24393291 16376460 25145550 20627064 -423671 -7034991 18464591 53804148
4383E3804148J8747730R066953K0211243K7689450J1522844j6113839l4476923
$$ 53804148 72551878 81618831 101830074 129519524 141042368 124928529 90451606
4376I0451606l6907144k3377808J998220K0301233J2482475j0177056j8871602
$$ 90451606 53544462 30166654 32164874 52466107 64948582 54771526 35899924
4369C5899924j2810209j6447767k6752318q658150L9806066O4879559L0929364
$$ 35899924 23089715 6641948 -20110370 -28768520 11037546 75917105 106846469
4362A06846469k2365472l5448600r884967R191245N961808Q5503l945017k0701704
$$ 106846469 84480997 49032397 39147430 48338675 54300483 54385986 50440969 29739265
4354B9739265m0368946l1815252L532594K4833998J2051845n287424L086645K4217045
$$ 29739265 -10629681 -42444933 -38912339 -14078341 -2026496 -7313920 -4227275 19989770
4346A9989770K8900825J5917823M598290K005203J080828j407415n456896j5509231
$$ 19989770 48890595 64808418 69406708 71411911 72492739 71085324 65628428 50119197
4338E0119197k8747815k6188864L630919L8708506M3147711J1926796k2559874
$$ 50119197 21371382 -4817482 -1186563 37521943 80669654 92596450 70036576
4331G0036576l0378578j3732797O589443J7363513J6665325N081293j2856711
$$ 70036576 39657998 25925201 32514644 49878157 66543482 71624775 58768064
4324E8768064k4256162j8462024k622020L242380j0138753k9361324l3810917
$$ 58768064 34511902 16049878 13427858 16670238 6531485 -22829839 -56640756
4317e6640756j7885369O419967K4327538K9421693K2730975Q511248p259592j8468911
$$ -56640756 -74526125 -68106158 -43778620 -14356927 8374048 16885296 9625704 -8843207
4309h843207k0929118j2484118N361098K2378044K2338631O76127k3377151k5117583
$$ -8843207 -29772325 -42256443 -36895345 -14517301 7821330 8497457 -14879694 -39997277
4301c9997277o175180N904596m432717j7412094m760898K9333936M9910706L2667844
$$ -39997277 -46172457 -40267861 -44700578 -62112672 -66873570 -37539634 12371072 45038916
4293D5038916q995024m0959758m3301687k3944062l743231N167022O089093P632142
$$ 45038916 36043892 -4915866 -48217553 -72161615 -75904846 -70737824 -64648731 -57016589
4285e7016589J1965223J4448757J0753085M66422j3086060k1935749j6817465
$$ -57016589 -45051366 -30602609 -19849524 -19383102 -32469162 -54404911 -71222376
4278g1222376J132371J6140634J5099213N589552M397770J1120522R676881l302536
$$ -71222376 -70090005 -53949371 -38850158 -33260606 -28862836 -17742314 -8065433 -11367969
4270a1367969j0487407j50746J7082405K6764634K9944819L2779086L1236102
$$ -11367969 -21855376 -22006122 -4923717 21840917 51785736 84564822 115800924
4263A15800924K0042067O470467J459884L346739R27659j1838704k9766101l9417011
$$ 115800924 135842991 142313458 143773342 147120081 148047740 136209036 106442935 67025924
4255F7025924k8460419l415962O082030j7944346m5258026k7757063K8051909
$$ 67025924 38565505 35149543 41231573 23287227 -21970799 -49727862 -21675953
4248b1675953N8720997L1593743q015607q746399R583705j706714l3289566l4289309
$$ -21675953 37045044 68638787 60623180 51876781 61460486 59753772 26464206 -7825103
4240g825103k98877J9140291K087612j6323276p562176J0742712J7155181J9722095
$$ -7825103 -8123980 11016311 13103923 -3219353 -10781529 -38817 17116364 36838459
4232C6838459K3318782Q002093l0307656n5077354l8501480n438024N757493K95021
$$ 36838459 60157241 68159334 37851678 -17225676 -55727156 -61165180 -55407687 -55112666
4224e5112666Q474589L0403038L8358499K3861722O177087k460550q510208j3840254
$$ -55112666 -46638077 -16235039 22123460 45985182 52162269 49701719 41191511 27351257
4216B7351257q785113O684250J6410746Q883262r958265k7230881l3473947k2788436
$$ 27351257 18566144 25250394 41661140 50544402 40586137 13355256 -20118691 -42907127
4208d2907127K268739K3906401K1965324r63072j8608496j1700219R438529K1146036
$$ -42907127 -40638388 -16731987 5233337 4270265 -14338231 -26038450 -16599921 4546115
4200D546115J8431745J7836140K7325353K7995210o58060m4061814o1720754l7480621
$$ 4546115 22977860 40814000 68139353 96134563 95476503 51414689 -10306065 -47786686
4192d7786686p22817J3929815Q607218O098703J0369717R316822M179165N688886
$$ -47786686 -48509503 -34579688 -25972470 -19873767 -9504050 -187228 3991937 9680823
4184I680823P385702n597186k3341007j9231345O879793K5655991K2794231J4277176
$$ 9680823 17066525 11469339 -11871668 -31103013 -24223220 1432771 24227002 38504178
4176C8504178J0805568J330400j6609447k3867063j3193795n271004j2771979
$$ 38504178 49309746 50640146 34030699 10163636 -3030159 -8301163 -21073142
4169b1073142j6265503L104827L0536713L8721495K3914075K502121j3331169
$$ -21073142 -37338645 -34233818 -3697105 35024390 58938465 61440586 48109417
4162D8109417k1711406k4770332k4813487j7663538N947817L7124019M2707779
$$ 48109417 26398011 1627679 -23185808 -40849346 -34901529 2222490 44930269
4155D4930269J1265830j5787898k414217J7245379n440216l7438573j0987702
$$ 44930269 56196099 40408201 37993984 55239363 49799147 12360574 1372872
4148A372872M7485829M8445282L583173J7894888P9466891K4977724j84608289
$$ 1372872 48858701 97303983 100887156 118782044 198248935 223226659 38618370
4141C8618370l16847932j64921874J24431991K26464951Q0221775o6543590m3084152
$$ 38618370 -278229562 -443151436 -318719445 -92254494 -12032719 -78576309 -121660461
4134a21660461M3440373M4257534n023338m518477K4497768R294412k6144194
$$ -121660461 -78220088 -33962554 -38985892 -43504369 -19006601 -9712189 -35856383
4127c5856383j3341105L0073421L6917817P763236q278867r189690k5148715m1873899
$$ -35856383 -49197488 -19124067 17793750 25556986 17278119 8088429 -17060286 -58934185
4119e8934185k4173482J0207369J7234622L323193M821002J5739724O164958j0467149
$$ -58934185 -83107667 -72900298 -55665676 -52342483 -47521481 -31781757 -25616799 -36083948
4111c6083948P90323K6641727K6386292N080558j259929M726949l210730q305863
$$ -36083948 -35293625 -8651898 17734394 22814952 21555023 26281972 23071242 14765379
4103A4765379K3941139O5480726N3288667l554595k8249354J621798J9272628
$$ 14765379 38706518 104187244 157475911 153921316 125671962 127293760 146566388
4096A46566388k0081335p0254101p3135599m1629109j9245677q449603J2560251
$$ 146566388 126485053 56230952 -16904647 -58533756 -77779433 -86229036 -73668785
4089g3668785L7866208M4393221L2460243K0066168J2591696M675930k467825
$$ -73668785 -35802577 8590644 41050887 61117055 73708751 78384681 75916856
4082G5916856o082666j0005581j3376968p776393L217765J378351j7797629l3993963
$$ 75916856 69834190 59828609 46451641 38675248 41893013 43271364 25473735 -8520228
4074h520228l0210912j2779710M785275J6579336J6115982j933745k2875540k0131731
$$ -8520228 -38731140 -51510850 -46725575 -30146239 -14030257 -15964002 -38839542 -58971273
4066e8971273P234126K9204458K6216641J0514276j911675j1046231j3801203
$$ -58971273 -51737147 -22532689 3683952 14198228 12286553 1240322 -12560881
4059a2560881J770743K6960478K9985006M153674j3194232M464395K9129390K1390248
$$ -12560881 -10790138 16170340 46155346 50309020 37114788 41579183 70708573 92098821
4051I2098821p661275j5221996P675735K7295171J8783793o259645k5504834l3362749
$$ 92098821 84437546 69215550 76891285 104186456 122970249 116710604 91205770 57843021
4043E7843021l6590209l8199993l1512621o524438L2992589N8566333M1265498
$$ 57843021 21252812 -16947181 -48459802 -54984240 -21991651 36574682 77840180
4036G7840180n528937l1218890j1985258J5442599Q683425j6572744j4648426
$$ 77840180 72311243 41092353 29107095 44549694 53233119 36660375 22011949
4029B2011949J4841980K5857970r15532k9407269k5897169o760949n387265k0408559
$$ 22011949 36853929 62711899 61796367 32389098 6491929 -269020 -5656285 -26064844
4021b6064844k6234187j7361013j0628767j0050259j06404K1811917L2827671
$$ -26064844 -52299031 -69660044 -80288811 -90339070 -90445474 -68633557 -35805886
4014c5805886J8120586j784850K605873K5599620L2029649P993551j7389604j2473639
$$ -35805886 -17685300 -19470150 -16864277 8735343 40764992 48758543 31368939 18895300
4006A8895300J2622744K1160711k48298k7840904l5269854k2942266r068802o018408
$$ 18895300 31518044 52678755 52430457 24589553 -10680301 -33622567 -42691369 -48709777
3998d8709777j1134065j1789560K451919K4498232K9500386K964908l4105965
$$ -48709777 -59843842 -71633402 -69181483 -44683251 -15182865 -12217957 -46323922
3991d6323922m5821720k6396616l654914M731527J3302292L6730699N9776139
$$ -46323922 -92145642 -118542258 -122197172 -117465645 -104163353 -67432654 -7656515
3984g656515N8068945L2921821O013403r876037j6451919j4110562J06873J9420419
$$ -7656515 50412430 83334251 89347654 79471617 63019698 48909136 49016009 68436428
3976F8436428K6282344Q464228k7212117n6145376n3126978j7819197J7728739
$$ 68436428 94718772 103183000 75970883 19825507 -33301471 -51120668 -33391929
3969c3391929K1366621J125000o163196J1004631K3441174J1656709N46082J8210961
$$ -33391929 -12025308 -10900308 -17063504 -6058873 17382301 29039010 29585092 47796053
3961D7796053M4971776L8580771k713390l8377947m2663235k9344134j7636210
$$ 47796053 92767829 131348600 128635210 90257263 47594028 18249894 613684
3954F13684o262553Q885667J8426138J5101843O699497Q51002p283284k0674780
$$ 613684 -5648869 3236798 21662936 36764779 43464276 44315278 37031994 16357214
3946A6357214k8323894k0285812l764056P620054J1434686J2391400R832145K314661
$$ 16357214 -11966680 -32252492 -36016548 -28396494 -16961808 -4570408 5261737 7576398
3938G576398j580114Q296838K5312042K9035322J0116035j6564433k8695846k1070639
$$ 7576398 5996284 14293122 39605164 68640486 78756521 62192088 33496242 12425603
3930A2425603p630817k176403m498302o875808o848301o995055n841596J873803
$$ 12425603 4794786 2618383 -1879919 -8755727 -15604028 -22599083 -28440679 -26566876
3922b6566876J4796126K2872985J9559114J0310686M489255L299000N94084p130204
$$ -26566876 -11770750 11102235 30661349 40972035 45461290 48760290 49354374 42224170
3914D2224170j5824572j8091254j0821948J89778M523667o36164n300519l8566
$$ 42224170 26399598 8308344 -2513604 -2323826 2199841 1563677 -3736842 -3775408
3906c775408Q329097M092735j4932050l3014271l5465397k1665353Q52564K2603957
$$ -3775408 4553689 8646424 -6285626 -39299897 -74765294 -96430647 -95578083 -72974126
3898g2974126L1530739K1204122L081132m091466J55333K51669n168473R92540
$$ -72974126 -41443387 -20239265 -17158133 -21249599 -21094266 -20842597 -26011070 -25018530
3890b5018530J9675735K3643094k000146l0892295l1044445j0839973k156136
$$ -25018530 -5342795 18300299 16300153 -14592142 -45636587 -56476560 -58632696
3883e8632696j1201101j5889342m870078R907939J7412186J8147741J0535336
$$ -58632696 -69833797 -85723139 -90593217 -80685278 -63273092 -45125351 -34590015
3876c4590015q880661k8952658k9301407o701241K0577345L6308919L8315033
$$ -34590015 -43470676 -72423334 -101724741 -108425982 -87848637 -51539718 -13224685
3869a3224685K8132719P155567j5866730k9745080l3237705k8839432j0900359
$$ -13224685 14908034 22063601 6196871 -23548209 -56785914 -85625346 -96525705
3862i6525705K0413192M1114447K6534003r655507k7946039j5777070J170346
$$ -96525705 -76112513 -34998066 -8464063 -18119570 -46065609 -61842679 -60672333
3855f0672333L543598K204318Q920258J4775670J1655884P160708L603400r694363
$$ -60672333 -57128735 -54924417 -46004159 -31228489 -19572605 -12411897 -8808497 -18502860
3847a8502860k6917141j8765672K2674602N9766333N6729838K7364678P374890
$$ -18502860 -45420001 -64185673 -41511071 18255262 74985100 102349778 109724668
3840A09724668K710608j367030j442317J2939752K3440507L354235l0743490l3359206
$$ 109724668 112435276 111068246 109625929 122565681 146006188 149360423 118616933 85257727
3832H5257727J48645K3036540Q412839j2560037n833787J0967844J948375k7106426
$$ 85257727 85406372 108442912 116855751 104295714 98461927 109429771 111378146 84271720
3824H4271720m0454105k8728479j5803870j4715159j1649002L244355J8913901
$$ 84271720 43817615 15089136 -714734 -15429893 -27078895 -23834540 -4920639
3817d920639K4807757K4455644J9097414J806027j9825193j9059687J2207438
$$ -4920639 19887118 44342762 63440176 65246203 45421010 26361323 38568761
3810C8568761L9985346K7923120j1020362l0852126j6085625J711820l946824
$$ 38568761 78554107 106477227 95456865 64604739 48519114 50230934 46284110
3803D6284110j6434367p824800J4033050J6862177o457016k5488284j2084772
$$ 46284110 29849743 22024943 36057993 52920170 46463154 20974870 8890098
3796H890098K5642681N5398338N4114698K2774961k1120992n5155334o1147906
$$ 8890098 34532779 89931117 144045815 166820776 145699784 90544450 29396544
3789B9396544l5356921N998013L7126569M4437257L6396113K7312548J5459222
$$ 29396544 -5960377 37636 37164205 81601462 117997575 145310123 160769345
3782A60769345j0548502m2270304m7459396j1347623L2018753L4728007l548363
$$ 160769345 150220843 107950539 60491143 49143520 81162273 115890280 112341917
3775A12341917l6808030l6321837k0634307j2338050j155468K5023034M2787847
$$ 112341917 75533887 39212050 18577743 6239693 5084225 30107259 72895106
3768G2895106K3872940j4299650k8282788j1650558L60707j0515511k0780171
$$ 72895106 96768046 82468396 54185608 42535050 42895757 32380246 11600075
3761A1600075q565340J2042527J7120292Q067520J877454M116277Q366926Q954452
$$ 11600075 3034735 15077262 32197554 40265074 42142528 46258805 54625731 63580183
3753F3580183N34611k1774623m8737866n6716550l5930439q126355j94642q302898
$$ 63580183 64114794 42340171 -6397695 -63114245 -99044684 -107171039 -107365681 -115668579
3745a15668579n426269J8713662M1933101L7419943O573436k2810766k7905168
$$ -115668579 -121094848 -102381186 -60448085 -23028142 -16454706 -39265472 -67170640
3738f7170640j4236890m710898r016821j3393835l618818J3634665K2217118J9255348
$$ -67170640 -81407530 -86118428 -95135249 -108529084 -112147902 -98513237 -76296119 -57040771
3730e7040771J2655484M072590q398207j6051895p601285J0452797J9907017J5889037
$$ -57040771 -44385287 -40312697 -48710904 -64762799 -72364084 -61911287 -42004270 -26115233
3722b6115233P724525j524625j4168967j9610243m404264J7928849J6942510q638044
$$ -26115233 -18390708 -19915333 -34084300 -53694543 -58098807 -40169958 -23227448 -31865492
3714c1865492k5109797j3929657L505199N091340l80898n13440n519457j9593562
$$ -31865492 -56975289 -70904946 -67399747 -62308407 -62689305 -63202745 -68722202 -88315764
3706h8315764j5840634K3917817O6055489O3048853K2318256m948806O02037O094494
$$ -88315764 -104156398 -80238581 -14183092 48865761 71184017 66235211 66837248 72931742
3698G2931742j1679660k7167369j1218977J6656850J4149262j9738803l9285106
$$ 72931742 61252082 34084713 22865736 39522586 53671848 33933045 -5352061
3691e352061j2799797L6467481O1683393M7833219J8606925k273042j3150444
$$ -5352061 -18151858 18315623 79999016 127832235 146439160 144166118 131015674
3684A31015674j7296601j0059983L978452M211997j4575961k3683672j000395
$$ 131015674 113719073 103659090 107637542 111849539 97273578 73589906 72589511
3677G2589511K6848094J8796867j5012886k4913654K497318K6416077J7412101
$$ 72589511 99437605 118234472 103221586 78307932 80805250 107221327 124633428
3670A24633428n184882j6495192k1102732k3164825o218194K8102845M2370675
$$ 124633428 119448546 102953354 81850622 58685797 52467603 80570448 122941123
3663A22941123J8099939r875511r622380l046480j7646316k7565187J238329L8652693
$$ 122941123 141041062 131165551 121543171 118496691 100850375 73285188 74523517 113176210
3655A13176210K8019973k2641756n2958516m4198219l3955846l7516043k3487998
$$ 113176210 141196183 118554427 65595911 21397692 -12558154 -50074197 -73562195
3648g3562195J8550070M8882524L9964381J6181527N797327r73608j8165796k9415129
$$ -73562195 -55012125 -6129601 33834780 50016307 55813634 54840026 36674230 7259101
3640G259101j8249042J7183O251767Q704481J8268935J9919772n10002k3100431
$$ 7259101 -10989941 -10972758 -4720991 3983490 22252425 42172197 41662195 18561764
3632A8561764j8752137P726102K7104896K6737627J7540488R408061K632557j370125
$$ 18561764 -190373 7535729 34640625 61378252 78918740 88326801 90959358 89589233
3624H9589233M40342M744709N726692L761838K412964J878229P44433j365890
$$ 89589233 90029575 94774284 100500976 104262814 106675778 108554007 109298440 107932550
3616A07932550m406129m609041M783091J8035799J2037364k2364070n4198001
$$ 107932550 103526421 98917380 103700471 121736270 133773634 111409564 57211563
3609E7211563m7707761j7609408j0891206l3149375l8443865m499365K8871948
$$ 57211563 9503802 -8105606 -18996812 -52146187 -90590052 -95089417 -66217469
3602f6217469K1233288r425459k1508283j0702032j64221M283093J1600872J6443584
$$ -66217469 -44984181 -54409640 -75917923 -86619955 -86784176 -82501083 -70900211 -54456627
3594e4456627Q398645j966441K600087J6051118K0097538J3399088M841827p351575
$$ -54456627 -46057982 -48024423 -45424336 -29373218 -9275680 4123408 8965235 1613660
3586A613660k3056671k3680087P31669K3477589J5447855n654476j222K8245946
$$ 1613660 -21443011 -45123098 -44391429 -20913840 -5465985 -11120461 -11121683 17124263
3578A7124263L3332944j291462l6563766l4251453n658128J2762124P452615n207403
$$ 17124263 50457207 49165745 12601979 -21649474 -27307602 -14545478 -7092863 -12300266
3570a2300266l425692K0150669N1171857O1516786L7346147r65521k2984552k8328515
$$ -12300266 -15725958 4424711 55596568 117113354 154459501 153493980 130509428 102180913
3562A02180913l9179668n5115462m7807150r643986K4176158K1306589m266241
$$ 102180913 63001245 7885783 -39921367 -49565353 -25389195 -4082606 -8348847
3555h348847j7029708r590359j773563k416348q93082N535556K952342j3446413
$$ -8348847 -25378555 -34968914 -36742477 -39158825 -40051907 -34516351 -31564009 -45010422
3547d5010422k5313185j5574958O027601J6297016J0315118M100818P376914J0792688
$$ -45010422 -70323607 -85898565 -79870964 -63573948 -53258830 -49158012 -41781098 -30988410
3539c0988410N297274k067256l012791m323512j2166713j1798440J2663758M3479906
$$ -30988410 -25691136 -27758392 -30771183 -35094695 -47261408 -59059848 -46396090 -2916184
3531b916184M3778242J0549328j7078132j4028332l779382j6537978l9851287
$$ -2916184 40862058 51411386 34333254 20304922 16525540 -12438 -39863725
3524c9863725m0390056j6892732J935295L597833L177640J0115331J4128608R119529
$$ -39863725 -80253781 -97146513 -95211218 -91613385 -88435745 -78320414 -64191806 -55072277
3516e5072277N258125Q922758J1729336Q866858R866001J9779830K5114269J2708770
$$ -55072277 -49814152 -40891394 -29162058 -20295200 -10429199 9350631 34464900 47173670
3508D7173670p373517j3227673k368600K360238j6967303m5302899m7291521r505687
$$ 47173670 39800153 26572480 24203880 26564118 9596815 -35706084 -82997605 -92503292
3500i2503292L9693555O0570256M4375279J2683513j6992630m2107200n3675733
$$ -92503292 -52809737 7760519 52135798 64819311 47826681 5719481 -47956252
3493d7956252l5161747N087902K8506122J4345118r173962n677615J7332371K6264112
$$ -47956252 -83117999 -78030097 -49523975 -35178857 -44352819 -50030434 -32698063 -6433951
3485f433951J5314839P798609J1126980O996963j0940482k2186904j1910250O510561
$$ -6433951 8880888 16679497 27806477 34803440 23862958 1676054 -10234196 -3723635
3477c723635J2752838M765275o969553j4459007j2079248M716254K9373074M1370626
$$ -3723635 9029203 13794478 6824925 -7634082 -19713330 -14997076 14375998 55746624
3469E5746624K4187266j4514249m4851362l9713176k055891L3526046L5147935
$$ 55746624 79933890 65419641 20568279 -19144897 -21200788 12325258 47473193
3462D7473193R796030p979736l935297R55712r711507k0385506j3321005l5203
$$ 47473193 57269223 49289487 45354190 46309902 36598395 16212889 2891884 2856681
3454B856681J304825k129858L961246J0842718N118863j592636N213646R358914
$$ 2856681 4161506 2031648 5992894 16835612 21954475 20361839 25575485 34934399
3446C4934399r409936l1300327k2011648R033493K1634065Q789804N87549Q016769
$$ 34934399 25524463 -5775864 -27787512 -18754019 2880046 11669850 12257399 20274168
3438B0274168J1770281O498358N790105J669641k6028208n4166270l1108910L6616048
$$ 20274168 32044449 38542807 44332912 46002553 19974345 -34191925 -65300835 -28684787
3430b8684787P3471952L7964008j9131373l2868864r198019O979249K904667o809950
$$ -28684787 44787165 82751173 63619800 30750936 21552917 28532166 31436833 24626883
3422B4626883j8233641k7234526j2649240K7159454N0576687K7444496j1154366
$$ 24626883 6393242 -20841284 -33490524 -6331070 44245617 71690113 60535747
3415F0535747j9971260o658047n167591j1058531K111235K2997827J7326270q834469
$$ 60535747 40564487 33906440 28738849 17680318 19791553 42789380 60115650 51281181
3407E1281181j6771885p40109Q049571J549084M713023J9984868J4883729k0519772
$$ 51281181 34509296 33769187 41818758 43367842 48080865 68065733 82949462 62429690
3399F2429690m9261483l9883554p113706J7738479K5926824K3784180J3488978
$$ 62429690 13168207 -26715347 -33829053 -16090574 9836250 33620430 47109408
3392D7109408j139222j0101486j1312003j2507789j3967988r291458n002748j4042387
$$ 47109408 45970186 35868700 24556697 12048908 -1919080 -11210538 -16213286 -30255673
3384c0255673k6974923j9069105P211866J7721276l315867k7499778k2525519
$$ -30255673 -57230596 -76299701 -69087835 -51366559 -54682426 -82182204 -104707723
3377a04707723N867194K8728233L0242317J3981837q630659k1787565j3705772
$$ -104707723 -98840529 -70112296 -39869979 -25888142 -34518801 -56306366 -70012138
3370g0012138O612660J6864818J2959269J2191375J7914696R323233j8746216
$$ -70012138 -63399478 -46534660 -33575391 -21384016 -3469320 5853913 -12892303
3363a2892303l5263258j5645992J9558484L5581668L1834443K8635867K3496523
$$ -12892303 -48155561 -63801553 -44243069 -8661401 23173042 51808909 75305432
3356G5305432j752296l8012933n1569575l2505146p745887J301126M606438J5932419
$$ 75305432 73553136 35540203 -16029372 -48534518 -56280405 -54979279 -50372841 -34440422
3348c4440422K6318325K2089384R141268R03445k692591o227115k459452J4153240
$$ -34440422 -8122097 13967287 23108555 24012000 21319409 15092294 12632842 26786082
3340B6786082K7578940J7482970p838992j9424465q422351M785588N066468J25112
$$ 26786082 54365022 71847992 64009000 44584535 36162184 40947772 46014240 46139352
3332D6139352m450342j9040083m1495206m1978381l829896M0457628M6761517
$$ 46139352 41689010 22648927 -18846279 -60824660 -64654556 -24196928 22564589
3325B2564589J9338271j844999l406752o089124j2894647J077222L5044576M6416121
$$ 22564589 41902860 40057861 36651109 30561985 17667338 18744560 53789136 100205257
3317A00205257J3406582k5428114k5407032K519044J7938732J1072566p22283
$$ 100205257 113611839 88183725 62776693 65295737 83234469 94307035 93584752
3310I3584752j3172162k9954042l3764927o634850K9107661L2430427K964673
$$ 93584752 80412590 50458548 16693621 10058771 39166432 71596859 74561532
3303G4561532k0927646k1844530j9827755k6118428k3078307k124925J5664212
$$ 74561532 53633886 31789356 11961601 -14156827 -37235134 -39360059 -23695847
3296b3695847J3129597N88143r044841j9027402k6685243j3046302K2903635M5220549
$$ -23695847 -10566250 -9978107 -19022948 -38050350 -64735593 -77781895 -54878260 -9657711
3288i657711K3928249j9173109l4488002o610450L0133807L6010246R097444j7675686
$$ -9657711 14270538 -4902571 -39390573 -46001023 -15867216 20143030 29240474 11564788
3280A1564788j4079352J5110660L5567698K3686820m709337j6610377n968684
$$ 11564788 -2514564 12596096 48163794 71850614 67141277 50530900 44562216
3273D4562216L204758m266700j5831003j6030244q430629l385896j802828j385141
$$ 44562216 47766974 43500274 27669271 11639027 3208398 -177498 -1980326 -3365467
3265c365467m455499j0329874j2130884p654894j529094O511745K0860580L5291048
$$ -3365467 -7820966 -18150840 -30281724 -37936618 -39465712 -32953967 -12093387 23197661
3257B3197661L6173753K3502472J0756011J767098j1316189k4732108k3142303
$$ 23197661 59371414 82873886 93629897 95396995 84080806 59348698 36206395
3250C6206395q994686m769002j6047850k0114645n271587O283876n769179k5490362
$$ 36206395 27211709 22442707 6394857 -13719788 -18991375 -12707499 -18476678 -43967040
3242d3967040k4812887l304938J8530794L0610835L6526253L6743309K7225033
$$ -43967040 -68779927 -72084865 -53554071 -22943236 13583017 50326326 77551359
3235G7551359P577010j9883111m8240532n8392116l3781411R081369K9650556
$$ 77551359 85128369 65245258 17004726 -41387390 -75168801 -66087432 -36436876
3228c6436876J5072985l710073j559503O461641R3286j0542899j1891023j6497532
$$ -36436876 -21363891 -25073964 -26633467 -20171826 -20078540 -30621439 -42512462 -59009994
3220e9009994l1447498k8907205R627234M6924995L7433316J030371n510853K0849353
$$ -59009994 -90457492 -119364697 -109737463 -62812468 -25379152 -24348781 -29859634 -9010281
3212i010281K7028325o907768l5392528j9593149J8221895L5139025K2778634
$$ -9010281 18018044 11110276 -24282252 -43875401 -25653506 9485519 32264153
3205C2264153j184982k3554179l4635343k4995301n431964n322940k9766418m2073963
$$ 32264153 31079171 7524992 -27110351 -52105652 -57537616 -62860556 -92626974 -134700937
3197a34700937j2188339L7860507O1450478M4614777J2137669j0793059j8583574
$$ -134700937 -146889276 -109028769 -47578291 -2963514 9174155 -1618904 -20202478
3190b0202478j4426224l030414O006517L992354n995074j3159139j2293330o628444
$$ -20202478 -34628702 -37659116 -31652599 -27660245 -33655319 -46814458 -59107788 -65736232
3182f5736232j920862l511341j2873193k1439487j6383434M96473R901306J493731
$$ -65736232 -67657094 -71168435 -84041628 -105481115 -121864549 -121368076 -111466770 -109973039
3174a09973039o357599J1211044M7421874O5267165M2070721k60502k0826190
$$ -109973039 -116330638 -105119594 -57697720 7569445 49640166 49379664 28553474
3167B8553474r757246L000645o890954k1353448p681587K6068235L4216872r22883
$$ 28553474 18796228 21796873 14905919 -6447529 -14129116 11939119 46155991 45233108
3159D5233108l8147142l3541082j241902J3599498L174314k225243O921027N442928
$$ 45233108 7085966 -26455116 -27697018 -14097520 -10923206 -13148449 -6227422 -784494
3151g84494j6305574l1273236k0341349j953683K447403M90276L976828K453274
$$ -784494 -17090068 -48363304 -68704653 -70658336 -68210933 -67720657 -63743829 -61290555
3143f1290555j0514897j1837857J6159134M5577231L5805181n261819l1444612
$$ -61290555 -71805452 -83643309 -67484175 -21906944 13898237 8636418 -22808194
3136b2808194k5002838j4283339k1110073k7910260j1601018J8345346L4845260
$$ -22808194 -47811032 -62094371 -83204444 -111114704 -122715722 -104370376 -69525116
3129f9525116K8382143J1065031j706659r65975J2799609K5087772J7270478p775798
$$ -69525116 -41142973 -30077942 -31784601 -32750576 -19950967 5136805 22407283 14631485
3121A4631485k1894879o985945J6911244J5888808j2519052l6863937l2232519
$$ 14631485 -7263394 -14249339 2661905 18550713 6031661 -30832276 -63064795
3114f3064795n224474K2202736L5738089L0681849Q164322k0274471l6099507
$$ -63064795 -68289269 -46086533 -10348444 20333405 28497727 8223256 -27876251
3107b7876251l1872181j7195887l71123K1541343M3711337M3125690R413041k6600662
$$ -27876251 -59748432 -76944319 -77315442 -55774099 -12062762 31062928 40475969 13875307
3099A3875307k4626482Q345080K4660909L475428k1818175j7458161J586502J538178
$$ 13875307 -10751175 -2406095 22254814 25730242 3912067 -13546094 -11959592 -10421414
3091a0421414j5663158k0071449k687569J5601460J9081848J2269914J157283
$$ -10421414 -26084572 -46156021 -48843590 -33242130 -14160282 -1890368 -733085
3084g33085j3251036k0406547n109270K6636198M8142893M4930618K7970705R605246
$$ -733085 -13984121 -34390668 -39499938 -12863740 35279153 80209771 108180476 117785722
3076A17785722j1604452l3897568m2608848l0808024j2194145n52488P410482
$$ 117785722 106181270 72283702 29674854 -1133170 -13327315 -13879803 -6469321
3069f469321J5985592J5168894q51686j4890228p894105J0604353J5210411K841882
$$ -6469321 9516271 24685165 23833479 8943251 1049146 11653499 26863910 29705792
3061B9705792m096943P099779K2033833K2347134Q678409q277523k5009669m0605914
$$ 29705792 25608849 32708628 54742461 77089595 85768004 77490481 52480812 11874898
3053A1874898m4852976k7830721o6773J2749637J009778j4896655j1871992L886029
$$ 11874898 -32978078 -60808799 -60875572 -48125935 -47116157 -62012812 -73884804 -69998775
3045f9998775P335765o762495j4776094J411680K8423591M0586541L1413066J2780122
$$ -69998775 -62663010 -69425505 -84201599 -82789919 -54366328 -13779787 17633279 30413401
3037C0413401n536316j9396240k2132350j0843321L671186R227247R831571J5013682
$$ 30413401 24877085 5480845 -16651505 -27494826 -23823640 -14596393 -4764822 10248860
3029A0248860J8197706O284714j3085664j7601868m669724L954075l002588r397566
$$ 10248860 28446566 34731280 21645616 4043748 -625976 3328099 325511 -9072055
3021i072055J536443K2694512L5644316L2087734J4462571r291404k3560178j3989641
$$ -9072055 -7535612 15158900 50803216 82890950 97353521 88062117 64501939 50512298
3013E0512298J1982960K8803807K5991152K1105969K8722647L4124347J4701617
$$ 50512298 62495258 91299065 117290217 138396186 167118833 201243180 215944797
3006B15944797k4106379n1554238m5701013j3994894J5740358J8500477o956692
$$ 215944797 191838418 140284180 94583167 80588273 96328631 114829108 107872416
2999A07872416l5517662m1280168k6442509j3233056r154613n27779J6691344
$$ 107872416 72354754 31074586 4632077 -8600979 -17755592 -18283371 -1592027
2992a592027K5236486J6944454J0728120K2769586L8489025L4101362J0416175
$$ -1592027 23644459 40588913 51317033 74086619 112575644 146677006 157093181
2985A57093181j5097591l6549020n8202442p3933420o9484688m2625849p224873
$$ 157093181 141995590 105446570 47244128 -26689292 -96173980 -138799829 -146024702
2978a46024702J9217421K4586050R199623p687878k909665J8384658K2897315
$$ -146024702 -126807281 -102221231 -93021608 -100709486 -103619151 -85234493 -62337178
2971f2337178m301748l2775926k5909517J0246064M0295238M6947033L9936229
$$ -62337178 -66638926 -99414852 -125324369 -115078305 -74783067 -27836034 12100195
2964A2100195K9209898J6195428N393039N83264n695743j8417296k3857530r251218
$$ 12100195 41310093 57505521 62898560 63481824 57786081 39368785 15511255 6260037
2956F260037J0212962R222931r436324k0396112j4393885m789883J247995J0256255
$$ 6260037 16472999 25695930 16259606 -4136506 -18530391 -23320274 -22072279 -11816024
2948a1816024K0937334K1292139R701437l894953j8014408l6923635m8477539
$$ -11816024 9121310 30413449 40114886 36219933 18205525 -18718110 -67195649
2941f7195649l2491155M050302K6585898J6637052n676267j1305123L886718K1899783
$$ -67195649 -99686804 -95636502 -69050604 -52413552 -58089819 -69394942 -65508224 -43608441
2933d3608441K3120209K13831l2396795m2499905j2857733K9995886M2003011
$$ -43608441 -20488232 -20274401 -52671196 -95171101 -108028834 -78032948 -36029937
2926c6029937J7126774r350534j5686550k0038382l9805204n5307082l7674571
$$ -36029937 -18903163 -28253697 -43940247 -63978629 -103783833 -159090915 -196765486
2919a96765486N666216L8096023L9048525K3500399J7712345K7666259L5001899
$$ -196765486 -191099270 -153003247 -113954722 -90454323 -72741978 -45075719 -10073820
2912a0073820K2335743q44898p396579Q493551J9160957N489507r145548M842314
$$ -10073820 12261923 11417025 4020446 12513997 31674954 37164461 28018913 32861227
2904C2861227K9881083K4672925o019821j3371926J6746819L6230397P198854
$$ 32861227 62742310 87415235 81395414 68023488 84770307 121000704 128199558
2897A28199558m0733395n6443077l7371584j8406342j4613786j2229950l527318
$$ 128199558 87466163 31023086 -6348498 -24754840 -39368626 -51598576 -55125894
2890e5125894L339599M720604N961571Q349043J0449509J6804277K8151719L0565952
$$ -55125894 -51786295 -47065691 -41104120 -32755077 -22305568 -5501291 22650428 53216380
2882E3216380J2510543j3496619k3914863j4444256j301141M317658P712299J6198062
$$ 53216380 65726923 52230304 28315441 13871185 12570044 16887702 24600001 40798063
2874D0798063K3898064J4866700j8219630n6161471o1845520k1408038K9058418
$$ 40798063 64696127 79562827 61343197 5181726 -56663794 -78071832 -49013414
2867d9013414M1021726J5913672J79681J4577693K6279603P129107j9321773j8255410
$$ -49013414 -7991688 7921984 8101665 22679358 48958961 56088068 36766295 18510885
2859A8510885N49903M372838o436328l502390J9685305L8744026L4797498J1709594
$$ 18510885 19060788 23433626 16997298 13494908 33180213 71924239 106721737 118431331
2851A18431331j7329895l5581600k4745684J1353832L4742015J5205159k3586198
$$ 118431331 101101436 65519836 40774152 52127984 86869999 102075158 78488960
2844G8488960l2202060m147306J8851609R741135j2166587j9058381j0721811
$$ 78488960 46286900 42139594 60991203 70732338 58565751 39507370 28785559
2837B8785559m64604P447188J1594215O160481n929192r357805K017689J3852242
$$ 28785559 28320955 35768143 47362358 53522839 47593647 38235842 40253531 54105773
2829E4105773J1303030k639178j7471351l0820553m2970471m5313874k7070979
$$ 54105773 65408803 62769625 45298274 14477721 -28492750 -73806624 -100877603
2822a00877603P314645L4997204L4161679Q870255j0568385j915193J8157475
$$ -100877603 -93562958 -58565754 -24404075 -15533820 -26102205 -28017398 -9859923
2815i859923J5566933r549939k0799944l733138Q790686q181555k6323714j0543093
$$ -9859923 5707010 -3842929 -24642873 -28376011 -19585325 -27766880 -54090594 -64633687
2807f4633687J8067910J3520306j8812204k9777808k974181K9114105M5233789
$$ -64633687 -46565777 -33045471 -51857675 -81635483 -84609664 -55495559 -10261770
2800a0261770N7482440O5599660M4160597n445080l9237233l2417605j5050684
$$ -10261770 47220670 112820330 156980927 151535847 112298614 79881009 64830325
2793F4830325j8963674k8648056j7537423J354826p96410j8383074k1979597m105060
$$ 64830325 45866651 17218595 -318828 1035998 239588 -18143486 -40123083 -44228143
2785d4228143J6649923K5786926K1989465P154119j1691320k1997945k2948519
$$ -44228143 -27578220 -1791294 20198171 27352290 15660970 -6336975 -29285494
2778b9285494k6901069l0494953r736178L5962664O3190268L7743683j4084701
$$ -29285494 -56186563 -86681516 -96417694 -60455030 2735238 40478921 26394220
2771B6394220l9540863k6268002k781939J0515885J5082637J1648850O6924n763916
$$ 26394220 -13146643 -39414645 -42196584 -31680699 -16598062 -4949212 -4882288 -10646204
2763a0646204M920779J5555719O103222r628619n136863J0722399O806418j4983509
$$ -10646204 -5725425 9830294 15933516 6304897 1168034 11890433 18696851 3713342
2755C713342k0560853n24147J6984227J6642677J7091252K9599378L4594462J6454987
$$ 3713342 -16847511 -17371658 -387431 16255246 33346498 62945876 97540338 113995325
2747A13995325j1305008l2012958m5810047m8193288k2886114K2093408M3473719
$$ 113995325 102690317 70677359 24867312 -23325976 -46212090 -24118682 19355037
2740A9355037J6241164k6507312l5885418r292508J8130700K6035628K1435502
$$ 19355037 35596201 9088889 -26796529 -36089037 -17958337 8077291 29512793
2733B9512793J0764804q158886k8946947l7278269k9564096j3571336N779292
$$ 29512793 40277597 32118711 3171764 -34106505 -63670601 -77241937 -71462645
2726g1462645K4574698L0611546J5639062p362863j7778895j4061014q650993
$$ -71462645 -46887947 -16276401 -637339 -8000202 -25779097 -39840111 -48491104
2719d8491104k373345J3260577L0705619K8778546M673508j8634672k3855250
$$ -48491104 -50864449 -37603872 -6898253 21880293 26553801 7919129 -15936121
2712a5936121j8105921j1651559J411259K5992028M4916944L5310389J565333
$$ -15936121 -34042042 -45693601 -44282342 -18290314 26626630 61937019 63502352
2705F3502352k4604606j8928503J0616968L5894660L7723507J9048424n098190
$$ 63502352 38897746 19969243 30586211 66480871 104204378 123252802 118154612
2698A18154612k2682160k8910217k3766885j3594493j1208299k2178269l0180716
$$ 118154612 95472452 66562235 42795350 29200857 17992558 -4185711 -34366427
2691c4366427j1236886L0297677N5659523L5717954j1122052m2548328m3521484
$$ -34366427 -45603313 -15305636 40353887 76071841 64949789 22401461 -21120023
2684b1120023l2072552k2184751r827194M017041Q280339R112188L0873685P1047524
$$ -21120023 -53192575 -75377326 -85204520 -81187479 -72907140 -63794952 -32921267 38126257
2676C8126257Q2618625L1761007m4480003p3601966l6204528J4271854K5023341
$$ 38126257 120744882 152505889 108025886 34423920 -1780608 12491246 37514587
2669C7514587N792457Q93052K2077294L6175587J6028641j9484660k9078232m777043
$$ 37514587 43307044 44200096 66277390 102452977 118481618 98996958 69918726 65141683
2661F5141683J3851756r225301n3198738o1268128j6748529K9714742K7427507
$$ 65141683 78993439 69768138 16569400 -44698728 -61447257 -31732515 -4305008
2654d305008l995487m894516L5250411O0446664K7351197l4556943o2146905l3866767
$$ -4305008 -8300495 -13195011 22055400 82502064 109853261 75296318 13149413 -20717354
2646b0717354J6054662M2444386K7798073j2158000m2442112l5898944p88339
$$ -20717354 -4662692 37781694 65579767 53421767 10979655 -24919289 -25707628
2639b5707628K6263560K3961787Q039471j518469j1105144k9088222l5563219
$$ -25707628 555932 24517719 32557190 31038721 19933577 -9154645 -44717864
2632d4717864j2446218J3331143K093716k9319713k2448851L0387639O2586843
$$ -44717864 -57164082 -43832939 -41739223 -71058936 -93507787 -63120148 -533305
2625e33305K8185753k7585533l4233731L064598K1065415j937975k2062361o529052
$$ -533305 27652448 66915 -34166816 -31102218 -10036803 -11974778 -34037139 -40566191
2617d0566191J9249047J9455091R59265q465745n711559n961161r706884o352003
$$ -40566191 -21317144 -1862053 -902788 -9368533 -15080092 -21041253 -30748137 -37100140
2609c7100140K18580j415208l517021J1161278L2924419K9115751n528256l0384738
$$ -37100140 -36881560 -38296768 -41813789 -30652511 2271908 31387659 25859403 -4525335
2601d525335j0981445K9776466L8690538K346299l7027170l8000201q329685J3925844
$$ -4525335 -15506780 14269686 52960224 55306523 18279353 -19720848 -28050533 -14124689
2593a4124689J0370962l080924m016434R706067K1848942J7273602l139165k3480956
$$ -14124689 -3753727 -6834651 -10851085 -1145018 20703924 37977526 34838361 11357405
$$ [...]
##END NTUPLES=NMR SPECTRUM
##END=
