##TITLE=31Pdec_DE-104_oil2_TFA
CDCl3, 64 sc
 28.7.2025
##JCAMPDX= 6.0         $$ Bruker NMR JCAMP-DX V2.0
##DATA TYPE= NMR SPECTRUM
##DATA CLASS= NTUPLES
##ORIGIN= UXNMR, Bruker Analytische Messtechnik GmbH
##OWNER= root
$$ XWIN-NMR		Version 3.5
$$ Mon Jul 28 14:49:46 2025 Russian Standard Time (UT+4h)  she@DPX200
##.OBSERVE FREQUENCY= 81.013821
##.OBSERVE NUCLEUS= ^31P
##.ACQUISITION MODE= SIMULTANEOUS
##.ACQUISITION SCHEME= undefined
##.AVERAGES= 64
##.DIGITISER RES= 17
##SPECTROMETER/DATA SYSTEM= spect
##.PULSE SEQUENCE= zgpg30
##.SOLVENT NAME= CDCl3
##.SHIFT REFERENCE= (INTERNAL, CDCl3, 0, 198.062)
##AUDIT TRAIL= $$ (NUMBER, WHEN, WHO, WHERE, WHAT)
$$ ##TITLE= Audit trail, XWIN-NMR		Version 3.5
$$ ##JCAMPDX= 5.01
$$ ##ORIGIN= Bruker BioSpin GmbH
$$ ##OWNER= she
$$ F:/spectra/data/she/nmr/P31/2/pdata/1/auditp.txt
$$ ##AUDIT TRAIL=  $$ (NUMBER, WHEN, WHO, WHERE, WHAT)
(   1,<2025-07-28 14:48:34.01 +0400>,<she>,<DPX200>,
      <created by zg, POWCHK disabled, PULCHK disabled
       configuration hash MD5:
       00 E9 B6 7A A2 85 ED C7 34 08 36 98 17 FE 4E 26
       data hash MD5: 32K
       32 6B A2 B2 9B D2 BD 4C AD 60 E3 D6 68 FB 92 F3>)
(   2,<2025-07-28 14:48:36.73 +0400>,<she>,<DPX200>,
      <Start of raw data processing
       efp BC_mod = 2 LB = 1.5 FT_mod = 6 PKNL = 1 PHC0 = 1484.139 PHC1 = -122.5013 SI = 64K 
       data hash MD5: 64K
       39 EA 37 BD 25 D8 5E D5 EC E5 9D FC DC B4 EE AB>)
(   3,<2025-07-28 14:49:06.89 +0400>,<she>,<DPX200>,
      <pk PHC0 = -23.08248 PHC1 = -2.4 
       data hash MD5: 64K
       74 FF E6 AB 63 42 35 09 E5 AC 1B 92 E8 94 E4 01>)
$$ ##END=
$$ 
$$ hash MD5
$$ 93 47 FA EE 2F F6 8F 2E 45 7A FF E3 6C F5 D6 13
##$RELAX= 
##$RELAX= 
##$RELAX= 
##$RELAX= 
##$RELAX= 
##$RELAX= 
##$RELAX= 
##$RELAX= 
$$ Bruker specific parameters
$$ --------------------------
##$DU= <F:/spectra>
##$EXPNO= 2
##$NAME= <P31>
##$PROCNO= 1
##$TYPE= <nmr>
##$USER= <she>
##$AMP= (0..31)
100 100 100 100 100 100 100 100 100 100 100 100 100 100 100 100 100 100 
100 100 100 100 100 100 100 100 100 100 100 100 100 100 
##$AQSEQ= 0
##$AQ_mod= 1
##$AUNM= <au_zg>
##$AUTOPOS= <>
##$BF1= 81.014009
##$BF2= 200.13
##$BF3= 200.13
##$BF4= 200.13
##$BF5= 200.13
##$BF6= 200.13
##$BF7= 200.13
##$BF8= 200.13
##$BYTORDA= 1
##$CFDGTYP= 0
##$CFRGTYP= 5
##$CHEMSTR= <none>
##$CNST= (0..31)
1 1 145 1 1 1 1 1 1 1 1 1 1 1 1 1 1 1 1 1 1 1 1 1 1 1 1 1 1 1 1 1 
##$CPDPRG= <waltz16>
##$CPDPRG1= <>
##$CPDPRG2= <waltz16>
##$CPDPRG3= <>
##$CPDPRG4= <mlev>
##$CPDPRG5= <mlev>
##$CPDPRG6= <mlev>
##$CPDPRG7= <mlev>
##$CPDPRG8= <mlev>
##$CPDPRGB= <>
##$CPDPRGT= <>
##$D= (0..31)
0 1 0 0 0 0 0 0 0 0.06 0 0.03 2e-05 3e-06 0 0 0.0002 0 0 0 0 0 0 0 0 0 
0 0 0 0 0 0 
##$DATE= 1753699713
##$DBL= (0..7)
120 120 120 11 120 120 24 19 
##$DBP= (0..7)
150 150 150 150 150 150 150 150 
##$DBP07= 0
##$DBPNAM0= <>
##$DBPNAM1= <>
##$DBPNAM2= <>
##$DBPNAM3= <>
##$DBPNAM4= <>
##$DBPNAM5= <>
##$DBPNAM6= <>
##$DBPNAM7= <>
##$DBPOAL= (0..7)
0.5 0.5 0.5 0.5 0.5 0.5 0.5 0.5 
##$DBPOFFS= (0..7)
$$ [...]
##$SUBNAM2= <"">
##$SUBNAM3= <"">
##$SUBNAM4= <"">
##$SUBNAM5= <"">
##$SUBNAM6= <"">
##$SUBNAM7= <"">
##$SUBNAM8= <"">
##$SUBNAM9= <"">
##$SW= 400.765351723535
##$SWIBOX= (0..15)
0 1 3 0 0 0 0 0 0 0 0 0 0 0 0 0 
##$SW_h= 32467.5324675325
##$TD= 32768
##$TD0= 1
##$TE= 0
##$TE2= 300
##$TE3= 300
##$TEG= 300
##$TL= (0..7)
0 120 53 12 22 120 120 120 
##$TP= (0..7)
150 150 150 150 150 150 150 150 
##$TP07= 0
##$TPNAME0= <>
##$TPNAME1= <>
##$TPNAME2= <>
##$TPNAME3= <>
##$TPNAME4= <>
##$TPNAME5= <>
##$TPNAME6= <>
##$TPNAME7= <>
##$TPOAL= (0..7)
0.5 0.5 0.5 0.5 0.5 0.5 0.5 0.5 
##$TPOFFS= (0..7)
0 0 0 0 0 0 0 0 
##$TUNHIN= 0
##$TUNHOUT= 0
##$TUNXOUT= 0
##$USERA1= <user>
##$USERA2= <user>
##$USERA3= <user>
##$USERA4= <user>
##$USERA5= <user>
##$V9= 5
##$VALIST= <valist>
##$VCLIST= <CCCCCCCCCCCCCCC>
##$VD= 0
##$VDLIST= <DDDDDDDDDDDDDDD>
##$VPLIST= <PPPPPPPPPPPPPPP>
##$VTLIST= <TTTTTTTTTTTTTTT>
##$WBST= 1024
##$WBSW= 4
##$XGAIN= (0..3)
0 0 0 0 
##$XL= 0
##$YL= 0
##$YMAX_a= 5874
##$YMIN_a= -6541
##$ZGOPTNS= <>
##$ZL1= 120
##$ZL2= 120
##$ZL3= 120
##$ZL4= 120
##$ABSF1= 0
##$ABSF2= 0
##$ABSG= 0
##$ABSL= 0
##$ALPHA= 0
##$AQORDER= 0
##$ASSFAC= 0
##$ASSFACI= 0
##$ASSFACX= 0
##$ASSWID= 0
##$AUNMP= <proc_1d>
##$AZFE= 0.1
##$AZFW= 0.5
##$BCFW= 0
##$BC_mod= 2
##$BYTORDP= 0
##$COROFFS= 0
##$CY= -3
##$DATMOD= 1
##$DC= 0
##$DFILT= <>
##$DTYPP= 0
##$F1P= 0
##$F2P= 0
##$FCOR= 1
##$FTSIZE= 65536
##$FT_mod= 6
##$GAMMA= 0
##$GB= 0
##$INTBC= 1
##$INTSCL= 9.790993e-09
##$ISEN= 30
##$LB= 1.5
##$LEV0= 0
##$LPBIN= 0
##$MAXI= 10000
##$MC2= 0
##$MEAN= 0
##$ME_mod= 0
##$MI= 50
##$NCOEF= 0
##$NC_proc= -8
##$NLEV= 6
##$NOISF1= 182.463
##$NOISF2= 159.3651
##$NSP= 0
##$NTH_PI= 0
##$NZP= 0
##$OFFSET= 198.0616
##$PC= 4
##$PHC0= 1461.057
##$PHC1= -124.9013
##$PH_mod= 1
##$PKNL= yes
##$PPARMOD= 0
##$PSCAL= 0
##$PSIGN= 0
##$REVERSE= no
##$SF= 81.0140089999434
##$SI= 65536
##$SIGF1= 159.3651
##$SIGF2= -187.1042
##$SINO= 113.3802
##$SIOLD= 16384
##$SREGLST= <1H.CDCl3>
##$SSB= 0
##$STSI= 65536
##$STSR= 0
##$SW_p= 32467.5324675325
##$SYMM= 0
##$S_DEV= 0
##$TDeff= 32768
##$TDoff= 0
##$TI= <>
##$TILT= no
##$TM1= 0
##$TM2= 0
##$TOPLEV= 0
##$USERP1= <user>
##$USERP2= <user>
##$USERP3= <user>
##$USERP4= <user>
##$USERP5= <user>
##$WDW= 1
##$XDIM= 65536
##$YMAX_p= 263679149
##$YMIN_p= -48818289
$$ End of Bruker specific parameters
$$ ---------------------------------
##NTUPLES= NMR SPECTRUM
##VAR_NAME=  FREQUENCY,     SPECTRUM/REAL,   SPECTRUM/IMAG
##SYMBOL=    X,             R,               I
##VAR_TYPE=  INDEPENDENT,   DEPENDENT,       DEPENDENT
##VAR_FORM=  AFFN,          ASDF,            ASDF
##VAR_DIM=   65536,         65536,           65536
##UNITS=     HZ,            ARBITRARY UNITS, ARBITRARY UNITS
##FACTOR=    0.49542278885378, 1,            1
##FIRST=     16045.7642231865, 0,            0
##LAST=      -16421.768244346, 0,            0
##MIN=       -16421.768244346, -48818289,    0
##MAX=       16045.7642231865, 263679149,    0
$$ Real data points
##PAGE= N=1
##DATA TABLE= (X++(R..R)), XYDATA
$$ [...]
$$ plain form
7510 2741694 1402701 -178074 -183669 914944 1417313 1438117 2545100 4543909 4945788
7501 4945788 2368307 -1095154 -1881954 1393538 6808411 10999978 11798080 9621673 6742667
7492 6742667 4940703 3788825 1561245 -2232231 -5756849 -6513446 -3863208 196801
7484 196801 2696224 2217401 -110788 -2106205 -2724594 -2388471 -1571193 -94180 2028483
7475 2028483 3987537 4764487 3717240 766335 -2908622 -4676188 -2841739 520171
7467 520171 1269415 -1541065 -4395901 -4352016 -2620113 -1260995 736357 4831666 8556820
7458 8556820 7955355 3748726 1151943 3247780 7745606 10722459 10596391 7900737 4161309
7449 4161309 1919222 3101070 6182522 7303164 5211276 2758275 2456932 3107486 2367798
$$ packed form
7510B741694j338993j580775n595J098613N02369K0804J106983J998809M01879
7501D945788k577481l463461p86800L275492N414873M191567P98102k176407k879006
7492F742667j801964j151878k227580l793476l524618p56597K650238M060009
7484A96801K499423m78823k328189j995417o18389L36123Q17278J477013K122663
7475B028483J959054P76950j047247k950905l674957j767566J834449L361910
7467E20171P49244k810480k854836M3885J731903J359118J997352M095309L725154
7458H556820o01465m206629k596783K095837M497826K976853j26068k695654l739428
7449D161309k242087J181848L081452J120642k091888k453001l01343O50554p39688
$$ plain form
7440 2367798 399540 -992373 -1271088 -1380862 -2004894 -2914662 -3425137 -3000556 -2241810
7431 -2241810 -2984130 -5779661 -7886065 -6434503 -3231029 -2733579 -4900593 -4540137 585189
7422 585189 5621853 5523748 1975118 -403689 -1225241 -3002506 -5212639 -4948892 -2315960
7413 -2315960 -296360 325225 1501090 3572230 4647639 4517143 5133695 6769537 7647643
7404 7647643 8028910 10554033 15277484 18294749 17148734 14126424 12051446 10040335
7396 10040335 6136135 1493748 -1236671 -2008766 -2792793 -3870111 -3603816 -1639394 185621
7387 185621 525286 309791 1173676 3207577 4993813 5442869 5069886 5312411 6640487
7378 6640487 7727695 6947204 4434715 2045436 1459819 2988643 5889060 8852434 10367498
$$ packed form
7440B367798j968258j391913k78715j09774o24032r09768n10475M24581P58746
7431b241810p42320k795531k106404J451562L203474M97450k167014L60456N125326
7422E85189N036664r8105l548630k378807q21552j777265k210133K63747K632932
7413b315960K019600O21585J175865K071140J075409j30496O16552J635842Q78106
7404G647643L81267K525123M723451L017265j146015l022310k074978k011111
7396A0040335l904200m642387k730419p72095p84027j077318K66295J964422J825015
7387A85621L39665k15495Q63885K033901J786236M49056l72983K42525J328076
7378F640487J087208p80491k512489k389279n85617J528824K900417K963374J515064
$$ plain form
7369 10367498 9809745 8393078 8159576 9820087 12134687 13209547 11818711 8103538
7361 8103538 3975348 2066074 2861553 3517832 1173005 -3134816 -5745645 -5102518 -3039484
7352 -3039484 -1646336 -1341885 -2170262 -4291646 -6414555 -6177247 -3229887 7797 1649587
7343 1649587 2518689 4077176 6160254 7956196 9411857 10359378 9888932 7892792 5719411
7334 5719411 4100356 2052090 -867342 -2951883 -2663623 -1079223 -198126 18689 1028580
7325 1028580 2938724 4173867 3544335 1326998 -1281111 -2716501 -1707041 1406789
7317 1406789 4414741 5284714 4154727 2713319 2262389 3001991 4426506 5691185 6247556
7308 6247556 6638460 7879947 9632963 9950796 7394944 2684318 -1917535 -4061812 -2605097
$$ packed form
7369A0367498n57753j416667k33502J660511K314600J074860j390836l715173
7361H103538m128190j909274P95479O56279k344827m307821k610829O43127K063034
7352c039484J393148L04451q28377k121384k122909K37308K947360L237684J641790
7343A649587Q69102J558487K083078J795942J455661R47521m70446j996140k173381
7334E719411j619055k048266k919432k084541K88260J584400Q81097K16815J009891
7325A028580J910144J235143o29532k217337k608109j435390J009460L113830
7317A406789L007952Q69973j129987j441408m50930P39602J424515J264679N56371
7308F247556L90904J241487J753016L17833k555852m710626m601853k144277J456715
$$ plain form
7299 -2605097 1016586 3091626 1340341 -1941180 -2787372 -1141939 -265813 -764603 315489
7290 315489 3330469 3914784 -272414 -5021778 -5438578 -2722583 -1024355 -781145 56918
7281 56918 778669 -677021 -2629710 -1558050 1483309 1752858 -1661455 -4323457 -3304841
7272 -3304841 -828874 335279 794560 1884821 2734778 2241425 1232209 667180 -47772
7263 -47772 -1370592 -2457774 -3092735 -4514610 -6832747 -7764485 -5547540 -1295228 2846643
7254 2846643 5925736 7266686 5591648 1056757 -3417826 -4845575 -3279651 -901980
7246 -901980 821325 1708913 1702701 691566 -976012 -2715050 -3983103 -4064656 -2594135
7237 -2594135 -588992 300681 -72770 -324980 93950 151904 -737852 -1748769 -2313960
$$ packed form
7299b605097L621683K075040j751285l281521q46192J645433Q76126m98790J080092
7290C15489L014980N84315m187198m749364m16800K715995J698228K43210Q38063
7281E6918P21751j455690j952689J071660L041359K69549l414313k662002J018616
7272c304841K475967J164153M59281J090261Q49957m93353j009216n65029p14952
7263d7772j322820j087182o34961j421875k318137r31738K216945M252312M141871
7254B846643L079093J340950j675038m534891m474583j427749J565924K377671
7246i01980J723305Q87588o212j011135j667578j739038j268053q1553J470521
7237b594135K005143Q89673l73451k52210M18930N7954q89756j010917n65191
$$ plain form
7228 -2313960 -2968165 -3829969 -4068320 -3610190 -3474785 -3649988 -2751134 -750113 264294
7219 264294 -588345 -1166050 382850 2449617 2212374 -315154 -2414112 -1905207 1086961
7210 1086961 4492737 5397985 2384372 -2072380 -3408364 -501338 2743633 2885089 1358337
7201 1358337 992322 865541 -1659677 -5518848 -6854664 -4940663 -3206721 -3826191 -4712475
7192 -4712475 -3115029 396479 2995008 2928027 606153 -2415865 -4610780 -5379506 -5236301
7183 -5236301 -4619720 -2855988 671258 4668383 6581805 5124015 1265651 -2892801
7175 -2892801 -5289973 -4803192 -2521196 -1443016 -3123876 -5127556 -3768257 955768
7167 955768 5274375 6349956 4820800 2501001 -20789 -2652497 -4657645 -5411537 -5127525
$$ packed form
7228b313960o54205q61804k38351M58130J35405j75203Q98854K001021J014407
7219B64294q52639n77705J548900K066767k37243k527528k098958N08905K992168
7210A086961L405776R05248l013613m456752j335984K907026L244971J41456j526752
7201A358337l66015j26781k525218l859171j335816J914001J733942o19470q86284
7192d712475J597446L511508K598529o6981k321874l022018k194915p68726J43205
7183e236301O16581J763732L527246L997125J913422j457790l858364m158452
7175b892801k397172M86781K281996J078180j680860k003680J359299M724025
7167I55768M318607J075581j529156k319799k521790k631708k005148p53892K84012
$$ plain form
7158 -5127525 -4236808 -3209588 -3171275 -5046639 -7651551 -8354279 -6279428 -3212020 -691528
7149 -691528 1887799 5250149 8195083 9132563 8315359 7029683 5684967 4188934 3130909
7140 3130909 2867054 2219940 -75467 -3059347 -4475406 -3856729 -2892147 -2529092 -1520161
7131 -1520161 1339384 4888636 6690114 5784379 3373176 1144257 -139281 -499542 -140881
7122 -140881 687200 1772183 3199040 5096208 6819013 6966659 4959657 2369159 1735797
7113 1735797 3738950 6153072 6119441 3233169 51429 -403668 2407937 5962302 7119801
7104 7119801 5271493 2646259 1272701 686228 -251329 -424366 2245055 6688853 8711460
7095 8711460 6289269 2532034 1623573 3663553 5548198 5395950 3751563 1592178 -265958
$$ packed form
7158e127525Q90717J027220L8313j875364k604912p02728K074851L067408K520492
7149f91528K579327L362350K944934R37480q17204j285676j344716j496033j058025
7140C130909k63855o47114k295407k983880j416059O18677R64582L63055J008931
7131a520161K859545L549252J801478r05735k411203k228919j283538l60261L58661
7122a40881Q28081J084983J426857J897168J722805J47646k007002k590498o33362
7113A735797K003153K414122l3631k886272l181740m55097K811605L554365J157499
7104G119801j848308k625234j373558n86473r37557j73037K669421M443798K022607
7095H711460k422191l757235r08461K039980J884645j52248j644387k159385j858136
$$ plain form
7086 -265958 -520096 1181263 2505246 797029 -2923796 -5103574 -5021913 -5955242 -9865893
7077 -9865893 -13702587 -13046825 -7846843 -2561678 -1295822 -4057974 -7304946 -7334034 -3594156
7068 -3594156 936134 3141893 3328486 4269356 7083484 10035792 11573211 12101779 11824035
7059 11824035 9312186 4078936 -1274032 -3655901 -3151685 -2204339 -2081507 -2094087 -1674397
7050 -1674397 -1264515 -1308659 -1900222 -3285700 -5451869 -7463261 -8327745 -8072773 -6873119
7041 -6873119 -3964504 894772 5499392 6849865 4828527 2423377 1995346 2945566 3453497
7032 3453497 2866410 1638581 260548 -879275 -1518351 -2033020 -3030691 -4031410 -3733908
7023 -3733908 -2127401 -920992 -955289 -698634 1149360 2821195 1459985 -2526378 -5507162
$$ packed form
7086b65958k54138J701359J323983j708217l720825k179778Q1661r33329l910651
7077i865893l836694O55762N199982N285165J265856k762152l246972k9088L739878
7068c594156M530290K205759J86593R40870K814128K952308J537419N28568k77744
7059A1824035k511849n233250n352968k381869N04216R47346J22832j2580M19690
7050a674397M09882m4144n91563j385478k166169k011392q64484K54972J199654
7041f873119K908615M859276M604620J350473k021338k405150m28031R50220N07931
7032C453497n87087j227829j378033j139823o39076n14669r97671j000719K97502
7023c733908J606507J206409l4297K56655J847994J671835j361210l986363k980784
$$ plain form
7014 -5507162 -5452215 -4485331 -5400674 -7399032 -7244204 -3856255 296771 2431034 2364492
7005 2364492 1745921 1838369 2971626 5142860 7936293 10229834 10999895 10413052 9530020
6996 9530020 9052653 8873141 8621955 7995883 6630175 4342927 1689101 -194092 -612463
6987 -612463 -149835 -399662 -2631701 -6328299 -9138398 -8956528 -6216853 -3476244 -2592645
6978 -2592645 -3147288 -3747382 -3599044 -2375222 -137529 1695943 1045987 -1706685 -2999842
6969 -2999842 -494542 3327611 4487638 3120343 2584322 3701308 3647420 944230 -2074599
6960 -2074599 -3003829 -2547715 -2480880 -3018864 -3704618 -4494032 -4509357 -2233235 1439218 3000846
6950 3000846 1129670 -1028762 -671011 502902 16204 -374750 2319967 6249859 6688015
$$ packed form
7014e507162N4947R66884r15343j998358J54828L387949M153026K134263o6542
7005B364492o18571R2448J133257K171234K793433K293541P70061n86843q83032
6996I530020m77367j79512k51186o26072j365708k287248k653826j883193m18371
6987f12463M62628k49827k232039l696598k810099J81870K739675K740609Q83599
6978b592645n54643o00094J48338J223822K237693J833472o49956k752672j293157
6969b999842K505300L822153J160027j367295n36021J116986n3888k703190l018829
6960b074599r29230M56114O6835n37984o85754p89414j5325K276122L672453J561628
6950C000846j871176k158432L57751J173913m86698l90954K694717L929892M38156
$$ plain form
6941 6688015 3552935 1938163 4353769 7001435 5650184 1523827 -1235686 -1300810 -425975
6932 -425975 463024 2428098 5866598 8895156 9226002 6835054 4003952 2653406 2130340
6923 2130340 381215 -2797755 -5092517 -4930288 -3832065 -4059461 -5265626 -5428338 -4060034
6914 -4060034 -2260400 -396872 1791440 3375000 3215064 2392126 2766529 3345663 1434578
6905 1434578 -2316805 -3711613 -1001156 2344006 2573233 365570 -1359461 -1611613 -1068154
6896 -1068154 27654 1344836 1676118 695551 -315169 -1197867 -3976144 -9010737 -12669223
6887 -12669223 -11707601 -7820023 -4783188 -3150474 -1184003 945103 1957167 3011642
6879 3011642 6029036 9258088 9030257 5659516 3039478 2317016 895603 -1565407 -1567192
$$ packed form
6941F688015l135080j614772K415606K647666j351251m126357k759513o5124Q74835
6932d25975Q88999J965074L438500L028558L30846k390948k831102j350546n23066
6923B130340j749125l178970k294762J62229J098223k27396j206165j62712J368304
6914d060034J799634J863528K188312J583560j59936q22938L74403N79134j911085
6905A434578l751383j394808K710457L345162K29227k207663j725031k52152N43459
6896a068154J095808J317182L31282r80567j010720q82698k778277n034593l658486
6887a2669223R61622L887578L036835J632714J966471K129106J012064J054475
6879C011642L017394L229052k27831l370741k620038p22462j421413k461010j785
$$ plain form
6870 -1567192 1723005 3383645 -449915 -6454063 -8597071 -6069980 -2977677 -2020458
6862 -2020458 -2224109 -1975466 -1049301 88226 683049 -144826 -1917753 -2464020 -758183
6853 -758183 1310184 1933746 2389812 4547855 7176956 7953639 7713858 8876834 10425387
6844 10425387 8748029 3694701 -443335 -1128198 -923038 -2837327 -5620931 -6138716 -4055679
6835 -4055679 -1638882 -495014 -723570 -2039163 -3582621 -3437849 -303863 4581788 8375695
6826 8375695 9159671 7000455 3512274 1133185 1608411 4123483 5915488 5485893 3908985
6817 3908985 2308916 112451 -2713393 -3827353 -1384878 2550906 4036480 1989778
6809 1989778 -1411490 -4409512 -7118351 -9400673 -9930311 -8109340 -5136903 -2503004
$$ packed form
6870a567192L290197J660640l833560o004148k143008K527091L092303R57219
6862b020458k03651K48643R26165J137527N94823q27875j772927n46267J705837
6853g58183K068367O23562M56066K158043K629101P76683k39781J162976J548553
6844A0425387j677358n053328m138036o84863K05160j914289k783604n17785K083037
6835d055679K416797J143868k28556j315593j543458J44772L133986M885651L793907
6826H375695P83976k159216l488181k379089M75226K515072J792005m29595j576908
6817C908985j600069k196465k825844j113960K442475L935784J485574k046702
6809A989778l401268k998022k708839k282322n29638J820971K972437K633899
$$ plain form
6801 -2503004 -679179 425509 986889 1467447 2161443 2486864 1797113 709705 453163
6792 453163 1192103 2201919 3130286 3651958 2762186 473509 -586346 2000805 6251191
6783 6251191 7377283 3920931 -609300 -2819677 -3034984 -2730813 -1673806 302525 1405596
6774 1405596 373422 -1080796 -840149 206407 -67281 -1154336 -702609 1407184 2502334
6765 2502334 769240 -2590604 -5085346 -5224932 -2983212 547433 3625890 4979987
6757 4979987 4739613 3878505 3063140 2399394 1546406 -345078 -3614579 -6362571 -5400324
6748 -5400324 -289543 5032573 6380633 3936304 1110720 106035 582335 1488412 1784544
6739 1784544 148831 -3520842 -6735648 -6887677 -4746849 -3222604 -3089277 -2503438 -528020
$$ packed form
6801b503004J823825J104688N61380M80558O93996L25421o89751j087408k56542
6792D53163P38940J009816R28367N21672q89772k288677j059855K587151M250386
6783F251191J126092l456352m530231k210377k15307L04171J057007J976331J103071
6774A405596j032174j454218K40647J046556k73688j087055M51727K109793J095150
6765B502334j733094l359844k494742j39586K241720L530645L078457J354097
6757D979987k40374q61108q15365o63746q52988j891484l269501k747992R62247
6748e400324N110781N322116J348060k444329k825584j004685M76300R06077K96132
6739A784544j635713l669673l214806j52029K140828J524245J33327N85839J975418
$$ plain form
6730 -528020 1674433 3356000 5122258 6796391 6900499 5069606 2764620 866364 -1300759
6721 -1300759 -3912579 -5824861 -6475703 -6390517 -5253818 -2065827 2043004 4129736 3846769
6712 3846769 4471316 7708190 10525689 9708492 6812012 5397420 5523407 4653550 2564782
6703 2564782 1361275 1176669 -155759 -2821523 -4058260 -2516632 -472682 -143064 -397716
6694 -397716 813211 2661751 2501911 -113539 -2661322 -2858890 -1054364 826175 1432825
6685 1432825 543838 -1552477 -4224987 -6315559 -6778115 -5869193 -5106561 -5505730 -6223407
6676 -6223407 -5523350 -2757357 1274153 5480169 8928919 10435329 9204664 6167191
6668 6167191 3271558 990627 -1963905 -5710675 -7724556 -5833827 -1529110 1494565
$$ packed form
6730e28020K202453J681567J766258J674133J04108j830893k304986j898256k167123
6721a300759k611820j912282o50842Q5186J136699L187991M108831K086732k82967
6712C846769O24547L236874K817499q17197k896480j414592J25987q69857k088768
6703B564782j203507j84606j332428k665764j236737J541628K043950L29618k54652
6694c97716J210927J848540j59840k615450k547783j97568J804526J880539O06650
6685A432825q88987k096315k672510k090572m62556R08922P62632l99169p17677
6676f223407P00057K765993M031510M206016L448750J506410j230665l037473
6668F167191k895633k280931k954532l746770k013881J890729M304717L023675
$$ plain form
6660 1494565 1528917 38001 -890826 -687561 -55649 -32608 -1286479 -3142406 -3501254
6651 -3501254 -1119666 2161548 3124614 1324857 -198912 1006394 3705366 5054462
6643 5054462 4353559 3093626 2168805 1087087 -57713 143352 2189861 4091775 3538299
6634 3538299 1104523 -296121 780189 2651616 3326132 3422874 4784329 7115956 7996910
6625 7996910 6212452 3301913 1365086 878444 1371368 2809128 5166423 7564571 8941696
6616 8941696 9046171 8097150 6283096 4353541 3678810 4571073 5385385 4616256 3194577
6607 3194577 3134062 4321898 4515554 2733145 874306 1104505 2906554 4005056 3615394
6598 3615394 3320532 4438950 5701322 4701030 1376262 -1356651 -1057583 1358946 3426695
$$ packed form
6660A494565L4352j490916r28827K03265O31912K3041j253871j855927l58848
6651c501254K381588L281214R63066j799757j523769J205306K698972J349096
6643E054462p00903j259933r24821j081718j144800K01065K046509J901914n53476
6634C538299k433776j400644J076310J871427O74516R6742J361455K331627Q80954
6625G996910j784458k910539j936827m86642M92924J437760K357295K398148J377125
6616H941696J04475r49021j814054j929555o74731Q92263Q14312p69129j421679
6607C194577o0515J187836J93656j782409j858839K30199J802049J098502l89662
6598C615394k94862J118418J262372j000292l324768k732913K99068K416529K067749
$$ plain form
6589 3426695 4797598 7114227 10553581 12928441 12829775 11424077 10030441 8062913 5039846
6580 5039846 2713491 2904401 4456732 4760741 3591386 3104510 4417842 6457011 8010487
6571 8010487 8684463 7870878 5246597 2738671 3513934 7926128 12458116 13949284 13141426
6562 13141426 12596158 12768183 12258095 11027235 10866397 12355149 13302598 11338094 7061018
6553 7061018 3349998 1826323 1290079 103901 -996573 233050 4163429 8266273
6545 8266273 10032612 9845658 10066278 11892213 13993865 13959960 10509981 4613978 -1124874
6536 -1124874 -4573515 -5832033 -6431821 -6917180 -6434720 -4860889 -3590047 -3434601 -3501434
6527 -3501434 -3259027 -3815333 -5561582 -6506060 -5147862 -3283939 -3292970 -4065412 -2758824
$$ packed form
6589C426695J370903K316629L439354K374860r8666j405698j393636j967528l023067
6580E039846k326355J90910J552331L04009j169355m86876J313332K039169J553476
6571H010487O73976q13585k624281k507926P75263M412194M531988J491168q07858
6562A3141426n45268J72025n10088j230860j60838J488752R47449j964504m277076
6553G061018l711020j523675n36244j186178j100474J229623L930379M102844
6545H266273J766339j86954K20620J825935K101652l3905l449979n896003n738852
6536a124874l448641j258518n99788m85359M82460J573831J270842J55446o6833
6527c501434K42407n56306j746249r44478J358198J863923r031p72442J306588
$$ plain form
6518 -2758824 418614 2702774 3605081 5475213 8922084 11348394 11026004 9352502 7840208
6509 7840208 5992093 3657826 2427184 2719152 2246360 -327636 -2594176 -1786365 1017047
6500 1017047 2698511 2513315 2076087 2298024 3030971 4637487 7012930 7715801 4064846
6491 4064846 -2883128 -8945173 -11488426 -11217676 -9368679 -5933867 -1487426 1743943
6483 1743943 2203040 892275 -309622 -933733 -1356209 -1272352 -319826 639732 597413 339559
6473 339559 1465576 3346119 3008356 -963202 -5915185 -8049632 -6940109 -5347259 -5103226
6464 -5103226 -5457071 -5589839 -6045917 -6518151 -4890022 -713677 2506925 1506848 -1710082
6455 -1710082 -2503007 -418135 683241 -582314 -755695 2394191 5562899 4625873 694532
$$ packed form
6518b758824L177438K284160R02307J870132L446871K426310l22390j673502j512294
6509G840208j848115k334267j230642K91968m72792k573996k266540Q07811K803412
6500A017047J681464j85196m37228K21937P32947J606516K375443P02871l650955
6491D064846o947974o062045k543253K70750J848997L434812M446441L231369
6483A743943M59097j310765j201897o24111m22476Q3857R52526R59558m2319k57854
6473C39559J126017J880543l37763l971558m951983k134447J109523J592850K44033
6464e103226l53845j32768m56078m72234J628129M176345L220602j000077l216930
6455a710082p92925K084872J101376j265555j73381L149886L168708r37026l931341
$$ plain form
6446 694532 -1936777 -1923861 -1486796 -2098730 -3002134 -3573028 -3982310 -3424008 -632585 3198021
6436 3198021 4551685 1783407 -2609679 -4996873 -4508756 -2879319 -1577298 -460385
6428 -460385 1106725 2887318 3756764 2696407 -319505 -4269103 -7644035 -8962247 -7338301
6419 -7338301 -3553590 -466705 -921310 -4508394 -7471415 -6739079 -3193702 -57502 940981
6410 940981 511755 -231797 -1045193 -1914858 -2565366 -2865342 -2868168 -2375832 -1185419 232192
6400 232192 957046 581176 -439125 -1273871 -1320833 -658325 -122900 -465541 -1310266 -1672658
6390 -1672658 -1544795 -1741715 -1868754 -138061 3714394 6875005 6546941 3722114 2069945
6381 2069945 3405189 5874600 6695328 5354682 3644759 3238432 3774481 3518204 1965159
$$ packed form
6446F94532k631309J2916M37065o11934r03404n70894m09282N58302K791423L830606
6436C198021J353664k768278m393086k387194M88117J629437J302021J116913
6428d60385J567110J780593Q69446j060357l015912l949598l374932j318212J623946
6419g338301L784711L086885m54605l587084k963021P32336L545377L136200R98483
6410I40981m29226p43552q13396q69665o50508k99976k826M92336J190413J417611
6400B32192P24854l75870j020301q34746m6962O62508N35425l42641q44725l62392
6390a672658J27863j96920j27039J730693L852455L160611l28064k824827j652169
6381B069945J335244K469411Q20728j340646j709923m06327N36049k56277j553045
$$ plain form
6372 1965159 1058101 2716205 5666478 6626298 4744670 2656431 2483940 3201058 3159754
6363 3159754 2709836 2414897 1023335 -2141306 -4462857 -2676929 2565124 7342239 9210330
6354 9210330 9147308 9202797 10183685 11411276 11332062 8918347 5463884 3671193 3864130
6345 3864130 3259056 736983 -408386 2604954 6937652 7840990 5617178 4500923 5790676
6336 5790676 6753485 5883534 4557642 3337692 1186108 -1083034 -993843 1006045 1303085
6327 1303085 -1398400 -4271508 -5150996 -5083810 -4836452 -3159837 -386954 411926 -1777752
6318 -1777752 -3719827 -2951416 -1339876 -1001671 -398188 2256991 5012140 5280527 4315871
6309 4315871 4918250 6732401 7261675 5803452 3286364 70790 -3016972 -3559914 -966798
$$ packed form
6372A965159r07058J658104K950273R59820j881628k088239j72491P17118m1304
6363C159754m49918k94939j391562l164641k321551J785928N242053M777115J868091
6354I210330o3022N5489R80888J227591p9214k413715l454463j792691J92937
6345C864130o05074k522073j145369L013340M332698R03338k223812j116255J289753
6336E790676R62809q69951j325892j219950k151584k269142Q9191J999888K97040
6327A303085k701485k873108q79488O7186K47358J676615K772883P98880k189678
6318a777752j942075P68411J611540L38205O03483K655179K755149K68387r64656
6309D315871O02379J814151N29274j458223k517088l215574l087762n42942K593116
$$ plain form
6300 -966798 881590 -1739518 -6629324 -8602138 -7084289 -6310561 -8198983 -9548603 -7286691
6291 -7286691 -2829542 353429 958530 158276 -492408 -185084 993808 2209960 2750114
6282 2750114 2849621 3141821 3745130 4576035 5798972 7178908 7999935 8404666 9357752
6273 9357752 10330583 9048114 5136621 1882870 2139060 4381578 5343195 4733769 4488456
6264 4488456 5012343 5436024 6292718 8519853 10767754 11064014 10239340 10275003 10311976 8246099
6254 8246099 5434577 5286742 7383500 7734071 5269393 3257622 3343156 3205660 1912118
6245 1912118 2592212 6868358 10879083 10502686 7349954 5808591 6582022 6993479 5987120
6236 5987120 4984626 4575363 3763809 2418962 1832126 2673877 4255825 5762975 6739014
$$ packed form
6300i66798J848388k621108m889806j972814J517849P73728j888422j349620K261912
6291g286691M457149L182971O05101q00254o50684L07324J178892J216152N40154
6282B750114R9507K92200O03309Q30905J222937J379936Q21027M04731R53086
6273I357752R72831j282469l911493l253751K56190K242518R61617o09426k45313
6264D488456N23887M23681Q56694K227135K247901K96260q24674L5663L6973k065877
6254H246099k811522j47835K096758L50571k464678k011771Q5534j37496j293542
6245A912118O80094M276146M010725l76397l152732j541363P73431M11457j006359
6236E987120j002494m09263q11554j344847n86836Q41751J581948J507150R76039
$$ plain form
6227 6739014 6658253 5396228 3806995 2737956 1994912 1184525 675564 682429 499622 -109159
6217 -109159 23595 1490062 2586459 1447110 -1005601 -2268357 -1793066 -1200142 -1268573
6208 -1268573 -953256 304208 1236564 493806 -1543230 -3343237 -3709005 -2285573 450746
6199 450746 3118636 4020196 2479796 -523308 -3224231 -4396932 -3910412 -2468386 -1065228
6190 -1065228 -516802 -1176628 -2706975 -3921636 -3340235 -682951 2284681 3287730 2064008
6181 2064008 501441 121906 510106 634089 506083 666067 934157 713345 4059
6172 4059 -726926 -1256507 -1535087 -1468479 -1442003 -2413094 -4648015 -6909450 -7757615 -7162042
6162 -7162042 -5947102 -4217867 -1584609 1177408 1926328 -901207 -6560633 -12323789
$$ packed form
6227F739014q0761j262025j589233j069039p43044q10387n08961O865j82807o08781
6217a09159J32754J466467J096397j139349k452711j262756M75291N92924o8431
6208a268573L15317J257464R32356p42758k037036j800007l65768J423432K736319
6199D50746K667890R01560j540400l003104k700923j172701M86520J442026J403158
6190a065228N48426o59826j530347j214661N81401K657284K967632J003049j223722
6181B064008j562567l79535L88200J23983j28006J59984K68090k20812p09286
6172D059p30985n29581k78580O6608K6476r71091k234921k261435q48165N95573
6162g162042J214940J729235K633258K762017P48920k827535n659426n763156
$$ plain form
6154 -12323789 -15352681 -14663223 -11808996 -9379292 -8325660 -7144939 -4246527 -428116
6146 -428116 2180575 3262377 4708000 7374091 9066383 7265799 3123337 806008
6138 806008 2455647 5402021 5568246 2565796 -341605 -951800 -656504 -1641321 -3498969
6129 -3498969 -4146766 -2939775 -1150021 90569 759611 1150804 1522559 2385302 3924390
6120 3924390 5370886 6059234 6536633 7168158 6381678 2469698 -3081322 -6487417 -6287141
6111 -6287141 -4836517 -4595301 -5207595 -5234445 -4478047 -3046555 -78144 4609580 8894977
6102 8894977 10362986 9247794 7801271 7334730 7331594 7035353 6520380 6222682 6216758 5843457
6092 5843457 3831305 -433059 -5395960 -8219153 -7833264 -5997275 -4647219 -3601000
$$ packed form
6154a2323789l028892O89458K854227K429704J053632J180721K898412L818411
6146d28116K608691J081802J445623K666091J692292j800584m142462k317329
6138H06008J649639K946374J66225l002450k907401o10195K95296r84817j857648
6129c498969o47797J206991J789754J240590O69042L91193L71755Q62743J539088
6120C924390J446496O88348M77399O31525p86480l911980n551020l406095K00276
6111f287141J450624K41216o12294k6850P56398J431492K968411M687724M285397
6102H894977J468009j115192j446523m66541l136k96241n14973k97698n924l73301
6092E843457k012152m264364m962901k823193L85889J835989J350056J046219
$$ plain form
6084 -3601000 -1947374 -250887 234294 -380055 -900327 -764925 -140274 1071440 2948630
6075 2948630 4663234 5037947 3741972 1255272 -1666581 -3795030 -3793283 -1920113 -414890
6066 -414890 -914412 -2331660 -2596448 -1619622 -983531 -1304820 -1506555 -518705 1493812
6057 1493812 3453214 4198097 3488931 2667778 3288424 4577859 3962681 1164833 -358380
6048 -358380 1976646 5741388 6596021 4093518 1351418 -105660 -1688184 -4056641 -5646191
6039 -5646191 -5754286 -6159686 -8253694 -10704915 -11361217 -9840255 -7104865 -4069873 -1889542
6030 -1889542 -2137902 -4965636 -7762484 -7270772 -3136700 1595323 3839058 3758838 4090729
6021 4090729 6219700 7983242 6479545 2350866 -742919 -961452 -82203 330292 1563176
$$ packed form
6084c601000J653626J696487M85181o14349n20272J35402O24651J211714J877190
6075B948630J714604L74713j295975k486700k921853k128449J747J873170J505223
6066d14890m99522j417248k64788R76826O36091l21289k01735R87850K012517
6057A493812J959402P44883p09166q21153O20646J289435o15178k797848j523213
6048c58380K335026L764742Q54633k502503k742100j457078j582524k368457j589550
6039e646191j08095m05400k094008k451221o56302J520962K735390L034992K180331
6030a889542k48360k827734k796848M91712M134072M732023K243735q0220L31891
6021D090729K128971J763542j503697m128679l093785k18533Q79249M12495J232884
$$ plain form
6012 1563176 4537701 6737584 5489213 2360838 812739 942558 402211 -605269 204086
6003 204086 1986982 996821 -2913281 -4613993 -687557 5569190 8638746 7359558 4436357
5994 4436357 1873281 -178676 -1597815 -2063147 -1975584 -1778354 -988414 905109 3482611
5985 3482611 6170528 8683565 9991806 8655721 5237261 2512064 2078756 2619103 2616406
5976 2616406 2444810 2256853 523756 -2950613 -5042587 -3399316 -632253 -1007039 -4211335
5967 -4211335 -6018464 -4508492 -1937080 -373503 868700 2579464 3668399 3415663
5959 3415663 3259219 4465416 5702959 4845053 2196065 194303 332228 1746125 2707777
5950 2707777 2341435 737097 -1586710 -3694398 -4272184 -2610603 249957 2034715 1435271
$$ packed form
6012A563176K974525K199883j248371l128375j548099J29819n40347j007480Q09355
6003B04086J782896r90161l910102j700712L926436O256747L069556j279188k923201
5994D436357k563076k051957j419139m65332Q7563J97230P89940J893523K577502
5985C482611K687917K513037J308241j336085l418460k725197m33308N40347k697
5976B616406j71596j87957j733097l474369k091974J643271K767063l74786l204296
5967d211335j807129J509972K571412J563577J242203J710764J088935k52736
5959C415663j56444J206197J237543q57906k648988k001762J37925J413897R61652
5950B707777l66342j604338k323807k107688n77786J661581K860560J784758n99444
$$ plain form
5941 1435271 -568846 -2098918 -2645180 -3202806 -4530830 -6265197 -7604572 -7908645 -6752435
5932 -6752435 -4356490 -1747932 463549 2888565 5627294 6685304 4356847 635020
5924 635020 -563924 1420502 3642712 4670919 6367302 9344250 10571002 7968323
5916 7968323 4093581 2230415 1579895 -260531 -2406318 -2205524 -77389 1169064 988437
5907 988437 1273356 2321447 2308709 853617 -198463 98825 654201 494215 -492441
5898 -492441 -2801558 -6543602 -9649442 -9874256 -8495584 -8785243 -10795665 -11269049 -9074250
5889 -9074250 -6760119 -5741654 -4131669 -1237214 -229300 -3420542 -7874183 -8917791
5881 -8917791 -6020586 -2324808 -9704 1099458 1607373 1911916 2652548 3606419 3038280
$$ packed form
5941A435271k004117j530072n46262n57626j328024j734367j339375l04073J156210
5932f752435K395945K608558K211481K425016K738729J058010k328457l721827
5924F35020j198944J984426K222210J028207J696383K976948J226752k602679
5916G968323l874742j863166o50520j840426k145787K00794K128135J246453j80627
5907I88437K84919J048091j2738j455092j052080K97288N55376j59986r86656
5898d92441k309117l742044l105840k24814J378672k89659k010422m73384K194799
5889i074250K314131J018465J609985K894455J007914l191242m453641j043608
5881h917791K897205L695778K315104J109162N07915L04543P40632R53871n68139
$$ plain form
5872 3038280 196381 -2557252 -2313390 516455 3089682 4140557 4751841 5588913 5830912
5863 5830912 4975015 3636647 2253043 699339 -548285 -465932 904879 2184641 2350799
5854 2350799 1739802 1316853 1889113 3786462 6148937 6911911 5036303 2501969 2235873
5845 2235873 4033268 4666352 2559844 115373 236950 2613210 5162914 7352383 9628478
5836 9628478 10685159 8338669 3288492 -650582 -960113 1031212 3004773 4814052
5828 4814052 6993645 8090454 6358139 3365917 2891648 5856698 8936175 9076254 7085778
5819 7085778 5374342 4123322 1696994 -2244233 -5887641 -7052104 -4735871 240940
5811 240940 5073749 6728096 5359232 4721857 7386575 10914812 11169901 8226561 5828618
$$ packed form
5872C038280k841899k753633K43862K829845K573227J050875O11284Q37072K41999
5863E830912q55897j338368j383604j553704j247624Q2353J370811J279762J66158
5854B350799o10997m22949N72260J897349K362475P62974j875608k534334k66096
5845B235873J797395O33084k106508k444471J21577K376260K549704K189469K276095
5836I628478J056681k346490n050177l939074l09531J991325J973561J809279
5828D814052K179593J096809j732315k992222m74269K965050L079477J40079j990476
5819G085778j711436j251020k426328l941227l643408j164463K316233M976811
5811B40940M832809J654347j368864o37375K664718L528237K55089k943340k397943
$$ plain form
5802 5828618 5435482 4460512 1196200 -1836811 -1264446 2626849 6539484 7847046 6284901
5793 6284901 3394902 1562849 2289733 4217396 4158429 1219291 -1580087 -1237280 1106016
5784 1106016 1862202 -125544 -2564068 -3404391 -3564583 -5230667 -8576899 -11329571 -11651569
5775 -11651569 -10600074 -10599183 -11491781 -10015596 -4686756 552764 509570 -4059662 -6926161
5766 -6926161 -4619078 -663600 -41242 -2627383 -4618217 -4048021 -1977983 224261 1910240
5757 1910240 2346837 1410608 598865 1347559 2860843 3280943 2226636 510965 -1635166
5748 -1635166 -4126480 -5761311 -5481300 -4195353 -3466219 -3197964 -2471932 -1564029 -962704
5739 -962704 409357 3385934 6034561 5910089 4005709 3145147 2968297 361319 -4836451
$$ packed form
5802E828618l93136r74970l264312l033011N72365L891295L912635J307562j562145
5793F284901k889999j832053P26884J927663n8967k939138k799378L42807K343296
5784A106016P56186j987746k438524q40323j60192j666084l346232k752672l21998
5775a1651569J051495Q91q92598J476185N328840N239520m3194m569232k866499
5766f926161K307083L955478O22358k586141j990834N70196K070038K202244J685979
5757A910240M36597r36229q11743P48694J513284M20100j054307j715671k146131
5748a635166k491314j634831K80011J285947P29134K68255P26032R07903O01325
5739i62704J372061K976577K648627j24472j904380q60562j76850k606978n197770
$$ plain form
5730 -4836451 -8502261 -7872779 -5166706 -3859285 -4123701 -3934122 -2481118 -426765 1699744
5721 1699744 3608620 4847446 5442340 5791703 5270796 2642100 -1372127 -4015647 -4229426
5712 -4229426 -4367314 -6514824 -8999341 -8712875 -5577739 -2436625 -1177420 -952023 -21331
5703 -21331 2130152 4494744 5484444 4428504 2559748 1763281 2013080 1338847 -1042767
5694 -1042767 -3149690 -2854609 -594109 1815095 3636155 5027578 5749038 5713699 5730163
5685 5730163 6130299 5825371 4349898 3498468 4922806 7326761 8391936 8532201 10111944
5676 10111944 13417189 16012427 16056532 14025856 11292058 9176996 9045821 10744173 11173006
5667 11173006 7413384 1395271 -1870756 -1294965 -1205425 -4431245 -7826883 -7384057 -4380330
$$ packed form
5730d836451l665810O29482K706073J307421k64416J89579J453004K054353K126509
5721A699744J908876J238826N94894L49363n20907k628696m014227k643520k13779
5712d229426j37888k147510k484517K86466L135136L141114J259205K25397R30692
5703b1331K151483K364592R89700j055940j868756p96467K49799o74233k381614
5694a042767k106923K95081K260500K409204J821060J391423P21460l5339J6464
5685E730163M00136l04928j475473q51430J424338K403955J065175J40265J579743
5676A0111944L305245K595238M4105k030676k733798k115062j31175J698352M28833
5667A1173006l759622o018113l266027N75791Q9540l225820l395638M42826L003727
$$ plain form
5658 -4380330 -2700233 -2556608 -1356485 593239 261279 -2125869 -2162619 2065655 6452846
5649 6452846 6567605 3735443 2223297 2559568 1522796 -1938333 -4541345 -3147433 1334675
5640 1334675 5694997 8105662 8788431 8509752 7863623 7222837 6292490 4368660 1852606
5631 1852606 584280 1586307 3321774 3539250 2237685 1269724 1310054 909972 -1215615
5622 -1215615 -4418339 -7104473 -8293689 -7659521 -5178926 -1614938 1395933 2633616
5614 2633616 2394883 1865658 1811370 2245029 2838612 3144175 2782567 1818712 610318 -942536
5604 -942536 -3417104 -6724166 -9492343 -10175874 -8519689 -5611085 -2879520 -1341403 -1247738
5595 -1247738 -1875813 -1957659 -771302 1409527 4131751 7394668 10885527 13123070 12376328
$$ packed form
5658d380330J680097J43625J200123J949724l31960k387148l6750M228274M387191
5649F452846J14759k832162j512146L36271j036772l461129k603012J393912M482108
5640A334675M360322K410665O82769k78679o46129o40786r30347j923830k516054
5631A852606j268326J002027J735467K17476j301565r67961M0330m00082k125587
5622a215615l202724k686134j189216O34168K480595L563988L010871J237683
5614B633616k38733n29225n4288M33659N93583L05563l61608r63855j208394j552854
5604i42536k474568l307062k768177o83531J656185K908604K731565J538117R3665
5595a247738o28075q1846J186357K180829K722224L262917L490859K237543p46742
$$ plain form
5586 12376328 8633754 4068879 1114084 170957 -402369 -1805346 -2696972 -548190 4575882
5577 4575882 8739060 7883270 2332079 -3733394 -6862183 -6834896 -4925299 -1915385 1487060
5568 1487060 4147437 5576569 6278239 6259485 4623424 1516140 -1102019 -1812128 -1427481
5559 -1427481 -1164211 -825946 -406691 -1713862 -6034567 -11353306 -14428802 -14932299 -14928276
5550 -14928276 -14664330 -11887564 -5975890 -202753 1565466 -838029 -3881469 -3877464 -117201
5541 -117201 4757090 7281567 6661099 5519483 6536401 9148022 10839905 10804403 10393629
5532 10393629 10469789 10516544 10262757 9929007 8727372 5480053 1211975 -1214858 -890888
5523 -890888 -162017 -1190792 -3255447 -4589507 -4889916 -4525779 -2977683 219169 4111186
$$ packed form
5586A2376328l742574m564875k954795r43127n73326j402977q91626K148782N124072
5577D575882M163178q55790n551191o065473l128789K7287J909597L009914L402445
5568A487060K660377J429132P01670j8754j636061l107284k618159p10109L84647
5559a427481K63270L38265M19255j307171m320705n318739l075496n03497M023
5550a4928276K63946K776766N911674N773137J768219k403495l043440M005L760263
5541a17201M874291K524477o20468j141616J016918K611621J691883l5502m10774
5532A0393629P6160M6755k53787l33750j201635l247319m268078k426833L23970
5523h90888P28871j028775k064655j334060l00409L64137J548096L196852L892017
$$ plain form
5514 4111186 7282001 9208254 9712174 8358164 5464187 2421475 15808 -2114763
5506 -2114763 -3451809 -2089313 2150380 6109629 7026260 6292122 7010225 9066864 9470146
5497 9470146 6945641 3325364 405300 -1935914 -4067674 -5336542 -5229436 -4180656
5489 -4180656 -2663753 -831213 705436 1257400 1523188 3076779 5850924 7599477 6654995
5480 6654995 4115947 2497776 2948132 4398681 4999705 4086230 2966080 3460319 5211031
5471 5211031 5325131 1928876 -2723226 -4526915 -2525945 474138 2199035 3259024
5463 3259024 4542075 4885574 3073023 352032 -1042740 -868224 -627178 -1060826 -1533940
5454 -1533940 -1487442 -964961 163499 2182510 4694399 6812367 8170415 8867322 8595142
$$ packed form
5514D111186L170815J926253N03920j354010k893977l042712k405667k130571
5506b114763j337046J362496M239693L959249R16631p34138P18103K056639M03282
5497I470146k524505l620277k920064k341214k131760j268868J07106J048780
5489d180656J516903J832540J536649N51964K65788J553591K774145J748553r44482
5480F654995k539048j618171M50356J450549O01024r13475j120150M94239J750712
5471E211031J14100l396255m652102j803689K000970L000083J724897J059989
5463C259024J283051L43499j812551k720991j394772J74516K41046m33648m73114
5454a533940M6498N22481J128460K019011K511889K117968J358048O96907k72180
$$ plain form
5445 8595142 6946384 4671960 3499017 4226691 5766829 6505758 5917377 4325294 1871086
5436 1871086 -1206894 -3548932 -3298382 -375508 2796998 3879614 3428250 3824071 5539967
5427 5539967 6231771 4317992 1848965 2144792 5359275 8210677 8055988 5743663 4238959
5418 4238959 5579775 9261295 12474862 11967534 7079735 1192372 -1203036 745415
5410 745415 3634907 4073452 1931734 -1007261 -3541647 -5019093 -4642964 -2549977 -434711
5401 -434711 484010 1121483 2632398 4022009 3663042 2383079 2682575 5045447 7282929
5392 7282929 7797232 7374413 7121075 6607806 5155463 3435510 2497428 2211553 1804621
5383 1804621 1121493 336104 -771251 -2113817 -2614609 -1576592 -253534 -499466 -1896711
$$ packed form
5445H595142j648758k274424j172943P27674J540138P38929n88381j592083k454208
5436A871086l077980k342038K50550K922874L172506J082616m51364L95821J715896
5427E539967O91804j913779k469027K95827L214483K851402j54689k312325j504704
5418D238959J340816L681520L213567n07328m887799n887363k395408J948451
5410G45415K889492M38545k141718k938995k534386j477446L76129K092987K115266
5401d34711R18721O37473J510915J389611l58967j279963K99496K362872K237482
5392G282929N14303m22819k53338n13269j452343j719953r38082k85875m06932
5383A804621o83128p85389j107355j342566n00792J038017J323058k45932j397245
$$ plain form
5374 -1896711 -1825917 1095687 4965712 6826733 5940081 3758894 1383850 -1449662 -4838401
5365 -4838401 -7564027 -8214327 -6833001 -4908649 -4092986 -5150561 -7483367 -9221542 -8553711
5356 -8553711 -5822188 -3754614 -4548159 -6955721 -7358840 -3754215 2289595 7620214 10285317
5347 10285317 10194430 8456417 6873151 7018547 8697008 9814964 8656970 5893331 3579334
5338 3579334 2636193 2262592 1557246 631397 -62324 -644601 -1560150 -2793282 -3788804
5329 -3788804 -4172037 -4331499 -5067739 -6608270 -8218925 -8971253 -8524870 -6833441 -3782890
5320 -3782890 -60473 2227226 1436798 -1003146 -1522511 1408698 5372719 6952476 5247852
5311 5247852 1754928 -1612129 -3212984 -2070428 700964 2154247 1099393 271990
$$ packed form
5374a896711P0794K921604L870025J861021q86652k181187k375044k833512l388739
5365d838401k725626o50300J381326J924352Q15663j057575k332806j738175O67831
5356h553711K731523K067574p93545k407562m03119L604625O043810N330619K665103
5347A0285317r0887j738013j583266J45396J678461J117956j157994k763639k313997
5338C579334r43141l73601p05346r25849o93721n82277r15549j233132r95522
5329c788804l83233j59462p36240j540531j610655p52328M46383J691429L050551
5320c782890L722417K287699p90428k439944n19365K931209L964021J579757j704624
5311E247852l492924l367057j600855J142556K771392J453283j054854q27403
$$ plain form
5303 271990 2699362 6889926 8436519 6133843 3534425 3876584 6185106 7593263 7263895
5294 7263895 6326404 5494785 4565734 3454858 2209784 390050 -2407791 -5516380 -7344166
5285 -7344166 -6492511 -2724271 2492568 6314892 6464955 3407101 -120243 -2037044 -2524588
5276 -2524588 -2583578 -2428866 -2057342 -2131157 -3166323 -4621517 -5703620 -6345257 -6600441
5267 -6600441 -6003275 -4590727 -3771478 -4884458 -7225246 -8540786 -7314463 -3891177 246128
5258 246128 3582718 5346506 5865485 5906941 5484397 4140991 2580345 2427243 3487170
5249 3487170 3072896 -160331 -3228180 -2173826 2391680 5937361 6178585 5719921 7723017
5240 7723017 11472346 13745456 12750719 9086965 4253591 3847 -1881574 -1169893 -110398
$$ packed form
5303B71990K427372M190564J546593k302676k599418L42159K308522J408157l29368
5294G263895r37491q31619r29051j110876j245074j819734k797841l108589j827786
5285g344166Q51655L768240N216839L822324J50063l057854l527344j916801m87544
5276b524588n8990J54712L71524p3815j035166j455194j082103o41637k55184
5267f600441N97166J412548Q19249j112980k340788j315540J226323L423286M137305
5258B46128L336590J763788N18979M1456m22544j343406j560646j53102J059927
5249C487170m14274l233227l067849J054354M565506L545681K41224m58664K003096
5240G723017L749329K273110r94737l663754m833374m249744j885421P11681J059495
$$ plain form
5231 -110398 -1068159 -3402304 -4325887 -2833409 -923774 -359536 75 2239165 5832976
5222 5832976 7865575 6759595 4303102 3394343 4765305 6734397 7523270 6752519 4861152
5213 4861152 2253479 -496579 -2362133 -2523338 -1123542 980810 2910848 3893075 3296839
5204 3296839 1405675 -44898 844010 3879779 6477862 6210491 3331236 259055 -1107258
5195 -1107258 -789656 441659 2477673 5300201 7671370 7725277 5154747 1884996 29887
5186 29887 -187029 -9454 -499842 -2184786 -5522397 -10200973 -14119917 -14688438 -11692715
5177 -11692715 -7732291 -5202211 -3844502 -1977837 848342 3432729 4478140 3553670
5169 3553670 1012563 -1932174 -3275952 -1537217 2661995 6887330 8949957 8469989
$$ packed form
5231a10398r57761k334145r23583J492478J909635N64238L59611K239090L593811
5222E832976K032599j105980k456493r08759J370962J969092P88873p70751j891367
5213D861152k607673k750058j865554j61205J399796K104352J930038R82227n96236
5204C296839j891164j450573Q88908L035769K598083k67371k879255l072181j366313
5195a107258L17602J231315K036014K822528K371169N3907k570530l269751j855109
5186B9887k16916J77575m90388j684944l337611m678576l918944n68521K995723
5177a1692715L960424K530080J357709J866665K826179K584387J045411r24470
5169C553670k541107k944737j343778J738735M199212M225335K062627m79968
$$ plain form
5161 8469989 6725092 5553360 6228833 8667085 11515779 13339682 13702149 12835171 10597362
5152 10597362 6518799 1010867 -4095051 -6733495 -6337937 -4274202 -2586564 -2423257
5144 -2423257 -3704591 -5949080 -8637021 -10505996 -9584541 -5245738 168481 3377570
5136 3377570 4041222 5062513 8421430 12275625 13375248 11161335 8001458 6069516
5128 6069516 5436676 4921875 3602193 1613492 314816 1288022 4312705 6894915 6890950
5119 6890950 5096312 4050951 4811139 6359199 7809638 9340815 10709946 10620790 8461793
5110 8461793 5576114 3862162 3649738 3634971 2627254 859917 -467132 -822919 -1228245
5101 -1228245 -2897843 -5016166 -5068399 -2119921 1439232 2762523 2259763 2778469 5658362
$$ packed form
5161H469989j744897j171732O75473K438252K848694J823903L62467q66978k237809
5152A0597362m078563n507932n105918k638444L95558K063735J687638J63307
5144b423257j281334k244489k687941j868975R21455M338803N414219L209089
5136C377570O63652J021291L358917L854195J099623k213913l159877j931942
5128F069516o32840n14801j319682j988701j298676R73206L024683K582210l965
5119F890950j794638j045361P60188J548060J450439J531177J369131q9156k158997
5110H461793k885679j713952k12424j4767j007717j767337j327049l55787m05326
5101a228245j669598k118323n2233K948478L559153J323291n02760N18706K879893
$$ plain form
5092 5658362 9509946 12711554 14984960 16055439 14741993 10534890 4946954 283840
5084 283840 -2358500 -3411031 -3837227 -4206780 -4205539 -2930701 -163369 2985189 5535778
5075 5535778 8125021 11534426 14221816 13531251 9669024 6187407 5490165 5875948 4587794
5066 4587794 2138379 1476931 3633678 6326418 6987847 5583116 3982771 3707405 4972778
5057 4972778 7181713 9366659 10270015 8990796 6112594 3525028 2230284 860892
5049 860892 -2208086 -5579213 -5908373 -2912657 -775429 -2736406 -6398835 -6954800 -3449762
5040 -3449762 1170896 5003265 8508451 11335190 11814390 10326398 9662993 10820584 11437825
5031 11437825 9691389 6851901 4549219 2451813 506497 648102 3865557 7778333
$$ packed form
5092E658362L851584L201608K273406J070479j313446m207103n587936m663114
5084B83840k642340j052531m26196l69553J241J274838K767332L148558K550589
5075E535778K589243L409405K687390o90565l862227l481617o97242L85783j288154
5066D587794k449415o61448K156747K692740O61429j404731j600345k75366J265373
5057D972778K208935K184946R03356j279219k878202k587566j294744j369392
5049H60892l068978l371127l29160K995716K137228j960977l662429n55965L505038
5040c449762M620658L832369L505186K826739M79200j487992o63405J157591O17241
5031A1437825j746436k839488k302682k097406j945316J41605L217455L912776
$$ plain form
5023 7778333 9550500 9376022 8841424 7812376 5588235 3442175 2976103 3008374 1138459
5014 1138459 -2067037 -3345706 -1342938 1479523 2120442 476260 -1189971 -1125086 177213
5005 177213 732164 -595572 -2589490 -3007727 -1186208 1725707 4757500 7450648 8272191
4996 8272191 5471272 504677 -2160318 -440154 2479506 2593026 188214 -1720314
4988 -1720314 -1941378 -1396106 -514318 841830 2013024 2641894 4042675 7073437 9819367
4979 9819367 9859547 7656619 5195384 2636613 -738559 -3493006 -3394569 -1288815 -313204
4970 -313204 -1312787 -2001612 -799712 1187336 2229290 1665413 -495949 -3395075 -4781248
4961 -4781248 -2981316 443354 2055713 677638 -1553756 -2070277 -159638 3158213
$$ packed form
5023G778333J772167j74478n34598j029048k224141k146060m66072L2271j869915
5014A138459l205496j278669K002768K822461O40919j644182j666231O4885J302299
5005A77213N54951j327736j993918m18237J821519K911915L031793K693148Q21543
4996H272191k800919m966595k664995J720164K919660J13520k404812j908528
4988a720314k21064N45272Q81788J356148J171194O28870J400781L030762K745930
4979I819367M0180k202928k461235k558771l375172k754447R8437K105754R75611
4970c13204r99583o88825J201900J987048J041954n63877k161362k899126j386173
4961d781248J799932L424670J612359j378075k231394n16521J910639L317851
$$ plain form
4953 3158213 5798374 5713580 3004017 214139 -910385 -1627338 -3484768 -5282919 -5075356
4944 -5075356 -3316607 -1365707 1072364 3883153 4210750 245732 -4406242 -4634779 -999379
4935 -999379 1423388 463042 -1387034 -1921325 -1267894 571517 3487312 4759028 1585717
4926 1585717 -3698806 -5476230 -2164510 2487632 5175330 5606744 3817860 163058
4918 163058 -2015187 899238 6907161 10148304 8721256 5824349 3524937 1167694
4910 1167694 -257114 1483086 4907326 6600474 7813145 12295672 17791606 17817551 12358982
4901 12358982 8099151 7118531 4816454 564629 38414 4214479 6673771 5481696
4893 5481696 6887216 12797743 15883965 12666529 10112865 12845554 15192193 12866125
$$ packed form
4953C158213K640161q4794k709563k789878j124524p16953j857430j798151K07563
4944e075356J758749J950900K438071K810789L27597l965018m651974k28537L635400
4935i99379K422767r60346j850076n34291O53431J839411K915795J271716l173311
4926A585717n284523j777424L311720M652142K687698M31414j788884l654802
4918A63058k178245K914425O007923L241143j427048k896907k299412k357243
4910A167694j424808J740200L424240J693148J212671M482527N495934K5945n458569
4901A2358982m259831r80620k302077m251825n26215M176065K459292j192075
4893E481696J405520N910527L086222l217436k553664K732689K346639k326068
$$ plain form
4885 12866125 10733874 11574031 9918881 5297908 7326028 17961626 24787306 23558922
4877 23558922 28539514 45226854 56141280 57873179 87064633 169360989 256446899
4870 256446899 263679149 175502380 69141894 19397563 20223347 22119423 8326875
4863 8326875 -2017513 -1490692 -3804994 -13005170 -16711076 -10607776 -4817899 -4301353
4855 -4301353 -3215919 -399196 -2460409 -9205405 -11855405 -8299309 -5963021 -7218466
4847 -7218466 -5579039 620968 3746177 232233 -2938706 108212 5597966 7759837
4839 7759837 6683614 4378521 565996 -3577993 -4235267 -1245624 355037 -1806950
4831 -1806950 -3790283 -2300176 418008 1434634 1397019 1116132 -868511 -4306963 -5477991
$$ packed form
4885A2866125k132251Q40157j655150m620973K028120J0635598O825680j228384
4877B3558922M980592J6687340J0914426J731899K9191454Q2296356Q7085910
4870B56446899P232250q8176769j06360486m9744331Q25784J896076j3792548
4863H326875j0344388N26821k314302r200176l705906O103300N789877N16546
4855d301353J085434K816723k061213o744996k650000L556096K336288j255445
4847g218466J639427O200007L125209l513944l170939L046918N489754K161871
4839G759837j076223k305093l812525m143989o57274K989643J600661k161987
4831a806950j983333J490107K718184J016626l7615k80887j984643l438452j171028
$$ plain form
4822 -5477991 -2348393 2363560 5412300 6476658 5886872 3237211 -98990 -1374301
4814 -1374301 -901263 -1762967 -3948344 -3737967 -416827 1773061 556667 -727264 965048
4805 965048 3788925 5262299 6375516 8154234 8458492 5802762 2667091 1581228 1281002
4796 1281002 -72873 -1250493 -770307 -98941 -722928 -1041776 586201 2587038 3039170
4787 3039170 2813957 2822972 1508948 -1350446 -1797823 2873848 8575564 9117391 4535219
4778 4535219 50022 -1743581 -2764158 -4396365 -5549600 -5967573 -7106322 -8846551
4770 -8846551 -8884852 -6473303 -3864078 -2909590 -2640868 -1464651 95156 219119 -1619494
4761 -1619494 -3868763 -4449948 -2888101 -897865 -317010 -446290 1264916 5437618 9351999
$$ packed form
4822e477991L129598M711953L048740J064358n89786k649661l336201j275311
4814a374301M73038q61704k185377K10377L321140K189888j216394j283931J692312
4805I65048K823877J473374J113217J778718L04258k655730l135671j085863l00226
4796A281002j353875j177620M80186O71366o23987l18848J627977K000837M52132
4787C039170k25213R015j314024k859394m47377M671671N701716N41827m582172
4778D535219m485197j793603j020577j632207j153235m17973j138749j740229
4770h846551l8301K411549K609225R54488K68722J176217J559807J23963j838613
4761a619494k249269n81185J561847J990236N80855j29280J711206M172702L914381
$$ plain form
4752 9351999 10267372 8413363 5497549 2316214 -321285 -385920 2938794 6900590 8020083
4743 8020083 6578599 5801002 7228876 9446196 10884128 11131091 9557159 5481679 270676
4734 270676 -3142302 -3662562 -3036157 -2781664 -2199925 -568415 601247 -630816 -3524937
4725 -3524937 -5247875 -4486192 -2980250 -2988178 -4334638 -5000464 -4136246 -3047538 -2789715
4716 -2789715 -2205843 315759 3960893 6117464 5730235 4351418 3701526 3867467 4340752
4707 4340752 5149527 6142436 6499373 5821361 4688805 3545443 2035635 -157489 -2840671
4698 -2840671 -5726796 -8050652 -8125384 -5305747 -2177526 -2124114 -4529964 -5535505 -4142716
4689 -4142716 -3774892 -6265420 -8447266 -7531886 -6050764 -7410944 -9434764 -7171631 -625304
$$ packed form
4752I351999R15373j854009k915814l181335k637499o4635L324714L961796J119493
4743H020083j441484p77597J427874K217320J437932K46963j573932m075480n211003
4734B70676l412978n20260O26405K54493N81739J631510J169662j232063k894121
4725c524937j722938P61683J505942p928j346460o65826Q64218J088708K57823
4716b789715N83872K521602L645134K156571l87229j378817o49892J65941M73285
4707D340752Q08775R92909L56937o78012j132556j143362j509808k193124k683182
4698b840671k886125k323856p4732K819637L128221N3412k405850j005541J392789
4689d142716L67824k490528k181846R15380J481122j360180k023820K263133O546327
$$ plain form
4680 -625304 5126467 7055497 7028701 7392245 7868483 7814635 8105419 9290756 10329180
4671 10329180 10417195 10240600 10551217 11079438 11343499 11025585 9434967 6346383 3386394
4662 3386394 2554697 3157490 2334015 -858359 -3843171 -3709853 -434811 3596272 5873882
4653 5873882 5329395 3169915 2377397 4767293 8313543 9038494 5796598 1502060 -629896
4644 -629896 -277068 897182 1527596 1316760 971989 1782490 4006997 5789272 5311209
4635 5311209 3728702 3782893 5619578 6648094 5818450 4980830 5059718 4097017 995576
4626 995576 -1546989 -452874 3183200 5517502 4775475 2373048 164855 -1158586 -1480152
4617 -1480152 -1181231 -1450251 -2878181 -3931010 -2610120 323765 1609010 -438414 -3541314
$$ packed form
4680f25304N751771J929030k6796L63544M76238n3848K90784J185337J038424
4671A0329180Q8015j76595L10617N28221K64061l17914j590618l088584k959989
4662C386394q31697O02793q23475l192374k984812J33318L275042M031083K277610
4653E873882n44487k159480p92518K389896L546250P24951l241896m294538k131956
4644f29896L52828J174250O30414k10836l44771Q10501K224507J782275m78063
4635E311209j582507N4191J836685J028516q29644q37620P8888r62701l101441
4626I95576k542565J094115L636074K334302p42027k402427k208193j323441l21566
4617a480152K98921k69020j427930j052829J320890K933885J285245k047424l102900
$$ plain form
4608 -3541314 -4203285 -2089592 -432600 -1857605 -4693363 -4554571 224584 5969021 7687685
4599 7687685 5027067 2430430 3383910 6586394 8702245 8991618 9419839 11227249 13456881
4590 13456881 14839710 15490311 16166273 16783839 16308184 13756469 8995467 2920775 -2718784
4581 -2718784 -5948315 -5879323 -3867517 -2700556 -3662038 -4781452 -3375693 -178752 1109557
4572 1109557 -1027710 -3670793 -3896412 -2965057 -3474129 -4537124 -3557452 -1485243 -1768556
4563 -1768556 -4190588 -4602559 -1959045 -888591 -4784060 -10317161 -12101885 -9699646
4555 -9699646 -6363942 -3386540 49794 2929031 2861187 347472 -1248912 -497890 444034
4546 444034 -412256 -2309048 -3788878 -4789082 -5500532 -5209550 -3648594 -1978774 -1180510
$$ packed form
4608c541314o61971K113693J656992j425005k835758J38792M779155N744437J718664
4599G687685k660618k596637R53480L202484K115851K89373M28221J807410K229632
4590A3456881J382829O50601O75962O17566m75655k551715m761002o074692n639559
4581b718784l229531O8992K011806J166961r61482j119414J405759L196941J288309
4572A109557k137267k643083k25619R31355n09072j062995R79672K072209k83313
4563a768556k422032m11971K643514J070454l895469n533101j784724K402239
4555i699646L335704K977402L436334K879237o7844k513715j596384P51022R41924
4546D44034q56290j896792j479830j000204p11450K90982J560956J669820P98264
$$ plain form
4537 -1180510 -665000 435138 1707445 2336673 2630251 3398770 4312131 4100117 2381537
4528 2381537 384764 -458731 -132829 230272 164527 800967 3338353 6808839 8471237
4519 8471237 6923545 3882623 2025626 1825484 1614487 217750 -1806009 -3351082 -3873871
4510 -3873871 -3209028 -1465013 535308 1618205 1481883 932810 674398 524182 92659
4501 92659 -442971 -713579 -903083 -1611895 -2943753 -3903360 -3018636 -87756 2647716
4492 2647716 2004241 -2643788 -7852219 -9044539 -4843310 2134659 8272991 11632015
4484 11632015 12006157 10040767 7005060 4342631 2447581 343391 -2673803 -5447489
4476 -5447489 -5926822 -3788196 -1255915 -715132 -1925727 -2486089 -1103267 735031 1135514
$$ packed form
4537a180510N15510J100138J272307O29228K93578P68519R13361k12014j718580
4528B381537j996773q43495L25902L63101o5745O36440K537386L470486J662398
4519H471237j547692l040922j856997k00142k10997j396737k023759j545073n22789
4510c873871O64843J744015K000321J082897j36322n49073k58412j50216m31523
4501I2659n35630k70608j89504p08812j331858r59607Q84724K930880K735472
4492B647716o43475m648029n208431j192320M201229O977969O138332L359024
4484A1632015L74142j965390l035707k662429j895050k104190l017194k773686
4476e447489m79333K138626K532281N40783j210595n60362J382822J838298M00483
$$ plain form
4467 1135514 810491 2051416 4982163 6901457 6033992 4063141 3545890 4233231 3822482
4458 3822482 1580957 -787210 -1759777 -1702865 -1692987 -2103930 -2855906 -3891736 -4734243 -4336833
4448 -4336833 -2060627 1384141 4106446 4082534 673375 -4104641 -6420985 -4196690 84074
4439 84074 1476241 -2076504 -7629188 -10999990 -11418875 -11317833 -12271603 -12763840 -10431966
4430 -10431966 -5586403 -1445204 -700624 -2551606 -3843760 -2845635 -857962 45716 -418358
4421 -418358 -1192736 -1711893 -2013964 -1829921 -1093667 -943927 -2611252 -5377750 -7163349
4412 -7163349 -7214341 -6660104 -6168668 -4782253 -1863154 1226534 2498701 1591719 -138000
4403 -138000 -1099894 -560915 832472 1106863 -1316039 -5117155 -6440177 -2987234 2988837
$$ packed form
4467A135514l25023J240925K930747J919294q67465j970851n17251O87341m10749
4458C822482k241525k368167r72567N6912R878m10943p51976j035830q42507L97410
4448d336833K276206L444768K722305k3912l409159m778016k316344K224295M280764
4439H4074J392167l552745n552684l370802m18885J01042r53770m92237K331874
4430a0431966M845563M141199P44580j850982j292154R98125J987673R03678m64074
4421d18358p74378n19157l02071J84043P36254J49740j667325k766498j785599
4412g163349n0992N54237M91436J386415K919099L089688J272167r06982j729719
4403a38000r61894N38979J393387K74391k422902l801116j323022L452943N976071
$$ plain form
4394 2988837 6984827 6933466 4410523 1874678 417682 158785 1053818 2514150 3229251
4385 3229251 2170296 -635287 -4571729 -8983444 -12900814 -15029015 -14816513 -13237890
4377 -13237890 -11866032 -11264326 -10740159 -9520744 -7628448 -5594491 -3829204 -2463434
4369 -2463434 -1446847 -551199 505589 1707454 2634661 2867427 2375440 1412963 270792
4360 270792 -662446 -890364 -295428 492356 725926 577558 977173 2128153 2704644 1193059
4350 1193059 -2027515 -4591994 -4509156 -2312142 -375120 -172802 -854726 -797513 164708
4341 164708 883148 818184 591410 557954 194235 -504239 -285140 1671507 4268921 5834235
4331 5834235 6171220 6132456 5996169 5653494 5559534 5783867 4873862 1794262 -1436238 -1465480
$$ packed form
4394B988837L995990n1361k522943k535845j456996k58897Q95033J460332P15101
4385C229251j058955k805583l936442m411715l917370k128201K12502J578623
4377a3237890J371858O01706N24167J219415J892296K033957J765287J365770
4369b463434J016587Q95648J056788J201865R27207K32766m91987r62477j142171
4360B70792r33238k27918N94936P87784K33570j48368L99615J150980N76491j511585
4350A193059l220574k564479Q2838K197014J937022K02318o81924N7213R62221
4341A64708P18440o4964k26774l3456l63719o98474K19099J956647K597414J565314
4331E834235L36985l8764j36287l42675r3960K24333r10005l079600l230500k9242
$$ plain form
4321 -1465480 1997519 5878766 8001838 9052219 9799576 9258278 6817882 3597747 253135
4312 253135 -3994121 -8451185 -9844103 -6620106 -2186510 -1087653 -3581696 -6613053
4304 -6613053 -8407926 -8986317 -7550501 -3097862 2719509 6641913 7774543 7747554 7100809
4295 7100809 4662157 883075 -1367318 -502226 1660335 2662877 2404857 2248097 2670144
4286 2670144 2969702 2400413 872634 -929743 -2017417 -2143221 -1853133 -918645 1915898
4277 1915898 6277828 8945748 7563934 4228322 2718087 3416900 4079783 4334273 5359754
4268 5359754 5761906 2574482 -3074569 -5999756 -4109809 -1281657 -1272438 -2925318 -3894599
4259 -3894599 -5158406 -8359244 -11593445 -11623350 -8595054 -5462426 -4035248 -4117903 -5118512
$$ packed form
4321a465480L462999L881247K123072J050381P47357n41298k440396l220135l344612
4312B53135m247256m457064j392918L223997M433596J098857k494043l031357
4304f613053j794873n78391J435816M452639N817371L922404J132630k6989o46745
4295G100809k438652l779082k250393Q65092K162561J002542k58020j56760M22047
4286B670144K99558n69289j527779j802377j087674j25804K90088R34488K834543
4277A915898M361930K667920j381814l335612j510235O98813O62883K54490J025481
4268E359754M02152l187424n649051k925187J889947K828152R219j652880r69281
4259c894599j263807l200838l234201k9905L028296L132628J427178q2655j000609
$$ plain form
4250 -5118512 -6046595 -5290235 -2784874 -1109841 -2193283 -4358221 -4982638 -4549050 -5270106
4241 -5270106 -6900318 -7025563 -5056754 -3089832 -2750305 -3533780 -4479483 -5467319 -6426463
4232 -6426463 -6781388 -6206473 -5114143 -4279538 -4462589 -6050231 -8543729 -10782509 -11926913
4223 -11926913 -11728590 -10165768 -7978931 -6994844 -7919583 -8270766 -5304688 -915362 -82289
4214 -82289 -3849062 -7862003 -9205229 -10171841 -12789910 -14245585 -11736360 -8149761 -8060288
4205 -8060288 -10515878 -10677512 -7140558 -3078788 -1026940 -704202 -1500137 -3364628 -5428720
4196 -5428720 -6737434 -7840046 -9186435 -9341018 -7664357 -6977755 -10005116 -14704908 -16908146
4187 -16908146 -16179947 -15129456 -14325281 -12288257 -9563689 -8338346 -8501442 -8132416 -7305934
$$ packed form
4250e118512r28083P56360K505361J675033j083442k164938o24417M33588p21056
4241e270106j630212j25245J968809J966922L39527p83475r45703r87836r59144
4232f426463l54925N74915J092330Q34605j83051j587642k493498k238780j144404
4223a1926913J98323J562822K186837R84087r24739l51183K966078M389326Q33073
4214h2289l766773m012941j343226r66612k618069j455675K509225L586599Q9473
4205h060288k455590j61634L536954M061770K051848L22738p95935j864491k064092
4196e428720j308714j102612j346389j54583J676661O86602l027361m699792k203238
4187a6908146P28199J050491Q04175K037024K724568J225343j63096L69026Q26482
$$ plain form
4178 -7305934 -7533300 -8294167 -8086841 -7809673 -8955416 -9891456 -8562752 -7331187 -9917399
4169 -9917399 -14912700 -17846756 -18276776 -18832591 -18779228 -15486715 -11249588 -11039309 -13800258
4160 -13800258 -13727037 -10155469 -8126273 -9003275 -9172970 -8472719 -10595513 -14327422 -14405609
4151 -14405609 -12209663 -14677377 -21273715 -24470366 -24819525 -30509401 -38975433 -37691090
4143 -37691090 -29582049 -34210666 -48818289 -32674507 42064987 138703313 187775111
4136 187775111 166695066 117653034 85740451 71789704 56489734 40113615 35645745
4129 35645745 40754837 40766660 32244536 24978996 24117872 25181320 24893506 24632172 23925771
4120 23925771 20522048 16367311 15377878 16348190 15312667 13200906 13836699 16163656 16089165
$$ packed form
4178g305934k27366p60867K07326K77168j145743r36040J328704J231565k586212
4169i917399m995301k934056m30020n55815N3363L292513M237127K10279k760949
4160a3800258P3221L571568K029196q77002j69695P00251k122794l731909p8187
4151a4405609K195946k467714o596338l196651l49159n689876q466032J284343
4143c7691090Q109041m628617j4607623J6143782P4739494R6638326M9071798
4136A87775111k1080045m9042032l1912583j3950747j5299970j6376119m467870
4129C5645745N109092J1823q522124p265540q61124J063448k87814k61334p06401
4120B3925771l403723m154737r89433R70312j035523k111761O35793K326957p4491
$$ plain form
4111 16089165 14647349 16462205 20759158 21803296 18555133 16299327 17517932 18255474
4103 18255474 15558138 12126364 10851820 10173000 7981789 5690837 5176345 5218559 4105570
4094 4105570 2941108 3381978 4299586 3530332 1400926 -15239 -179877 -519872 -2037407
4085 -2037407 -3951851 -4511885 -2478473 1665133 5568447 6894817 5819598 4893334 6070737
4076 6070737 8686521 10706124 11114767 10506469 9796267 8883861 6757091 3128004 -302193
4067 -302193 -1311546 -201584 136000 -1782303 -3512857 -1886428 2470706 5971296 6677476
4058 6677476 5681895 4175712 1847461 -1140486 -2969909 -2479258 -1231915 -1577081 -3225145
4049 -3225145 -3458671 -1163880 737070 -1452307 -6578560 -8485530 -3220133 5146274
$$ packed form
4111A6089165j441816J814856M296953J044138l248163k255806J218605P37542
4103A8255474k697336l431774j274544o78820k191211k290952n14492M2214j112989
4094D105570j164462M40870R17608p69254k129406j416165j64638l39995j517535
4085b037407j914444n60034K033412M143606L903314J326370j075219r26264J177403
4076F070737K615784K019603M08643o08298p10202r12406k126770l629087l430197
4067c02193j009353J109962L37584j918303j730554J626429M357134L500590P06180
4058F677476r95581j506183k328251k987947j829423M90651J247343l45166j648064
4049c225145k33526K294791J900950k189377n126253j906970N265397Q366407
$$ plain form
4041 5146274 8751623 5397819 284605 -1908724 -2289386 -3241692 -3133328 559515 5839623
4032 5839623 8464241 7981779 7166555 6657602 4820950 2476475 2861052 6215260 8772154
4023 8772154 8364001 7166248 7354726 7658391 6246756 4006572 2714652 2313650 1990172
4014 1990172 1846956 1698035 295090 -2400166 -4185552 -3759775 -2916953 -3528803 -4278307
4005 -4278307 -2939218 -419394 341291 -1162844 -2323773 -1245176 915287 1931766
3997 1931766 1354910 616985 910413 1607674 1141816 -503976 -1168942 525420 2628727
3988 2628727 2418165 827361 1248642 3815737 4617657 1841134 -1143760 -1073621 497474
3979 497474 872886 1110624 3026167 4153623 1080485 -3624122 -3587802 2189698 7696465
$$ packed form
4041E146274L605349l353804n113214k193329l80662r52306J08364L692843N280108
4032E839623K624618m82462q15224n08953j836652k344475L84577L354208K556894
4023H772154m08153j197753J88478L03665j411635k240184j291920m01002l23478
4014A990172j43216j48921j402945k695256j785386M25777Q42822o11850p49504
4005d278307J339089K519824P60685j504135j160929J078597K160463J016479
3997A931766n76856p37925K93428O97261m65858j645792o64966J694362K103307
3988B628727k10562j590804M21281K567095Q01920k776523k984894P0139J571095
3979D97474L75412K37738J915543J127456l073138m704607L6320N777500N506767
$$ plain form
3970 7696465 8350130 6005359 3975545 2230567 425218 1097965 5654138 10362429 10939287
3961 10939287 9059583 9579484 12468172 12669672 8309091 4052200 4338881 7184996 7661768
3952 7661768 4912469 2308513 2011937 2923809 3941224 5969594 9489956 12433379 12336419
3943 12336419 9524472 6577555 5261470 5385923 6186006 7134247 7327844 5801699 3247487
3934 3247487 2196312 4345795 8269966 10755282 10114529 7377119 4499291 2439372
3926 2439372 1200276 894970 2006995 4630153 7876478 10353354 11282166 10975346 10128333
3917 10128333 8967488 7420436 5771258 4530973 3834250 3626053 4255305 6014653 8172877
3908 8172877 9491290 9751340 9637635 9061585 7183860 4602490 3703436 5574606 8007931
$$ packed form
3970G696465O53665k344771k029814j744978j805349O72747M556173M708291N76858
3961A0939287j879704N19901K888688K01500m360581m256891K86681K846115M76772
3952G661768k749299k603956k96576R11872J017415K028370L520362K943423r6960
3943A2336419k811947k946917j316085J24453Q00083R48241J93597j526145k554212
3934C247487j051175K149483L924171K485316o40753k737410k877828k059919
3926B439372j239096l05306J112025K623158L246325K476876R28812l06820q47013
3917A0128333j160845j547052j649178j240285o96723k08197O29252J759348K158224
3908H172877J318413K60050j13705n76050j877725k581370q99054J871170K433325
$$ plain form
3899 8007931 8189650 6354295 5009347 5259376 5870751 5759331 5418143 5445672 5194708
3890 5194708 3721714 1359791 -241708 485095 3482047 6753948 8176273 7939879 8207755
3881 8207755 9732490 10317391 8083981 4860427 4093493 6156087 8149530 8087748 6857062
3872 6857062 6022106 6189670 7838245 11101884 13940690 13204248 8989910 5747038 7242453
3863 7242453 12030958 15611760 15639434 13174619 9958486 6594518 3125696 -200162 -2870270
3854 -2870270 -4104507 -3208377 -356484 3546670 7894330 12149159 14587309 13281297
3846 13281297 9106109 5628973 4678245 4142692 1944511 -83670 938033 3828519
3838 3828519 4543302 2086328 57420 1802458 6390688 10090781 10133574 6602680 2081930
$$ packed form
3899H007931J81719j835355j344948K50029O11375j11420l41188K7529k50964
3890E194708j472994k361923j601499P26803K996952L271901J422325k36394K67876
3881H207755J524735N84901k233410l223554p66934K062594J993443o1782j230686
3872F857062q34956J67564J648575L263639K838806p36442m214338l242872J495415
3863G242453M788505L580802K7674k464815l216133l363968l468822l325858k670108
3854b870270j234237Q96130K851893L903154M347660M254829K438150j306012
3846A3281297m175188l477136r50728n35553k198181k028181J021703K890486
3838C828519P14783k456974k028908J745038M588230L700093M2793l530894m520750
$$ plain form
3829 2081930 -348111 -58537 339451 -1438068 -3616674 -2404228 2464642 6862163 7452735
3820 7452735 5245538 2999408 1472362 -68520 -1329930 -1055103 983859 3485954
3812 3485954 4971525 4999324 4385127 4462935 5519105 5938930 3912728 79502 -2790824
3803 -2790824 -3025005 -1613667 -218227 762381 1358176 874146 -1025142 -2958317 -2885992
3794 -2885992 -332434 3012179 4559726 2598101 -2305603 -7328662 -9647801 -8942161
3786 -8942161 -6909319 -4557355 -1506209 1897993 3676635 2347113 -1264506 -4972472
3778 -4972472 -6904032 -6113969 -3278998 -1199282 -2611877 -6663682 -9359036 -8261163
3770 -8261163 -4788450 -1215179 1965495 4439742 4746374 2706461 810463 883315 1544204
$$ packed form
3829B081930k430041K89574L97988j777519k178606J212446M868870M397521N90572
3820G452735k207197k246130j527046j540882j261410K74827K038962K502095
3812C485954J485571K7799o14197P7808J056170M19825k026202l833226k870326
3803b790824k34181J411338J395440R80608N95795m84030j899288j933175P2325
3794b885992K553558L344613J547547j961625m903704n023059k319139P05640
3786h942161K032842K351964L051146L404202J778642j329522l611619l707966
3778d972472j931560P90063K834971K079716j412595m051805k695354J097873
3770h261163L472713L573271L180674K474247L06632k039913j895998P2852O60889
$$ plain form
3761 1544204 1282468 1520250 3599114 5146106 3264160 -459116 -2309463 -2468412 -4027381
3752 -4027381 -6635145 -6252137 -1811328 2741169 4526785 5446194 7654723 9279490 7707771
3743 7707771 4330665 2708741 3628401 4828970 4662452 3603022 2629373 2063067 1928780
3734 1928780 2251746 3037761 4386961 6102784 7103925 6326505 4376382 2890951 2037708
3725 2037708 358803 -2455935 -4553362 -4480380 -3045160 -1821261 -1481593 -2302136 -4383553
3716 -4383553 -6535022 -6989931 -6176849 -6564498 -8691951 -9929517 -8732326 -7385155 -8242287
3707 -8242287 -9692830 -8740934 -5767490 -3601529 -2966328 -1838299 1143065 5054141 8124274
3698 8124274 8940282 6915789 3289055 692444 88033 -450260 -2116147 -2684591 -235422
$$ packed form
3761A544204k61736K37782K078864J546992j881946l723276j850347j58949j558969
3752d027381k607764L83008M440809M552497J785616R19409K208529J624767j571719
3743G707771l377106j621924R19660J200569j66518j059430r73649n66306j34287
3734A928780L22966P86015J349200J715823J001141p77420j950123j485431q53243
3725B037708j678905k814738k097427P2982J435220J223899L39668q20543k081417
3716d383553k151469m54909Q13082l87649k127453j237566J197191J347171q57132
3707h242287j450543R51896K973444K165961O35201J128029K981364L911076L070133
3698H124274Q16008k024493l626734k596611o04411n38293j665887n68444K449169
$$ plain form
3689 -235422 2563907 1806328 -1333102 -2069112 563035 2381817 841154 -1282403 -687331
3680 -687331 1642129 2738338 2076137 1290508 1236393 1401620 1180688 371178 -689393
3671 -689393 -817483 930035 3468583 4583996 3910998 3055565 2465496 716187 -2309834
3662 -2309834 -4316314 -4095954 -3533250 -4233783 -4533374 -2221034 1626173 4096474 4476008
3653 4476008 4454685 5250879 6706111 8391358 9439963 7994860 3157490 -2706257 -5639879
3644 -5639879 -4205058 -490768 2765164 4586297 5520207 6522682 8083452 9300889
3636 9300889 8115131 3720876 -1649133 -4825816 -5318133 -5265906 -5980769 -6401414 -5349256
3627 -5349256 -3598303 -2784477 -3271047 -3881212 -3165148 -562050 3021107 5490749 5193347
$$ packed form
3689b35422K799329p57579l139430p36010K632147J818782j540663k123557N95072
3680f87331K329460J096209o62201p85629n4115J65227k20932q09510j060571
3671f89393j28090J747518K538548J115413o72998q55433n90069j749309l026021
3662b309834k006480K20360N62704p00533k99591K312340L847207K470301L79534
3653D476008k1323P96194J455232J685247J048605j445103m837370n863747k933622
3644e639879J434821L714290L255932J821133R33910J002475J560770J217437
3636I300889j185758m394255n370009l176683m92317N2227p14863m20645J052158
3627e349256J750953Q13826m86570o10165P16064K603098L583157K469642k97402
$$ plain form
3618 5193347 2724058 559955 535922 2211321 4005342 5173732 5952923 6303068 5674345
3609 5674345 4237778 3321368 3715892 4042868 2095796 -2039239 -5571027 -6420462 -5681936
3600 -5681936 -5403610 -5286539 -3738483 -1353974 -500113 -1363538 -1415647 288999 1273769
3591 1273769 -139857 -1455992 520621 4719090 7343549 7326581 7110273 8216036 9029611
3582 9029611 7638799 4549639 1567007 -391612 -1338860 -1207639 190236 2636401 5384911
3573 5384911 7345621 7622253 6527491 5785452 6810730 8872134 9807492 8497921 5878903
3564 5878903 3632093 2625948 2523805 2280837 1191797 -139244 -382699 574333 1265947
3555 1265947 971677 1105237 2933938 5119602 5433931 4165257 3706129 4995780 6324017
$$ packed form
3618E193347k469289k164103k4033J675399J794021J168390P79191L50145o28723
3609E674345j436567r16410L94524L26976j947072m135035l531788q49435P38526
3600e681936K78326J17071J548056K384509Q53861q63425n2109J704646R84770
3591A273769j413626j316135J976613M198469K624459j6968k16308J105763Q13575
3582I029611j390812l089160k982632j958619r47248J31221J397875K446165K748510
3573E384911J960710K76632j094762p42039J025278K061404R35358j309571k619018
3564E878903k246810j006145j02143k42968j089040j331041k43455R57032O91614
3555A265947k94270J33560J828701K185664L14329j268674m59128J289651J328237
$$ plain form
3546 6324017 5699083 2753750 -1634854 -6000532 -8674578 -9128235 -8723444 -8514498 -6917574
3537 -6917574 -1896995 4832148 8645122 7546896 4247542 1979919 980654 368979 781597
3528 781597 2996786 5783236 7286707 7353989 6709171 5104999 2322096 55982 570575
3519 570575 3689111 6901417 8419514 8578314 8111641 6604655 3428341 -587494 -3300833
3510 -3300833 -3197965 -967541 1117283 1509123 795942 606817 1745876 4014912 7003972
3501 7003972 9755156 10345641 7741633 3974563 2416384 3542395 4460715 3292130 1812061
3492 1812061 2473180 4745713 6232116 6154792 5853045 6408598 7336712 7522364 6562468
3483 6562468 5283498 5154938 6620108 8084825 7715188 6152073 5681181 6521858 6273996
$$ packed form
3546F324017o24934k945333m388604m365678k674046m53657M04791K08946J596924
3537f917574N020579O729143L812974j098226l299354k267623r99265o11675M12618
3528G81597K215189K786450J503471O7282o44818j604172k782903k266114N14593
3519E70575L118536L212306J518097J58800m66673j506986l176314m015835k713339
3510c300833J02868K230424K084824L91840p13181j89125J139059K269036K989060
3501G003972K751184N90485k604008l767070j558179J126011R18320j168585j480069
3492A812061O61119K272533J486403p7324l01747N55553R28114J85652r59896
3483F562468j278970j28560J465170J464717l69637j563115m70892Q40677k47862
$$ plain form
3474 6273996 3930649 1962503 2778948 5291367 7091327 8242352 10425287 13497986
3466 13497986 15416222 15055436 13119705 10701314 8593941 7448306 7077221 6277917 4668052
3457 4668052 3648745 4133060 4812735 4603940 5175981 8400049 12533228 14004975 12273792
3448 12273792 9735542 7262476 3477520 -1154020 -3272597 -1311568 1558355 1299215
3440 1299215 -1895239 -4347606 -3757657 -1553526 -602638 -1802168 -3413172 -3568246 -2800516
3431 -2800516 -3089398 -4483048 -4572848 -2358727 -587404 -2180773 -5984569 -8698842 -9749838
3422 -9749838 -11072805 -12761652 -12479688 -9397737 -5534797 -2626517 -499743 872879
3414 872879 566659 -1155923 -2416275 -2337164 -1979492 -2244287 -3095739 -4898484 -7737326
$$ packed form
3474F273996k343347j968146Q16445K512419J799960J151025K182935L072699
3466A3497986J918236l60786j935731k418391k107373j145635l71085p99304j609865
3457D668052j019307M84315O79675k08795N72041L224068M133179J471747j731183
3448A2273792k538250k473066l784956m631540k118577J961029K869923k59140
3440A299215l194454k452367N89949K204131R50888j199530j611004j55074P67730
3431b800516k88882j393650q9800K214121J771323j593369l803796k714273j050996
3422i749838j322967j688847K81964L081951L862940K908280K126774J372622
3414H72879l06220j722582j260352P9111L57672k64795q51452j802745k838842
$$ plain form
3405 -7737326 -9432820 -7624860 -3993997 -2435553 -2595643 -73238 5594891 8614896
3397 8614896 5400494 142655 -2005710 -2473258 -4899986 -7369231 -5432594 -437184
3389 -437184 1861811 84856 -1618713 -1097759 -847819 -2363250 -3551716 -3465278 -4520657
3380 -4520657 -7657433 -9649778 -8036982 -5162157 -4366007 -5111631 -4912268 -3676547 -2997426
3371 -2997426 -2927729 -2531920 -2343132 -3315847 -4246469 -3203190 -1129838 -1065017 -3429440
3362 -3429440 -4811959 -2702953 512733 242449 -4240678 -8252464 -6879555 -723012
3354 -723012 4724121 5281493 2286420 6045 279426 1317551 1051702 -411545 -1810271
3345 -1810271 -2341522 -1632907 402641 2826811 3883561 2817050 818704 -342372 6283
$$ packed form
3405g737326j695494J807960L630863J558444j60090K522405N668129L020005
3397H614896l214402n257839k148365m67548k426728k469245J936637M995410
3389d37184K298995j776955j703569N20954K49940j515431j188466Q6438j055379
3380d520657l136776j992345J612796K874825P96150p45624J99363J235721O79121
3371b997426O9697L95809J88788r72715r30622J043279K073352O4821k364423
3362c429440j382519K109006L215686k70284m483127m011786J372909O156543
3354g23012N447133N57372k995073k280375K73381J038125k65849j463247j398726
3345a810271n31251P08615K035548K424170J056750j066511j998346j161076L48655
$$ plain form
3336 6283 1351279 2758109 3570871 4195358 6060416 9624313 12723490 12742544 10456107
3327 10456107 9390509 10744328 11533943 9205280 5553788 3736610 3383226 1716880
3319 1716880 -1494019 -3370384 -2352865 -322617 499144 521111 1448351 3517450 5352557
3310 5352557 5750183 4660784 2945386 1834738 2190608 3757101 5372341 6118445 5938993
3301 5938993 5119105 3738001 1856697 -113655 -1339070 -773613 1982519 5395415 6324559
3292 6324559 3091665 -1925817 -4354983 -2729172 279036 1939716 2678482 3869183
3284 3869183 4453294 2339929 -1673551 -4152278 -3313439 -606519 2440800 6219578 10467585
3275 10467585 12256891 9229006 3576805 19030 171453 1431227 1371492 509759 69311
$$ packed form
3336F283J344996J406830Q12762O24487J865058L563897L099177J9054k286437
3327A0456107j065598J353819P89615k328663l651492j817178l53384j666346
3319A716880l210899j876365J017519K030248Q21761K1967R27240K069099J835107
3310E352557L97626j089399j715398j110648L55870J566493J615240P46104j79452
3301E938993q19888j381104j881304j970352j225415N65457K756132L412896R29144
3292F324559l232894n017482k429166J625811L008208J660680P38766J190701
3284C869183N84111k113365m013480k478727Q38839K706920L047319L778778M248007
3275A0467585J789306l027885n652201l557775J52423J259774n9735q61733m40448
$$ plain form
3266 69311 -358476 -1487089 -2761372 -3816211 -5768558 -9072656 -11494611 -10550798 -7159538
3257 -7159538 -4604986 -4349342 -5058495 -5361002 -5037471 -3416184 640731 6197859 9949006
3248 9949006 9854086 7596585 6327812 7314907 9746829 12306983 13682693 12887594 10552990
3239 10552990 8899713 9084129 9491449 7990079 4998064 2881936 2995088 4670445 6537815
3230 6537815 7502172 6912636 4964185 2495708 -364666 -4213496 -7988984 -8399232 -3936467
3221 -3936467 1978337 4762023 4692689 5772272 8848723 9921372 6402573 1305051 -974977
3212 -974977 -41987 1910228 4283904 7582797 10507844 11189241 10604668 11403636 13515482
3203 13515482 14132148 12231237 9856369 8199123 5707493 1567525 -1924456 -2611053
$$ packed form
3266F9311m27787j128613j274283j054839j952347l304098k421955R43813L391260
3257g159538K554552K55644p09153l02507L23531J621287M056915N557128L751147
3248I949006r4920k257501j268773R87095K431922K560154J375710p95099k334604
3239A0552990j653277J84416M07320j501370k992015k116128J13152J675357J867370
3230F537815R64357n89536j948451k468477k860374l848830l775488m10248M462765
3221c936467N914804K783686o9334J079583L076451J072649l518799n097522k280028
3212i74977R32990J952215K373676L298893K925047O81397n84573P98968K111846
3203A3515482O16666j900911k374868j657246k491630m139968l491981o86597
$$ plain form
3195 -2611053 -1665072 -1067736 -13823 3119907 6748011 7647212 6062305 5576016 7483899
3186 7483899 8863832 7551729 5760137 6420603 8372291 8157591 5286949 2712095 2412663
3177 2412663 3165951 2979943 1551746 -288417 -1757989 -1960920 -124778 2910093 4574011
3168 4574011 3189358 176109 -1324056 283526 3855643 7196197 9039592 9403346
3160 9403346 8860223 7986149 7193840 6493598 5290128 2955638 63208 -1473874 -466545
3151 -466545 1572200 1901076 221767 -831552 328720 1739759 1038548 -725636 -1048973
3142 -1048973 -461942 -1629286 -4234871 -4592257 -1375683 1798649 1559830 -292066 290356
3133 290356 3766721 7018553 8000616 7533891 6972634 6642380 6574273 6723705 6364188 4905189
$$ packed form
3195b611053R45981N97336J053913L133730L628104Q99201j584907m86289J907883
3186G483899J379933j312103j791592O60466J951688k14700k870642k574854k99432
3177B412663P53288j86008j428197j840163j469572k02931J836142L034871J663918
3168D574011j384653l013249j500165J607582L572117L340554J843395L63754
3160I403346n43123q74074p92309p00242j203470k334490k892430j537082J007329
3151d66545K038745L28876j679309j053319J160272J411039p01211j764184l23337
3142a048973N87031j167344k605585l57386L216574L174332k38819j851896N82422
3133B90356L476365L251832R82063m66725n61257l30254o8107J49432l59517j458999
$$ plain form
3123 4905189 3187514 2402715 2093310 1067952 -9480 865451 3828122 6654624 7950974
3114 7950974 8708572 9888191 10526071 9573123 7990231 7371520 7470320 6655053 4316612
3105 4316612 1495985 -688801 -2182546 -3511608 -4837323 -5606305 -4912758 -2389176 1051758
3096 1051758 3616901 3989371 2183871 -761009 -3464219 -4763872 -4413155 -3392541 -2934662
3087 -2934662 -3178745 -3393291 -3382407 -3722827 -4587455 -5417519 -5933058 -6301297 -6042009 -4175800
3077 -4175800 -1068024 1371452 2389316 3915244 7865473 12935801 15928185 15738659
3069 15738659 14047098 12186668 9648540 6471161 4925377 6866760 10427361 11513545
3061 11513545 8662798 4656972 2765818 2970984 3084501 2390981 2269334 3401149 4288215
$$ packed form
3123D905189j717675p84799l09405j025358j077432Q74931K962671K826502J296350
3114G950974P57598J179619O37880r52948j582892o18711R8800q15267k338441
3105D316612k820627k184786j493745j329062j325715p68982O93547K523582L440934
3096A051758K565143L72470j805500k944880k703210j299653L50717J020614M57879
3087b934662k44083k14546J0884l40420q64628q30064n15539l68239K59288J866209
3077d175800L107776K439476J017864J525928L950229N070328K992384j89526
3069A5738659j691561j860430k538128l177379j545784J941383L560601J086184
3061A1513545k850747m005826j891154K05166J13517o93520j21647J131815Q87066
$$ plain form
3052 4288215 3291330 848387 -1332228 -2429957 -2821349 -2838634 -2396473 -1708302 -1378176
3043 -1378176 -1561102 -1513918 -138721 2981507 6664555 8329731 6206920 1805460 -1037438
3034 -1037438 -436380 1433911 1653144 583502 742225 2676679 4296223 4052453 2679423
3025 2679423 1737213 2202851 4342412 7093457 7871398 5236965 1559774 430706 1474360
3016 1474360 893932 -2337351 -4464968 -2620211 934755 2460083 1633765 199375 -1407363
3007 -1407363 -2830758 -1716871 3086268 7859301 7882036 4246498 2490397 4571122 6753183
2998 6753183 6263175 5328993 6311656 6811975 3283783 -2772045 -6184767 -5100579 -3223287
2989 -3223287 -4493452 -8021389 -9686791 -7427358 -3321149 -658406 -391928 -1220904 -2224143
$$ packed form
3052D288215r96885k442943k180615j097729l91392j7285M42161O88171L30126
3043a378176j82926M7184J375197L120228L683048J665176k122811m401460k842898
3034a037438O01058J870291K19233j069642J58723J934454J619544k43770j373030
3025B679423r42210M65638K139561K751045P77941k634433l677191j129068J043654
3016A474360n80428l231283k127617J844757L554966J525328q26318j434390j606738
3007a407363j423395J113887M803139M773033K2735l635538j756101K080725K182061
2998F753183m90008r34182R82663N00319l528192o055828l412722J084188J877292
2989c223287j270165l527937j665402K259433M106209K662743K66478q28976j003239
$$ plain form
2980 -2224143 -3773816 -5725816 -6529162 -5299597 -3393888 -2284291 -999088 2117492
2972 2117492 5755649 6482490 3521732 148244 -549804 942362 2531501 3642638 4686346
2963 4686346 5260225 5058240 5374953 7423973 9770152 9605507 6426595 2547403 -28035
2954 -28035 -1349821 -1905578 -1273284 608019 2184914 1525278 -1769810 -6512407 -11007694
2945 -11007694 -13553272 -12869246 -9256203 -4897872 -1879667 -91420 1878242 4013903
2937 4013903 4523572 2625505 286534 91944 2152981 4271389 4711813 3584492 1684681
2928 1684681 -561452 -2503103 -2780351 -463802 3575273 7026212 7923877 6125010 3356110
2919 3356110 1697963 1459688 666287 -2543587 -7074696 -9553672 -8104084 -4235674 -503476
$$ packed form
2980b224143j549673j952000q03346J229565J905709J109597J285203L116580
2972B117492L638157P26841k960758l373488o98048J492166J589139J111137J043708
2963D686346N73879k01985L16713K049020K346179j64645l178912l879192k575438
2954b8035j321786n55757O32294J881303J576895o59636l295088m742597m495287
2945a1007694k545578O84026L613043M358331L018205J788247J969662K135661
2937D013903N09669j898067k338971j94590K061037K118408M40424j127321j899811
2928A684681k246133j941651k77248K316549M039075L450939Q97665j798867k768900
2919C356110j658147k38275p93401l209874m531109k478976J449588L868410L732198
$$ plain form
2910 -503476 2261046 4343943 5183356 3923364 1567426 782002 3023457 6761761 9032049
2901 9032049 8359776 5910914 3891152 3009892 2025242 238059 -458309 2301274 7369624
2892 7369624 10473391 9319465 6169676 4178456 3488807 2782457 2359928 2929220 3087495
2883 3087495 1254265 -950156 -584910 2015431 3958061 4690242 6332103 8922509 9514210
2874 9514210 7225304 5265781 5882910 6655705 4434420 325224 -2097295 -1642674 108299
2865 108299 1723596 2599271 1901793 -593751 -3302837 -4595385 -5073222 -6219229 -7716381
2856 -7716381 -8227316 -8021178 -8485347 -9463525 -9352687 -7708196 -5713047 -4173056 -3053659
2847 -3053659 -2890477 -4351446 -6000029 -4773141 185401 5733775 8012556 6557352
$$ packed form
2910e03476K764522K082897Q39413j259992k355938p85424K241455L738304K270288
2901I032049o72273k448862k019762q81260r84650j787183o96368K759583N068350
2892G369624L103767j153926l149789j991220o89649p06350m22529N69292J58275
2883C087495j833230k204421L65246K600341J942630P32181J641861K590406N91701
2874I514210k288906j959523O17129P72795k221285m109196k422519M54621J750973
2865A08299J615297Q75675o97478k495544k709086j292548m77837j146007j497152
2856g716381n10935K06138m64169r78178J10838J644491J995149J539991J119397
2847c053659J63182j460969j648583J226888M958542N548374K278781j455204
$$ plain form
2839 6557352 4086173 2914318 2790389 2209161 810519 -286469 -348860 -233557 -952149
2830 -952149 -1723073 -977017 724239 662080 -2355727 -6006850 -7450806 -6865185 -6369221
2821 -6369221 -6626643 -6508127 -5436310 -4026849 -2611477 -932764 674232 1373164 1226014
2812 1226014 1164310 1466308 1497920 1080569 941249 1529966 2232359 1948499 -2937 -3263642
2802 -3263642 -6187497 -6824894 -4934884 -2419665 -1067430 -757959 -674556 -931900 -1684058
2793 -1684058 -2021387 -1533838 -1670564 -3353191 -4332274 -1569029 4233608 9002338 9972015
2784 9972015 7703486 3850158 -417750 -3796571 -5286906 -5479318 -5198093 -3256758 1561042
2775 1561042 6659452 7572132 4347967 2180903 4386189 8386743 10354764 10094035 8898369
$$ packed form
2839F557352k471179j171855j23929n81228j398642j096988o2391J15303p18592
2830i52149p70924P46056J701256o2159l017807l651123j443956N85621M95964
2821f369221k57422J18516J071817J409461J415372J678713J606996O98932j47150
2812A226014o1704L01998L1612m17351j39320N88717P02393k83860j951436l260705
2802c263642k923855o37397J890010K515219J352235L09471Q3403k57344p52158
2793a684058l37329M87549j36726j682627r79083K763245N802637M768730R69677
2784I972015k268529l853328m267908l378821j490335j92412K81225J941335M817800
2775A561042N098410R12680l224165k167064K205286M000554J968021k60729j195666
$$ plain form
2766 8898369 6180728 1676594 -1698566 -1030867 2187948 4264430 4529569 4965131 5851745
2757 5851745 5654746 4829378 5877300 9091077 11494211 10983066 8933550 7693402 7716163
2748 7716163 8219234 8678321 8468228 6688103 3646848 1301511 1066205 2132994 2868544
2739 2868544 2837806 2371855 1040191 -2003485 -6282663 -9620796 -9762902 -6133207 -224758
2730 -224758 5365286 8531741 8870501 7534840 5910278 4537809 3258507 1946221 753536
2721 753536 -105416 -338622 588460 2934977 5605135 6202450 3215313 -1780880 -5166624
2712 -5166624 -5036826 -3012349 -1684444 -1446312 -1139798 -810993 -1823886 -4456389 -7285679
2703 -7285679 -9144200 -10004022 -9721375 -7758040 -4721778 -2475409 -1880204 -1723823 -466380
$$ packed form
2766H898369k717641m504134l375160O67699L218815K076482K65139M35562Q86614
2757E851745j96999q25368J047922L213777K403134n11145k049516j240148K2761
2748G716163N03071M59087k10093j780125l041255k345337k35306J066789P35550
2739B868544l0738m65951j331664l043676m279178l338133j42106L629695N908449
2730b24758N590044L166455L38760j335661j624562j372469j279302j312286j192685
2721G53536q58952k33206R27082K346517K670158N97315k987137m996193l385744
2712e166624J29798K024477J327905K38132L06514L28805j012893k632503k829290
2703g285679j858521q59822K82647J963335L036262K246369N95205J56381J257443
$$ plain form
2694 -466380 2181304 5589590 8441998 8534380 4648206 -780615 -3325809 -1841309 436685
2685 436685 1009404 1164476 2210174 2234308 -383122 -3250753 -3503671 -2678165 -3885118
2676 -3885118 -6073376 -5987007 -4695338 -6609018 -11651999 -13873663 -9707785 -3129115 52183
2667 52183 -371916 -217585 2801536 6933257 9344337 9043694 7509880 7575654 10697404
2658 10697404 14567463 14899960 10452970 4662691 1358380 642241 175272 -1308538 -3322871
2649 -3322871 -4921097 -5031247 -2684545 1610400 5666350 7893951 8725917 8994735 8494091
2640 8494091 7229237 6281629 5958101 4843616 2414291 828585 2010140 4471351 5365682
2631 5365682 4396734 3194109 1997852 -97916 -2282536 -2567630 -1235194 -880532 -2590808
$$ packed form
2694d66380K647684L408286K852408R2382l886174n428821k545194J484500K277994
2685D36685N72719J55072J045698K4134k617430k867631k52918Q25506j206953
2676c885118k188258Q6369J291669j913680n042981k221664M165878O578670L181298
2667E2183m24099J54331L019121M131721K411080l00643j533814O5774L121750
2658A0697404L870059L32497m446990n790279l304311p16139m66969j483810k014333
2649c322871j598226j10150K346702M294945M055950K227601Q31966K68818n00644
2640H494091j264854r47608l23528j114485k429325j585706J181555K461211Q94331
2631E365682r68948j202625j196257k095768k184620k85094J332436L54662j710276
$$ plain form
2622 -2590808 -4683704 -5893326 -7313936 -10121774 -13448998 -15694298 -16232044 -14817131
2614 -14817131 -11134562 -6285270 -3080563 -3167118 -4935778 -5799867 -5570233 -5933645 -7359950
2605 -7359950 -8459008 -8321523 -7834539 -8276018 -9681182 -10958491 -10888830 -8886187 -5527722
2596 -5527722 -2433655 -846972 -231747 844669 2274825 2027020 -1074311 -5160580 -7157699
2587 -7157699 -6455011 -5441135 -6212573 -7912793 -8001017 -5407074 -1566202 1346568 2364822
2578 2364822 1934596 980872 233299 189625 1237027 3479506 6331159 8506231 8926701
2569 8926701 7869560 6846056 6974556 7639794 7010909 3753991 -1734959 -7216505 -9547021
2560 -9547021 -6705247 132030 6873540 9767715 8399247 5122740 2170445 213033
$$ packed form
2622b590808k092896j209622j420610k807838l327224k245300n37746J414913
2614a4817131L682569M849292L204707q6555j768660q64089K29634l63412j426305
2605g359950j099058J37485M86984m41479j405164j277309O9661K002643L358465
2596e527722L094067J586683O15225J076416J430156k47805l101331m086269j997119
2587g157699P02688J013876p71438j700220q8224K593943L840872K912770J018254
2578B364822m30226r53724p47573m3674J047402K242479K851653K175072M20470
2569H926701j057141j023504J28500O65238o28885l256918n488950n481546k330516
2560i547021K841774O837277O741510K894175j368468l276507k952295j957412
$$ plain form
2552 213033 -807269 -905194 -327026 468692 1433922 2806289 4259345 4967949 4622151
2543 4622151 3606591 2161692 276486 -1509104 -2222184 -1694767 -862253 -549142 -676122
2534 -676122 -826115 -827077 -628992 -339061 -436360 -1222748 -2146964 -2451337 -2219873 -1913335
2524 -1913335 -1459709 -1051068 -1986720 -4759986 -6991519 -5915447 -2774730 -1695551 -3747014
2515 -3747014 -5450498 -4313794 -2293469 -1690953 -1056646 1631866 4430669 4061405 1541302
2506 1541302 1037932 3514210 5330173 3614128 -199867 -3155453 -4557552 -5741438
2498 -5741438 -7752430 -10296147 -11999837 -11338836 -8277688 -4976607 -3752268 -4523773 -5446953
2489 -5446953 -5562992 -5218162 -4320080 -2207183 692060 2917492 3931222 4442973 4716252
$$ packed form
2552B13033j020302r7925N78168P95718R65230J372367J453056P08604l45798
2543D622151j015560j444899j885206j785590p13080N27417Q32514L13111j26980
2534f76122j49993r62J98085K89931r7299p86388r24216l04373K31464L06538
2524a913335M53626M08641r35652k773266k231533J076072L140717J079179k051463
2515c747014j703484J136704K020325O02516O34307K688512K798803l69264k520103
2506A541302n03370K476278J815963j716045l813995k955586j402099j183886
2498e741438k010992k543717j703690O61001L061148L301081J224339p71505r23180
2489e446953j16039L44830Q98082K112897K899243K225432J013730N11751K73279
$$ plain form
2480 4716252 4228147 3209737 2921190 4095737 6386222 9243770 11867254 12611035 10390232
2471 10390232 6649571 4000320 2922791 1879411 588385 587369 2147127 3381945 3457143
2462 3457143 4153565 6725242 9232751 8735560 4795548 -532712 -4989934 -7319146 -7478233
2453 -7478233 -6807502 -7061983 -8527320 -9943165 -10397326 -9900150 -8238171 -5462858 -3669944
2444 -3669944 -5446577 -9632022 -11542664 -8968737 -5213447 -4200208 -5164730 -4733704 -2114919
2435 -2114919 701850 2503509 3853054 5381526 7239978 9332195 10346938 8046312
2427 8046312 2597392 -2012532 -2346439 199812 2064845 2757243 4170328 6074642 6236103
2418 6236103 4603325 3605597 4154135 4792240 5049334 6050762 7089435 5187661 -426003
$$ packed form
2480D716252m88105j018410k88547J174547K290485K857548K623484P43781k220803
2471A0390232l740661k649251j077529j043380j291026j016J559758J234818P5198
2462C457143O96422K571677K507509m97191l940012n328260m457222k329212j59087
2453g478233O70731k54481j465337j415845m54161M97176J661979K775313J792914
2444c669944j776633m185445j910642K573927L755290J013239r64522M31026K618785
2435b114919K816769J801659J349545J528472J858452K092217J014743k300626
2427H046312n448920m609924l33907K546251J865033O92398J413085J904314J61461
2418F236103j632778r97728N48538O38105K57094J001428J038673j901774n613664
$$ plain form
2409 -426003 -6271724 -8672598 -7617796 -5316643 -3200168 -1800244 -1504062 -1782767 -1231723
2400 -1231723 355886 1468191 1387417 1424577 2545271 3640072 3483914 2650863 2038209
2391 2038209 1151825 -554556 -2079698 -2218975 -1341583 -502927 -29271 -176145 -1701834
2382 -1701834 -4429891 -6778165 -8106364 -9722357 -11860522 -11800181 -7613330 -2159162 -186524
2373 -186524 -2234696 -4467506 -4226568 -2687854 -1868128 -2053258 -3024792 -5160177 -7932851
2364 -7932851 -9296345 -8077417 -5720400 -4478276 -4899215 -6043783 -7155403 -8058908 -8608764
2355 -8608764 -8657087 -8162608 -6851076 -4358086 -1140742 1409543 2251821 1595240 257810
2346 257810 -1224346 -2567001 -3492494 -3828551 -3307065 -1244833 2689525 7225110 10030037
$$ packed form
2409d26003n845721k400874J054802K301153K116475J399924K96182k78705N51044
2400a231723J587609J112305q0774L7160J120694J094801j56158q33051o12654
2391B038209q86384j706381j525142j39277Q77392Q38656M73656j46874j525689
2382a701834k728057k348274j328199j615993k138165O0341M186851N454168J972638
2373a86524k048172k232810K40938J538714Q19726j85130r71534k135385k772674
2364g932851j363494J218928K357017J242124m20939j144568j111620r03505n49856
2355h608764m8323M94479J311532K492990L217344K550285Q42278o56581j337430
2346B57810j482156j342655r25493l36057N21486K062232L934358M535585K804927
$$ plain form
2337 10030037 9941593 7891997 5452940 3520313 2643635 3172234 4319203 4451154 3367130
2328 3367130 3063510 4950967 7446306 7958406 6390105 4724983 3648180 1889866 -843277
2319 -843277 -2625246 -2142169 -989302 -1409209 -2716902 -1985069 1703707 5477142 6036086
2310 6036086 3715973 1851034 2394751 3735754 3519872 2272413 2539051 4893035 6888630
2301 6888630 6579207 5209796 5107625 6370721 7421016 7763650 8032273 7914904 6534862
2292 6534862 4860785 5042501 6714067 6715031 3919474 1776251 3746950 8130444 10248130
2283 10248130 8632197 5973246 4334077 2718252 58187 -2321996 -2824143 -2143623
2275 -2143623 -1894236 -1900598 -616488 2361817 5635125 7618672 7851864 6974236 6210261
$$ packed form
2337A0030037q8444k049596k439057j932627q76678N28599J146969J31951j084024
2328C367130l03620J887457K495339N12100j568301j665122j076803j758314k733143
2319h43277j781969M83077J152867m19907j307693P31833L688776L773435N58944
2310F036086k320113j864939N43717J341003k15882j247459K66638K353984J995595
2301F888630l09423j369411j02171J263096J050295L42634K68623j17369j380042
2292F534862j674077J81716J671566R64k795557k143223J970699M383494K117686
2283A0248130j615933k658951j639169j615825k660065k380183n02147O80520
2275b143623K49387o362J284110K978305L273308J983547K33192q77628p63975
$$ plain form
2266 6210261 6624378 8201712 9837749 10586520 10455311 9687154 8158728 6190176 5034066
2257 5034066 5413174 6088960 5076493 2148589 -751865 -1447767 763660 4826937 8441581
2248 8441581 9413610 7730005 5965518 6347553 7770793 7378598 4956381 3502464 4675324
2239 4675324 5961409 4275394 857278 -62296 2804527 5913637 5907852 4315848 5104443
2230 5104443 8557532 10284198 6891563 437336 -4328286 -5657287 -5590053 -5915874 -6184167
$$ packed form
2266F210261M14117J577334J636037P48771j31209p68157j528426j968552j156110
2257E034066L79108O75786j012467k927904k900454o95902K211427M063277L614644
2248H441581R72029j683605j764487L82035J423240l92195k422217j453917J172860
2239D675324J286085j686015l418116r19574K866823L109110n785j592004P88595
2230E104443L453089J726666l392635o454227m765622j329001O7234l25821k68293
$$ [...]
##END NTUPLES=NMR SPECTRUM
##END=
