##TITLE=31Pdec_DE-102_oil_TFA2
CDCl3, 64 sc
 13.8.2025
##JCAMPDX= 6.0         $$ Bruker NMR JCAMP-DX V2.0
##DATA TYPE= NMR SPECTRUM
##DATA CLASS= NTUPLES
##ORIGIN= UXNMR, Bruker Analytische Messtechnik GmbH
##OWNER= root
$$ XWIN-NMR		Version 3.5
$$ Wed Aug 13 14:16:15 2025 Russian Standard Time (UT+4h)  she@DPX200
##.OBSERVE FREQUENCY= 81.013821
##.OBSERVE NUCLEUS= ^31P
##.ACQUISITION MODE= SIMULTANEOUS
##.ACQUISITION SCHEME= undefined
##.AVERAGES= 64
##.DIGITISER RES= 17
##SPECTROMETER/DATA SYSTEM= spect
##.PULSE SEQUENCE= zgpg30
##.SOLVENT NAME= CDCl3
##.SHIFT REFERENCE= (INTERNAL, CDCl3, 0, 198.062)
##AUDIT TRAIL= $$ (NUMBER, WHEN, WHO, WHERE, WHAT)
$$ ##TITLE= Audit trail, XWIN-NMR		Version 3.5
$$ ##JCAMPDX= 5.01
$$ ##ORIGIN= Bruker BioSpin GmbH
$$ ##OWNER= she
$$ F:/spectra/data/she/nmr/P31/2/pdata/1/auditp.txt
$$ ##AUDIT TRAIL=  $$ (NUMBER, WHEN, WHO, WHERE, WHAT)
(   1,<2025-08-13 14:14:19.20 +0400>,<she>,<DPX200>,
      <created by zg, POWCHK disabled, PULCHK disabled
       configuration hash MD5:
       00 E9 B6 7A A2 85 ED C7 34 08 36 98 17 FE 4E 26
       data hash MD5: 32K
       79 01 F5 8D 74 90 7E 2D 1F 8D E0 EB 46 0D BC 15>)
(   2,<2025-08-13 14:15:17.40 +0400>,<she>,<DPX200>,
      <Start of raw data processing
       efp BC_mod = 2 LB = 1.5 FT_mod = 6 PKNL = 1 PHC0 = 1765.425 PHC1 = 40.09939 SI = 64K 
       data hash MD5: 64K
       31 F3 0C 9B 3A B8 6F D5 A2 84 4B D2 B7 3D BE FD>)
(   3,<2025-08-13 14:15:35.37 +0400>,<she>,<DPX200>,
      <pk PHC0 = 45.46169 PHC1 = -45.6 
       data hash MD5: 64K
       83 C9 6B 75 DB 5C CE 88 42 F3 DE FD E4 EB E7 43>)
(   4,<2025-08-13 14:15:41.60 +0400>,<she>,<DPX200>,
      <abs ABSG = 5 
       data hash MD5: 64K
       D5 53 42 1C 87 F5 EF 00 A4 55 64 25 AE 92 20 31>)
$$ ##END=
$$ 
$$ hash MD5
$$ AD 66 2E 12 6E 86 84 EE EC 37 69 7B 36 EA D3 EA
##$RELAX= 
##$RELAX= 
##$RELAX= 
##$RELAX= 
##$RELAX= 
##$RELAX= 
##$RELAX= 
##$RELAX= 
$$ Bruker specific parameters
$$ --------------------------
##$DU= <F:/spectra>
##$EXPNO= 2
##$NAME= <P31>
##$PROCNO= 1
##$TYPE= <nmr>
##$USER= <she>
##$AMP= (0..31)
100 100 100 100 100 100 100 100 100 100 100 100 100 100 100 100 100 100 
100 100 100 100 100 100 100 100 100 100 100 100 100 100 
##$AQSEQ= 0
##$AQ_mod= 1
##$AUNM= <au_zg>
##$AUTOPOS= <>
##$BF1= 81.014009
##$BF2= 200.13
##$BF3= 200.13
##$BF4= 200.13
##$BF5= 200.13
##$BF6= 200.13
##$BF7= 200.13
##$BF8= 200.13
##$BYTORDA= 1
##$CFDGTYP= 0
##$CFRGTYP= 5
##$CHEMSTR= <none>
##$CNST= (0..31)
1 1 145 1 1 1 1 1 1 1 1 1 1 1 1 1 1 1 1 1 1 1 1 1 1 1 1 1 1 1 1 1 
##$CPDPRG= <waltz16>
##$CPDPRG1= <>
##$CPDPRG2= <waltz16>
##$CPDPRG3= <>
##$CPDPRG4= <mlev>
##$CPDPRG5= <mlev>
##$CPDPRG6= <mlev>
##$CPDPRG7= <mlev>
##$CPDPRG8= <mlev>
##$CPDPRGB= <>
##$CPDPRGT= <>
##$D= (0..31)
0 1 0 0 0 0 0 0 0 0.06 0 0.03 2e-05 3e-06 0 0 0.0002 0 0 0 0 0 0 0 0 0 
0 0 0 0 0 0 
##$DATE= 1755080058
##$DBL= (0..7)
120 120 120 11 120 120 24 19 
##$DBP= (0..7)
150 150 150 150 150 150 150 150 
##$DBP07= 0
##$DBPNAM0= <>
##$DBPNAM1= <>
$$ [...]
##$SUBNAM3= <"">
##$SUBNAM4= <"">
##$SUBNAM5= <"">
##$SUBNAM6= <"">
##$SUBNAM7= <"">
##$SUBNAM8= <"">
##$SUBNAM9= <"">
##$SW= 400.765351723535
##$SWIBOX= (0..15)
0 1 3 0 0 0 0 0 0 0 0 0 0 0 0 0 
##$SW_h= 32467.5324675325
##$TD= 32768
##$TD0= 1
##$TE= 0
##$TE2= 300
##$TE3= 300
##$TEG= 300
##$TL= (0..7)
0 120 53 12 22 120 120 120 
##$TP= (0..7)
150 150 150 150 150 150 150 150 
##$TP07= 0
##$TPNAME0= <>
##$TPNAME1= <>
##$TPNAME2= <>
##$TPNAME3= <>
##$TPNAME4= <>
##$TPNAME5= <>
##$TPNAME6= <>
##$TPNAME7= <>
##$TPOAL= (0..7)
0.5 0.5 0.5 0.5 0.5 0.5 0.5 0.5 
##$TPOFFS= (0..7)
0 0 0 0 0 0 0 0 
##$TUNHIN= 0
##$TUNHOUT= 0
##$TUNXOUT= 0
##$USERA1= <user>
##$USERA2= <user>
##$USERA3= <user>
##$USERA4= <user>
##$USERA5= <user>
##$V9= 5
##$VALIST= <valist>
##$VCLIST= <CCCCCCCCCCCCCCC>
##$VD= 0
##$VDLIST= <DDDDDDDDDDDDDDD>
##$VPLIST= <PPPPPPPPPPPPPPP>
##$VTLIST= <TTTTTTTTTTTTTTT>
##$WBST= 1024
##$WBSW= 4
##$XGAIN= (0..3)
0 0 0 0 
##$XL= 0
##$YL= 0
##$YMAX_a= 14584
##$YMIN_a= -4771
##$ZGOPTNS= <>
##$ZL1= 120
##$ZL2= 120
##$ZL3= 120
##$ZL4= 120
##$ABSF1= 198.0616
##$ABSF2= -202.7028
##$ABSG= 5
##$ABSL= 3
##$ALPHA= 0
##$AQORDER= 0
##$ASSFAC= 0
##$ASSFACI= 0
##$ASSFACX= 0
##$ASSWID= 0
##$AUNMP= <proc_1d>
##$AZFE= 0.1
##$AZFW= 0.5
##$BCFW= 0
##$BC_mod= 2
##$BYTORDP= 0
##$COROFFS= 0
##$CY= -3
##$DATMOD= 1
##$DC= 0
##$DFILT= <>
##$DTYPP= 0
##$F1P= 0
##$F2P= 0
##$FCOR= 1
##$FTSIZE= 65536
##$FT_mod= 6
##$GAMMA= 0
##$GB= 0
##$INTBC= 1
##$INTSCL= 9.790993e-09
##$ISEN= 30
##$LB= 1.5
##$LEV0= 0
##$LPBIN= 0
##$MAXI= 10000
##$MC2= 0
##$MEAN= 0
##$ME_mod= 0
##$MI= 50
##$NCOEF= 0
##$NC_proc= -8
##$NLEV= 6
##$NOISF1= 182.463
##$NOISF2= 159.3651
##$NSP= 0
##$NTH_PI= 0
##$NZP= 0
##$OFFSET= 198.0616
##$PC= 4
##$PHC0= 1810.887
##$PHC1= -5.50061
##$PH_mod= 1
##$PKNL= yes
##$PPARMOD= 0
##$PSCAL= 0
##$PSIGN= 0
##$REVERSE= no
##$SF= 81.0140089999434
##$SI= 65536
##$SIGF1= 159.3651
##$SIGF2= -187.1042
##$SINO= 113.3802
##$SIOLD= 16384
##$SREGLST= <1H.CDCl3>
##$SSB= 0
##$STSI= 65536
##$STSR= 0
##$SW_p= 32467.5324675325
##$SYMM= 0
##$S_DEV= 0
##$TDeff= 32768
##$TDoff= 0
##$TI= <>
##$TILT= no
##$TM1= 0
##$TM2= 0
##$TOPLEV= 0
##$USERP1= <user>
##$USERP2= <user>
##$USERP3= <user>
##$USERP4= <user>
##$USERP5= <user>
##$WDW= 1
##$XDIM= 65536
##$YMAX_p= 253933940
##$YMIN_p= -205462628
$$ End of Bruker specific parameters
$$ ---------------------------------
##NTUPLES= NMR SPECTRUM
##VAR_NAME=  FREQUENCY,     SPECTRUM/REAL,   SPECTRUM/IMAG
##SYMBOL=    X,             R,               I
##VAR_TYPE=  INDEPENDENT,   DEPENDENT,       DEPENDENT
##VAR_FORM=  AFFN,          ASDF,            ASDF
##VAR_DIM=   65536,         65536,           65536
##UNITS=     HZ,            ARBITRARY UNITS, ARBITRARY UNITS
##FACTOR=    0.49542278885378, 1,            1
##FIRST=     16045.7642231865, 0,            0
##LAST=      -16421.768244346, 0,            0
##MIN=       -16421.768244346, -205462628,   0
##MAX=       16045.7642231865, 253933940,    0
$$ Real data points
##PAGE= N=1
##DATA TABLE= (X++(R..R)), XYDATA
$$ [...]
##PAGE= N=2
##DATA TABLE= (X++(I..I)), XYDATA
7472d542603J192523R21095o44702j737364J60315L274429K973747j352194m878601
$$ -4542603 -3350080 -2428985 -3073687 -4811051 -4650736 -1376307 1597440 245246 -4633355
7463d633355m110949j323922j41158r2770J319033L644413M312723L161499K498080
$$ -4633355 -8744304 -10068226 -10209384 -10302154 -8983121 -5338708 -1025985 2135514 4633594
7454D633594K984714K750799Q62379j229395k318827k916859l258175k365553
$$ 4633594 7618308 10369107 11231486 10002091 7683264 4766405 1508230 -857323
7446h57323l51837P07956p6577m87502J363520L385077K105081j992769m761467
$$ -857323 -1209160 -501204 -577781 -1065283 298237 3683314 5788395 3795626 -965841
7437i65841l948594j572136k41699O6395L72872L81932l75949j020341q83746
$$ -965841 -4914435 -6486571 -6728270 -6661875 -6289003 -5907071 -6283020 -7303361 -8187107
7428h187107r59078j774731j543499J010046L513225K905431N80819P49637L779146
$$ -8187107 -9146185 -10920916 -12464415 -11454369 -7941144 -5035713 -4454894 -3705257 73889
7419G3889N306804K878888o19500j936103j947498k535124k521782l54350J879525
$$ 73889 5380693 8259581 7640081 5703978 3756480 1221356 -1300426 -1654776 224749
7410B24749J303338p07366o98826Q82773O13328j496262j648474R91149K297966
$$ 224749 1528087 820721 121895 1004668 1617996 121734 -1526740 -535591 1762375
7401A762375j22670k833396k096369K98982M62453j176025j134212J055167K358288
$$ 1762375 1639705 -1193691 -3290060 -2991078 -2528625 -3704650 -4838862 -3783695 -1425407
7392a425407J343738j33247n91727p65042j017730j49952J826806K492869N49525
$$ -1425407 -81669 -214916 -806643 -1571685 -2589415 -2739367 -912561 1580308 2129833
7383B129833j604941j161715P40375O42164j882582l367646j480516J507323J768338
$$ 2129833 524892 -636823 103552 745716 -1136866 -4504512 -5985028 -4477705 -2709367
7374b709367j001771l340529k318784J509931N344543O740762M685868j82201
$$ -2709367 -3711138 -7051667 -9370451 -7860520 -2515977 4224785 8910653 8728452
7366H728452n195936o700111l375776J575001L203016K66170l297658l046090
$$ 8728452 3532516 -3167595 -6543371 -4968370 -1765354 -1499184 -4796842 -7842932
7358g842932Q40150M161741L818997R58667j142025j101033l55147n11806j128325
$$ -7842932 -7002782 -2841041 977956 1936623 794598 -306435 -661582 -1173388 -2301713
7349b301713q10692L46811Q07968M7140n71596q0401L15777q67213k683459k799388
$$ -2301713 -3112405 -2765594 -1957626 -1910486 -2482082 -2562483 -2246706 -3113919 -5797378 -8596766
7339h596766r49929N84583K52239p89564o97328N24740J531703J631997J231813
$$ -8596766 -9546695 -8962112 -8709873 -9499437 -10196765 -9672025 -8140322 -6508325 -5276512
7330e276512R36247R78235J010147P1217k352446m816655m740707j624442J760957
$$ -5276512 -4340265 -3362030 -2351883 -2280666 -4633112 -9449767 -14190474 -15814916 -14053959
7321a4053959K592713J366732O53638J411793K290859K127616J312199O73824
$$ -14053959 -11461246 -10094514 -9440876 -8029083 -5738224 -3610608 -2298409 -1624585
7313a624585N46302J026954J769055J513657n87100l018920l089113o38715J296319
$$ -1624585 -1078283 -51329 1717726 3231383 2644283 -374637 -3463750 -4102465 -2806146
7304b806146O23066q13810j61720J914415K183794o1017j680510l33176J947067
$$ -2806146 -2183080 -2996890 -3158610 -1244195 939599 878582 -801928 -1135104 811963
7295H11963J752596n82603j421377Q42160L384452K810084m09053k840971k430529
$$ 811963 2564559 1981956 560579 1402739 4787191 7597275 7188222 4347251 1916722
7286A916722m08426P08734k51999k352391l484544k286818K07882J395914K87929
$$ 1916722 1508296 2217030 1965031 -387360 -3871904 -6158722 -5950840 -4554926 -4266997
7277d266997j149264r51269m2912k45616q37070r077J220925L59359j436544p2184
$$ -4266997 -5416261 -6367530 -6410442 -6656058 -7493128 -7502205 -6281280 -5921921 -7358465 -7430649
7267g430649M519311O796647L475870j317352k294998o16359p04809k485499k318585
$$ -7430649 -2911338 3885309 7361179 6043827 3748829 3132470 2427661 -57838 -2376423
7258b376423M0067J245550O23333R13858K404153J948298r10764k283667n22103
$$ -2376423 -2336356 -1090806 -467473 446385 2850538 4798836 3888072 1604405 1082302
7249A082302O06786j693619m173571k598285J628680L920959K972720Q90880r91484
$$ 1082302 1689088 -4531 -4178102 -6776387 -5147707 -1226748 1745972 2636852 1645368
7240A645368k544577k728050q84535R54078N02489j089757j303429p44991j752789
$$ 1645368 -899209 -3627259 -4511794 -3557716 -3055227 -4144984 -5448413 -6193404 -7946193
7231g946193l410122k267083J911925N193913M919991K491413n1575k573209m633113
$$ -7946193 -11356315 -13623398 -11711473 -6517560 -1597569 893844 842269 -1730940 -6364053
7222f364053m211552q14726K627776L159116J389005o1730j54225K74981N77691
$$ -6364053 -10575605 -11390331 -8762555 -5603439 -4214434 -4276164 -4430389 -4155408 -3577717
7213c577717Q68101J100846Q86597J31288o07242k72153J749462M070716L639209
$$ -3577717 -2709616 -1608770 -722173 -590885 -1198127 -1470280 279182 4349898 7989107
7204G989107n97763n075147n104845q12443L033168L175159R50289j084868k225114
$$ 7989107 7391344 2316197 -2788648 -3601091 -567923 2607236 3557525 2472657 247543
7195B47543k308437p83092J220198J021773j418260k460748j68043K354368J726790
$$ 247543 -2060894 -2843986 -1623788 -602015 -2020275 -4481023 -4649066 -2294698 -567908
7186e67908n86955j251849m35760k99798l62225J171982K964122K163346k47907
$$ -567908 -1154863 -2406712 -2842472 -3142270 -3504495 -2332513 631609 2794955 2547048
7177B547048m98777J593726K029852p86041l279448k112135J307177L568940L523903
$$ 2547048 2048271 3641997 5671849 4885808 1606360 -505775 801402 4370342 7894245
7168G894245J991055j98870k045391k348902j364591p39094r23960p61730k37828
$$ 7894245 9885300 9686430 7641039 5292137 3927546 3188452 2264492 1502762 1264934
7159A264934q34461k200517j728268R72376K547769J043850p74949j35087R32971
$$ 1264934 430473 -1770044 -3498312 -2525936 21833 1065683 290734 155647 1088618
7150A088618p06715l385326l006204J83344K011314J062776J49056O64248J65507
$$ 1088618 381903 -3003423 -6009627 -5826283 -3814969 -2752193 -2603137 -1938889 -1773382
7141a773382k748565n064312l414381J088855M565006N127527L752026J845041
$$ -1773382 -4521947 -9586259 -13000640 -11911785 -7346779 -2219252 1532774 3377815
7133C377815J70693o86852p69111j139493k277256k731760j058700J502080K322169
$$ 3377815 3548508 2861656 2092545 953052 -1324204 -4055964 -5114664 -3612584 -1290415
7124a290415J193806N48475J349314J211205j728709n011388m644449r29297J651006
$$ -1290415 -96609 451866 1801180 3012385 1283676 -3727712 -8372161 -9301458 -7650452
7115g650452Q58242k27962J553316L990739K674701j930817m731348l283168p03292
$$ -7650452 -6792210 -7020172 -5466856 -1476117 1198584 -732233 -5463581 -8746749 -9450041
7106i450041j48172l16495J181072L229518L227926J472263J22360o11826j758732
$$ -9450041 -9598213 -9914708 -8733636 -5504118 -2276192 -803929 -681569 -1293395 -3052127
7097c052127k288791l80383K570047L132240J066614n07219m74718r91821k365698
$$ -3052127 -5340918 -5721301 -3151254 -19014 1047600 540381 65663 -926158 -3291856
7088c291856j360823K918444N691874K815505k623434m350807j610358P74208
$$ -3291856 -4652679 -1734235 3957639 6773144 4149710 -201097 -1811455 -1037247
7080a037247K03341o03512J016519L323613L100504K52539k486120k873484q07220
$$ -1037247 -833906 -1437418 -420899 2902714 6003218 6255757 3769637 896153 88933
7071H8933K025191L098849J036868k315878l217868n96593K173752J581582j291508
$$ 88933 2114124 5212973 6249841 3933963 716095 119502 2293254 3874836 2583328
7062B583328k437408n20854J662666J461334k38956r32067j16102N46764j01973
$$ 2583328 145920 -374934 1287732 2749066 2510110 1578043 1461941 2008705 1906732
7053A906732j372903j928093j241200K56566J714530K364639K042134J355421
$$ 1906732 533829 -1394264 -2635464 -2378898 -664368 1700271 3742405 5097826
7045E097826R23932M63828q09970k820195m313356m150929k409201k3406K070168
$$ 5097826 6021758 6485586 5675616 2855421 -1457935 -5608864 -8018065 -8041471 -5971303
7036e971303L223806L225406K566364J960305J284689j77697k036877k527498
$$ -5971303 -2747497 477909 3044273 5004578 6289267 6111570 4074693 1547195
7028A547195r25748Q66744O39998r82908j503295k65086Q13592M19248k36295
$$ 1547195 621447 1488191 2128189 1145281 -358014 -623100 190492 609740 373445
7019C73445N41858K500740L990280L837400J946372q77056l030239l177760j880062
$$ 373445 915303 3416043 7406323 11243723 13190095 12313039 9282800 6105040 4224978
7010D224978r89348r16783j78656J482120J692423r71846l842501l250296K34856
$$ 4224978 3235630 2318847 2140191 3622311 5314734 4342888 500387 -2749909 -2515053
7001b515053K463955J286865j253286k430112j859751m18733J297903K300433
$$ -2515053 -51098 1235767 -17519 -2447631 -4307382 -4726115 -3428212 -1127779
6993a127779J177868j772594m037998l857642k175965m29341J670089M274989
$$ -1127779 50089 -1722505 -5760503 -9618145 -11794110 -12223451 -10553362 -6278373
6985f278373N216353K509794j839479l520450j422498J181576J376109j7170p67010
$$ -6278373 -1062020 1447774 -391705 -3912155 -5334653 -4153077 -2776968 -2794138 -3561148
6976c561148o17482o80857j049236r42053m59634m81177j030219j005311L98614
$$ -3561148 -4178630 -4859487 -5908723 -6850776 -7310410 -7791587 -8821806 -9827117 -9428503
6967i428503K672682M301522L877637J544691m88212p5283J727967J355195k275120
$$ -9428503 -6755821 -2454299 1423338 2968029 2479817 2404534 4132501 5487696 3212576
6958C212576n402931m223444m00204J255110l46123j736667r45647k20997j304460
$$ 3212576 -2190355 -6413799 -6814003 -5558893 -5905016 -7641683 -8587330 -8808327 -10112787
6949a0112787j920435K68145L173810L221164R02046k44809P34917J213593m06792
$$ -10112787 -12033222 -11765077 -8591267 -5370103 -4468057 -4712866 -3977949 -2764356 -3171148
6940c171148k325875k350469q58015K11314k36992j626785k177271k86531L325596
$$ -3171148 -5497023 -7847492 -8705507 -8494193 -8731185 -10357970 -12535241 -12821772 -9496176
6931i496176N492586M302759J970955J630841K306113N38635l356438m947562
$$ -9496176 -4003590 299169 2270124 3900965 6207078 6745713 3389275 -1558287
6923a558287k468957L72042L44235n56517P29907K797561K260011m44753j772411
$$ -1558287 -4027244 -3655202 -3310967 -3867484 -3137577 -340016 1919995 1475242 -297169
6914b97169m86186J297461J961484K001078J867802J093984j44751q55085q55089
$$ -297169 -783355 514106 2475590 4476668 6344470 7438454 7293703 6438618 5583529
6905E583529q59263j105638j436378k112347k909260k482731o26138K96368j182632
$$ 5583529 4724266 3618628 2182250 69903 -2839357 -5322088 -5948226 -5651858 -6834490
6896f834490k347863o4185L482072L368830j89898j822692L82405J815854q06032
$$ -6834490 -9182353 -9246538 -5764466 -2395636 -2585534 -4408226 -4025821 -2209967 -3015999
6887c015999l783467k455096J275279K265129K94366k86671K135630M441394M140429
$$ -3015999 -6799466 -9254562 -7979283 -5714154 -5419788 -5706459 -3570829 870565 5010994
6878E010994K458043J240502L33415o60813r19235l34778o86291l019018n345582
$$ 5010994 7469037 8709539 9042954 8382141 7462906 7128128 6441837 3422819 -1922763
6869a922763m808138j383584K067578L095025J813377p6828j288546j603121j244087
$$ -1922763 -6730901 -8114485 -6046907 -2951882 -1138505 -1215333 -2503879 -4107000 -5351087
6860e351087l83322O21148J024495K92016j144528k171217k059903r17204O80156
$$ -5351087 -5734409 -5113261 -4088766 -3796750 -4941278 -7112495 -9172398 -10089602 -9409446
6851i409446J827630J388222q57489l102357k978805n97466J342661J241961P91559
$$ -9409446 -7581816 -6193594 -7051083 -10153440 -13132245 -13729711 -12387050 -11145089 -10353530
6842a0353530K137476M295985M415109J924940o84535j270287m55024j93013j210262
$$ -10353530 -8216054 -3920069 495040 2419980 1735445 465158 10134 -182879 -1393141
6833a393141k469243k427771m89437K229108L489605J952098j240838l415237
$$ -1393141 -3862384 -6290155 -6779592 -4550484 -1060879 891219 -349619 -3764856
6825c764856k989736p63989J303300K067263J897791J804295K068456J883729
$$ -3764856 -6754592 -7518581 -6215281 -4148018 -2250227 -445932 1622524 3506253
6817C506253N59133j256732k284207k318028k123665j730290l82114J529902K316932
$$ 3506253 4065386 2808654 524447 -1793581 -3917246 -5647536 -6029650 -4499748 -2182816
6808b182816J483308M44402k23456j955504m932369o028810k743067K495305N012799
$$ -2182816 -699508 -255106 -478562 -2434066 -7366435 -13395245 -16138312 -13643007 -8630208
6799h630208L837360J881984J007021L26810p63633j335862j133210j015024p67064
$$ -8630208 -4792848 -2910864 -1903843 -1577033 -2340666 -3676528 -4809738 -5824762 -6591826
6790f591826N97037K044029J364683o05031l37228K609998M079636J588208j652803
$$ -6591826 -5994789 -3950760 -2586077 -3191108 -3528336 -918338 3161298 4749506 3096703
6781C096703j770672P7918N11510l38771O9653J675952K056439P77738l05201
$$ 3096703 1326031 1403949 1915459 1576688 1646341 3322293 5378732 6156470 5851269
6772E851269p05147j748416l411946l945140k929761j924233j752482j618118
$$ 5851269 5146122 3397706 -14240 -3959380 -6889141 -8813374 -10565856 -12183974
6764a2183974j026905j82598J400521M032403N816300M563979J719637Q72737
$$ -12183974 -13210879 -13393477 -11992956 -7960553 -2144253 2419726 4139363 5012100
6756E012100K033450J444976j801182l457275q98859J908003M0888m691289o142119
$$ 5012100 7045550 8490526 6689344 3232069 2333210 4241213 4282101 -409188 -6551307
6747f551307k400435K346673M028750K798989O87988j201187k101862j127146
$$ -6551307 -8951742 -6605069 -2576319 222670 910658 -290529 -2392391 -3519537
6739c519537J056519K099349R05895p79285q81242K20101O07698m52815j865953
$$ -3519537 -2463018 -363669 542226 -237059 -1118301 -898200 -290502 -743317 -2609270
6730b609270k225251j172638L71856R46536M6113r79868l87689J458467K269356
$$ -2609270 -4834521 -6007159 -5635303 -4688767 -4642654 -5622522 -6010211 -4551744 -2282388
6721b282388R78561o75069o48303N70372R85952Q9242p69318o13696J37979R27554
$$ -2282388 -1303827 -1978896 -2627199 -2056827 -1070875 -981633 -1750951 -2364647 -2226668 -1299114
6711a299114J869180K873708L120343K078192L21075j247249k365653l055376
$$ -1299114 570066 3443774 6564117 8642309 8963384 7716135 5350482 2295106
6703B295106k897635j499911N17957J749280J365314p3771j193028r88687L88717
$$ 2295106 -602529 -2102440 -1584483 164797 1530111 1456340 263312 -725375 -336658
6694c36658J715204J713147L54707j018202j282899r60050j333995k313878k269806
$$ -336658 1378546 3091693 3446400 2428198 1145299 185249 -1148746 -3462624 -5732430
6685e732430l82056J888466K510494J341001j08449q23623j019761r88573n59792
$$ -5732430 -6114486 -4226020 -1715526 -374525 -482974 -1306597 -2326358 -3314931 -3874723
6676c874723J04824L35333p8954o98154j427532k543988l343039k149281J382164
$$ -3874723 -3769899 -3434566 -3513520 -4211674 -5639206 -8183194 -11526233 -13675514 -12293350
6667a2293350N020410O103682M272041J295719r39404j446742k59511J292054
$$ -12293350 -7272940 -1169258 3102783 4398502 3459098 2012356 1752845 3044899
6659C044899J450082L95838M87749K601850L848843J402676k716204l980019j880492
$$ 3044899 4494981 4890819 5378568 7980418 11829261 13231937 10515733 6535714 4655222
6650D655222l15857j195770j817853n1238J882402J373191j79520j92455M87080
$$ 4655222 4339365 3143595 1325742 1274504 3156906 4530097 4350577 4158122 4645202
6641D645202n10151k414955k534440j057597o85782j885866k355096j289948m54604
$$ 4645202 4135051 1720096 -814344 -1871941 -2557723 -4443589 -6798685 -8088633 -8543237
6632h543237n01055J27863J717284K268870J300331J169535K765439L251843O38913
$$ -8543237 -9044292 -8916429 -7199145 -4930275 -3629944 -2460409 305030 3556873 4195786
6623D195786k371454k281867k54549j01611k297998l730036k812966j252273n07165
$$ 4195786 1824332 -457535 -712084 -813695 -3111693 -6841729 -9654695 -10906968 -11414133
6614a1414133K57168J809788L051915K810096J598619N19491j13275j64150Q06566
$$ -11414133 -11156965 -9347177 -6295262 -3485166 -1886547 -1367056 -1480331 -1644481 -837915
6605h37915K299589K430823J43193k854048l723589j861879M69805R29250l85709
$$ -837915 1461674 3892497 4035690 1181642 -2541947 -4403826 -3934021 -3004771 -3390480
6596c390480j532612j169509K69948J580209K033211J338314n96194k830631l143235
$$ -3390480 -4923092 -6092601 -5822653 -4242444 -2209233 -870919 -1467113 -4297744 -7440979
6587g440979l70984L168883L700727R27601j318144n06589R61377k33213k796795
$$ -7440979 -7811963 -4643080 -942353 -14752 -1332896 -1839485 -878108 -1111321 -3908116
6578c908116k691025L30333J847707q66577m754405m886446m88132M623884O442266
$$ -3908116 -6599141 -6268808 -4421101 -5287678 -10042083 -14928529 -15416661 -10792777 -4350511
6569d350511M268992O68312r58878P11148L663477M555200K248816j245428l302092
$$ -4350511 -81519 586793 -372085 339063 4002540 8557740 10806556 9561128 6259036
6560F259036l089302j380408O28416J789592J530212N80688K25255M12397k74802
$$ 6259036 3169734 1789326 2417742 4207334 5737546 6318234 6543489 6955886 6681084
6551F681084k380946m611996n583383n117555l301638q1897L191814L767132Q50470
$$ 6681084 4300138 -311858 -5895241 -11012796 -14314434 -14396331 -11204517 -7437385 -6586915
6542f586915k352324j996973J646402M586564L905830O31998j972225j691947
$$ -6586915 -8939239 -10936212 -9289810 -4703246 -797416 -165418 -2137643 -3829590
6534c829590R22500L103446K393812n96791k605028j718812J33865Q4101j477551
$$ -3829590 -2907090 196356 2590168 1993377 -611651 -2330463 -2196598 -2112497 -3590048
6525c590048j740887J25966J929738J928330R55982L56406j12324j112736k047649
$$ -3590048 -5330935 -5204969 -3275231 -1346901 -390919 -34513 -146837 -1259573 -3307222
6516c307222j952567j081813l52501J03057P02936J247049J091714K73513m81306
$$ -3307222 -5259789 -6341602 -6694103 -6591046 -5888110 -4641061 -3549347 -3275834 -3757140
6507c757140q27996j085249j332995r39239N54958K363890K826336J126988j519785
$$ -3757140 -4585136 -5670385 -7003380 -7942619 -7387661 -5023771 -2197435 -1070447 -2590232
6498b590232k814144j655187P62905K247662J678338l19041k201504k635092j354562
$$ -2590232 -5404376 -7059563 -6296658 -4048996 -2370658 -2689699 -4891203 -7526295 -8880857
6489h880857M66489J070164p226j201354p32483J133265K438678K032380Q63856
$$ -8880857 -8414368 -7344204 -7351430 -8552784 -9285267 -8152002 -5713324 -3680944 -2817088
6480b817088O22472J700827K787799K256758m8978k306441k324589L8910K478812
$$ -2817088 -2194616 -493789 2294010 4550768 4501790 2195349 -129240 -90330 2388482
6471B388482K639577M88269k011907k933055j688256P58834K296697J304048j166617
$$ 2388482 5028059 5516328 3504421 571366 -1116890 -358056 1938641 3242689 2076072
6462B076072j944504L16791L013054L081890J292669N97731J143197J68712l001104
$$ 2076072 131568 448359 3461413 6543303 7835972 8433703 9576900 9745612 6744508
6453F744508n228584m080813j372641m06669j598878k668578j849291O10122L040290
$$ 6744508 1515924 -2564889 -3937530 -4344199 -5943077 -8611655 -10460946 -9850824 -6810534
6444f810534L317381N87553k860236l083797P25530M626640M793245K214162L52718
$$ -6810534 -3493153 -2905600 -5765836 -8849633 -8124103 -3497463 1295782 3509944 3862662
6435C862662r7819j033439k568342k495226l34995J355451P74454o04373o25719
$$ 3862662 3764843 2731404 163062 -2332164 -2667159 -1311708 -537254 -1141627 -1767346
6426a767346N05689J236826J066612M17149n97463j755377k084649j124005n4513
$$ -1767346 -1261657 -24831 1041781 1458930 861467 -893910 -2978559 -4102564 -4157077
6417d157077j35555o81931j79669J035025J059334m97254j567504n95459J012370
$$ -4157077 -4292632 -4974563 -5154232 -4119207 -3059873 -3557127 -5124631 -5720090 -4707720
6408d707720Q43404q70808j347365P64140L073787K303185j329063m079028l113040
$$ -4707720 -3864316 -4735124 -6082489 -5318349 -2244562 58623 -1270440 -5349468 -8462508
6399h462508L39417K841019K678073R72248l86246o18561k7368P30103J065760
$$ -8462508 -8123091 -5282072 -2603999 -1631751 -2017997 -2636558 -2663926 -1933823 -868063
6390h68063Q93430P91035J124219J115790k71824k462311l447383k333053o17562
$$ -868063 25367 816402 1940621 3056411 2784587 322276 -3125107 -5458160 -6075722
6381f075722r5877l76989L48697K521031M430268M273935K072005o24290k203271
$$ -6075722 -6171599 -6548588 -6199891 -3678860 751408 5025343 7097348 6473058 4269787
6372D269787k046723q56697j67901q77039k020080j715698L85365K454818K830285
$$ 4269787 2223064 1366367 1198466 321427 -1698653 -3414351 -3028986 -574168 2256117
6363B256117K047374J564474J358062L70659j063284j285872k27553j78786k341222
$$ 2256117 4303491 5867965 7226027 7596686 6533402 5247530 5019977 4841191 2499969
6354B499969m277843k871231J020621L232060J694623j007582j301473Q79665
$$ 2499969 -1777874 -4649105 -3628484 -396424 1298199 290617 -1010856 -131191
6346a31191K568308J661878j073421l436683l953952k612924m48129J224362J653701
$$ -131191 2437117 4098995 3025574 -411109 -4365061 -6977985 -7426114 -6201752 -4548051
6337d548051J171758Q34090J309651J972246J324581j123164l453356k908757
$$ -4548051 -3376293 -2542203 -1232552 739694 2064275 941111 -2512245 -5421002
6329e421002N37984L403969K753401p7206j649305j289430j064658j354081o2912
$$ -5421002 -4883018 -1479049 1274352 1197146 -452159 -1741589 -2806247 -4160328 -4223240
6320d223240K868097L890928J046125k303646j996948Q85940J978107J45688j696973
$$ -4223240 -1355143 2535785 3581910 1278264 -718684 167256 2145363 2291051 594078
6311E94078j634141q19830l17395O14617K168328K819829J738526J35300q39750
$$ 594078 -1040063 -1859893 -2177288 -1562671 605657 3425486 5164012 5299312 4459562
6302D459562j561045k378396k548324j695223o06362K78786J456462K696869K666429
$$ 4459562 2898517 520121 -2028203 -3723426 -4329788 -4051002 -2594540 102329 2768758
6293B768758J110455l71804o39865l95513n23876r28547j664525l009498l662094
$$ 2768758 3879213 3507409 2867544 2472031 1948155 1019608 -644917 -3654415 -7316509
6284g316509j548489K370520L992516J539616j678905k063416l89166Q76199J862176
$$ -7316509 -8864998 -6494478 -2501962 -962346 -2641251 -4704667 -5093833 -4217634 -2355458
6275b355458L455203L883505J425513j382639r00359J457768J109005k158842
$$ -2355458 1099745 4983250 6408763 5026124 4125765 5583533 6692538 4533696
6267D533696l670980j305664J591914K018731J305686J278027P75459j133768
$$ 4533696 862716 -442948 1148966 3167697 4473383 5751410 6526869 5393101
6259E393101k036391K59486L436066L347620l66810m113595m840509k551385P13491
$$ 5393101 3356710 3616196 7052262 10399882 10033072 5919477 1078968 -1472417 -758926
6250g58926K542973J731297k62240m95576J560747K884919J161108j707009k414698
$$ -758926 1784047 3515344 3253104 2757528 4318275 7203194 8364302 6657293 4242595
6241D242595q85436M00316L88066P2710l9083m81130j230395j739907k123991
$$ 4242595 3357159 3757475 4145541 4218251 4179168 3698038 2467643 727736 -1396255
6232a396255k381725j283522J696468M232859L645328R03155q49922j325012l090769
$$ -1396255 -3777980 -5061502 -3365034 867825 4513153 5416308 4566386 3241374 150605
6223A50605o289858p279847m081774J92479J699823J069342J460133L227193L779676
$$ 150605 -6139253 -13419100 -17500874 -17308395 -15608572 -14539230 -13079097 -9851904 -6072228
6214f072228K207766R14686J830498L227608J984538j848195m531468l127924
$$ -6072228 -3864462 -2949776 -1119278 2108330 4092868 2244673 -2286795 -5414719
6206e414719P05670K678016J147447j268081j630279j98868J148110J964892K576547
$$ -5414719 -4709049 -2031033 -883586 -2151667 -3781946 -3980814 -2832704 -867812 1708735
6197A708735J993968n77905k967182k039725J490837L399056J633863j311797
$$ 1708735 3702703 3124798 157616 -1882109 -391272 3007784 4641647 3329850
6189C329850k544960k259332j769495r84425K85053R47318N59951M98468J285803
$$ 3329850 784890 -1474442 -3243937 -4228362 -3943309 -2995991 -2436040 -1937572 -651769
6180f51769J044017j129209k539274n31979L045635M169675K153143k99148j502127
$$ -651769 392248 -736961 -3276235 -3808214 -762579 3407096 5560239 5261091 3758964
6171C758964j887167j344483Q36856L186138K702507p77649l703293l402979j134360
$$ 3758964 1871797 527314 1364170 4550308 7252815 6475166 2771873 -631106 -1765466
6162a765466N97843J441681K307912K867655J914958m53078k467714k501997p52504
$$ -1765466 -1167623 274058 2581970 5449625 7364583 6911505 4443791 1941794 1189290
6153A189290Q63149O59326p31400r53848Q20623K546291K424575J666848J930550
$$ 1189290 2052439 2711765 1980365 1026517 1847140 4393431 6818006 8484854 10415404
6144A0415404J691252j404829n479742n911249k160332J108942Q82501l64820
$$ 10415404 12106656 10701827 5222085 -689164 -2849496 -1740554 -858053 -1222873
6136a222873L66769J780700J394472K03704N78036J707247R04661j786721l628374
$$ -1222873 -856104 924596 2319068 2522772 3100808 4808055 5712716 3925995 297621
6127B97621l100439j061809J165559K338204R84804k640096n206465l842398k93631
$$ 297621 -2802818 -3864627 -2699068 -360864 623940 -2016156 -7222621 -11065019 -11358650
6118a1358650J397827O01929J40051J128118J632037P79349M00877J470280K202336
$$ -11358650 -9960823 -9358894 -9218843 -8090725 -6458688 -5679339 -5278462 -3808182 -1605846
6109a605846J168271m09627r05503m56959L41685J551268K516248J810353k23493
$$ -1605846 -437575 -847202 -1752705 -2209664 -1867979 -316711 2199537 4009890 3786397
6100C786397j369573j156238j696295l429853l384899p5839L093939K549427l1027
$$ 3786397 2416824 1260586 -435709 -3865562 -7250461 -7326300 -4232361 -1682934 -1713961
6091a713961o87477O75337J271194Q56526J495447K704923J654606j628936l756936
$$ -1713961 -2401438 -1726101 -454907 401619 1897066 4601989 6256595 4627659 870723
6082H70723l350932k666274k880371k144620K7263P96080j046442k091770M29813
$$ 870723 -2480209 -5146483 -8026854 -10171474 -10144211 -9348131 -10394573 -12486343 -12056530
6073a2056530L674760L314144J99692j240374K81904J944823J790005P13855l78965
$$ -12056530 -8381770 -5067626 -4867934 -6108308 -5826404 -3881581 -2091576 -1377721 -1756686
6064a756686j783259k986061k603983r10798K36457L73966P04400J194226M31910
$$ -1756686 -3539945 -6526006 -9129989 -10040787 -9804330 -9430364 -8725964 -7531738 -7099828
6055g099828j059871o30238K209590M352596L492273J155531l31137j066805j714998
$$ -7099828 -8159699 -8789937 -6580347 -2227751 1264522 2420053 2088916 1022111 -692887
6046f92887j248100P74841K099809R74000n85223K2815J356975K99915k235645
$$ -692887 -1940987 -1166146 933663 1907663 1322440 1345255 2702230 3002145 766500
6037G66500k301675O42757K599855J066427j651343k503141j761937j252882j215543
$$ 766500 -1535175 -892418 1707437 2773864 1122521 -1380620 -3142557 -4395439 -5610982
6028e610982r14284l43326M77537K178427M378329N020758L087448M86001n65207
$$ -5610982 -6525266 -6868592 -6391055 -4212628 165701 5186459 8273907 8759908 8194701
6019H194701p21835k098241m580521n643057l667505J11216L078850L724177K642561
$$ 8194701 7472866 5374625 794104 -4848953 -8516458 -8405242 -5326392 -1602215 1040346
6010A040346J604262J574596J719961R21245j80835p7758Q40716M27893j875477
$$ 1040346 2644608 4219204 5939165 6860410 6679575 6601817 7442533 7870426 5994949
6001E994949l931448l967403k716216j528081n02102L08327J43166m97453M47519
$$ 5994949 2063501 -1903902 -4620118 -6148199 -6650301 -6341974 -6198808 -6696261 -6248742
5992f248742L072450M211668K023380o75354n87162R38780N14231j547712k188669
$$ -6248742 -3176292 1035376 3058756 2383402 1796240 2735020 3249251 1701539 -487130
5983d87130r23852J11236N59890J796047K883602J293949k118610l536232k202989
$$ -487130 -1410982 -1299746 -739856 1056191 3939793 5233742 3115132 -421100 -2624089
5974b624089j276899j676097l13945L465425M935107R28252m520859n576209k422912
$$ -2624089 -3900988 -5577085 -5891030 -2425605 2509502 3437754 -1083105 -6659314 -9082226
5965i082226N00227J468610K138193K962220K566082J127835L99535M04887n08422
$$ -9082226 -8581999 -7113389 -4975196 -2012976 553106 1680941 2080476 2485363 1976941
5956A976941k207941k428301l11200K210751L032570J917347k17707k195765k729417
$$ 1976941 -231000 -2659301 -2970501 -759750 2272820 4190167 3972460 1776695 -952722
5947i52722j408262M68016J400840J492549J321456K38146k018508l233905j232275
$$ -952722 -2360984 -1892968 -492128 1000421 2321877 2560023 541515 -2692390 -3924665
5938c924665K198084L178253J325310l6644N21472N96008j259932k641065j349470
$$ -3924665 -1726581 1451672 2776982 2740338 3261810 3857818 2597886 -43179 -1392649
5929a392649Q29169J198032N77106J458246L280033K982571r3350k897068k782199
$$ -1392649 -563480 634552 1211658 2669904 5949937 8932508 8839158 5942090 3159891
5920C159891o97142O37915K17925o91340p27720j01870k4807r84024k055549k057632
$$ 3159891 2462749 3100664 3318589 2627249 1899529 1797659 1772852 788828 -1266721 -3324353
5910c324353r54075L76904J349712J807603J322084l31471j974524j820002N2175
$$ -3324353 -4278428 -3901524 -2551812 -744209 577875 246404 -1728120 -3548122 -3495947
5901c495947J461231J099477K65323N16038J013560p7439k411761l651940k695062
$$ -3495947 -2034716 -935239 -669916 -153878 859682 782243 -1629518 -5281458 -7976520
5892g976520r64636j58202j61753J08396Q65614J413299J386849J048013M55836
$$ -7976520 -8941156 -9099358 -9261111 -9152715 -8287101 -6873802 -5486953 -4438940 -3983104
5883c983104o75140j903730j727067O24296L377960L637421R82522j800091k431861
$$ -3983104 -4658244 -6561974 -8289041 -7664745 -4286785 -649364 333158 -1466933 -3898794
5874c898794j943992k158490k086485K62666L348436L186673m37670k687913m84210
$$ -3898794 -5842786 -8001276 -10087761 -9825095 -6476659 -3289986 -3727656 -6415569 -6899779
5865f899779K832414K575689l05898j203216Q38266K156954N88930j585869j668035
$$ -6899779 -4067365 -1491676 -1797574 -3000790 -2162524 -5570 583360 -1002509 -2670544
5856b670544j19559J181050J502371P24870j250608l099124k463000O01323K849787
$$ -2670544 -2790103 -1609053 -106682 618188 -632420 -3731544 -6194544 -5593221 -2743434
5847b743434K342587J314518K233881L406199J765491j680822l048517j489281
$$ -2743434 -400847 913671 3147552 6553751 8319242 6638420 3589903 2100622
5839B100622l9855n18372j309894r25818k35564Q0346J032643K611310K569400
$$ 2100622 2060767 1542395 232501 -693317 -928881 -848535 184108 2795418 5364818
5830E364818l935k528808k653104j706191j887216k335569j098102Q83212J207095
$$ 5364818 5360883 2832075 178971 -1527220 -3414436 -5750005 -6848107 -5964895 -4757800
5821d757800J08915l28796M5713M8839M68231K627329M308030J884451l254364
$$ -4757800 -4648885 -4977681 -4931968 -4883129 -4414898 -1787569 2520461 4404912 1150548
5812A150548n389256k635656N08880M66237o64611k56967L0983j554516k332053
$$ 1150548 -4238708 -6874364 -6365484 -5899247 -6563858 -6820825 -6789842 -8344358 -10676411
5803a0676411L36375L538778L047024L41244j43515J361914J136606o40209k54768
$$ -10676411 -10340036 -6801258 -3754234 -3412990 -3556505 -2194591 -1057985 -1698194 -1952962
5794a952962K092271K026171q99862j633544J642142L662266N46276l494507k650555
$$ -1952962 139309 2165480 1265618 -367926 1274216 4936482 5482758 1988251 -662304
5785f62304J537528L029604L08843k700400l182402k032415n52413J111497K135375
$$ -662304 875224 3904828 4213671 1513271 -1669131 -3701546 -4253959 -3142462 -1007087
5776a007087J197555j079622k588201k729766k452370j531094J255594M980439
$$ -1007087 190468 -889154 -3477355 -6207121 -8659491 -10190585 -8934991 -3954552
5768c954552O503082M424131Q12791j833828l191287l730600k983563q48057R34419
$$ -3954552 2548530 6972661 7785452 5951624 2760337 -970263 -3953826 -4801883 -3867464
5759c867464O13780q64575p88336J572047L581108K416021j143472l365432k116129
$$ -3867464 -3253684 -4118259 -4906595 -3334548 246560 2662581 1519109 -1846323 -3962452
5750c962452N76284J465014M13854o5824R79798J696258P34438p08583j233101
$$ -3962452 -3386168 -1921154 -1507300 -1573124 -593326 1102932 1837370 1128787 -104314
5741a04314j297176j431946o13641J573524L059981J952838l86400j325806p42979
$$ -104314 -1401490 -2833436 -3447077 -1873553 1186428 3139266 2752866 1427060 684081
5732F84081l49089m61216j92696J20592m01355q25187K64434J693939J197614
$$ 684081 334992 -126224 -318920 -198328 -599683 -1424870 -1160436 533503 1731117
5723A731117m60691m84617Q65803K08408l136256n262445l342010K62673J747727
$$ 1731117 1270426 785809 1651612 1860020 -1276236 -6538681 -9880691 -9618018 -7870291
5714g870291R38486K30819O63355J425413J702191J059324o04319k016473j206327
$$ -7870291 -6931805 -6700986 -6037631 -4612218 -2910027 -1850703 -2455022 -4471495 -5677822
5705e677822J348060K446258Q43860l24939J571357L753582J700400l649024o516790
$$ -5677822 -4329762 -1883504 -1039644 -1364583 206774 3960356 5660756 2011732 -4505058
5696d505058m090007R2761J527916L52672k18166J126103K647568K581191J332505
$$ -4505058 -8595065 -8502304 -6974388 -6621716 -6839882 -5713779 -3066211 -485020 847485
5687H47485L55453k0854p20990k012425k537993j176174P90385R72267o78684
$$ 847485 1202938 1182084 461094 -1551331 -4089324 -5265498 -4475113 -3502846 -4181530
5678d181530j603608l57910J400790J688510R33984L94408k04350j314303j512982
$$ -4181530 -5785138 -6143048 -4742258 -3053748 -2119764 -1725356 -1929706 -3244009 -4756991
5669d756991N29514L036594K858425j43336k908578l206328j583711N48448K434522
$$ -4756991 -4227477 -1190883 1667542 1524206 -1384372 -4590700 -6174411 -5625963 -3191441
5660c191441L463754L300234K774391K845816K782835J307367q03785j613143
$$ -3191441 272313 3572547 6346938 9192754 11975589 13282956 12479171 10866028
5652A0866028j210936j272646j596792l55801J856661J866917j067855l603249
$$ 10866028 9655092 8382446 6785654 6429853 8286514 10153431 9085576 5482327
5644E482327l272822j703598r11298K6397J853500K185729n96278l354000k481676
$$ 5482327 2209505 505907 -405391 -378994 1474506 3660235 3063957 -290043 -2771719
5635b771719o8739q23104m086806m427676l23074L195455K079871j287824k560749
$$ -2771719 -2840458 -3663562 -7750368 -12178044 -12501118 -9305663 -7225792 -8513616 -11074365
5626a1074365j406015p0370Q86672K012678K313253P61038p79408M36107L489166
$$ -11074365 -12480380 -12550750 -11664078 -9651400 -7338147 -6577109 -7356517 -6920410 -3431244
5617c431244M333386J204026k909521l921305j164256K397710L424872J303265
$$ -3431244 902142 2106168 -803353 -4724658 -5888914 -3491204 -66332 1236933
5609A236933j326283j215292J735647L990385K572416j176608l554185l370987
$$ 1236933 -89350 -1304642 431005 4421390 6993806 5817198 2263013 -1107974
5601a107974k699762l030136l184202j688491Q94100L020025L906682L282357
$$ -1107974 -3807736 -6837872 -10022074 -11710565 -10816465 -7796440 -3889758 -607401
5593f07401J066515j526283k173827k69698J750421J555286J63475N9845J138209
$$ -607401 459114 -1067169 -3240996 -3510694 -1760273 -204987 -41512 18333 1156542
5584A156542J131171k90993q46499K67732M95291k074681m981772m268284o8887
$$ 1156542 2287713 1996720 1150221 1417953 1913244 -161437 -5143209 -9411493 -9480380
5575i480380L386226L302239J311803K72029M56769M58929R81l19326q45962j861056
$$ -9480380 -6094154 -2791915 -1480112 -1208083 -751314 -292385 -291404 -610730 -1456692 -3317748
5565c317748j493696K173306O707918O728993J339898l333313k025914K132647
$$ -3317748 -4811444 -2638138 4069780 10798773 12138671 8805358 6779444 8912091
5557H912091K223363k172360m684234k046685J544560J862843J022930K655067
$$ 8912091 11135454 8963094 4278860 2232175 3776735 5639578 6662508 9317575
5549I317575M884361L233328j740377m991550m436459k972860k828461k482410
$$ 9317575 14201936 17435264 15694887 10703337 6266878 3294018 465557 -2016853
5541b016853n11696J372434J191660j59773o92268k29610K27992M06840M76787
$$ -2016853 -2528549 -1156115 35545 -124228 -816496 -1046106 -818114 -411274 65513
5532F5513K50011q0084K70307J173674J413317Q72535R83131J870168J293756
$$ 65513 315524 235440 505747 1679421 3092738 3965273 4948404 6818572 8112328
5523H112328j779508m607918m003346p28612J816544K099570J172175j21694j859450
$$ 8112328 6332820 1724902 -2278444 -3007056 -1190512 909058 2081233 1959539 100089
5514A00089l289331l012533j173375N70175J424623J949108K144600J143626p78909
$$ 100089 -3189242 -6201775 -7375150 -6804975 -5380352 -3431244 -1286644 -143018 -921927
5505i21927j811133r79877N14107J007164K63296q37101j442233j168881l23477
$$ -921927 -2733060 -3712937 -3198830 -2191666 -1928370 -2765471 -4207704 -5376585 -5700062
5496e700062J10339m21762j024722m82449Q45892J605506J669265K094805K915575
$$ -5700062 -5589723 -6011485 -7036207 -7518656 -6672764 -5067258 -3397993 -1303188 1612387
5487A612387K916552J888071J061466P14649n01841k786895l830245j931933J052029
$$ 1612387 4528939 6417010 7478476 8193125 7691284 4904389 1074144 -857789 194240
5478A94240J847914j4511j940897j800402q8691J375342J584274Q92298K04318
$$ 194240 2042154 2027643 86746 -1713656 -1802347 -427005 1157269 2049567 2253885
5469B253885o8407l46518r85108j203570J17911K253588K496372p10366n236908
$$ 2253885 2185478 1838960 853852 -349718 -231807 2021781 4518153 3807787 -1429121
5460a429121p125523m867873r09835J237325P93854K56760K147161N561408O837989
$$ -1429121 -8554644 -13422517 -14332352 -13095027 -12301173 -12044413 -9897252 -4335844 2502145
5451B502145M062303l04836k523073k056613r42718J01615J704837K459036j89191
$$ 2502145 6564448 6259612 3736539 1679926 737208 838823 2543660 5002696 4813505
5442D813505m687223n555561j198378K774114J549333j650187j241654J302744
$$ 4813505 126282 -5429279 -6627657 -3853543 -2304210 -3954397 -5196051 -3893307
5434c893307L27513l584335l781564J395332N350542L516401K6201J10141J799134
$$ -3893307 -3565794 -7150129 -10931693 -9536361 -4185819 -669418 -643217 -533076 1266058
5425A266058O25699k029508j707727R58984J549509j70478k73270J593980J204657
$$ 1266058 1891757 -137751 -1845478 -886494 663015 492537 219267 1813247 3017904
5416C017904k344666m048062q94955L032996K895233J39757r05174j7706K0331
$$ 3017904 673238 -3374824 -4269779 -1236783 1658450 1798207 893033 875327 895658
5407H95658q62945m28910Q77033K18246k356481l363473j381582Q12848Q97368
$$ 895658 32713 -396197 480836 699082 -1657399 -5020872 -6402454 -5589606 -4692238
5398d692238K81348R04186J769131J025373p14016j543932j116959j21155J534299
$$ -4692238 -4410890 -3506704 -1737573 -712200 -1426216 -2970148 -4087107 -4208262 -2673963
5389b673963L613544L989930R72665l537463n905432n283261l566187j387952
$$ -2673963 939581 4929511 5902176 2364713 -3540719 -8823980 -12390167 -13778119
5381a3778119K284212O187817O430553K106766k029953j448823J885253K494689
$$ -13778119 -11493907 -5306090 1124463 3231229 1201276 -247547 1637706 4132395
5373D132395p80601l705494l081211m58939J406423K382476L329546L284679J029933
$$ 4132395 3351794 -353700 -3434911 -3893850 -2487427 -104951 3224595 6509274 7539207
5364G539207j859004k356492j92559J625883R07851j075778j957698j670141j891730
$$ 7539207 5680203 3323711 3131152 4757035 5664886 4589108 2631410 961269 -930461
5355i30461k933651l147736j693943j17274J6204k26489J169612L312922K894721
$$ -930461 -3864112 -7011848 -8705791 -8823065 -8806861 -9033350 -7863738 -4550816 -1656095
5346a656095n88054k779576m7865M704196N281932P36169l255012k401304P19375
$$ -1656095 -2244149 -5023725 -5071590 -367394 4914538 5650707 2395695 -5609 713766
5337G13766J479005M8047k87244O17056j37071k702560l526720j114079J417290
$$ 713766 2192771 2240818 1953574 2570630 2433559 -269001 -3795721 -4909800 -3492510
5328c492510J434090P78079J857857K823115N56107l300810l831436k26865K659869
$$ -3492510 -2058420 -1280341 577516 3400631 3956738 655928 -3175508 -3402373 -742504
5319g42504J432909r51766l4015L126906L506574k47673l650193k736031O03069
$$ -742504 690405 -261361 -295376 2831530 6338104 6090431 2440238 -295793 307276
5310C07276J817478J48116j119800j29961J080983L31775j295669j557639n21314
$$ 307276 2124754 2272870 1153070 1023109 2104092 2435867 1140198 -417441 -938755
5301i38755L01126Q35869J840102K306485M91626k566252l619729j868361j19487
$$ -938755 -637629 198240 2038342 4344827 4836453 2270201 -1349528 -3217889 -3337376
5292c337376l09315q53773q5056O27899l23733j320031L7172K633725L272525
$$ -3337376 -3646691 -4500464 -4585520 -3957621 -4281354 -5601385 -5564213 -2930488 342037
5283C42037J439267m86599j123452j025952j61925K086792M209814L329470m24917
$$ 342037 1781304 1294705 171253 -854699 -1016624 1070168 5279982 8609452 8184535
5274H184535l354089l156865j655050j221767j308975m64744N74959K01628j193622
$$ 8184535 4830446 1673581 18531 -1203236 -2512211 -2976955 -2401996 -2200368 -3393990
5265c393990j833062j036633N42879K098729K654242J169157j703093l189050
$$ -3393990 -5227052 -6263685 -5720806 -3622077 -967835 201322 -1501771 -4690821
5257d690821j526259J453420K581138J241332p25298j993872k569753k327399
$$ -4690821 -6217080 -4763660 -2182522 -941190 -1666488 -3660360 -6230113 -8557512
5249h557512r61403P30043J382850R27834M23148K12002j90366n71188j33400
$$ -8557512 -9518915 -8788872 -7406022 -6478188 -6055040 -5843038 -6033404 -6604592 -6737992
5240f737992P89260Q46757j51340p32657K5467J167761J464629J104243P41192
$$ -6737992 -5948732 -5101975 -5253315 -5985972 -5960505 -4792744 -3328115 -2223872 -1482680
5231a482680k10738k772999n866114o146652j719751M471761O829535L466674
$$ -1482680 -1693418 -4466417 -10332531 -16479183 -18198934 -13727173 -6897638 -3430964
5223c430964j214633j913419R95967K787934J371077n82449p85390o70794j803514
$$ -3430964 -4645597 -6559016 -5563049 -2775115 -1404038 -1986487 -2771877 -3442671 -5246185
5214e246185k444959n89654K035149K218806k6592j944230k031332q56431R90901
$$ -5246185 -7691144 -8280798 -6245649 -4026843 -4053435 -5997665 -8028997 -8885428 -7894527
5205g894527L027891L891398K851962J448692J216208J037463n87495k236250
$$ -7894527 -4866636 -975238 1876724 3325416 4541624 5579087 4991592 2755342
5197B755342j866890r18193k064862l959900k875607P67756K533797J135584L55669
$$ 2755342 888452 -29741 -2094603 -6054503 -8930110 -8162354 -5628557 -4492973 -4137304
5188d137304K333475L834009J734643j849156k979208j330583P86057K313959
$$ -4137304 -1803829 2030180 3764823 1915667 -1063541 -2394124 -1608067 705892
5180G05892L367614L185528J095165j563687k703855j904042k03383J334228J744823
$$ 705892 4073506 7259034 8354199 6790512 4086657 2182615 1979232 3313460 5058283
5171E058283L35340k137395l835688m094886l659268k430294M53889L687402M106999
$$ 5058283 5393623 3256228 -579460 -4674346 -8333614 -10763908 -10310019 -6622617 -2515618
5162b515618J337056r02423N8061K200956K319045M42135j399303k289032k056624
$$ -2515618 -1178562 -2080985 -2022924 178032 2497077 2939212 1539909 -749123 -2805747
5153b805747k10227K476608L527470J965347k82512j746419l182057m283114k559410
$$ -2805747 -3015974 -539366 2988104 4953451 4670939 2924520 -257537 -4540651 -7100061
5144g100061J822935M216835K105578m68129O06968K586408Q49355k666581k542578
$$ -7100061 -5277126 -1060291 1045287 577158 1184126 3770534 4619889 1953308 -589270
5135e89270Q25382J950864o40031k790765k230340j297908j414050q30544P91234
$$ -589270 236112 2186976 1546945 -1243820 -3474160 -4772068 -6186118 -7016662 -6225428
5126f225428J060553k52429r4936K258208L260716Q61941k177958k923566k080700
$$ -6225428 -5164875 -5417304 -5512240 -3254032 6684 868625 -1309333 -4232899 -6313599
5117f313599r57229J276694M640648O329118M509618J161968j254588k937210
$$ -6313599 -7270828 -5994134 -1353486 4975632 9485250 10647218 9392630 6455420
5109F455420m327171l933666j264133J161685J526591J503681K531663K494061
$$ 6455420 2128249 -1805417 -3069550 -1907865 -381274 1122407 3654070 6148131
5101F148131m41482l578771l333182r09449j14254j102336p14523J736709L328506
$$ 6148131 5706649 2127878 -1205304 -2114753 -2229007 -3331343 -4045866 -2309157 1019349
5092A019349K288277K46972q12138r18157q27096p69329r52104j338924q78811
$$ 1019349 3307626 3554598 2742460 1824303 997207 227878 -724226 -2063150 -2941961
5083b941961J016244K498830J322573j226249j467187J026282K221051l07198
$$ -2941961 -1925717 573113 1895686 669437 -797750 228532 2449583 2142385
5075B142385l167984j864008K363123M051640J278212j913304j730939J68336
$$ 2142385 -1025599 -2889607 -526484 3525156 4803368 2890064 1159125 1327461
5067A327461L1654j941831k351024l80015R58179j63282j596885r81905O05634
$$ 1327461 1359115 -582716 -2933740 -3313755 -2355576 -2518858 -4115743 -5097648 -4492014
5058d492014R81383N22418Q12277J291692K68770j638152j992841j86903J872526
$$ -4492014 -3510631 -2988213 -2175936 -884244 -615474 -2253626 -4246467 -4433370 -2560844
5049b560844K544183J768011q3303k487569m109576l823352k164840k47157J810435
$$ -2560844 -16661 1751350 1668047 -819522 -4929098 -8752450 -10917290 -11164447 -9354012
5040i354012L634242L442389P12113j689282j186910L66376j18104j488243o36674
$$ -9354012 -5719770 -2277381 -1565268 -3254550 -4441460 -4075084 -4193188 -5681431 -6318105
5031f318105J394046J212450m8529J736049N252083M222293k067170o117078l268106
$$ -6318105 -4924059 -3711609 -3760138 -2024089 3227994 7450287 5383117 -733961 -4002067
5022d002067J375348J346092j848659k884225j082883Q51202K537248M682585
$$ -4002067 -2626719 -1280627 -3129286 -6013511 -7096394 -6245192 -3707944 974641
5014I74641N303197K680965m37494o86581L59686n10305j988752j043976N12602
$$ 974641 6277838 8958803 8521309 7834728 8194414 7684109 5695357 4651381 5163983
5005E163983j321215m949081m829428o94770J567962p67029l258102j679603J887671
$$ 5163983 3842768 -1106313 -5935741 -6630511 -5062549 -5829578 -9087680 -10767283 -8879612
4996h879612L248317K263997J524365J678163J442375P61223R90795K231894K602771
$$ -8879612 -5631295 -3367298 -1842933 -164770 1277605 2038828 3029623 5261517 7864288
4987G864288P25106k087971l065082j442112L46340J0002j038753K71147L425840
$$ 7864288 8589394 6501423 3436341 1994229 2340569 2350571 1311818 1582965 5008805
4978E008805M339219J389509j984005k487477j539439k109025l758752l871509
$$ 5008805 9348024 10737533 8753528 6266051 4726612 2617587 -1141165 -5012674
4970e012674j874068N80503K222290K796232K555748K603974L748558M108164
$$ -5012674 -6886742 -6306239 -4083949 -1287717 1268031 3872005 7620563 11728727
4962A1728727J004070l735719m739295j184971J274123m80040j990075N35481
$$ 11728727 12732797 8997078 4257783 3072812 4346935 3866895 1876820 2412301
4954B412301L112277J205604j519655O28300M743861L582797k187573m917366
$$ 2412301 5524578 6730182 5210527 5838827 10582688 14165485 11977912 7060546
4946G060546k066825J110537R50893m22116j037418k128364l940186m410602l148412
$$ 7060546 4993721 6104258 7055151 6633035 5595617 3467253 -472933 -4883535 -8031947
4937h031947j825027m86275J742731L140545J918033Q32258L128522N551998K647780
$$ -8031947 -9856974 -10343249 -8600518 -5459973 -3541940 -2709682 418840 5970838 8618618
4928H618618l276043m630880m63709K701042K121288J912434L678413L248926
$$ 8618618 5342575 711695 247986 2949028 5070316 6982750 10661163 13910089
4920A3910089o79742l066797j006954J587490J026281r20056j653313j593070
$$ 13910089 13230347 10163550 9156596 10744086 11770367 10850311 9196998 7603928
4912G603928j097408O67310K201577R14745j343692m59921K139825J351673k021484
$$ 7603928 6506520 7173830 9375407 10290152 8946460 8486539 10626364 11978037 9956553
4903I956553k149612J131000J912223q40760j847895J07168P13179j99820J344846
$$ 9956553 7806941 8937941 10850164 10009404 8161509 8268677 8981856 8782036 10126882
4894A0126882L325781M2038m939731k352688N334856O101830m20423k148297K464492
$$ 10126882 13452663 13494701 8554970 6202282 11537138 17638968 17218545 15070248 17534740
4885A7534740J598470n295850l890581O649750Q231651k467724m455212Q153704
$$ 17534740 19133210 13837360 9946779 16596529 24828180 22360456 17905244 26058948
4877B6058948J0630443o060055j1185350Q517384N875254n8333363j30263223
$$ 26058948 36689391 30629336 19443986 27961370 33836624 -24496739 -154759962
4870a54759962j15064283j0578465P9450834Q0129439L0455344O256607J6200054
$$ -154759962 -269824245 -280402710 -200951876 -120822437 -90367093 -84110486 -67910432
4863f7910432J9549293N298852j706067N992840R367773K054399j252953M073151
$$ -67910432 -48361139 -43062287 -44768354 -38775514 -29407741 -27353342 -28606295 -24533144
4855b4533144N348843j107966l569277J705501M046837n85650k719650J915905
$$ -24533144 -19184301 -20292267 -23861544 -22156043 -18109206 -18694856 -21414506 -19498601
4847a9498601N016248J962941o62017J150105J947185j227284k870198l7975K125655
$$ -19498601 -14482353 -12519412 -13181429 -12031324 -10084139 -11311423 -14181621 -14219596 -12093941
4838a2093941N41588o12478Q43835O39836k782134m072526n69336K518695J215531
$$ -12093941 -11552353 -12164831 -11320996 -10681160 -13463294 -17535820 -18105156 -15586461 -14370930
4829a4370930q19158K40864J731006L25245j701469j053075Q53337J300079J124908
$$ -14370930 -15190088 -14949224 -13218218 -12892973 -14594442 -15647517 -14794180 -13494101 -12369193
4820a2369193K121411L206245K613255Q61138r82155k906985l936956j951074
$$ -12369193 -10247782 -7041537 -4428282 -3567144 -4549299 -7456284 -11393240 -13344314
4812a3344314K506513N497161M582070J510914j209624l169735m259358l458213
$$ -13344314 -10837801 -5340640 -758570 752344 -457280 -3627015 -7886373 -11344586
4804a1344586j048224P96931R53478M35635p2162j000139j757023q36875J329710
$$ -11344586 -12392810 -11595879 -10642401 -10206766 -10278928 -11279067 -13036090 -13872965 -12543255
4795a2543255K510706K158799J961266K573130K643645J428995l02766k072293
$$ -12543255 -10032549 -7873750 -5912484 -3339354 -695709 733286 430520 -1641773
4787a641773l749909m004999j540949K222415M339457L929221K278640L86047
$$ -1641773 -5391682 -9396681 -10937630 -8715215 -4375758 -446537 1832103 2218150
4779B218150j018244n73321J455487J806375j318273m424826l470120k75092N73645
$$ 2218150 1199906 626585 2082072 3888447 2570174 -1854652 -5324772 -5599864 -5026219
4770e026219r02231j299274n42873j178433k344251j077352J291012R76233p24776
$$ -5026219 -5928450 -7227724 -7770597 -8949030 -11293281 -12370633 -11079621 -10103388 -10828164
4761a0828164P02511L835185K470380l133474n039534q9584M943653M256648J161496
$$ -10828164 -10125653 -6290468 -3820088 -6953562 -11993096 -12082680 -7139027 -2882379 -1720883
4752a720883Q43420K130056J738137O40342O91435J2266k913491m991133l417394
$$ -1720883 -877463 1252593 2990730 3631072 4322507 4334773 1421282 -3569851 -6987245
4743f987245p32118k30036m68649Q23267J577649n11373k508150o16234L017559
$$ -6987245 -7719363 -7949399 -8418048 -7594781 -6017132 -6528505 -9036655 -9652889 -6635330
4734f635330L644562J577530P66708J620915J019945j506000k925443j842094
$$ -6635330 -2990768 -1413238 -646530 974385 1994330 488330 -2437113 -4279207
4726d279207j61238L86736L3414m72798m84583O16790K035132J685778k81623
$$ -4279207 -4440445 -4053709 -4020295 -4493093 -4977676 -4360886 -2325754 -639976 -921599
4717i21599n77758K068257L884294J582412k145787k848693j302848j415142l194219
$$ -921599 -1499357 568900 4453194 6035606 3889819 1041126 -261722 -1676864 -4871083
4708d871083l107175m17122J865170K021823J178861K3913j828024l151681j743607
$$ -4871083 -7978258 -8395380 -6530210 -4508387 -3329526 -3305613 -5133637 -8285318 -10028925
4699a0028925J820628M293903L939648J972582O0888r91540n92911R35900J650917
$$ -10028925 -8208297 -3914394 25254 1997836 2058724 1067184 474273 1410173 3061090
4690C061090M79013o81882j5084P26522q12447k814848j731153J559110K649102
$$ 3061090 3540103 2858221 2843137 3569659 2757212 -57636 -1788789 -229679 2419423
4681B419423L96979j728336j439753m68262o76190j115803l38415J217219K296601
$$ 2419423 2816402 1088066 -351687 -819949 -1496139 -2611942 -2950357 -1733138 563463
4672E63463K182877N76210j877878l134313j979410j00620L87850K68825J142240
$$ 563463 2746340 3322550 1444672 -1689641 -3669051 -3769671 -3381821 -3112996 -1970756
4663a970756J620369m20028l023904k333799R61687K405480J036917N22209K211717
$$ -1970756 -350387 -770415 -3794319 -6128118 -5166431 -2760951 -1724034 -1201825 1009892
4654A009892K544501p56635m808623o262239n594281m271382j739783J885583
$$ 1009892 3554393 2797758 -2010865 -8273104 -13867385 -18138767 -19878550 -17992967
4646a7992967L772732K214222l09974p54105L73282J052748J245586J658750J537272
$$ -17992967 -14220235 -12006013 -12315987 -13070092 -12696810 -11644062 -10398476 -8739726 -7202454
4637g202454M66244J05453J438292K524997J709299P67929J869095L544507L013411
$$ -7202454 -6736210 -6630757 -5192465 -2667468 -958169 -190240 1678855 5223362 8236773
4628H236773P53344o83295r84642j702441k664402k358581j214115r35304r45765
$$ 8236773 8990117 8306822 7322180 5619739 2955337 596756 -617359 -1552663 -2498428
4619b498428Q15170L453098L335703k29446l008520j379065K792549M998854L890782
$$ -2498428 -1683258 1769840 5105543 4876097 1867577 488512 3281061 8279915 12170697
4610A2170697J791853N87913j99452j260961j825429j201097n01773j297391l097527
$$ 12170697 13962550 14550463 14351011 13090050 11264621 10063524 9561751 8264360 5166833
4601E166833l720078k271166l50980K69365r6377n2106O92395J315331J205266
$$ 5166833 1446755 -824411 -1175391 -906026 -1002403 -1054509 -362114 953217 2158483
4592B158483J11658k014843l929099l145683P90545M214409L292466o02509k659788
$$ 2158483 2270141 255298 -3673801 -6819484 -6028939 -1814530 1477936 875427 -1784361
4583a784361j520738o30291k114801l424543j964196N28500R70034l85287j117420
$$ -1784361 -3305099 -3935390 -6050191 -9474734 -11438930 -10910430 -9940396 -10325683 -11443103
4574a1443103m28236R81917K929201M783256M269852N05846l062011k266810J852414
$$ -11443103 -11871339 -10889422 -7960221 -3176965 1092887 1598733 -1463278 -3730088 -1877674
4565a877674M141793K202763j121340k440486j831781j203629j283570j615307
$$ -1877674 2264119 4466882 3345542 905056 -926725 -2130354 -3413924 -5029231
4557e029231j794298j563577q69132l32963m14298k8452K242873N368369O376066
$$ -5029231 -6823529 -8387106 -9256238 -9589201 -10003499 -10031951 -7789078 -2420709 3955357
4548C955357M221246J078813r68551k278069l532539l653459j755207O44977J554508
$$ 3955357 8176603 9255416 8286865 6008796 2476257 -1177202 -2932409 -2287432 -732924
4539g32924J266956J041636M24808j454721l002657j837205R36001J580498o59582
$$ -732924 534032 1575668 2000476 545755 -2456902 -4294107 -3358106 -1777608 -2437190
4530b437190k301826j201382J78604o66756j723851R6793L314836L860858J512361
$$ -2437190 -4739016 -5940398 -5761794 -6428550 -8152401 -8055608 -4740772 -879914 632447
4521F32447n3427N71952Q18040o20575j307825K14490J212230p85202l397349
$$ 632447 579020 1150972 1969012 1348437 40612 255102 1467332 682130 -2715219
4512b715219k783239M30996K240711J128800n77208p52384J51260P99904O02239
$$ -2715219 -5498458 -5067462 -2826751 -1697951 -2275159 -3027543 -2876283 -2076379 -1474140
4503a474140m76705j801819j906107j59785J839352K266511J703188J773628K055572
$$ -1474140 -1950845 -3752664 -5658771 -5818556 -3979204 -1712693 -9505 1764123 3819695
4494C819695Q43931j570267l007719k588724j447733n26380L0711l13340j807064
$$ 3819695 4663626 3093359 85640 -2503084 -3950817 -4477197 -4446486 -4759826 -6566890
4485f566890k929023k069942j69201Q53018J321790K401249K733749N62707j718118
$$ -6566890 -9495913 -11565855 -11735056 -10882038 -9560248 -7158999 -4425250 -3862543 -5580661
4476e580661j67573L611998L577131j502607n566631m178573m92591P92830M52362
$$ -5580661 -5748234 -2136236 1440895 -61712 -5628343 -9806916 -10299507 -9506677 -9054315
4467i054315J570365L330858K712068p7844k124554k212587j359408m13690J49712
$$ -9054315 -7483950 -4153092 -1441024 -1518868 -3643422 -5856009 -7215417 -7629107 -7479395
4458g479395k90131r00215N71719L864664N007103J825549k170902k645956m52171
$$ -7479395 -7769526 -8669741 -8098022 -4233358 773745 2599294 428392 -2217564 -2669735
4449b669735P63447L19306j02696m17919j206955q92805J664894L550921J476007
$$ -2669735 -1906288 -1586982 -1689678 -2107597 -3314552 -4207357 -2542463 1008458 2484465
4440B484465k404210l269785j102345j69039j613153j984799M27018K793003K418629
$$ 2484465 80255 -3189530 -4291875 -4460914 -6074067 -8058866 -7631848 -4838845 -2420216
4431b420216K07804j607003j872476j06842L101088N079490L675892O98595o39624
$$ -2420216 -2212412 -3819415 -5691891 -5798733 -2697645 2381845 6057737 6756332 6116708
4422F116708r74398l147887n925386m820744K27385L654669K426377J12003M00097
$$ 6116708 5142310 1994423 -3930963 -8751707 -8524322 -4869653 -2443276 -2331273 -1931176
4413a931176J478429J91890k255524k619194q77650L81008K9170r64601j544428
$$ -1931176 -452747 -260857 -2516381 -5135575 -6013225 -5632217 -5603047 -6567648 -8112076
4404h112076j119828M59192J979176J639454r2034n66971R86695K105362J144465
$$ -8112076 -9231904 -8772712 -6793536 -5154082 -5246116 -5813087 -4826392 -2721030 -1576565
4395a576565j93019j59999J21747p03154j345088k13433J532196J816038P29318
$$ -1576565 -1769584 -1929583 -1807836 -2510990 -3856078 -4069511 -2537315 -721277 8041
4386H041m64352j577397k568743k254696k94355J212694M36853j330373j641438
$$ 8041 -456311 -2033708 -4602451 -6857147 -7151502 -5938808 -5501955 -6832328 -8473766
4377h473766k51205J428596K625628L002836J862544m00999j739576j319078j049719
$$ -8473766 -8724971 -7296375 -4670747 -1667911 194633 -206366 -1945942 -3265020 -4314739
4368d314739k163055k528834j30619K864890K839057R9637j813855j263016K02875
$$ -4314739 -6477794 -9006628 -9137247 -6272357 -3433300 -3333663 -5147518 -6410534 -6207659
4359f207659R90284Q96509l7562j275972r99725J532005L492227J636093k386591
$$ -6207659 -5217375 -4320866 -4358428 -5634400 -6634125 -5102120 -1609893 26200 -2360391
4350b360391l486554k73447K886279K137757q10119j893215m49868P98324J96059
$$ -2360391 -5846945 -6120392 -3234113 -1096356 -1906475 -3799690 -4249558 -3451234 -3255175
4341c255175r90328j062099k82768n0140o72017j026879m02170K99884o3381r05957
$$ -3255175 -4245503 -5307602 -5590370 -5640510 -6312527 -7339406 -7741576 -7441692 -7505073 -8411030
4331h411030o28355P43440J191072m35880k577564k945537j317999O28453J474839
$$ -8411030 -9039385 -8295945 -7104873 -7540753 -10118317 -13063854 -14381853 -13753400 -12278561
4322a2278561J153400N36767O45459J719367K730524K516824J394825N35249p0874
$$ -12278561 -11125161 -10588394 -9942935 -8223568 -5493044 -2976220 -1581395 -1046146 -1117020
4313a117020j280066k413206j467827J655511M307816M340157K220224p17167
$$ -1117020 -2397086 -4810292 -6278119 -4622608 -314792 4025365 6245589 5528422
4305E528422l747506n703065n188531l037505j800237j575046M19187M494508
$$ 5528422 1780916 -3922149 -9110680 -12148185 -13948422 -15523468 -15104281 -10609773
4297a0609773O463430L592643q69354k353323j066606J29975R47248K522245L481694
$$ -10609773 -4146343 -553700 -1423054 -3776377 -4842983 -4713008 -3765760 -1243515 2238179
4288B238179J860732o08354o82817R96144J010807j215759l099439l409982k991302
$$ 2238179 4098911 3490557 2807740 3803884 4814691 3598932 499493 -2910489 -5901791
4279e901791j823730L18780J144916j427891m371671k637769K747858N190913
$$ -5901791 -7725521 -7406741 -6261825 -7689716 -12061387 -14699156 -11951298 -6760385
4271f760385K043649j879768k058796k59724n1420r48689o08867N13951M46112
$$ -6760385 -4716736 -6596504 -8655300 -8915024 -8966444 -9915133 -10524000 -10010049 -9563937
4262i563937n35949o50936K66906R15153O91882j51240j353763k149183j266623
$$ -9563937 -10099886 -10750822 -10483916 -9568763 -8876881 -9028121 -10381884 -12531067 -13797690
4253a3797690J163206L041933K917088J809580J307461J357494J195555R61171
$$ -13797690 -12634484 -9592551 -6675463 -4865883 -3558422 -2200928 -1005373 -44202
4245d4202R64518O16474m95583j477942j336516m57368J77209L95688M40231J158
$$ -44202 920316 1536790 1041207 -436735 -1773251 -2230619 -2053410 -1657722 -1217491 -1216333
4235a216333j160934k126055j595328J37641R68336n13035k625015k009232J796245
$$ -1216333 -2377267 -4503322 -6098650 -5961009 -4992673 -5505708 -8130723 -10139955 -8343710
4226h343710M613696K511311k460861m485849j837909J293684J664040J118681
$$ -8343710 -3730014 -1218703 -3679564 -8165413 -10003322 -8709638 -7045598 -5926917
4218e926917J675112J247121j813411m020018j703765K325471K614970n11602
$$ -5926917 -4251805 -3004684 -4818095 -8838113 -10541878 -8216407 -5601437 -6113039
4210f113039k060907n18902Q80803M00044k56612j83022m19450q11823k92406
$$ -6113039 -8173946 -8692848 -7812045 -7412001 -7668613 -7851635 -8271085 -9082908 -9375314
4201i375314K3695j415337k519015k82801L189314K971003q51184l421626k905722
$$ -9375314 -9351619 -10766956 -13285971 -13568772 -10379458 -7408455 -8259639 -11681265 -14586987
4192a4586987k003045j751942j43515K674294L938825L491613L581241L487978
$$ -14586987 -16590032 -18341974 -18485489 -15811195 -11872370 -8380757 -4799516 -1311538
4184a311538O48641l123320l462756j264492j292096l323622k772419J76301R66127
$$ -1311538 -662897 -3786217 -7248973 -8513465 -9805561 -13129183 -15901602 -15725301 -14759174
4175a4759174J7770J869769M969621L239284j723875k112646J431412J65033n796810
$$ -14759174 -14741404 -12871635 -7902014 -4662730 -6386605 -8499251 -7067839 -6902806 -12699616
4166a2699616o027599J043900L874632j570308m047507K217687O497135J400123
$$ -12699616 -18727215 -17683315 -13808683 -15378991 -19426498 -17208811 -10711676 -9311553
4158i311553l637450o87317K167525j772846l663462K218206M130850n002562
$$ -9311553 -12949003 -13636320 -11468795 -13241641 -16905103 -14686897 -10556047 -15558609
4150a5558609j0701988l093140J287330j0367206j8458675o742988l494903l9039424
$$ -15558609 -26260597 -29353737 -28066407 -38433613 -56892288 -63635276 -67130179 -106169603
4142a06169603p6845163m7414580M4818099J09447873Q6477570K1128287r876663
$$ -106169603 -183014766 -230429346 -185611247 -76163374 10314196 31442483 21565820
4135B1565820O24504P307932n272483j1831202j976936M795409r00400m608274
$$ 21565820 22190324 29498256 24225773 12394571 10417635 15213044 14312644 9704370
4127I704370O49959K581603l826246n897689K285022Q461655L889553l310383
$$ 9704370 10354329 12935932 9109686 3211997 5497019 13958674 17848227 14537844
4119A4537844m717229m134121n593698m426680J542256N290166K768344J56505
$$ 14537844 9820615 5686494 92796 -4333884 -2791628 2498538 5266882 5423387
4111E423387K229079M245077J732295j606089j722042q98844j329235o32073J537978
$$ 5423387 7652466 11897543 13629838 12023749 10301707 9402863 8073628 7441555 8979533
4102H979533R32309k839829l783751L06872L648966K608111J267605K391363J881533
$$ 8979533 9911842 7072013 3288262 3595134 7244100 9852211 11119816 13511179 15392712
4093A5392712k360210m755139j463703K356394J263785j550979p99212J767240
$$ 15392712 13032502 8277363 6813660 9170054 10433839 8882860 8083648 9850888
4085I850888J618716n45035j640961k299782l911857m012887o71272K518462J583977
$$ 9850888 11469604 10924569 9283608 6983826 3071969 -940918 -1612190 906272 2490249
4076B490249j386078k301183j749275k198539k293033K47003L153775K779076
$$ 2490249 1104171 -1197012 -2946287 -5144826 -7437859 -7190856 -4037081 -1258005
4068a258005K58858p04859R8844M42678M30256J335070J801530J6623k146505
$$ -1258005 -999147 -1704006 -1605162 -1162484 -732228 602842 2404372 2420995 274490
4059B74490j749344P6064K6773j741764k133207k31574J887714K683740K362786
$$ 274490 -1474854 -1398790 -1372017 -3113781 -5246988 -5478562 -3590848 -907108 1455678
4050A455678J440456N79501O64042J174392M17488j102824n80390J956367K353842
$$ 1455678 2896134 3475635 4139677 5314069 5731557 4628733 4048343 6004710 8358552
4041H358552j059777l912541k554573l6825o75868k725681k039189L88445P44899
$$ 8358552 7298775 3386234 831661 794836 118968 -2606713 -4645902 -4257457 -3512558
4032c512558l19165P47644L266280L306219Q77543k05804P20392N77445r79059
$$ -3512558 -3831723 -3084079 182201 3488420 4365963 4160159 4880551 5457996 4478937
4023D478937p34949J537396J745847j505801l972196k354006O78088R87850r99123
$$ 4478937 3743988 5281384 7027231 5521430 1549234 -804772 -126684 861166 -137957
4014a37957j884153n67872R14204O02413j366965l325615l554363j695547R01102
$$ -137957 -2022110 -2589982 -1675778 -1073365 -2440330 -5765945 -9320308 -11015855 -10114753
4005a0114753K653668L211736K837829J405903p28457k045777j663600o84614
$$ -10114753 -7461085 -4249349 -1411520 -5617 -734074 -2779851 -4443451 -5128065
3997e128065j86488N83444K135147K778416J263177m31560R3956J629706J293394
$$ -5128065 -5314553 -4731109 -2595962 182454 1445631 1014071 1108027 2737733 4031127
3988D031127q95247k635647l199282l304961k587530q41492k74825k367199l865280
$$ 4031127 3135880 500233 -2699049 -6004010 -8591540 -9433032 -9707857 -12075056 -15940336
3979a5940336o86614N047786P015541L503971r36968k813978l240758l286071
$$ -15940336 -16626950 -11579164 -4563623 -1059652 -1996620 -4810598 -8051356 -11337427
3971a1337427j298838L009762O336584O077522L457833O76450j682624k977802
$$ -11337427 -12636265 -9626503 -3289919 2787603 6245436 6921886 5239262 2261460
3963B261460j920756O64181J890791J071496M49823N57714q65321l588588l314912
$$ 2261460 340704 1004885 2895676 3967172 4416995 4974709 4109388 520800 -2794112
3954b794112J602415O063613M662828q87902m575319l902218j218783Q45123J631451
$$ -2794112 -1191697 4871916 9534744 8646842 4071523 169305 -1049478 -204355 1427096
3945A427096J240747J46720n20747l31037l05937q75479o50811J162799K904374
$$ 1427096 2667843 2814563 2293816 1962779 1656842 781363 130552 1293351 4197725
3936D197725K744286J088793q47430k774304l967204k671988Q77282L172301J752297
$$ 4197725 6942011 8030804 7183374 4409070 441866 -2230122 -1352840 1819461 3571758
3927C571758j191103k126484j110099n39713q09014m67493N05421Q31705O88536
$$ 3571758 2380655 254171 -855928 -1395641 -2204655 -2672148 -2166727 -1335022 -646486
3918f46486J432730K915634L575551K984921K138226J384963j7589k304439m486051
$$ -646486 786244 3701878 7277429 10262350 12400576 13785539 13767950 11463511 6977460
3909F977460n092838l083270R77047M151532L396706m29148k976995k109785o39487
$$ 6977460 1884622 -1198648 -221601 3929931 7326637 6897489 3920494 1810709 1171222
3900A171222j553492l368773k987783p08297R06504J280074J572758J675290Q22389
$$ 1171222 -382270 -3751043 -6738826 -7447123 -6540619 -5260545 -3687787 -2012497 -1190108
3891a190108M3396P78711K066489K093495J315068R76665J06197k389419m141510
$$ -1190108 -1146712 -368001 1698488 3791983 5107051 6083716 6189913 3800494 -341016
3882c41016k147603J747188K783592L59764j484063p64606Q0861o62450j228994
$$ -341016 -2488619 -741431 2042161 2401925 917862 153256 234117 -428333 -1657327
3873a657327l51908K75340m04099n13457J046386J849821l18179l445692l784694
$$ -1657327 -2009235 -1733895 -2137994 -2651451 -1605065 244756 -73423 -3519115 -7303809
3864g303809p64415K767404L939430J925537j904925m468190l160185R54243L578697
$$ -7303809 -8068224 -5300820 -1361390 564147 -1340778 -5808968 -8969153 -8014910 -4436213
3855d436213K148052j110745k378792r17074J050885J768819J391009O69050j71571
$$ -4436213 -2288161 -3398906 -5777698 -6694772 -5643887 -3875068 -2484059 -1815009 -1986580
3846a986580j187722k077399j975310k85098J806160J694593j239277l634949
$$ -1986580 -3174302 -5251701 -7227011 -7512109 -5705949 -4011356 -5250633 -8885582
3838h885582j968057K286659M319489K629783M71668K09586K50168q52785j191031
$$ -8885582 -10853639 -8566980 -4247491 -1617708 -1146040 -936454 -686286 -1539071 -2730102
3829b730102Q78898L026562K137572q74107k595762j988675q16233k84708K0578
$$ -2730102 -1851204 1175358 3312930 2438823 -156939 -2145614 -2961847 -3246555 -3225977
3820c225977N03502J113362J948864K540538J490412j371397l611298k936269
$$ -3225977 -2722475 -1609113 339751 2880289 4370701 2999304 -611994 -3548263
3812c548263k10889K173988L555658M367496L783758R93618k093540k630030j051918
$$ -3548263 -3759152 -1585164 1970494 6337990 10121748 11115366 9021826 6391796 5339878
3803E339878n18637k115273l575737l183528k050829j584604j203072Q0152J656444
$$ 5339878 4821241 2705968 -869769 -4053297 -6104126 -7688730 -8891802 -8811650 -7155206
3794g155206K241310J520265m7262j850454k779015j556649J528716M105960L912280
$$ -7155206 -4913896 -3393631 -3440893 -5291347 -8070362 -9627011 -8098295 -3992335 -80055
3785h0055J123407j931931k944488j409787J073487K145862R41312r81873j473980
$$ -80055 1043352 -888579 -3833067 -5242854 -4169367 -2023505 -1082193 -2064066 -3538046
3776c538046j90430J580173K800933L122487K063657l97005k553551k341489l62037
$$ -3538046 -3728476 -2148303 652630 3775117 5838774 5441769 2888218 546729 184692
3767A84692M07424j338919l325853k943475p48122P94369Q05996M17520L52509
$$ 184692 592116 -746803 -4072656 -7016131 -7764253 -6969884 -6163888 -5746368 -5393859
3758e393859j7775j109477k071528j811187k84753J580019K683587K283983L65051
$$ -5393859 -5411634 -6521111 -8592639 -10403826 -10688579 -9108560 -6424973 -4140990 -3775939
3749c775939k104484l653595l475060j989623j06197J676348L054012L357958
$$ -3775939 -5880423 -9534018 -13009078 -14998701 -15104898 -13428550 -10374538 -7016580
3741g016580K214811P02911N76697J802787K151630L38637j631143j034867J437670
$$ -7016580 -4801769 -4098858 -3522161 -1719374 432256 770893 -860250 -1895117 -457447
3732d57447K467879R52856n08585L06353K137539K597428J541536K80039r01655
$$ -457447 2010432 2963288 2454703 2761056 4898595 7496023 9037559 9317598 8415943
3723H415943k351143l338652k823724j249679J42640J102470J937094K174491
$$ 8415943 6064800 2726148 -97576 -1347255 -1204615 -102145 1834949 4009440
3715D009440J307574K1403r00029j831081k845042k509123l26513J217107j27043
$$ 4009440 5317014 5338417 4438388 2607307 -237735 -2746858 -3073371 -1856264 -1983307
3706a983307k525573k796742j743888k593896m715431l804987R76325M899133
$$ -1983307 -4508880 -7305622 -9049510 -11643406 -16358837 -20163824 -19187499 -14288366
3698a4288366M480190K118885J538444K388752K303918J191541L42176k02428
$$ -14288366 -9808176 -7689291 -6150847 -3762095 -1458177 -266636 75540 -126888
3690a26888m53573Q60303L379727L480429p28492n033357m124989N28370K605187
$$ -126888 -580461 279842 3659569 7139998 6411506 1378149 -2746840 -2218470 386717
3681C86717J40277k195821o48075K507165L244786J444764k55808p07281p49746
$$ 386717 526994 -1668827 -2316902 190263 3435049 4879813 4624005 3916724 3166978
3672C166978r69899j177160j359476j577805j413029n88490L53248P48516O74112
$$ 3166978 2197079 1019919 -339557 -1917362 -3330391 -3918881 -3565633 -2817117 -2143005
3663b143005O36041J004357J989985L312914L687455J810738j622049m005521
$$ -2143005 -1506964 -502607 1487378 4800292 8487747 10298485 8676436 4670915
3655D670915l654078j678124l69908n41470j201291j177357k41478R82465J571838
$$ 4670915 1016837 -661287 -1031195 -1572665 -2773956 -3951313 -4192791 -3210326 -1638488
3646a638488R82349m05190j539889j632613o74764P77746J909323K024270J282168
$$ -1638488 -656139 -1061329 -2601218 -4233831 -4908595 -4130849 -2221526 -197256 1084912
3637A084912P74873J099612J255954L6183j852609k471303j341583J00878Q12011
$$ 1084912 1859785 2959397 4215351 4251534 2398925 -72378 -1413961 -1313083 -501072
3628e01072J135390J154458P8002j768025k247308k91156J923905J528739j116632
$$ -501072 634318 1788776 1866778 98753 -2148555 -2439711 -515806 1012933 -103699
3619a03699k886652j945479L41028J625987J306523N95535P74000J862699K660035
$$ -103699 -2990351 -4935830 -4594802 -2968815 -1662292 -1066757 -292757 1569942 4229977
3610D229977J917354l43321k775883m078677m032355l007469j180380J098230
$$ 4229977 6147331 5804010 3028127 -1050550 -5082905 -8090374 -9270754 -8172524
3602h172524K704570K490678O86027j035600j105388M12797J808567J381753n98604
$$ -8172524 -5467954 -2977276 -2291249 -3326849 -4432237 -4019440 -2210873 -829120 -1427724
3593a427724j949586j251022R3961j55700j417759q21930K153160M180338K763568
$$ -1427724 -3377310 -4628332 -4534371 -4690071 -6107830 -6929760 -4776600 -596262 2167306
3584B167306N1761m46569Q94514R77072p54551j817090j246753q76064j337692
$$ 2167306 2219067 1772498 2667012 3644084 2889533 1072443 -174310 -1050374 -2388066
3575b388066n41542K124122L462253J069518k296579k302348N86310J898359k81402
$$ -2388066 -2929608 -805486 2656767 3726285 1429706 -872642 -286332 1612027 1330625
3566A330625l086704l505458k035653o81960L4402N74096R04193J070872J650491
$$ 1330625 -1756079 -5261537 -7297190 -7979150 -7944748 -7370652 -6466459 -5395587 -3745096
3557c745096K219812J020768k168312m413129l052759L80144K051895R04019o82693
$$ -3745096 -1525284 -504516 -2672828 -7085957 -10138716 -9758572 -7706677 -6802658 -7485351
3548g485351q54062r1452R97699K620461L746902K212437j504052l335276p37550
$$ -7485351 -8339413 -8430865 -7433166 -4812705 -1065803 1146634 -357418 -3692694 -4430244
3539d430244L392772M486315K252760k6038q23472j593465l118888m067975l694075
$$ -4430244 -1037472 3448843 5701603 5675565 4852093 3258628 139740 -3928235 -7622310
3530g622310l117634l052056k592746j186918K15383Q63783J263013J779645J932986
$$ -7622310 -10739944 -13792000 -16384746 -17571664 -17356281 -16492498 -15229485 -13449840 -11516854
3521a1516854J698005J737932J866831J254950N04689J090837K262888J470036
$$ -11516854 -9818849 -8080917 -6214086 -4959136 -4454447 -3363610 -1100722 369314
3513C69314j198273k338102n33743J219583O10861j93507J017744J922848k33138
$$ 369314 -828959 -3167061 -3700804 -2481221 -1870360 -2063867 -1046123 876725 643587
3504F43587l017083k440833m8008n70704l605382l838541J93608L647250L064316
$$ 643587 -2373496 -4814329 -4862337 -5433041 -9038423 -12876964 -12683356 -9036106 -5971790
3495e971790R96254P53416J474532J262445J023874J965261K648371J698911N87915
$$ -5971790 -4975536 -4222120 -2747588 -1485143 -461269 1503992 4152363 5851274 6439189
3486F439189P68406P42620j076576l123906l243254k085869j125628J29006J960751
$$ 6439189 7207595 7950215 6873639 3749733 506479 -1579390 -2705018 -2576012 -615261
3477f15261K363090O43869J34783L050913N480614K697619k787677m529168k140749
$$ -615261 1747829 2391698 2526481 5577394 11058008 13755627 10967950 6438782 4298033
3468D298033j235157l454574l840548Q942L015415N53949m038864m470755l20759
$$ 4298033 3062876 -391698 -4232246 -4223304 -1207889 -653940 -4692804 -9163559 -9484318
3459i484318L700942M781686L911053K341531K48743j614147k111618j437005
$$ -9484318 -5783376 -1001690 2909363 5250894 5499637 3885490 1773872 336867
3451C36867n61076K97391Q72047n5673k517570l862485k130426M92913P64488
$$ 336867 -224209 73182 945229 889556 -1628014 -5490499 -7620925 -7128012 -6363524
3442f363524l27758P49569L717393M354968J333636j414754j003081J2741j400127
$$ -6363524 -6691282 -5941713 -2224320 2130648 3464284 2049530 1046449 1059190 -340937
3433c40937l041354j156315K465770K453462j431220l070582Q02760N069376L482417
$$ -340937 -3382291 -4538606 -2072836 380626 -1050594 -4121176 -3318416 1750960 5233377
3424E233377k000725m007934l01181L770183L629269J093767l19990j050197k833289
$$ 5233377 3232652 -775282 -1076463 2693720 6322989 7416756 7096766 6046569 3213280
3415C213280l842918j274085K871771L493140l24763m106792m494901k771003
$$ 3213280 -629638 -1903723 968048 4461188 4136425 29633 -4465268 -7236271
3407g236271r25849J451079M302437N022760K300683q02231q86655P69778N40081
$$ -7236271 -8162120 -6711041 -2408604 2614156 4914839 4112608 3225953 3995731 4535812
3398D535812j820464l274485k437360r75223k69788K17758R45259J262072R62862
$$ 4535812 2715348 -559137 -2996497 -3971720 -4241508 -4023750 -3078491 -1816419 -853557
3389h53557Q31237J104117J016107J81508r63336k083963k914646k621047q69999
$$ -853557 -22320 1081797 2097904 2279412 1316076 -767887 -3682533 -6303580 -7173579
3380g173579Q29393P97042q8138M66550K369485K965057J064233j245111j664115
$$ -7173579 -6344186 -5547144 -5635282 -5168732 -2799247 165810 1230043 -15068 -1679183
3371a679183n19914M18824K32626r10494k216941k240197l5446K941773L806524
$$ -1679183 -2199097 -1780273 -1547647 -2458141 -4675082 -6915279 -6950725 -4008952 -202428
3362b02428J896425k85552n63252M01208J048014J230887J143662j5897k336727
$$ -202428 1693997 1408445 845193 1246401 2294415 3525302 4668964 4653067 2316340
3353B316340l718441k300257N97074J958043Q74987q59862j449876q06990R5064
$$ 2316340 -1402101 -3702358 -3105284 -1147241 -272254 -1132116 -2581992 -3388982 -3293918
3344c293918L13242l09543o53987O70146L033775L720768J358622j867670k992832
$$ -3293918 -2980676 -3290219 -3944206 -3274060 -240285 3480483 4839105 2971435 -21397
3335b1397k061528j278590j394761j149844J52128J587471K065917J316168k83431
$$ -21397 -2082925 -3361515 -4756276 -5906120 -5753992 -4166521 -2100604 -784436 -1067867
3326a067867j589074j196839M88655R21294r03543j977107O41606M598708M945896
$$ -1067867 -2656941 -3853780 -3365125 -2443831 -3347374 -5324481 -4682875 -84167 4861729
3317D861729J559108n92067Q38708K291690O03873j835399j406797P35440R11879
$$ 4861729 6420837 5828770 6667478 8959168 9563041 7727642 6320845 7056285 7968164
3308G968164j139925k644599k674295k575050k233674o5384L084114L893163J382207
$$ 7968164 6828239 4183640 1509345 -1065705 -3299379 -3364763 -280649 3612514 4994721
3299D994721j518157k479058k747717l804920l958331j127582K757011L439392
$$ 4994721 3476564 997506 -1750211 -5555131 -9513462 -10641044 -7884033 -4444641
3291d444641J42566l036102k196679J698102M228773K674283j148962l024299
$$ -4444641 -4302075 -7338177 -9534856 -7836754 -3607981 -933698 -2082660 -5106959
3283e106959q75954L011920M507405K238479j040478j977161m87120Q94740O99847
$$ -5106959 -5982913 -2970993 1536412 3774891 2734413 757252 270132 1164872 1864719
3274A864719n4909j2688O81483J254309J566822J502512K52014k355947m437101
$$ 1864719 1809810 1797122 2478605 3732914 5299736 6802248 7054262 4698315 261214
3265B61214l636324k37714K705413K813765Q12046j091991k030208k431442k011658
$$ 261214 -3375110 -3612824 -907411 1906354 2718400 1626409 -403799 -2835241 -4846899
3256d846899K26343L621302N184449K711464k025496m617500k776058J206767
$$ -4846899 -4620556 -999254 4185195 6896659 4871163 253663 -2522395 -1315628
3248a315628L222840J860365n74164j154142N13176K427239K686110J162748r65043
$$ -1315628 1907212 3767577 3193413 2039271 2552447 4979686 7665796 8828544 7863501
3239G863501k502876k865197k144533j183750j178105k340521l039586j392598
$$ 7863501 5360625 2495428 350895 -832855 -2010960 -4351481 -7391067 -8783665
3231h783665J817893L081528L61100l452004l344687J443252O089767O211299
$$ -8783665 -6965772 -3884244 -3523144 -6975148 -10319835 -8876583 -2786816 3424483
3223C424483L008774N33463j42329r16980j958037j112164J427322J952964j132080
$$ 3424483 6433257 6966720 6824391 5907411 3949374 2837210 4264532 6217496 5085416
3214E085416l872477k126710J984830K853311n83226l648536k765937L25231K121509
$$ 5085416 1212939 -913771 1071059 3924370 3341144 -307392 -3073329 -2748098 -626589
3205f26589J856164Q79384P2257l19255o5432L02113l57712j741019j957045o22959
$$ -626589 1229575 2108959 2181216 1861961 1796529 2098642 1740930 -89 -1957134 -2580093
3195b580093K5241j224731k072351k96790K077349J394061j878390l437031j182041
$$ -2580093 -2554852 -3779583 -5851934 -6148724 -4071375 -2677314 -4555704 -7992735 -9174776
3186i174776K163451L213763K098594J177498J399306J511348J73828k155916
$$ -9174776 -7011325 -3797562 -1698968 -521470 877836 2389184 2563012 407096
3178D07096l382765j844411J444834L270549J839540r03147j963268j352322j324835
$$ 407096 -2975669 -4820080 -3375246 -104697 1734843 831696 -1131572 -2483894 -3808729
3169c808729k190534j760572O52372K536953J754191m44777j508144q67254M80498
$$ -3808729 -5999263 -7759835 -7107463 -4570510 -2816319 -3261096 -4769240 -5636494 -5155996
3160e155996K010912L356897L201383O56481k830003m837703m893230m285321
$$ -5155996 -3145084 211813 3413196 4069677 1239674 -3598029 -8491259 -12776580
3152a2776580l300186p90382L057072N538597M401046R29669j457491j360070
$$ -12776580 -16076766 -16867148 -13810076 -8271479 -3870433 -2940764 -4398255 -5758325
3144e758325o16252j082501j775507n82054K119714L644801K890631J753942J632722
$$ -5758325 -6374577 -7457078 -9232585 -9814639 -7694925 -4050124 -1159493 594449 2227171
3135B227171Q11892k464069n979300n682708j366064K814949L747294K441371
$$ 2227171 3039063 574994 -5404306 -11087014 -12453078 -9638129 -5890835 -3449464
3127c449464J030216l68402k220053l388431k554524n17212P26802M18524o22598
$$ -3449464 -2419248 -2787650 -5007703 -8396134 -10950658 -11467870 -10741068 -10322544 -10945142
3118a0945142j204784m67785J449773K721101J375500j568139k429489K90762
$$ -10945142 -12149926 -12617711 -11167938 -8446837 -7071337 -8639476 -11068965 -10778203
3110a0778203L358335K999466p2489k122930j578571k12432J03340o30493j583388
$$ -10778203 -7419868 -4420402 -4492891 -6615821 -8194392 -8406824 -8303484 -8933977 -10517365
3101a0517365k035260j273994Q25806L122113M232971L909157K582043N61259
$$ -10517365 -12552625 -13826619 -13000813 -9878700 -5645729 -1736572 845471 1406730
3093A406730j272650j444189q9187L63620j417877l253775k670589p66835n5087
$$ 1406730 134080 -1310109 -1399296 -1035676 -2453553 -5707328 -8377917 -9144752 -9199839
3084i199839j50607Q89914K273177J656870k7129N33068L109297L499830J20995
$$ -9199839 -9350446 -8460532 -6187355 -4530485 -4557614 -4024546 -915249 2584581 2705576
3075B705576l233649l018652o12544P68424O15370K18071j12361n19579m32782
$$ 2705576 -528073 -3546725 -4159269 -3390845 -2775475 -2557404 -2669765 -3189344 -3622126
3066c622126M2702m01477j656565j329451J588638M496118M729337L113174J780092
$$ -3622126 -3579424 -3980901 -5637466 -6966917 -5378279 -882161 3847176 6960350 8740442
3057H740442P31567r17972k372955k534969k114398j796387l59303K485156L611774
$$ 8740442 9472009 8554037 6181082 3646113 1531715 -264672 -623975 1861181 5472955
3048E472955N50095l677817l979577m85559J889308Q42004p55040j52204J579779
$$ 5472955 6023050 2345233 -1634344 -2119903 -230595 611409 -143631 -295835 1283944
3039A283944K376760K161109J429844j74586k236928l041871k265135j887798
$$ 1283944 3660704 5821813 7251657 7077071 4840143 1798272 -466863 -2354661
3031b354661k874664l270925j460835Q77486J397723R10774J829125L749603L530978
$$ -2354661 -5229325 -8500250 -9961085 -9083599 -7685876 -6775102 -4945977 -1196374 2334604
3022B334604l9811m067509n021508k896276o35935q4564N3098J803466M498623
$$ 2334604 2294793 -1772716 -6794224 -9690500 -10326435 -10410999 -10357901 -8554435 -4055812
3013d055812N131579K285941j651639l216794j883687K6680Q46767J130224J607480
$$ -4055812 1075767 3361708 1710069 -1506725 -3390412 -3363732 -2516965 -1386741 220739
3004B20739J457767l19586k831610l791056j973584J407595L871232M071066K886051
$$ 220739 1678506 1358920 -1472690 -5263746 -7237330 -5829735 -1958503 2112563 4998614
2995D998614J931644J364975J54391j510867j779343J5554J748423J328060k36610
$$ 4998614 6930258 8295233 8449624 6938757 5159414 5174968 6923391 8251451 8014841
2986H014841n77114L21366M79284p15663k024546k884903l804971m242704k779416
$$ 8014841 7437727 7759093 8238377 7522714 5498168 2613265 -1191706 -5434410 -8213826
2977h213826J50277K165898K198968J624082J628263J773447J732849J954933
$$ -8213826 -8063549 -5897651 -3698683 -2074601 -446338 1327109 3059958 5014891
2969E014891J857289K4203k762076l453886j126717J255410J179512P775n8179
$$ 5014891 6872180 6896383 4134307 680421 -446296 809114 1988626 1996401 1938222
2960A938222J96402r87412k557408k056467L66598K217827K162356Q44117r23340
$$ 1938222 2134624 1147212 -1410196 -3466663 -3100065 -882238 1280118 2124235 1200895
2951A200895k352155j953989O94570K978352J715558k488126n667220n197428
$$ 1200895 -1151260 -3105249 -2410679 567673 2283231 -204895 -5872115 -11069543
2943a1069543j985019J699530M170595M242913J838981q77185j268910L28441
$$ -11069543 -13054562 -11355032 -7184437 -2941524 -1102543 -1979728 -3248638 -2920197
2935b920197J061676n8339o86064Q61933K544002J543224j247232k156608R7056
$$ -2920197 -1858521 -1916860 -2602924 -1740991 803011 2346235 1099003 -1057605 -960549
2926i60549K349824J021403l024084n228697k987372J057635K562705J098528
$$ -960549 1389275 2410678 -613406 -5842103 -8829475 -7771840 -5209135 -4110607
2918d110607l7870P72335J331020j33373j675537q57500J123015J435539R2169
$$ -4110607 -4148477 -3376142 -2045122 -2178495 -3854032 -4711532 -3588517 -2152978 -2060809
2909b060809p18522o38227j139238k071973j568964N62014K366001K860051K801591
$$ -2060809 -2779331 -3417558 -4556796 -6628769 -8197733 -7635719 -5269718 -2409667 391924
2900C91924K182915l6822l196935m809904l878607j796368L97409K716408L831913
$$ 391924 2574839 2538017 -658918 -5468822 -9347429 -11143797 -10746388 -8029980 -4198067
2891d198067J614908k713722m521448j742157K132886L049067J469452K19185
$$ -4198067 -2583159 -5296881 -9818329 -11560486 -9427600 -6378533 -4909081 -4689896
2883d689896L3940n9962j88421j78092q43661k305348k824179j537760k51044
$$ -4689896 -4655956 -4715918 -4904339 -5082431 -5926092 -8231440 -11055619 -12593379 -12844423
2874a2844423j53346O83175L470366N023653K057187k719142l551580Q7629K917551
$$ -12844423 -12997769 -12314594 -8844228 -3820575 -1763388 -4482530 -8034110 -7946481 -5028930
2865e028930J641930j163283j824770k16414J807048L250668L571198K176460
$$ -5028930 -3387000 -4550283 -6375053 -6591467 -4784419 -1533751 2037447 4213907
2857D213907r973p70331J77867L46110j715182l907813l525867q82675J676417
$$ 4213907 4203934 3433603 3611470 3957580 2242398 -1665415 -5191282 -6073957 -4397540
2848d397540K843748K775268J756814J53408j131302j485496j272061r08146k18854
$$ -4397540 -1553792 1221476 2978290 3131698 2000396 514900 -757161 -1665307 -1884161
2839a884161O20451P75508K12415M0613M00390l70316k969541m980215l485747
$$ -1884161 -1263710 -488202 -275787 -235174 165216 -205100 -3174641 -8154856 -11640603
2830a1640603Q92576M417462M421091J652273j256647k319981j356853J78638
$$ -11640603 -10748027 -6330565 -1909474 -257201 -1513848 -3833829 -5190682 -5012044
2822e012044M97514o26140j500019p03163R71498J665741Q69022m87840j714177
$$ -5012044 -4514530 -5140670 -6640689 -7343852 -6372354 -4706613 -3837591 -4325431 -6039608
2813f039608k606308k364884j50123K888586L827555J295359k368942l466946
$$ -6039608 -8645916 -11010800 -11160923 -8272337 -4444782 -3149423 -5518365 -8985311
2805h985311j119409J907321K599140J027138k70875K87693J547774J493321m6337
$$ -8985311 -10104720 -8197399 -5598259 -4571121 -4841996 -4554303 -3006529 -1513208 -1559545
2796a559545j425403j347956R4160K190535L992336L964305J084549k999698m637923
$$ -1559545 -2984948 -4332904 -4238744 -2048209 1944127 5908432 6992981 3993283 -644640
2787f44640k344065R83486J620358k05776j088650N11209K349615J975816J17210
$$ -644640 -2988705 -2005219 -384861 -590637 -1679287 -1168078 1181537 3157353 3274563
2778C274563q40196m37325m34452j766549k826583j581265J377740L132081K035947
$$ 3274563 2434367 1997042 1562590 -203959 -3030542 -4611807 -3234067 -101986 1933961
2769A933961l1962o9962J910617K751754M74520k922243m157695k916970j683304
$$ 1933961 1901999 1832037 3742654 6494408 6968928 4046685 -111010 -3027980 -4711284
2760d711284j933529k467573j713871L8786J478079K126566K400530K508201K209254
$$ -4711284 -6644813 -9112386 -10826257 -10787471 -9309392 -7182826 -4782296 -2274095 -64841
2751f4841J426806M73244k82175o76424p76808p64403o80361l72327Q2168J98886
$$ -64841 1361965 1835209 1553034 876610 99802 -664601 -1344962 -1717289 -1635121 -1436235
2741a436235j46475j34730Q92458J913197J094565j507679l467989l018909j373978
$$ -1436235 -1582710 -1717440 -824982 1088215 2182780 675101 -2792888 -5811797 -7185775
2732g185775q11660j373727j126883O66575K458775K752432J918181J073527O09768
$$ -7185775 -7997435 -9371162 -10498045 -9831470 -7372695 -4620263 -2702082 -1628555 -1018787
2723a018787P29356J989357L833751L751760L1635n001021o780515l978284j24772
$$ -1018787 -289431 1699926 5533677 9285437 9317072 4316051 -2464464 -6442748 -6567520
2714f567520J131731L26943J23331P80937L12488j582399k648040j551918K43818
$$ -6567520 -5435789 -5108846 -4985515 -4204578 -3892090 -5474489 -8122529 -9674447 -9430629
2705i430629J074433J373685J922566J754491M6107j180897Q54501M935237O019677
$$ -9430629 -8356196 -6982511 -5059945 -3305454 -3259347 -4440244 -3585743 1349494 7369171
2696G369171J428517n127806p556906m348943M15981K524119J836633O18938n3185
$$ 7369171 8797688 3669882 -3887024 -8235967 -7819986 -5295867 -3459234 -2840296 -2893481
2687b893481n09127m92310O83685K191348K119204L51677r35506n34121j1940
$$ -2893481 -3402608 -3894918 -3211233 -1019885 1099319 1450996 515490 -18631 -30571
2678c0571q49722j658729m56239J666680J917196J75977r83358o02853n01942
$$ -30571 -880293 -2539022 -2995261 -1328581 588615 764592 -218766 -821619 -1323561
2669a323561j473331j566193K62769J715336P31643q08307J17627K685783L236878
$$ -1323561 -2796892 -4363085 -4100316 -2384980 -1653337 -2461644 -2344017 341766 3578644
2660C578644O93966k082681k525486j252897m4539P37695J431256J460498J30118
$$ 3578644 4272610 2189929 -335557 -1588454 -1632993 -895298 535958 1996456 2126574
2651B126574j634959j852318j9566J774159J010391k050725m186013k912519L84522
$$ 2126574 491615 -1360703 -1380269 393890 1404281 -646444 -4832457 -7744976 -7360454
2642g360454K366720K184229J812671J996663R27846j789708l083268r39184J657612
$$ -7360454 -4993734 -2809505 -996834 999829 1927675 137967 -2945301 -3884485 -2226873
2633b226873Q63022j809516j645745J777563L884325K148159p36149k011410k777991
$$ -2226873 -1363851 -3173367 -4819112 -3041549 842776 2990935 2254786 243376 -2534615
2624b534615m316033m327113n66843M114418M538163M32174k707991o98586L972877
$$ -2534615 -6850648 -11177761 -11744604 -7630186 -3092023 -2659849 -5367840 -6066426 -2093549
2615b093549N382073J523550l319979l840007j02095K874269J868056n48649l96269
$$ -2093549 3288524 4812074 1492095 -2347912 -2450007 424262 2292318 1743669 1347400
2606A347400J531522J234415j702114l152900j035491J275353K40269k457501
$$ 1347400 2878922 4113337 2411223 -741677 -1777168 -501815 -261546 -2719047
2598b719047k742321j06496K350234K546485J335476M99234R99323K666378L991614
$$ -2719047 -5461368 -5567864 -3217630 -671145 664331 1163565 2162888 4829266 8820880
2589H820880L035856m2250k515128k530240j468307j244137j251971l31274K04039
$$ 8820880 11856736 11814486 9299358 6769118 5300811 4056674 2804703 2473429 2677468
2580B677468j355770l387788k797236M8578J694526P16265q73082j472091j801550
$$ 2677468 1321698 -2066090 -4863326 -4814748 -3120222 -2403957 -3277039 -4749130 -6550680
2571f550680k316505j852707o6327J313951J007958q047l16930M7390M52619Q08654
$$ -6550680 -8867185 -10719892 -10786219 -9472268 -8464310 -8472357 -8789287 -8741897 -8289278 -7480624
2561g480624J035939Q28278N28481Q47618J435909J314802P84632R19823J107238
$$ -7480624 -6444685 -5616407 -5087926 -4240308 -2804399 -1489597 -704965 214858 1322096
2552A322096l90868k914484l265213l42048K631126K285803m87708k215112j366913
$$ 1322096 931228 -1983256 -5248469 -5590517 -2959391 -673588 -1161296 -3376408 -4743321
2543d743321O64892J974099J770977L30178j303797k023060j861243j836959k195890
$$ -4743321 -4078429 -2104330 -333353 -3175 -1306972 -3330032 -5191275 -7028234 -9224124
2534i224124j906603l50553J734375L400994M244104L844768K206155Q81956J474819
$$ -9224124 -11130727 -11481280 -9746905 -6345911 -2101807 1742961 3949116 4831072 6305891
2525F305891K725412J742425j301342k821765j278283M25812k12339j487355r95727
$$ 6305891 9031303 10773728 9472386 6650621 5372338 5798150 5585811 4098456 3102729
2516C102729K79907M00695M6070L22215k03350k525396l943224k084732K74581
$$ 3102729 3382636 3783331 3829401 4151616 3948266 1422870 -2520354 -4605086 -4330505
2507d330505o40522k798300j519700K022665K214929j249779k292011J360577
$$ -4330505 -4971027 -7769327 -9289027 -7266362 -5051433 -6301212 -8593223 -7232646
2499g232646L997879J171195l126829l067431J91695J615005O18455N29362J827000
$$ -7232646 -3234767 -2063572 -5190401 -8257832 -8066137 -6451132 -5832677 -5303315 -3476315
2490c476315J655510m91342j628611k71806J460940J594315R02666P42659R05205
$$ -3476315 -1820805 -2312147 -3940758 -4212564 -2751624 -1157309 -254643 488016 1393221
2481A393221P92784P51319J102032J230590N09062q10694k047501k628406k140930
$$ 1393221 2186005 2937324 4039356 5269946 5779008 4968314 2920813 292407 -1848523
2472a848523p72355L81436L80007l77792r18716j167507j545239j696980j063444
$$ -1848523 -2620878 -2239442 -1859435 -2237227 -3155943 -4323450 -5868689 -7565669 -8629113
2463h629113k56489k46575n07731K61038J732491K194964J295652N54891P67579
$$ -8629113 -8885602 -9132177 -9639908 -9378870 -7646379 -5451415 -4155763 -3600872 -2833293
2454b833293Q96894K40834k86953j03796l24034j669916k538082j070275J737421
$$ -2833293 -1936399 -1695565 -1982518 -2086314 -2410348 -4080264 -6618346 -7688621 -5951200
2445e951200K993707J728459k7331j69813R61043J544372O74333r25862j905256
$$ -5951200 -2957493 -1229034 -1256365 -1426178 -465135 1079237 1753570 827708 -1077548
2436a077548j307056R17213L578493M592982K594547j389052m466790m673589
$$ -1077548 -2384604 -1467391 2111102 6704084 9298631 7909579 3442789 -1230800
2428a230800k873826j292428o46619J25745J447333K056933J073436l77757q83045
$$ -1230800 -4104626 -5397054 -6043673 -5917928 -4470595 -2413662 -1340226 -1717983 -2601028
2419b601028r30065j684347k395156j222453J413727K610986Q81183j615019j967745
$$ -2601028 -3531093 -5215440 -7610596 -8833049 -7419322 -4808336 -3927153 -5542172 -7509917
2410g509917k47508J183226J196152R95444J775375K751295K206795o3581k088810
$$ -7509917 -7757425 -6574199 -5378047 -4382603 -2607228 144067 2350862 2287281 198471
2401A98471j795219M45178K026265J284411l51055m53882Q70117J360506L00982
$$ 198471 -1596748 -1151570 874695 2159106 1808051 1354169 2224286 3584792 3885774
2392C885774n23313j73657k55727j648355j962565J011224M919001N264069J689871
$$ 3885774 3362461 3188804 2933077 1284722 -677843 333381 5252382 10516451 12206322
2383A2206322j585154j912474j289334j985500k446523k45775L083527L550363
$$ 12206322 10621168 8708694 7419360 5433860 2987337 2741562 5825089 9375452
2375I375452L83387k826310k985677j081191l1037p80680j777703j288030Q64359
$$ 9375452 9758839 6932529 3946852 2865661 2834624 2053944 276241 -1011789 -147430
2366a47430L283124L971031J912475j579052l645008k812072o95834O7912q26730
$$ -147430 3135694 7106725 9019200 7440148 3795140 983068 287234 355146 -471584
2357d71584j228639K52449K142148J885328r22476l842242m025065r94013K886000
$$ -471584 -1700223 -1447774 694374 2579702 1657226 -2185016 -6210081 -7204094 -4318094
2348d318094M528222K890766k09927k113194j950019q79102m8655O03677J325870
$$ -4318094 210128 3100894 2890967 777773 -1172246 -2051348 -2100003 -1496326 -170456
2339a70456J605156J103112N58517O24701N63958n54667j937209j957435o94345
$$ -170456 1434700 2537812 3096329 3721030 4284988 3730321 1793112 -164323 -858668
2330h58668J78315J7965k24550l55280j576085l794753m540037k306036P94542
$$ -858668 -680353 -662388 -886938 -1242218 -2818303 -6613056 -11153093 -13459129 -12664587
2321a2664587J850757J243968J424451K561135K416523N08443o64324M94260K112564
$$ -12664587 -10813830 -9569862 -8145411 -5584276 -3167753 -2659310 -3323634 -2829374 -716810
2312g16810J756751M8373n56878M51339J048879l36437k749886l912989k685828
$$ -716810 1039941 1088314 531436 982775 2031654 1695217 -1054669 -4967658 -7653486
2303g653486n1848J960169K146735R93302k36703r05916j131309r78316l74029
$$ -7653486 -7705334 -5745165 -3598430 -2605128 -2841831 -3747747 -4879056 -5857372 -6231401
2294f231401L82042R51714J605448K417169K103966n72166l981205m295580k56168
$$ -6231401 -5849359 -4897645 -3292197 -875028 1228938 656772 -3324433 -7620013 -7876181
2285g876181M243107M087762j119535o446811o819748j983108L559225N060465
$$ -7876181 -3633074 454688 -664847 -7111658 -13931406 -15914514 -12355289 -7294824
2277g294824K163160r85420p06598J805309K598551Q23612m31475M27254Q93018
$$ -7294824 -5131664 -6117084 -6823682 -5018373 -2419822 -1596210 -2027685 -1600431 -707413
$$ [...]
##END NTUPLES=NMR SPECTRUM
##END=
