##TITLE=31Pdec_DE-102_oil_TFA
CDCl3, 64 sc
 12.8.2025
##JCAMPDX= 6.0         $$ Bruker NMR JCAMP-DX V2.0
##DATA TYPE= NMR SPECTRUM
##DATA CLASS= NTUPLES
##ORIGIN= UXNMR, Bruker Analytische Messtechnik GmbH
##OWNER= root
$$ XWIN-NMR		Version 3.5
$$ Tue Aug 12 14:14:18 2025 Russian Standard Time (UT+4h)  she@DPX200
##.OBSERVE FREQUENCY= 81.013821
##.OBSERVE NUCLEUS= ^31P
##.ACQUISITION MODE= SIMULTANEOUS
##.ACQUISITION SCHEME= undefined
##.AVERAGES= 64
##.DIGITISER RES= 17
##SPECTROMETER/DATA SYSTEM= spect
##.PULSE SEQUENCE= zgpg30
##.SOLVENT NAME= CDCl3
##.SHIFT REFERENCE= (INTERNAL, CDCl3, 0, 198.062)
##AUDIT TRAIL= $$ (NUMBER, WHEN, WHO, WHERE, WHAT)
$$ ##TITLE= Audit trail, XWIN-NMR		Version 3.5
$$ ##JCAMPDX= 5.01
$$ ##ORIGIN= Bruker BioSpin GmbH
$$ ##OWNER= she
$$ F:/spectra/data/she/nmr/P31/2/pdata/1/auditp.txt
$$ ##AUDIT TRAIL=  $$ (NUMBER, WHEN, WHO, WHERE, WHAT)
(   1,<2025-08-12 14:13:21.92 +0400>,<she>,<DPX200>,
      <created by zg, POWCHK disabled, PULCHK disabled
       configuration hash MD5:
       00 E9 B6 7A A2 85 ED C7 34 08 36 98 17 FE 4E 26
       data hash MD5: 32K
       06 9B FC D4 E3 AB CF 18 61 81 22 65 8A A1 FC FC>)
(   2,<2025-08-12 14:13:24.43 +0400>,<she>,<DPX200>,
      <Start of raw data processing
       efp BC_mod = 2 LB = 1.5 FT_mod = 6 PKNL = 1 PHC0 = 1765.425 PHC1 = 40.09939 SI = 64K 
       data hash MD5: 64K
       03 86 6A 48 8C 4D 3D C9 A1 C5 4E 51 73 79 EA BA>)
$$ ##END=
$$ 
$$ hash MD5
$$ 5A DD EB 9C CA E1 76 D0 1E E2 18 6B 82 9E 0D F5
##$RELAX= 
##$RELAX= 
##$RELAX= 
##$RELAX= 
##$RELAX= 
##$RELAX= 
##$RELAX= 
##$RELAX= 
$$ Bruker specific parameters
$$ --------------------------
##$DU= <F:/spectra>
##$EXPNO= 2
##$NAME= <P31>
##$PROCNO= 1
##$TYPE= <nmr>
##$USER= <she>
##$AMP= (0..31)
100 100 100 100 100 100 100 100 100 100 100 100 100 100 100 100 100 100 
100 100 100 100 100 100 100 100 100 100 100 100 100 100 
##$AQSEQ= 0
##$AQ_mod= 1
##$AUNM= <au_zg>
##$AUTOPOS= <>
##$BF1= 81.014009
##$BF2= 200.13
##$BF3= 200.13
##$BF4= 200.13
##$BF5= 200.13
##$BF6= 200.13
##$BF7= 200.13
##$BF8= 200.13
##$BYTORDA= 1
##$CFDGTYP= 0
##$CFRGTYP= 5
##$CHEMSTR= <none>
##$CNST= (0..31)
1 1 145 1 1 1 1 1 1 1 1 1 1 1 1 1 1 1 1 1 1 1 1 1 1 1 1 1 1 1 1 1 
##$CPDPRG= <waltz16>
##$CPDPRG1= <>
##$CPDPRG2= <waltz16>
##$CPDPRG3= <>
##$CPDPRG4= <mlev>
##$CPDPRG5= <mlev>
##$CPDPRG6= <mlev>
##$CPDPRG7= <mlev>
##$CPDPRG8= <mlev>
##$CPDPRGB= <>
##$CPDPRGT= <>
##$D= (0..31)
0 1 0 0 0 0 0 0 0 0.06 0 0.03 2e-05 3e-06 0 0 0.0002 0 0 0 0 0 0 0 0 0 
0 0 0 0 0 0 
##$DATE= 1754993601
##$DBL= (0..7)
120 120 120 11 120 120 24 19 
##$DBP= (0..7)
150 150 150 150 150 150 150 150 
##$DBP07= 0
##$DBPNAM0= <>
##$DBPNAM1= <>
##$DBPNAM2= <>
##$DBPNAM3= <>
##$DBPNAM4= <>
##$DBPNAM5= <>
##$DBPNAM6= <>
##$DBPNAM7= <>
##$DBPOAL= (0..7)
0.5 0.5 0.5 0.5 0.5 0.5 0.5 0.5 
##$DBPOFFS= (0..7)
0 0 0 0 0 0 0 0 
##$DE= 6
##$DECBNUC= <off>
##$DECIM= 4
##$DECNUC= <off>
##$DECSTAT= 4
##$DIGMOD= 1
##$DIGTYP= 9
##$DL= (0..7)
0 0 52 120 120 21 21 25 
##$DP= (0..7)
$$ [...]
##$SUBNAM2= <"">
##$SUBNAM3= <"">
##$SUBNAM4= <"">
##$SUBNAM5= <"">
##$SUBNAM6= <"">
##$SUBNAM7= <"">
##$SUBNAM8= <"">
##$SUBNAM9= <"">
##$SW= 400.765351723535
##$SWIBOX= (0..15)
0 1 3 0 0 0 0 0 0 0 0 0 0 0 0 0 
##$SW_h= 32467.5324675325
##$TD= 32768
##$TD0= 1
##$TE= 0
##$TE2= 300
##$TE3= 300
##$TEG= 300
##$TL= (0..7)
0 120 53 12 22 120 120 120 
##$TP= (0..7)
150 150 150 150 150 150 150 150 
##$TP07= 0
##$TPNAME0= <>
##$TPNAME1= <>
##$TPNAME2= <>
##$TPNAME3= <>
##$TPNAME4= <>
##$TPNAME5= <>
##$TPNAME6= <>
##$TPNAME7= <>
##$TPOAL= (0..7)
0.5 0.5 0.5 0.5 0.5 0.5 0.5 0.5 
##$TPOFFS= (0..7)
0 0 0 0 0 0 0 0 
##$TUNHIN= 0
##$TUNHOUT= 0
##$TUNXOUT= 0
##$USERA1= <user>
##$USERA2= <user>
##$USERA3= <user>
##$USERA4= <user>
##$USERA5= <user>
##$V9= 5
##$VALIST= <valist>
##$VCLIST= <CCCCCCCCCCCCCCC>
##$VD= 0
##$VDLIST= <DDDDDDDDDDDDDDD>
##$VPLIST= <PPPPPPPPPPPPPPP>
##$VTLIST= <TTTTTTTTTTTTTTT>
##$WBST= 1024
##$WBSW= 4
##$XGAIN= (0..3)
0 0 0 0 
##$XL= 0
##$YL= 0
##$YMAX_a= 5643
##$YMIN_a= -8705
##$ZGOPTNS= <>
##$ZL1= 120
##$ZL2= 120
##$ZL3= 120
##$ZL4= 120
##$ABSF1= 0
##$ABSF2= 0
##$ABSG= 0
##$ABSL= 0
##$ALPHA= 0
##$AQORDER= 0
##$ASSFAC= 0
##$ASSFACI= 0
##$ASSFACX= 0
##$ASSWID= 0
##$AUNMP= <proc_1d>
##$AZFE= 0.1
##$AZFW= 0.5
##$BCFW= 0
##$BC_mod= 2
##$BYTORDP= 0
##$COROFFS= 0
##$CY= -3
##$DATMOD= 1
##$DC= 0
##$DFILT= <>
##$DTYPP= 0
##$F1P= 0
##$F2P= 0
##$FCOR= 1
##$FTSIZE= 65536
##$FT_mod= 6
##$GAMMA= 0
##$GB= 0
##$INTBC= 1
##$INTSCL= 9.790993e-09
##$ISEN= 30
##$LB= 1.5
##$LEV0= 0
##$LPBIN= 0
##$MAXI= 10000
##$MC2= 0
##$MEAN= 0
##$ME_mod= 0
##$MI= 50
##$NCOEF= 0
##$NC_proc= -8
##$NLEV= 6
##$NOISF1= 182.463
##$NOISF2= 159.3651
##$NSP= 0
##$NTH_PI= 0
##$NZP= 0
##$OFFSET= 198.0616
##$PC= 4
##$PHC0= 1765.425
##$PHC1= 40.09939
##$PH_mod= 1
##$PKNL= yes
##$PPARMOD= 0
##$PSCAL= 0
##$PSIGN= 0
##$REVERSE= no
##$SF= 81.0140089999434
##$SI= 65536
##$SIGF1= 159.3651
##$SIGF2= -187.1042
##$SINO= 113.3802
##$SIOLD= 16384
##$SREGLST= <1H.CDCl3>
##$SSB= 0
##$STSI= 65536
##$STSR= 0
##$SW_p= 32467.5324675325
##$SYMM= 0
##$S_DEV= 0
##$TDeff= 32768
##$TDoff= 0
##$TI= <>
##$TILT= no
##$TM1= 0
##$TM2= 0
##$TOPLEV= 0
##$USERP1= <user>
##$USERP2= <user>
##$USERP3= <user>
##$USERP4= <user>
##$USERP5= <user>
##$WDW= 1
##$XDIM= 65536
##$YMAX_p= 280055324
##$YMIN_p= -91951162
$$ End of Bruker specific parameters
$$ ---------------------------------
##NTUPLES= NMR SPECTRUM
##VAR_NAME=  FREQUENCY,     SPECTRUM/REAL,   SPECTRUM/IMAG
##SYMBOL=    X,             R,               I
##VAR_TYPE=  INDEPENDENT,   DEPENDENT,       DEPENDENT
##VAR_FORM=  AFFN,          ASDF,            ASDF
##VAR_DIM=   65536,         65536,           65536
##UNITS=     HZ,            ARBITRARY UNITS, ARBITRARY UNITS
##FACTOR=    0.49542278885378, 1,            1
##FIRST=     16045.7642231865, 0,            0
##LAST=      -16421.768244346, 0,            0
##MIN=       -16421.768244346, -91951162,    0
##MAX=       16045.7642231865, 280055324,    0
$$ Real data points
##PAGE= N=1
##DATA TABLE= (X++(R..R)), XYDATA
$$ [...]
$$ plain form
7479 -4615370 -3886821 -1218855 -228908 -479900 339890 1225825 -645650 -4664714 -7194970
7470 -7194970 -6776634 -5437995 -4862447 -4351249 -3006057 -1310282 205096 1841129 3513373
7461 3513373 4275404 3812884 3159360 3249121 3681994 3368802 1601939 -1729815 -6064128
7452 -6064128 -9994681 -12024719 -11900431 -10677152 -9372428 -8148817 -6759368 -4993251
7444 -4993251 -2651485 104586 2390001 3510086 4199996 5704419 7378887 6714991 2643280
7435 2643280 -2439647 -5256640 -5448249 -5313282 -6265337 -7329854 -7277674 -6434206 -5578525
7426 -5578525 -4596953 -3533802 -3730450 -5987086 -8117921 -6579278 -963409 5036323 7986318
7417 7986318 8252316 7903514 6939206 3994536 -119838 -2502389 -2174926 -1517472 -2548740
$$ packed form
7479d615370P28549K667966R89947k50992Q19790Q85935j871475m019064k530256
7470g194970M18336J338639N75548N11198J345192J695775J515378J636033J672244
7461C513373P62031m62520o53524Q9761M32873l13192j766863l331754m334313
7452f064128l930553k030038J24288J223279J304724J223611J389449J766117
7444d993251K341766K756071K285415J120085O89910J504423J674468o63896m071711
7435B643280n082927k816993j91609J34967r52055j064517N2180Q43468Q55681
7426e578525R81572J063151j96648k256636k130835J538643N615869N999732K949995
7417G986318K65998l48802r64308k944670m114374k382551L27463O57454j031268
$$ plain form
7408 -2548740 -3766330 -2466977 974888 3195320 2078368 -614662 -1239881 1890451
7400 1890451 6930068 10299396 9926869 6976780 4469973 4310346 5987217 7946788 9188019
7391 9188019 9160719 7375117 4334788 2128514 2526723 4490514 4974247 2682145 -71509
7382 -71509 -64895 2936631 5970022 6393960 4663292 3251910 3565079 4779584 5514457
7373 5514457 5505149 5115565 4199773 2629254 1474090 2123946 3974802 4405740 1910130
7364 1910130 -1691744 -3193094 -1647737 852749 1745135 427599 -1831844 -3615897
7356 -3615897 -4661002 -5708657 -7269288 -8731422 -9039465 -8142449 -7084701 -6540987 -6125007
7347 -6125007 -5512463 -5264502 -5862413 -6904571 -8180570 -10448475 -13638678 -15129051 -12006210
$$ packed form
7408b548740j217590J299353L441865K220432j116952k693030o25219L130332
7400A890451N039617L369328l72527k950089k506807j59627J676871J959571J241231
7391I188019k7300j785602l040329k206274L98209J963791M83733k292102k753654
7382g1509O614L001526L033391M23938j730668j411382L13169J214505P34873
7373E514457r308l89584r15792j570519j155164O49856J850856M30938k495610
7364A910130l601874j501350J545357K500486Q92386j317536k259443j784053
7356c615897j045105j047655j560631j462134l08043Q97016J057748N43714M15980
7347f125007O12544K47961n97911j042158j275999k267905l190203j490373L122841
$$ plain form
7338 -12006210 -5177129 832259 2977098 2904839 3932532 6341560 7516966 5983361
7330 5983361 3136892 762337 -1243857 -3659932 -5732836 -5635671 -2799622 1222815 4095734
7321 4095734 4271715 1774569 -1520507 -2842244 -1263312 577688 -798910 -5003257
7313 -5003257 -7773035 -6432768 -3135820 -1218383 -687296 168470 658098 -1257900 -4659556
7304 -4659556 -6257937 -5446118 -5072678 -6401009 -6975172 -5050079 -2715230 -2334399 -2767057
7295 -2767057 -1851042 -345707 -446095 -2021527 -3184123 -3384290 -3387028 -3330865 -3192171 -3815484
7285 -3815484 -4963145 -3962364 602301 5298780 5616631 2403437 621470 2133807
7277 2133807 3890484 3460524 2121339 1562811 1492796 1825778 3516263 5591909 4934952
$$ packed form
7338a2006210O829081O009388K144839p2259J027693K409028J175406j533605
7330E983361k846469k374555k006194k416075k072904R7165K836049M022437K872919
7321D095734J75981k497146l295076j321737J578932J841000j376598m204347
7313e003257k769778J340267L296948J917437N31087Q55766M89628j915998l401656
7304d659556j598381Q11819L73440j328331n74163J925093K334849L80831m32658
7295b767057R16015J505335j00388j575432j162596k00167k738N6163J38694o23313
7285c815484j147661J000781M564665M696479L17851l213194j781967J512337
7277B133807J756677m29960j339185n58528p0015L32982J690485K075646o56957
$$ plain form
7268 4934952 1018146 -2436299 -2707792 -1754528 -2080505 -2104206 957857 5934149 9063352
7259 9063352 9085802 7728848 6248765 4611329 3292021 2866908 2241376 -16874 -2866630
7250 -2866630 -3748791 -2147829 -104200 417778 -1308372 -5410515 -10704811 -13913284 -12392302
7241 -12392302 -7669853 -3882791 -2777964 -2650010 -2014484 -1480691 -1664456 -2006691 -2374517
7232 -2374517 -3444194 -4844072 -5238692 -4828126 -5261809 -6381049 -5826329 -3021342 -738091
7223 -738091 -1036546 -2225203 -1904083 -718585 -658235 -1528779 -1848082 -1881587 -2913168 -4261961
7213 -4261961 -3853040 -1640407 -7330 -456488 -1826771 -2202174 -1112128 481674 1248862
7204 1248862 483732 -964946 -1044166 1056114 3259697 2886884 208128 -2033444 -2518021
$$ packed form
7268D934952l916806l454445k71493R53264l25977k3701L062063M976292L129203
7259I063352K2450j356954j480083j637436j319308m25113o25532k258250k849756
7250b866630q82161J600962K043629N21978j726150m102143n294296l208473J520982
7241a2392302M722449L787062J104827J27954O35526N33793j83765l42235l67826
7232b374517j069677j399878l94620M10566m33683j119240N54720K804987K283251
7223g38091k98455j188657L21120J185498O0350q70544l19303l3505j031581j348793
7213d261961M08921K212633J633077m49158j370283l75403J090046J593802P67188
7204A248862p65130j448678p9220K100280K203583l72813k678756k241572m84577
$$ plain form
7195 -2518021 -2792950 -4451037 -6694914 -7540140 -6191453 -3561475 -1420568 -1306041 -3008454
7186 -3008454 -3864313 -1126982 4340344 8304515 7979854 5157295 3505576 4260434 6029093
7177 6029093 7553419 8715513 9379316 9058923 7736455 5803550 3379166 756379 -888875
7168 -888875 -555931 1050486 2360740 3114933 4259547 5705611 5785689 3378655 -667994
7159 -667994 -4637877 -7308579 -7900941 -6109461 -3019071 -881190 -923380 -1962699 -1913363
7150 -1913363 -96707 2513637 4606839 5372608 4719635 3545400 3312884 4449004 5406579
7141 5406579 4149430 567968 -3164019 -4729109 -3880515 -2497027 -2479832 -3560204 -3544061
7132 -3544061 -1162155 1900850 2907720 1656251 589565 1183935 2042900 1310738 -749271
$$ packed form
7195b518021k74929j658087k243877q45226J348687K629978K140907J14527j702413
7186c008454q55859K737331N467326L964171l24661k822559j651719P54858J768659
7177F029093J524326J162094O63803l20393j322468j932905k424384k622787j645254
7168h88875L32944J606417J310254P54193J144614J446064Q0078k407034m046649
7159f67994l969883k670702n92362J791480L090390K137881m2190j039319M9336
7150a913363J816656K610344K093202P65769o52973j174235k32516J136120R57575
7141E406579j257149l581462l731987j565090Q48594J383488J7195j080372J6143
7132c544061K381906L063005J006870j251469j066686N94370Q58965p32162k060009
$$ plain form
7123 -749271 -2700196 -3868828 -3961791 -2265675 961542 3440139 3166256 1016557 -670127
7114 -670127 -1215947 -1386441 -1056281 411474 2013434 2067354 1253606 1947978 4242713
7105 4242713 5462296 4381938 3116530 3520839 4295286 3498886 1846689 1343200 2047991
7096 2047991 2312128 1385629 6056 -1045752 -1581524 -1742159 -2160176 -3591903 -5361053
7087 -5361053 -5246362 -2296324 1188792 2058281 28706 -2506641 -3760116 -3937895 -3631505
7078 -3631505 -2585452 -445306 2361406 4891960 6362408 6623436 6309566 6110695 5615145
7069 5615145 3724734 703811 -1413982 -1467433 -1007311 -2042951 -3893260 -4032534 -1594884
7060 -1594884 1639284 3551741 3507069 2062685 394502 61748 1912347 4850847 6638604
$$ packed form
7123g49271j950925j168632r2963J696116L227217K478597k73883k149699j686684
7114f70127n45820j70494L30160J467755J601960N3920q13748O94372K294735
7105D242713J219583j080358j265408M04309P74447p96400j652197n03489P04791
7096B047991K64137r26499j379573j051808n35772j60635m18017j431727j769150
7087e361053J14691K950038L485116Q69489k029575k535347j253475j77779L06390
7078c631505J046053K140146K806712K530554J470448K61028l13870j98871m95550
7069E615145j890411l020923k117793n3451M60122j035640j850309j39274K437650
7060a594884L234168J912457m4672j444384j668183l32754J850599K938500J787757
$$ plain form
7051 6638604 6147918 4203255 2359526 1579449 1847385 2313339 2093746 1525889 2026091
7042 2026091 4024671 5959870 6297404 5496451 4692988 3600663 1521533 -453358 -399604
7033 -399604 1608342 3489260 3747388 2445525 103058 -2508342 -3941021 -3424605 -2180980
7024 -2180980 -1381777 405675 5104683 11132185 14786700 15515866 16216560 17873645 17829803
7015 17829803 14631813 10652552 7800153 4340820 -1043431 -5233517 -4530671 -460840
7007 -460840 2214749 2078612 1752223 2503752 2101071 -1235285 -5791969 -8445728 -7667296
6998 -7667296 -3545505 3127720 10378360 14968157 14427168 9220143 2542212 -1900740
6990 -1900740 -2244800 466054 3331231 4201210 3265964 1865256 478896 -1176707 -2700054
$$ packed form
7051F638604m90686j944663j843729p80077K67936M65954k19593n67857N00202
7042B026091J998580J935199L37534q00953q03463j092325k079130j974891N3754
7033c99604K007946J880918K58128j301863k342467k611400j432679N16416J243625
7024b180980P99203J787452M699008O027502L654515P29166P00694J657085m3842
7015A7829803l197990l979261k852399l459333n384251m190086P02846M069831
7007d60840K675589j36137l26389P51529m02681l336356m556684k653759P78432
6998g667296M121791O673225P250640M589797n40989n207025o677931m442952
6990a900740l44060K710854K865177Q69979r35246j400708j386360j655603j523347
$$ plain form
6981 -2700054 -3151867 -2700150 -2792340 -4227240 -6001352 -6656199 -6142948 -5658782 -5789877
6972 -5789877 -5411188 -2869064 1734001 6014949 7672384 6956913 5811633 4928382 3335508
6963 3335508 1121167 417126 2382675 4941951 5364118 3890635 2787544 2745291 2596582
6954 2596582 2114458 2347685 2850966 1324585 -2670066 -5742508 -4356049 629578 4941190
6945 4941190 5874109 4512436 3046513 1812203 21521 -1794042 -1820576 481328 3233776
6936 3233776 4281285 3544066 2264331 755800 -1450057 -3455443 -3107151 -152026 2358502
6927 2358502 1366756 -2307729 -4914763 -4341845 -2412580 -2438300 -5344166 -8597489 -8728336
6918 -8728336 -4835447 461701 3812962 4589162 4774264 5731647 6607117 6259061 5019006
$$ packed form
6981b700054m51813M51717r2190j434900j774112o54847N13251M84166j31095
6972e789877L78689K542124M603065M280948J657435p15471j145280q83251j592874
6963C335508k214341p04041J965549K559276M22167j473483j103091m2253j48709
6954B596582m82124K33227N03281j526381l994651l072442J386459M985627M311612
6945D941190R32919j361673j465923j234310j790682j815563k6534K301904K752448
6936C233776J047509p37219j279735j508531k205857k005386L48292K955125K510528
6927B358502r91746l674485k607034N72918J929265k5720k905866l253323j30847
6918h728336L892889N297148L351261P76200J85102R57383Q75470l48056j240055
$$ plain form
6909 5019006 3569420 1657608 -739889 -2393534 -2628609 -3006754 -5297070 -8538073 -10031412
6900 -10031412 -8758146 -6019691 -3211867 -936675 43349 -788344 -2165438 -1925201 91324
6891 91324 1674588 1229315 -392182 -1519877 -1755217 -1905033 -2930170 -5254193 -8056104
6882 -8056104 -9239832 -7479162 -4401567 -3212832 -4850713 -7017161 -7415176 -6358750
6874 -6358750 -5531978 -5616284 -5989276 -5672846 -3911280 -817397 2058634 2874134 1675538
6865 1675538 403711 391041 972673 831101 -523164 -2774081 -4885658 -5141108 -2937300
6856 -2937300 -695133 -1707351 -5555038 -8205495 -7552934 -5914395 -5454516 -4463938 -1099436
6847 -1099436 2031655 1182695 -2171677 -2842060 402530 3056901 1674393 -1530642 -2726292
$$ packed form
6909E019006j449586j911812k397497j653645k35075l78145k290316l241003j493339
6900a0031412J273266K738455K807824K275192R80024q31693j377094K40237K016525
6891I1324J583264m45273j621497j127695k35340j49816j025137k324023k801911
6882h056104j183728J760670L077595J188735j637881k166448l98015J056426
6874f358750Q26772q4306l72992L16430J761566L093883K876031Q15500j198596
6865A675538j271827j2670N81632j41572j354265k250917k111577k55450K203808
6856b937300K242167j012218l847687k650457O52561J638539M59879R90578L364502
6847a099436L131091q48960l354372o70383L244590K654371j382508l205035j195650
$$ plain form
6838 -2726292 -1832675 -1265478 -1649867 -1762445 -1482692 -1901665 -2828838 -2628601 -741296
6829 -741296 1458554 2503703 1933514 -455454 -4484315 -8261119 -9082333 -6787971 -4364575
6820 -4364575 -3673775 -2403392 2354522 8780438 11766411 9573871 5853665 4249026
6812 4249026 4151623 3556787 3165298 4619291 6477755 5504346 1525298 -2113610 -3123682
6803 -3123682 -2592791 -2310937 -2474680 -3017205 -4733034 -7449760 -8865581 -7034102 -2988781
6794 -2988781 565250 2334068 2869378 2651789 1257845 -1633224 -5420661 -8920210 -11113857
6785 -11113857 -11667901 -10918684 -9217036 -6565426 -3529203 -2018195 -3679368 -7300912
6777 -7300912 -9346065 -7824457 -4483248 -2376300 -2327152 -2754635 -2166353 -711493 468481
$$ packed form
6838b726292Q93617N67197l84389j12578K79753m18973r27173K00237J887305
6829g41296K199850J045149n70189k388968m028861l776804q21214K294362K423396
6820d364575O90800J270383M757914O425916K985973k192540l720206j604639
6812D249026r7403n94836l91489J453993J858464r73409l979048l638908j010072
6803c123682N30891K81854j63743n42525j715829k716726j415821J831479M045321
6794b988781L554031J768818N35310k17589j393944k891069l787437l499549k193647
6785a1113857n54044P49217J701648K651610L036223J511008j661173l621544
6777g300912k045153J521608L341209K106948M9148m27483N88282J454860J179974
$$ plain form
6768 468481 690140 444668 647058 1052351 158168 -2419172 -4387922 -3365774 -482920
6759 -482920 882259 -89858 -738860 651284 2204803 1382967 -1827434 -5938274 -9786277
6750 -9786277 -11837008 -10194394 -5431226 -1331449 -560493 -1378544 -815469 808260 1041486
6741 1041486 -726196 -3129207 -5213500 -6368764 -5457611 -2873589 -1866177 -4521810
6733 -4521810 -7830717 -7426805 -4062484 -2187333 -2820658 -2605097 -208703 1171175 -932127
6724 -932127 -4640057 -7147008 -8134184 -7869316 -5370521 -888486 2647758 3227762 2532800
6715 2532800 2846520 3479127 2739799 1361041 1125661 1597892 985284 -834934 -2733851
6706 -2733851 -4899130 -8395702 -12560925 -15146028 -15059332 -13285286 -11220539 -9502803 -8188227
$$ packed form
6768D68481K21659k45472K02390M05293q94183k577340j968750J022148K882854
6759d82920J365179r72117o49002J390144J553519q21836l210401m110840l848003
6750i786277k050731J642614M763168M099777P70956q18051N63075J623729K33226
6741A041486j767682k403011k084293j155264R11153K584022J007412k655633
6733d521810l308907M03912L364321J875151o33325K15561K396394J379878k103302
6724i32127l707930k506951r87176K64868K498795M482035L536244N80004o94962
6715B532800L13720O32607p39328j378758k35380M72231o12608j820218j898917
6706b733851k165279l496572m165223k585103Q6696J774046K064747J717736J314576
$$ plain form
6697 -8188227 -6839431 -4858559 -2723611 -1979635 -2815953 -2994418 -1029613 844865 -536728
6688 -536728 -4140612 -5289397 -1672200 3750419 6699321 6262756 4374306 2445758 502269
6679 502269 -1059381 -934624 1191024 3270552 2670071 -508161 -2853860 -1330766 2991484
6670 2991484 6208334 6339381 4943314 3682240 1757492 -1671909 -4691759 -4826976 -2816224
6661 -2816224 -1456089 -1289041 -267745 2400725 5041551 6688135 8603009 11391187
6653 11391187 13107221 12085513 9842604 9162523 10515876 12226273 13131647 13070868 11524795
6644 11524795 8156155 4688880 3984723 6455132 8982284 8439355 5256928 2498668
6636 2498668 2145411 3418389 4461009 4499909 4004805 3461136 2713639 1509353 174154
$$ packed form
6697h188227J348796J980872K134948P43976q36318j78465J964805J874478j381593
6688e36728l603884j148785L617197N422619K948902m36565j888450j928548j943489
6679E02269j561650J24757K125648K079528o00481l178232k345699J523094M322250
6670B991484L216850J31047j396067j261074j924748l429401l019850j35217K010752
6661b816224J360135J67048J021296K668470K640826J646584J914874K788178
6653A1391187J716034j021708k242909o80081J353353J710397R05374o0779j546073
6644A1524795l368640l467275p04157K470409K527152n42929l182427k758260
6636B498668l53257J272978J042620L8900m95104n43669p47497j204286j335199
$$ plain form
6627 174154 -672804 -985202 -1337317 -1821152 -1435405 607846 3073944 3292087 182508
6618 182508 -3998799 -5849658 -4476918 -2098753 -1174398 -2003450 -3308214 -3943697 -3306054
6609 -3306054 -1097722 2031975 3997311 2724927 -1638349 -6645877 -9755502 -10043449
6601 -10043449 -7922236 -4240782 -129028 2961765 3773561 1874951 -2102828 -6550656
6593 -6550656 -9513584 -10072699 -9191896 -8434634 -7725192 -5347170 -618848 4375900 6659797
6584 6659797 5584368 3352448 2361883 2636067 2119898 -668405 -4539000 -6523261 -5076360
6575 -5076360 -1941931 -184428 -735332 -1949207 -2489149 -3176769 -5316858 -8401464 -10635087
6566 -10635087 -11166406 -10776355 -10592868 -10841650 -10633732 -8488301 -3560587 2948672 8065469
$$ packed form
6627A74154q46958l12398l52115m83835L85747K043251K466098K18143l109579
6618A82508m181307j850859J372740K378165R24355q29052j304764o35483O37643
6609c306054K208332L129697J965336j272384m363276n007528l109625k87947
6601a0043449K121213L681454M111754L090793Q11796j898610l977779m447828
6593f550656k962928n59115Q80803P57262P09442K378022M728322M994748K283897
6584F659797j075429k231920r90565K74184n16169k788303l870595j984261J446901
6575e076360L134429J757503n50904j213875n39942o87620k140089l084606k233623
6566a0635087n31319L90051J83487k48782K07918K145431M927714O509259N116797
$$ plain form
6557 8065469 9597802 8219981 6303413 5001147 3441291 709688 -2460343 -4406895
6549 -4406895 -4311952 -2800295 -1095105 59726 778811 1644117 3017163 4612035 5540547
6540 5540547 4750243 1817083 -2279582 -5446094 -6161842 -4801722 -2734121 -442808 2424980
6531 2424980 5315385 6640554 5994765 5166581 5957985 7974658 9597816 10212292 10179338
6522 10179338 9297638 6887042 3360289 412283 -681342 -219529 590801 841672 368760
6513 368760 -532223 -1638436 -3004025 -4362536 -4579598 -2704355 261631 1939653 1520295
6504 1520295 753515 1079131 1376627 161383 -1433811 -1151665 739764 1793085 1146868
6495 1146868 462500 878261 1455853 1349160 1267590 1659856 1388162 -278087 -1761712
$$ packed form
6557H065469J532333j377821j916568j302266j559856k731603l170031j946552
6549d406895R4943J511657J705190J154831P19085Q65306J373046J594872R28512
6540E540547p90304k933160m096665l166512p15748J360120K067601K291313K867788
6531B424980K890405J325169o45789q28184P91404K016673J623158O14476l2954
6522A0179338q81700k410596l526753k948006j093625M61813Q10330K50871m72912
6513C68760r00983j106213j365589j358511k17062J875243K965986J678022m19358
6504A520295p66780L25616K97496j215244j595194K82146J891429J053321o46217
6495A146868o84368M15761N77592j06693q1570L92266k71694j666249j483625
$$ plain form
6486 -1761712 -916408 2084519 4864279 5301695 2982433 -1025141 -4729625 -6102264 -4593518
6477 -4593518 -1745246 300085 709548 101885 -589456 -851104 -736336 -821027 -1553721
6468 -1553721 -2364269 -2217112 -1429643 -1793391 -4037118 -6279147 -6292001 -4511858 -3296160
6459 -3296160 -3652353 -4329872 -4086369 -3202660 -2343699 -1365571 -91650 708341 122136
6450 122136 -1526822 -2859974 -2865795 -1691839 -162127 1098415 1997736 2513627 1998707
6441 1998707 -515806 -4681203 -7932628 -7628129 -4482227 -2418381 -3848986 -6259595
6433 -6259595 -5290769 -640091 3369391 3369274 740184 -1290376 -2154212 -3474963 -5578003
6424 -5578003 -7080808 -7391536 -7043581 -5681906 -2490265 932806 1132126 -2310783 -5026117
$$ packed form
6486a761712Q45304L000927K779760M37416k319262m007574l704484j372639J508746
6477d593518K848272K045331M09463o07663o91341k61648J14768q4691p32694
6468a553721q10548J47157P87469l63748k243727k242029j2854J780143J215698
6459c296160l56193o77519K43503Q83709Q58961R78128J273921P99991n86205
6450A22136j648958j333152n821J173956J529712J260542Q99321N15891n14920
6441A998707k514513m165397l251425L04499L145902K063846j430605k410609
6433f259595R68826M650678M009482j17k629090k030560q63836j320751k103040
6424e578003j502805l10728L47955J361675L191641L423071J99320l442909k715334
$$ plain form
6415 -5026117 -3182345 1306139 3353197 1190202 -2313254 -4039934 -3625231 -2191944
6407 -2191944 -658986 114375 -562062 -2150777 -3076370 -2261600 424552 4738865 9440777
6398 9440777 11559700 8666520 2322276 -2747632 -3542878 -1153714 2014677 5071541
6390 5071541 7844983 9610814 10172829 10503993 10873206 9961514 7320651 4979852 4718522
6381 4718522 5227992 4155079 1803859 434166 678859 1207218 1644757 3211207 6058874
6372 6058874 8186030 7805504 5227180 1765214 -1768387 -4810527 -6619590 -6919870 -6062633
6363 -6062633 -4122240 -984540 2211185 3206383 1249392 -1527261 -2518682 -1546334 -202793
6354 -202793 647786 995209 21911 -3346140 -7920547 -10458174 -9464069 -7130003 -6182665
$$ packed form
6415e026117J843772M488484K047058k162995l503456j726680M14703J433287
6407b191944J532958P73361o76437j588715r25593Q14770K686152M314313M701912
6398I440777K118923k893180o344244n069908p95246K389164L168391L056864
6390E071541K773442J765831N62015L31164L69213r11692k640863k340799k61330
6381D718522N09470j072913k351220j369693K44693N28359M37539J566450K847667
6372F058874K127156l80526k578324l461966l533601l042140j809063l00280Q57237
6363f062633J940393L137700L195725R95198j956991k776653r91421R72348J343541
6354b02793Q50579L47423r73298l368051m574407k537627R94105K334066R47338
$$ plain form
6345 -6182665 -6399611 -6124186 -5781577 -6977019 -8530985 -6833255 -1123539 4595652 6702735
6336 6702735 6373784 6412675 6096071 2828084 -2340189 -5080904 -3925972 -2227070 -2868989
6327 -2868989 -4370631 -4049490 -2286369 -1284853 -1506199 -1724783 -1407208 -955096 -470810
6318 -470810 -20044 -261085 -1273220 -1767506 -1044558 -566792 -1676608 -2849795 -1571696
6309 -1571696 1674906 3809819 3525850 2930911 4322158 7204452 9325335 9415043 8175588
6300 8175588 7295848 7859983 9251355 9662197 8057611 5136892 1927064 -1473894 -4800824
6291 -4800824 -6622550 -6088217 -4615789 -3940051 -3386441 -1199951 2280483 5239182 7403405
6282 7403405 9487495 10112084 6959763 1486049 -1335614 492428 3079880 2308097 -566938
$$ packed form
6345f182665k16946K75425L42609j195442j553966J697730N709716N719191K107083
6336F702735l28951L8891l16604l267987n168273k740715J154932J698902o41919
6327b868989j501642L21141J763121J001516k21346k18584L17575M52112M84286
6318d70810M50766k41041j012135m94286P22948M77766j109816j173187J278099
6309a571696L246602K134913k83969n94939J391247K882294K120883Q9708j239455
6300H175588q79740N64135J391372M10842j604586k920719l209828l400958l326930
6291d800824j821726N34333J472428O75738N53610K186490L480434K958699K164223
6282G403405K084090O24589l152321n473714k821663J828042K587452p71783k875035
$$ plain form
6273 -566938 -1665098 -432323 448199 -279671 -1171766 -1074267 -580761 -357423 -226880 -252248
6263 -252248 -986327 -2245783 -2916637 -2199357 -99437 3091161 6664681 9214295 9910776
6254 9910776 9905430 10982984 12819979 13115421 10702288 7109225 4621067 4083266 5095916
6245 5095916 7001332 8767784 8909508 6699823 3197222 410304 -389069 666552 2448234
6236 2448234 3465776 2666070 269278 -2323038 -3729283 -3474671 -1724122 1041061 3627989
6227 3627989 4311091 2492639 -120763 -1081421 11165 1239574 1039910 7509 -586000
6218 -586000 -956082 -2152821 -3783906 -4104164 -2704853 -1585458 -2589147 -4857680 -6089840
6209 -6089840 -5609003 -4668681 -3967323 -2540344 397059 3744129 5429138 4416692 1391849
$$ packed form
6273e66938j098160J232775Q80522p27870q92095R7499M93506K23338J30543k5368
6263b52248p34079j259456o70854P17280K099920L190598L573520K549614O96481
6254I910776n346J077554J836995K95442k413133l593063k488158n37801J012650
6245E095916J905416J766452J41724k209685l502601k786918p99373J055621J781682
6236B448234J017542p99706k396792k592316j406245K54612J750549K765183K586928
6227C627989O83102j818452k613402r60658J092586J228409j99664j032401n93509
6218e86000l70082j196739j631085l20258J399311J119395j003689k268533j232160
6209f089840M80837R40322P01358J426979K937403L347070J685009j012446l024843
$$ plain form
6200 1391849 -1954610 -4077614 -4731257 -5184411 -6513598 -7686220 -6607533 -3273388 -119146
6191 -119146 1582197 3688957 7896745 12220085 13257328 10944377 8168104 5999706
6183 5999706 2573179 -2694224 -7121175 -8810781 -9920126 -13193016 -17076202 -17509154
6175 -17509154 -13853817 -9820666 -8229092 -7719923 -5652188 -1835668 2156866 5494677
6167 5494677 7902417 8154589 5064913 -97104 -3949457 -4250326 -1906415 396629 697387
6158 697387 -1192852 -4130021 -6572059 -7533553 -7060054 -5806075 -4362896 -3191564 -2695520
6149 -2695520 -2764821 -2682602 -2159690 -1890309 -2165613 -1733903 330397 2077789 245166
6140 245166 -5176574 -10021414 -10610980 -7611042 -4130774 -1875002 -899389 -1408636 -3174893
$$ packed form
6200A391849l346459k123004o53643m53154j329187j172622J078687L334145L154242
6191a19146J701343K106760M207788M323340J037243k312951k776273k168398
6183E999706l426527n267403m426951j689606j109345l272890l883186m32952
6175a7509154L655337M033151J591574N09169K067735L816520L992534L337811
6167E494677K407740K52172l089676n162017l852353l00869K343911K303044L00758
6158F97387j890239k937169k442038r61494M73499J253979J443179J171332M96044
6149b695520o9301Q2219N22912K69381k75304M31710K064300J747392j832623
6140B45166n421740m844840n89566K999938L480268K255772R75613n09247j766257
$$ plain form
6131 -3174893 -4002045 -1602404 2812364 5159495 3317108 -530220 -3010911 -3215631 -2286439
6122 -2286439 -1069787 265787 1235980 1300663 964201 1515593 3532481 6156335 7824239
6113 7824239 7472412 5295979 2592098 552529 -934653 -2805346 -5053107 -6328723
6105 -6328723 -5859221 -4877195 -5043055 -5936519 -5585259 -3705908 -2905350 -5448121 -9587680
6096 -9587680 -10781057 -6801521 -221987 4915154 7463421 8722147 8868396 6533741
6088 6533741 2101237 -1347527 -1820230 -1149264 -2113924 -4346902 -5221994 -3763970 -1397548
6079 -1397548 600280 2142547 3128598 3383556 3666726 4598680 4769456 2426950 -876203
6070 -876203 -1334015 1498088 3120558 -37153 -5561807 -8318511 -7205083 -5944066 -7659791
$$ packed form
6131c174893q27152K399641M414768K347131j842387l847328k480691k04720R29192
6122b286439J216652J335574R70193O4683l36462N51392K016888K623854J667904
6113G824239l51827k176433k703881k039569j487182j870693k247761j275616
6105f328723M69502R82026j65860q93464L51260J879351Q00558k542771m139559
6096i587680j193377L979536O579534N137141K548267J258726J46249k334655
6088F533741m432504l448764m72703O70966r64660k232978q75092J458024K366422
6079a397548J997828J542267R86051K54958K83170R31954J70776k342506l303153
6070h76203m57812K832103J622470l157711n524654k756704J113428J261017j715725
$$ plain form
6061 -7659791 -11114452 -12816286 -11324699 -8527798 -6992740 -6724974 -5329122 -1760161
6053 -1760161 1267589 305731 -4022440 -7614858 -8304713 -7914947 -8281139 -8431788 -7412512
6044 -7412512 -6818422 -7789462 -7919442 -4475827 929725 4319242 4868084 4909263 5247934
6035 5247934 4535577 3346175 4510255 8017879 9426505 5758560 201757 -1839956
6027 -1839956 486239 3491992 4532664 4528275 4979361 5200785 3605527 195456 -3428029
6018 -3428029 -5838439 -6648856 -6002465 -4168960 -1799369 124307 1080207 1405442 1471604
6009 1471604 928914 -414442 -1360842 -390742 1826720 2588451 675589 -1764567 -2218619
6000 -2218619 -1408763 -1957463 -4174952 -5444141 -3929073 -939231 982076 829338 -641211
$$ packed form
6061g659791l454661j701834J491587K796901J535058K67766J395852L568961
6053a760161L027750r61858m328171l592418o89855L89766l66192j50649J019276
6044g412512N94090r71040j29980L443615N405552L389517N48842M1179L38671
6035E247934p12357j189402J164080L507624J408626l667945n556803k041713
6027a839956K326195L005753J040672m389M51086K21424j595258l410071l623485
6018c428029k410410q10417O46391J833505K369591J923676R55900L25235O6162
6009A471604n42690j343356r46400R70100K217462P61731j912862k440156m54052
6000b218619Q09856n48700k217489j269189J515068K989842J921307j52738j470549
$$ plain form
5991 -641211 -2183206 -2813332 -2281601 -1497445 -1709386 -2669748 -2374192 667423 5364592
5982 5364592 8784693 8674789 5084822 91185 -3678645 -4713890 -3397508 -1208666
5974 -1208666 793234 2516457 4136237 5406604 5731132 4610437 2125928 -741948
5966 -741948 -2602885 -2943589 -2663263 -2901756 -3743224 -4566994 -5080188 -5268107 -4939133 -4259738
5956 -4259738 -4157822 -5058174 -5726194 -4724449 -2684863 -1570858 -1669033 -916620 2306292
5947 2306292 6975124 10619162 11791989 10759310 8445084 5426520 1925596 -1423760
5939 -1423760 -3129606 -1950562 1239838 3669907 3480761 1442742 -753590 -2450636
5931 -2450636 -3132215 -1512139 2233583 4847575 3568322 458655 -95306 2210904 3384119
$$ packed form
5991f41211j541995o30126N31731P84156k11941r60362K95556L041615M697169
5982E364592L420101j09904l589967m993637l769830j035245J316382K188842
5974a208666K001900J723223J619780J270367L24528j120695k484509k867876
5966g41948j860937l40704K80326k38493q41468q23770n13194j87919L28974O79395
5956d259738J01916r00352o68020J001745K039586J114005r8175P52413L222912
5947B306292M668832L644038J172827j032679k314226l018564l500924l349356
5939a423760j705846J179044L190400K430069j89146k038019k196332j697046
5931b450636o81579J620076L745722K613992j279253l109667n53961K306210J173215
$$ plain form
5922 3384119 1604104 -132801 717866 2069237 776338 -2415722 -4363778 -4062943 -2889606
5913 -2889606 -1630182 -25625 1398781 1557231 773023 603406 1563851 2391931 1702348
5904 1702348 -512842 -2959942 -4034892 -3045381 -839767 1201725 2761723 4228083
5896 4228083 5002148 3972499 1913546 1237514 2615310 4105405 4601397 5426418 6849573
5887 6849573 6015680 1207029 -4195348 -5606211 -3699152 -3257531 -6217336 -9586767 -10387745
5878 -10387745 -9085981 -7266506 -5094635 -2656111 -1433993 -2531648 -4749664 -5978430
5870 -5978430 -5767992 -5442986 -6133527 -7421629 -7799149 -6332899 -3982939 -2740403 -2965860
5861 -2965860 -2505193 473377 4667740 7155951 6981460 5500620 3819081 2026003 744731
$$ packed form
5922C384119j780015j736905Q50667J351371j292899l192060j948056L00835J173337
5913b889606J259424J604557J424406J58450p84208j69617R60445Q28080o89583
5904A702348k215190k447100j074950R89511K205614K041492J559998J466360
5896D228083P74065j029649k058953o76032J377796J490095M95992Q25021J423155
5887F849573q33893m808651n402377j410863J907059M41621k959805l369431q00978
5878a0387745J301764J819475K171871K438524J222118j097655k218016j228766
5870e978430K10438L25006o90541j288102l77520J466250K349960J242536k25457
5861b965860M60667K978570M194363K488211j74491j480840j681539j793078j281272
$$ plain form
5852 744731 1160220 3167427 5334013 6935902 8262842 8876355 7711925 5252389 3397608
5843 3397608 2570226 1106657 -1697464 -4086344 -4395629 -3150219 -1681074 -714611 -1233765
5834 -1233765 -4150997 -7639164 -7591046 -3051975 1393886 1665284 283596 2500538 7932750
5825 7932750 10928016 9113041 6455559 6418844 6878662 4746036 1683648 1046245 1697948
5816 1697948 -213486 -4233769 -5360825 -1561182 2880927 3449265 1242260 28107
5808 28107 280735 -295265 -1855568 -1895695 446838 2778418 2794772 850743 -1481314
5799 -1481314 -3314572 -4158953 -3653232 -2469798 -1880473 -1768928 -800699 886760 1364910
5790 1364910 251268 -77693 1727676 3302892 2050787 -461641 -477085 2455995 4788695
$$ packed form
5852G44731M15489K007207K166586J601889J326940O13513j164430k459536j854781
5843C397608q27382j463569k804121k388880l09285J245410J469145R66463n19154
5834a233765k917232l488167M8118M539071M445861K71398j381688K216942N432212
5825G932750K995266j814975k657482l6715M59818k132626l062388o37403O51703
5816A697948j911434m020283j127056L799643M442109N68338k207005j214153
5808B8107K52628n76000j560303m0127K342533K331580J6354j944029k332057
5799a481314j833258q44381N05721J183434N89325J11545R68229J687459M78150
5790A364910j113642l28961J805369J575216j252105k512428j5444K933080K332700
$$ plain form
5781 4788695 3686500 121221 -3034593 -4270928 -4442385 -5603720 -8832414 -12508450
5773 -12508450 -13487640 -10902853 -7590655 -6371640 -6404838 -5256168 -3104873 -2090138 -2415052
5764 -2415052 -2308921 -1582746 -1901399 -3159741 -2829798 23842 2777509 2602130 -329388
5755 -329388 -4051517 -7164194 -8895397 -8801166 -7661530 -7062583 -7143334 -6468641 -4924066
5746 -4924066 -4598385 -6534342 -8648502 -8536901 -6740705 -5555001 -5841626 -6500177 -6075674
5737 -6075674 -3802472 -225143 2379456 1753976 -1269038 -3323868 -3163906 -3346951 -5584516
5728 -5584516 -7089594 -4440486 870665 4222221 4152827 3245337 2924533 1100118 -3824863
5719 -3824863 -9326190 -10955798 -6922950 552791 7361843 10155133 8056350 3114063
$$ packed form
5781D788695j102195l565279l155814j236335j71457j161335l228694l676036
5773a2508450r79190K584787L312198J219015l3198J148670K151295J014735l24914
5764b415052J06131P26175l18653j258342L29943K853640K753667j75379k931518
5755c29388l722129l112677j731203R4231J139636N98947q0751O74693J544575
5746d924066L25681j935957k114160J11601J796196J185704k86625o58551M24503
5737f075674K273202L577329K604599o25480l023014k054830J59962j83045k237565
5728e584516j505078K649108N311151L351556o9394r07490l20804j824415m924981
5719c824863n501327j629608M032848P475741O809052K793290k098783m942287
$$ plain form
5711 3114063 -1044094 -1793652 724256 3983946 5057306 2843486 -978288 -3421273
5703 -3421273 -3027163 -915307 1098440 2382441 2867249 1928290 -498675 -2441597 -1545451
5694 -1545451 1643565 3724348 2421380 -673636 -2195255 -1074389 517600 138248
5686 138248 -1965378 -3375410 -2521936 -357161 1037889 616598 -1227352 -3285714 -3715714
5677 -3715714 -943200 3908997 6526271 3689311 -2340211 -6177574 -5844320 -4089926
5669 -4089926 -3178803 -2071016 11369 1023082 -405822 -1898253 -726270 1957650
5661 1957650 3267845 3081314 3293876 4093629 4083863 2965982 1243059 -1469347 -4900082
5652 -4900082 -6401008 -4212404 -1074412 -646030 -1458239 970950 6519755 10144173 9714222
$$ packed form
5711C114063m158157p49558K517908L259690J073360k213820l821774k442985
5703c421273L94110K111856K013747J284001M84808r38959k426965j942922Q96146
5694a545451L189016K080783j302968l095016j521619J120866J591989l79352
5686A38248k103626j410032Q53474K164775J395050m21291j843950k058362m30000
5677c715714K772514M852197K617274k836960o029522l837363L33254J754394
5669d089926R11123J107787K082385J011713j428904j492431J171983K683920
5661A957650J310195j86531K12562P99753r766j117881j722923k712406l430735
5652d900082j500926K188604L137992M28382q12209K429189N548805L624418m29951
$$ plain form
5643 9714222 8868244 10295886 11115962 7919500 2577735 -469709 -141556 1257693 2002345
5634 2002345 2001778 1260906 -203360 -1852653 -3711601 -6542247 -9426521 -9217964 -4571845
5625 -4571845 1291083 4246640 4103286 3348705 2810930 1667076 566419 1271106 3522980
5616 3522980 5403436 6719802 8892024 11238907 10773701 6882502 3275817 3413548 6119695
5607 6119695 7791123 7349676 6621555 6634798 6134649 4188423 2314579 2756951 5397764
5598 5397764 7573137 7017484 4265517 1799345 1251501 1941069 1960920 111276 -3261536
5589 -3261536 -6724643 -8809646 -9090671 -8521804 -8381101 -8750876 -8526617 -7126471 -5588294
5580 -5588294 -5481530 -7022086 -8648589 -8389224 -5646271 -1925576 264699 -346060 -2725871
$$ packed form
5643I714222q45978J427642Q20076l196462n341765l047444L28153J399249P44652
5634B002345n67p40872j464266j649293j858948k830646k884274K08557M646119
5625d571845N862928K955557j43354p54581n37775j143854j100657P04687K251874
5616C522980J880456J316366K172222K346883m65206l891199l606685J37731K706147
5607F119695J671428m41447p28121J3243n00149j946226j873844M42372K640813
5598E397764K175373n55653k751967k466172n47844O89568J9851j849644l372812
5589c261536l463107k085003k81025N68867J40703l69775K24259J400146J538177
5580e588294J06764j540556j626503K59365K742953L720695K190275o10759k379811
$$ plain form
5571 -2725871 -5016427 -6472863 -7060884 -5900996 -1982227 3505215 7524838 8624707
5563 8624707 8390365 8639911 8888718 7864192 5947174 4357827 2998138 936773 -1614081
5554 -1614081 -3499254 -4379969 -4811660 -4947594 -4532553 -3760262 -2802983 -1068869 1534534
5545 1534534 3237898 2304365 74050 20101 3494642 8229759 11377436 12188993 11239941
5536 11239941 9071270 6634299 5309408 5099735 4132842 1348771 -1499064 -2148045 -1238188
5527 -1238188 -1486063 -3667425 -5285445 -3729757 564643 4835641 6951341 6769501 5090997
5518 5090997 2430534 -831174 -3781605 -5285488 -5050034 -3869450 -2564197 -1136262
5510 -1136262 587158 1899306 1615517 -382977 -2594549 -3187210 -1720424 328450 600451
$$ packed form
5571b725871k290556j456436n88021J159888L918769N487442M019623J099869
5563H624707k34342K49546K48807j024526j917018j589347j359689k061365k550854
5554a614081j885173q80715m31691j35934M15041P72291R57279J734114K603403
5545A534534J703364r33533k230315n3949L474541M735117L147677Q11557r49052
5536A1239941k168671k436971j324891k09673r66893k784071k847835o48981R09857
5527a238188k47875k181362j618020J555688M294400M270998K115700j81840j678504
5518E090997k660463l261708k950431j503883K35454J180584J305253J427935
5510a136262J723420J312148k83789j998494k211572n92661J466786K048874K72001
$$ plain form
5501 600451 -2121890 -6343994 -8712595 -7287428 -3681403 -925679 456877 2628540
5493 2628540 6532747 9900146 10434595 9343436 9634184 11645085 12498800 10100331 5736005
5484 5736005 2112390 423147 210587 710122 1098302 452718 -1061716 -1569112 411558
5475 411558 3452211 4411199 2422591 212182 655684 3147390 4523586 2997628 -75365
5466 -75365 -2352475 -3318393 -4296267 -6042997 -7178228 -5604726 -1377105 2719902 4155102
5457 4155102 3630739 3892379 5731019 6768569 4827103 1036564 -1628520 -1924051 -1077896
5448 -1077896 -623920 -979407 -1902884 -2970933 -3533951 -3154990 -1944447 309213 4574884
5439 4574884 10698382 15741798 16247628 12179227 6762181 2434146 -853644 -3141672
$$ packed form
5501F00451k722341m222104k368601J425167L606025K755724J382556K171663
5493B628540L904207L367399N34449j091159K90748K010901Q53715k398469m364326
5484E736005l623615j689243k12560M99535L88180o45584j514434n07396J980670
5475D11558L040653R58988j988608k210409M43502K491706J376196j525958l072993
5466g5365k277110r65918r77874j746730j135231J573502M227621M097007J435200
5457D155102n24363K61640J838640J037550j941466l790539k665084k95531Q46155
5448a077896M53976l55487r23477j068049n63018L78961J210543K253660M265671
5439D574884O123498N043416N05830m068401n417046m328035l287790k288028
$$ plain form
5431 -3141672 -3174828 -966254 829025 174027 -1433584 -1456031 -394864 -1008847 -4177746
5422 -4177746 -7795580 -9551066 -8936274 -6663161 -3876737 -1959565 -1467150 -1067147 1073207
5413 1073207 4669621 7343068 7440015 5728212 4131549 3737475 4134159 3922962 2016092
5404 2016092 -883434 -2627084 -2309477 -1667459 -2407944 -3283701 -2073216 267830 353190
5395 353190 -2583813 -5343902 -5343696 -3776436 -2742318 -1768656 614889 3637272 5138622
5386 5138622 4802910 4379488 5052955 6297814 7093739 6850984 5325436 2786670 46798
5377 46798 -2543211 -5536290 -8879832 -10851326 -9871633 -6640017 -2958262 772514 4949510
5368 4949510 8290222 8527239 5872895 3346729 2681416 2020792 -808434 -4452665 -5595167
$$ packed form
5431c141672l3156K208574J795279o54998j607611k2447J061167o13983l168899
5422d177746l617834j755486O14792K273113K786424J917172M92415M00003K140354
5413A073207L596414K673447R6947j711803j596663l94074L96684k11197j906870
5404B016092k899526j743650L17607O42018p40485q75757J210485K341046Q5360
5395C53190k937003k760089K06J567260J034118R73662K383545L022383J501350
5386E138622l35712m23422O73467J244859P95925k42755j525548k538766k739872
5377D6798k590009k993079l343542j971494R79693L231616L681755L730776M176996
5368D949510L340712K37017k654344k526166o65313o60624k829226l644231j142502
$$ plain form
5359 -5595167 -3618675 -1509801 -1823416 -3434718 -3327131 -782068 1507273 678659 -2887845
5350 -2887845 -6206462 -7274812 -6774770 -6031839 -4870008 -2678075 -398595 407652 -26439
5341 -26439 -174479 -3498 -1065197 -3441790 -4998257 -4765703 -4758891 -6555807 -7941885
5332 -7941885 -5542418 88913 4544934 4558458 863128 -3752428 -7012326 -7557545 -5116011
5323 -5116011 -1321469 1160878 1327101 671979 885573 1978284 3174112 4178754 4768012
5314 4768012 4501163 3772867 3846784 4839394 5008577 3277032 1184785 806362 1745521
5305 1745521 1888214 449127 -1419383 -2647619 -3331719 -4033282 -5279798 -7407583 -9685443
5296 -9685443 -10200732 -8160810 -5818016 -6338076 -9958536 -13969117 -16282847 -17055779 -16730614
$$ packed form
5359e595167J976492K108874l13615j611302J07587K545063K289341q28614l566504
5350b887845l318617j068350N00042P42931J161831K191933K279480Q06247m34091
5341b6439j48040J70981j061699k376593j556467K32554O812j796916j386078
5332g941885K399467N631331M456021J3524l695330m615556l259898n45219K441534
5323e116011L794542K482347J66223o55122K13594J092711J195828J004642N89258
5314D768012k66849p28296P3917R92610J69183j731545k092247l78423R39159
5305A745521J42693j439087j868510j228236o84100p01563j246516k127785k277860
5296i685443n15289K039922K342794n20060l620460m010581k313730p72932L25165
$$ plain form
5287 -16730614 -14747444 -11029641 -7005290 -4069636 -2138141 -495129 895496 1593044
5279 1593044 1436778 660077 -223422 -739041 -1341997 -3390163 -6987219 -9596547 -8661781
5270 -8661781 -5070883 -1819394 265534 2672289 5303731 5961626 4433479 3474644 4268458
5261 4268458 4449055 2692151 1721777 3812164 6449132 6205069 4538248 5504686 9167072
5252 9167072 11645046 11175889 9964424 9790406 9527533 7870026 5482365 3420640 1823324
5243 1823324 1029280 1901790 4232625 6476136 7506963 7208662 5496149 2580298 -112571
5234 -112571 -1423052 -2514834 -5050178 -7730154 -7563272 -4431999 -1135464 1235281 4208109
5225 4208109 7503938 7859024 4105554 -322304 -2448978 -4020864 -7707421 -11838876
$$ packed form
5287a6730614J983170L717803M024351K935654J931495J643012J390625O97548
5279A593044j56266p76701q83499n15619o02956k048166l597056k609328R34766
5270h661781L590898L251489K084928K406755K631442O57895j528147r58835P93814
5261D268458J80597j756904r70374K090387K636968k44063j666821R66438L662386
5252I167072K477974m69157j211465j74018k62873j657507k387661k061725j597316
5243A823324p94044Q72510K330835K243511J030827k98301j712513k915851k692869
5234a12571j310481j091782k535344k679976J66882L131273L296535K370745K972828
5225D208109L295829L55086l753470m427858k126674j571886l686557m131455
$$ plain form
5217 -11838876 -12467114 -8803436 -3263340 2314689 6990311 8560480 5208549 -640809
5209 -640809 -3703437 -1939519 1312524 2038542 32373 -2259606 -3291535 -3390490 -3328770
5200 -3328770 -3134903 -2065287 376133 2933645 2770279 -1416758 -6807853 -8970535 -7242029
5191 -7242029 -5543001 -6944213 -9467351 -9074823 -5454989 -2389277 -2507177 -3997182 -3551087
5182 -3551087 -1010864 666775 -364446 -2461334 -2907723 -1324508 568239 1769102
5174 1769102 2841442 3928824 3761775 1685438 -522182 -450320 1533920 2106003 -1153579
5165 -1153579 -6396810 -8875923 -5852771 254397 4024590 2238044 -3481449 -9044819
5157 -9044819 -11887591 -12092198 -10741570 -8755563 -7191296 -7143216 -8680202 -10548719 -11305156
$$ packed form
5217a1838876o28238L663678N540096N578029M675622J570169l351931n849358
5209f40809l062628J763918L252043P26018k006169k291979j031929r8955O1720
5200c328770J93867J069616K441420K557512j63366m187037n391095k162682J728506
5191g242029J699028j401212k523138L92528L619834L065712j17900j490005M46095
5182c551087K540223J677639j031221k096888m46389J583215J892747J200863
5174A769102J072340J087382j67049k076337k207620P1862J984240N72083l259582
5165a153579n243231k479113L023152O107168L770193j786546n719493n563370
5157i044819k842772k04607J350628J986007J564267M8080j536986j868517p56437
$$ plain form
5148 -11305156 -10415680 -8401428 -6487495 -5810888 -6187472 -6024699 -4390101 -2634796 -2662541
5139 -2662541 -4118071 -5045329 -5019882 -5420483 -6396275 -6032610 -3513366 -936557 -465283
5130 -465283 -1270771 -924207 1318017 4132301 6133348 6799499 5984655 3862016 1247068
5121 1247068 -765570 -1399931 -390482 1714606 3402277 3359717 1904927 258691 -1272742
5112 -1272742 -2799864 -3052559 -653129 2723412 3531735 1493968 291817 1740444 2819666
5103 2819666 854903 -1782960 -1547187 437438 364963 -2288042 -4881619 -6384224 -7762142
5094 -7762142 -8323314 -6160262 -2475208 -1289460 -3831201 -6646144 -6462600 -3991987 -1762403
5085 -1762403 -937587 -1565296 -3487386 -5556204 -5928814 -4314569 -2199547 -215976 2493235
$$ packed form
5148a1305156Q89476K014252J913933O76607l76584J62773J634598J755305k7745
5139b662541j455530r27258K5447m00601r75792L63665K519244K576809M71274
5130d65283q05488L46564K242224K814284K001047O66151q14844k122639k614948
5121A247068k012638o34361J009449K105088J687671m2560j454790j646236j531433
5112a272742j527122k52695K399430L376541Q08323k037767j202151J448627J079222
5103B819666j964763k637863K35773J984625p2475k653005k593577j502605j377918
5094g762142n61172K163052L685054J185748k541741k814943J83544K470613K229584
5085a762403Q24816o27709j922090k068818l72610J614245K115022J983571K709211
$$ plain form
5076 2493235 5586398 6872163 5666908 4313108 4711256 5640746 5381353 4735680 5113607
5067 5113607 5533047 4298195 2420730 2563780 5196036 8286662 10372178 11459884 11155941
5058 11155941 8598705 4629862 1583373 188235 -1062232 -2508847 -1742987 2730538
5050 2730538 8189946 10595925 9715784 8580210 8257986 6415754 1902176 -2317551 -2918752
5041 -2918752 -797947 704408 845202 1828151 4589077 7198027 7884834 7191735 6411511
5032 6411511 6026272 6444575 8160578 10208541 10471146 8644913 7023405 7232780 8159175
5023 8159175 8300320 7968897 7618939 6269770 3618046 1653428 1902693 2941710 3018794
5014 3018794 3166895 4827610 6170631 4287998 74987 -2500115 -1562265 1215552 3768621
$$ packed form
5076B493235L093163J285765j205255j353800L98148R29490k59393o45673L77927
5067E113607M19440j234852j877465J43050K632256L090626K085516J087706l03943
5058A1155941k557236l968843l046489j395138j250467j446615P65860M473525
5050B730538N459408K405979q80141j135574l22224j842232m513578m219727o01201
5041b918752K120805J502355J40794R82949K760926K608950O86807o93099p80224
5032F411511l85239M18303J716003K047963K62605j826233j621508K09375R26395
5023H159175J41145l31423l49958j349169k651724j964618K49265J039017P7084
5014C018794J48101J660715J343021j882633m213011k575102R37850K777817K553069
$$ plain form
5005 3768621 5179668 4566876 1791638 -775338 -445962 1654855 1830406 -495233 -1625149
4996 -1625149 1036976 5426208 7713356 6288664 1987707 -3198364 -6689284 -6882986
4988 -6882986 -5147617 -4369848 -5106367 -5396605 -4531165 -3973115 -3822449 -1783715 2642028
4979 2642028 5968396 5130452 1881393 282300 1378153 2878815 3139083 2931927 3385272
4970 3385272 4170309 4274082 3402420 1927961 -11478 -2515623 -4885265 -5574946 -4279923
4961 -4279923 -3291541 -4705811 -6548531 -4699484 633261 3985078 2028626 -1885838
4953 -1885838 -3433667 -3576404 -4902373 -5425824 -1837134 3474401 5037933 2708286 1101507
4944 1101507 1335337 83600 -2983815 -3831813 -1439615 42019 -1438432 -2446282 -428084
$$ packed form
5005C768621J411047o12792k775238k566976L29376K100817J75551k325639j129916
4996a625149K662125M389232K287148j424692m300957n186071l490920j93702
4988f882986J735369P77769p36519k90238Q65440N58050J50666K038734M425743
4979B642028L326368q37944l249059j599093J095853J500662K60268k07156M53345
4970C385272P85037J03773q71662j474459j939439k504145k369642o89681J295023
4961d279923R88382j414270j842720J849047N332745L351817j956452l914464
4953a885838j547829j42737j325969n23451L588690N311535J563532k329647j606779
4944A101507K33830j251737l067415q47998K392198J481634j480451j007850K018198
$$ plain form
4935 -428084 1992069 1735226 -539540 -3226680 -5975952 -7188810 -4567950 -291900 -73472
4926 -73472 -4548086 -7349486 -4720329 -1150287 -1844852 -5315909 -7680104 -9024442 -10845026
4917 -10845026 -11782809 -10602050 -9498954 -10270654 -10859144 -9221133 -6729116 -4738168 -2291115
4908 -2291115 -6358 -919541 -4465225 -5533883 -2739562 -1118749 -3178859 -4635810
4900 -4635810 -2983232 -1939978 -2520849 1011433 9923402 15331580 11515805 5490505
4892 5490505 4668418 4874025 758691 -2078648 2321774 6992376 3103651 -4039320 -4441837
4883 -4441837 -703263 -664429 -1362434 2944656 5961684 1544458 334363 11517608 20404301
4874 20404301 15871683 30121264 106025084 219205299 280055324 236658155 138752544
$$ packed form
4935d28084K420153k56843k274766k687140k749272j212858K620860M276050K18428
4926g3472m474614k801400K629157L570042o94565l471057k364195j344338j820584
4917a0845026r37783J180759J103096p71700n88490J638011K492017J990948K447053
4908b291115K284757r13183l545684j068658K794321J620813k060110j456951
4900d635810J652578J043254n80871L532282Q911969N408178l815775o025300
4892E490505q22087K05607m115334k837339M400422M670602l888725p142971m02517
4883d441837L738574L8834o98005M307090L017028m417226j210095J1183245Q886693
4874B0404301m532618J4249581P5903820J13180215O0850025m3397169r7905611
$$ plain form
4867 138752544 70782730 53574272 48405057 32185517 20799191 25346775 30410127
4860 30410127 23836908 15488124 15190747 16406431 12711225 10669640 15314082 18827897
4852 18827897 14262494 7627016 6704532 8667538 7721937 5855653 7463880 10591808
4844 10591808 11076656 9626553 8695914 7522966 5316286 4441676 6055554 7108399 5267152
4835 5267152 2419348 587776 -797847 -1223029 1834793 7367014 9739647 6270578
4827 6270578 1104001 -1327882 -1946921 -3213073 -4231259 -2880275 780346 5659331
4819 5659331 10756164 13506834 10943413 4183169 -1933951 -4712508 -5148119 -3476219
4811 -3476219 1401150 7255206 9334424 7466483 6502739 8001096 7869465 4581525 2851733
$$ packed form
4867A38752544o7969814j7208458n169215j6219540j1386326M547584N063352
4860C0410127o573219q348784k97377J215684l695206k041585M644442L513815
4852A8827897m565403o635478r22484J963006r45601j866284J608227L127928
4844A0591808M84848j450103r30639j172948k206680q74610J613878J052845j841247
4835E267152k847804j831572j385623m25182L057822N532221K372633l469069
4827F270578n166577k431883o19039j266152j018186J350984L660621M878985
4819E659331N096833K750670k563421o760244o117120k778557m35611J671900
4811c476219M877369N854056K079218j867941r63744J498357j31631l287940j729792
$$ plain form
4802 2851733 5559247 8408420 7013592 3686973 2490385 2542117 1168509 -607391 -630381
4793 -630381 -13138 -497782 -837183 102115 206380 -1793741 -2735452 136174 4162335
4784 4162335 5419279 4477956 3671585 2232138 -898272 -2727498 -196957 4000826 5008337
4775 5008337 3225246 2904548 4951659 6277801 5268519 3228689 1246221 -265908
4767 -265908 -8792 2288968 3736697 1923371 -958995 -1643290 -1366927 -3190727 -5666309
4758 -5666309 -4696721 -603889 2308537 2767275 3496872 5177187 5105845 2689047 982914
4749 982914 1371168 1331017 -955466 -3850054 -5527778 -6163499 -5614844 -2852333 882868
4740 882868 2261018 845633 73331 1449909 1777487 -1285030 -4592971 -3813484 273597
$$ packed form
4802B851733K707514K849173j394828l326619j196588N1732j373608j775900k2990
4793f30381O17243m84644l39401R39298J04265k000121r41711K871626M026161
4784D162335J256944r41323q06371j439447l130410j829226K530541M197783J007511
4775E008337j783091l20698K047111J326142j009282k039830j982468j512129
4767b65908K57116K297760J447729j813326k882366o84295K76363j823800k475582
4758e666309R69588M092832K912426M58738P29597J680315p1342k416798j706133
4749I82914L88254m0151k286483k894588j677724o35721N48655K762511L735201
4740H82868J378150j415385p72302J376578L27578l062517l307941P79487M087081
$$ plain form
4731 273597 3167568 2610792 156111 -1937664 -2594814 -1510405 711357 2306627 1939284
4722 1939284 198996 -1564927 -2994899 -4090540 -3940505 -1733699 1586982 4060773
4714 4060773 4606021 3202243 139438 -3518007 -5557012 -4493721 -1631494 232348
4706 232348 98413 -564496 -372911 331792 831436 1478112 2694838 3576564 2996143 1709136
4696 1709136 1733898 3491348 5255666 6075288 7266464 9426903 9891897 6091824 551108
4687 551108 -1099307 2447022 6279684 6160959 3830227 3100227 3877302 3585270 2288568
4678 2288568 2183542 2976197 1999711 -976417 -2892040 -2129092 -750282 -806049 -1388504
4669 -1388504 -1045763 -645247 -1688883 -3426132 -3828454 -2617406 -1494776 -1628301 -2260785
$$ packed form
4731B73597K893971n56776k454681k093775o57150J084409K221762J595270l67343
4722A939284j740288j763923j429972j095641J50035K206806L320681K473791
4714D060773N45248j403778l062805l657445k039005J063291K862227J863842
4706B32348j33935o62909J91585P04703M99644O46676J216726Q81726n80421j287007
4696A709136K4762J757450J764318Q19622J191176K160439M64994l800073n540716
4687E51108j650415L546329L832662j18725k330732p30000P77075k92032j296702
4678B288568j05026P92655r76486k976128j915623P62948J378810n5767n82455
4669a388504L42741M00516j043636j737249m02322J211048J122630j33525o32484
$$ plain form
4660 -2260785 -1905934 -126586 2140626 3856081 5236670 7270135 9564999 9690660 5875189
4651 5875189 -257457 -5163439 -7301935 -8009339 -8675605 -8994659 -8368855 -7206916 -5990204
4642 -5990204 -4367598 -1966847 847656 3463374 5270673 5268008 2838795 -583429 -2022785
4633 -2022785 59981 4217930 7830405 9340869 8480600 5949133 3646698 3606311 5526468
4624 5526468 6715694 5770304 4946600 7078872 11055232 12578267 9457950 4242153 954215
4615 954215 664272 1337381 1126106 333533 98984 441469 466289 -59528 -391502 -82717
4605 -82717 316168 90141 -854478 -2304088 -3999682 -5227273 -5152182 -4167690 -3844974 -4680921
4595 -4680921 -4997017 -3286290 -706435 237214 -1146621 -3322468 -4694471 -4690855 -3218025
$$ packed form
4660b260785L54851J779348K267212J715455J380589K033465K294864J25661l815471
4651E875189o132646m905982k138496p07404o66266l19054O25804J161939J216712
4642e990204J622606K400751K814503K615718J807299k665k429213l422224j439356
4633b022785K082766M157949L612475J510464q60269k531467k302435m0387J920157
4624E526468J189226r45390q23704K132272L976360J523035l120317n215797l287938
4615I54215k89943O73109k11275p92573k34549L42485K4820n25817l31974L08785
4605h2717L98885k26027r44619j449610j695594j227591P5091R84492L22716q35947
4595d680921l16096J710727K579855R43649j383835k175847j372003L616J472830
$$ plain form
4586 -3218025 -699224 1578253 2594186 2738977 2539073 1134033 -2009717 -4696723 -4039598
4577 -4039598 -834292 879036 -867588 -3688729 -4674308 -3948183 -3192157 -2957155 -3030536
4568 -3030536 -3541828 -3999370 -2873427 86334 2525836 2344173 777830 756202 2939996
4559 2939996 5129289 5067796 2298171 -2231693 -6817328 -9574033 -9882958 -9214546 -9354627
4550 -9354627 -10022961 -9446248 -7074704 -4346412 -2636985 -1752141 -925413 -293208 -607505
4541 -607505 -1949248 -3464857 -4447288 -5251199 -6695509 -8468708 -8650280 -5517344 237965
4532 237965 5811827 8913885 9380233 8095772 5449350 1637902 -2277988 -4786982 -5369553
4523 -5369553 -4782293 -3797795 -2228418 503215 4099313 7061491 7760259 5821821 2538332
$$ packed form
4586c218025K518801K277477J015933J44791j99904j405040l143750k687006O57125
4577d039598L205306J713328j746624k821141r85579P26125P56026K35002p3381
4568c030536n11292m57542J125943K959761K439502j81663j566343k1628K183794
4559B939996K189293o1493k769625m529864m585635k756705l08925O68412j40081
4550i354627o68334N76713K371544K728292J709427Q84844Q26728O32205l14297
4541f07505j341743j515609r82431q03911j444310j773199j81572L132936N755309
4532B37965N573862L102058M66348j284461k646422l811448l915890k508994n82571
4523e369553N87260R84498J569377K731633L596098K962178O98768j938438l283489
$$ plain form
4514 2538332 100744 282927 3093132 6170167 6333871 2981023 -543562 -575338 2215943
4505 2215943 4039880 3835568 4683649 8159400 10854069 9351143 5762413 4509458 5676771
4496 5676771 5982719 5059123 5710254 8009700 8270601 5025652 1436922 -51716 -1337369
4487 -1337369 -4580879 -8014752 -8532974 -5822980 -1585665 2878209 6152768 6359421 3666346
4478 3666346 891304 -359782 -1581751 -3603063 -4390596 -3264724 -3559495 -7331178 -10848369
4469 -10848369 -9974173 -7077764 -7103637 -9013135 -7556232 -2651796 -191445 -2795035 -6147569
4460 -6147569 -6385100 -5291384 -5325319 -4673532 -1141952 2923034 3805010 1854567 -54302
4451 -54302 -1291142 -2889198 -4041569 -3295167 -2182395 -3507495 -6283874 -6406715 -2865105
$$ packed form
4514B538332k437588J82183K810205L077035J63704l352848l524585l1776K791281
4505B215943J823937k04312Q48081L475751K694669j502926l588730j252955J167313
4496E676771L05948r23596O51131K299446K60901l244949l588730j488638j285653
4487a337369l243510l433873n18222K709994M237315M463874L274559K06653k693075
4478C666346k775042j251086j221969k021312p87533J125872k94771l771683l517191
4469a0848369Q74196K896409k5873j909498J456903M904436K460351k603590l352534
4460f147569k37531J093716l3935O51787L531580M064986Q81976j950443j908869
4451e4302j236840j598056j152371P46402J112772j325100k776379j22841L541610
$$ plain form
4442 -2865105 467300 428250 -1433660 -2294680 -2520938 -4045500 -6386639 -7418178 -7032446
4433 -7032446 -6865217 -6709358 -4504995 -476154 1972180 1121633 -23289 2018599 5983090
4424 5983090 7883673 6957061 6160926 7117256 8113453 7685935 6829400 6343397 4988677
4415 4988677 2164719 -89100 39584 1314122 1735370 1715484 2400210 2596060 579663
4406 579663 -2071643 -1953931 915495 2483603 -47057 -4744789 -7512209 -6193629 -1615156
4397 -1615156 3508590 6031675 4600782 1381703 183449 2113595 4399269 4154965
4389 4154965 1853780 96315 197423 1286048 2111519 2476134 2835653 3142783 2452208
4380 2452208 -82433 -3716561 -6209315 -6092070 -4452111 -3647387 -4556611 -5940815 -6166492
$$ packed form
4442b865105L332405l9050j861910q61020k26258j524562k341139j031539L85732
4433g032446J67229J55859K204363M028841K448334q50547j144922K041888L964491
4424E983090J900583r26612p96135R56330R96197m27518q56535m86003j354720
4415D988677k823958k253819J28684J274538M21248j9886O84726J95850k016397
4406E79663k651306J17712K869426J568108k530660m697732k767420J318580M578473
4397a615156N123746K523085j430893l219079j198254J930146K285674k44304
4389D154965k301185j757465J01108J088625Q25471L64615L59519L07130o90575
4380B452208k534641l634128k492754J17245J639959Q04724r09224j384204k25677
$$ plain form
4371 -6166492 -4587445 -1579799 1629606 3347320 2787706 1043061 -246541 -914878 -1868803
4362 -1868803 -3058161 -3349753 -2443137 -1465698 -1384207 -2054802 -3137852 -4729994 -6554907
4353 -6554907 -7456523 -6315445 -3044788 1487535 6039554 9466877 11139616 11040303 9420024
4344 9420024 6776586 4191230 2682104 1833261 332833 -1444578 -1022274 2643470 6645673
4335 6645673 6942064 2743201 -3427519 -8796509 -11634146 -10904421 -7157543 -3071586 -864866
4326 -864866 158387 1521275 2377382 1098099 -1218094 -2183064 -2211967 -3431336 -4970162
4317 -4970162 -3612583 515686 3325547 3024900 2811799 5388529 8585361 9089140 7496029
4308 7496029 6662303 7173190 7402044 6748851 6207578 6305616 6353539 5545511 3978660 3034956
$$ packed form
4371f166492J579047L007646L209405J717714n59614j744645j289602o68337r53925
4362a868803j189358k91592R06616R77439Q1491o70595j083050j592142j824913
4353f554907r01616J141078L270657M532323M552019L427323J672739r9313j620279
4344I420024k643438k585356j509126q48843j500428j777411M22304L665744M002203
4335F645673K96391m198863o170720n368990k837637P29725L746878M085957K206720
4326h64866J023253J362888Q56107j279283k316193r64970k8903j219369j538826
4317d970162J357579M128269K809861l00647k13101K576730L196832N03779j593111
4308G496029q33726N10887K28854o53193n41273R8038M7923q08028j566851r43704
$$ plain form
4298 3034956 4639788 8730262 11747070 9965413 4419934 -229151 -2025626 -3535287
4290 -3535287 -6480773 -8498840 -7337942 -4795905 -3720527 -3926978 -3938242 -4137897 -5014201
4281 -5014201 -4602728 -1282530 2522193 3040102 504946 -1545067 -1581270 -1429428 -2595233
4272 -2595233 -4290038 -5371860 -5857317 -6106334 -6173484 -6026380 -5134182 -2307725 2684046
4263 2684046 7966231 11368756 12616025 12494187 11053547 8246259 5165491 2836518
4255 2836518 767341 -1662424 -3605519 -4313506 -4866315 -6194705 -6760456 -4793045 -1867635
4246 -1867635 -1455368 -4173827 -6846728 -6336061 -2601586 1831547 4036471 2853279 193926
4237 193926 -618280 1067547 2143481 34333 -3747915 -6129702 -6559054 -6272564 -5478715
$$ packed form
4298C034956J604832M090474L016808j781657n545479m649085j796475j509661
4290c535287k945486k018067J160898K542037J075378k06451j1264j99655q76304
4281e014201M11473L320198L804723N17909k535156k050013l6203J51842j165805
4272b595233j694805j081822m85457k49017o7150J47104Q92198K826457M991771
4263B684046N282185L402525J247269j21838j440640k807288l080768k328973
4255B836518k069177k429765j943095p07987n52809j328390n65751J967411K925410
4246a867635M12267k718459k672901N10667L734475M433133K204924j183192k659353
4237A93926q12206J685827J075934k109148l782248k381787m29352K86490P93849
$$ plain form
4228 -5478715 -4097550 -3582379 -4838004 -5705189 -3820948 -826223 -245728 -2061659 -3037065
4219 -3037065 -1911418 -526064 183502 1620960 4313797 6284647 5502917 1936818 -2916356
4210 -2916356 -6604046 -6456281 -2278738 2242301 3477072 2554832 3289368 6212625 8119083
4201 8119083 7228952 5221359 3920359 3230996 2731499 2357322 1247546 -1288933 -3634437
4192 -3634437 -3557089 -1917193 -1620873 -2964166 -3229691 -1019638 2122301 4527529 5878700
4183 5878700 5946108 4809923 4097643 5071788 6128804 5380581 4651336 7001991 11169324
4174 11169324 12779072 10532001 6940298 3664505 632414 -1081871 -367488 828196
4166 828196 398954 488414 3421661 5612747 2807100 -868353 1813582 8255055 9037152
$$ packed form
4228e478715J381165N15171j255625q67185J884241K994725N80495j815931r75406
4219c037065J125647J385354P09566J437458K692837J970850p81730l566099m853174
4210b916356l687690J47765M177543M521039J234771r22240P34536K923257J906458
4201H119083q90131k007593j301000o89363m99497l74177j109776k536479k345504
4192c634437P7348J639896K96320j343293k65525K210053L141939K405228J351171
4183E878700O7408j136185p12280R74145J057016p48223p29245K350655M167333
4174A1169324J609748k247071l591703l275793l032091j714285P14383J195684
4166H28196m29242Q9460K933247K191086k805647l675453K681935O441473P82097
$$ plain form
4157 9037152 3834181 2472188 8256585 12631028 10102405 6103413 5077614 3345201
4149 3345201 -44560 1573329 9204791 14126282 15844770 27084253 46611597 44886059
4141 44886059 97934 -62183035 -91951162 -74521901 -42643290 -28589478 -30128956
4134 -30128956 -30685492 -28148550 -28702678 -29531007 -24775975 -18732048 -18816554 -22285563 -21756395
4125 -21756395 -18034739 -16693237 -17000540 -14513453 -10581125 -9610681 -10157565 -7829088 -4380964
4116 -4380964 -5154394 -9356214 -11178641 -9381745 -8075388 -8768840 -8942619 -8203598 -8925606
4107 -8925606 -10508402 -9366471 -5338948 -2442699 -2411970 -2699954 -1866118 -1969398 -4137448
4098 -4137448 -6102776 -5969727 -5011049 -5018170 -5581038 -5444270 -4444673 -3043374 -1637168
$$ packed form
4157I037152n202971j361993N784397M374443k528623l998992j025799j732413
4149C345201l389761J617889P631462M921491J718488J1239483J9527344j725538
4141D4886059m4788125o2280969k9768127J7429261L1878611J4053812j539478
4134c0128956n56536K536942n54128q28329M755032O043927q4506l469009N29168
4125b1756395L721656J341502l07303K487087L932328R70444n46884K328477L448124
4116d380964p73430m201820j822427J796896J306357o93452j73779P39021p22008
4107h925606j582796J141931M027523K896249L0729k87984Q33836j03280k168050
4098d137448j965328J33049R58678p121n62868J36768R99597J401299J406206
$$ plain form
4089 -1637168 -969485 -1781333 -3740906 -5762430 -7073502 -7113609 -5584277 -3879836 -4703807
4080 -4703807 -8295358 -10864212 -9254839 -5445793 -3611948 -4433767 -5650402 -6797857
4072 -6797857 -9429458 -13154055 -15277295 -14676843 -13076278 -12241177 -12299585 -12655712 -12364942
4063 -12364942 -10246634 -6866863 -5219789 -6770573 -8389621 -6629863 -3434021 -3225679
4055 -3225679 -5469793 -5412287 -2227230 -793942 -3848524 -7379767 -6412074 -1534070 3097597
4046 3097597 5300476 5711365 5330243 4729433 4290870 3525861 1469187 -1241376 -2432448
4037 -2432448 -1484477 -410752 -894973 -2297705 -3587366 -5067138 -7020208 -8732692 -10015867
4028 -10015867 -11614970 -13040215 -12319014 -9203761 -6261764 -5247034 -4698095 -2852224
$$ packed form
4089a637168O67683q11848j959573k021524j311072m0107J529332J704441q23971
4080d703807l591551k568854J609373L809046J833845q21819j216635j147455
4072f797857k631601l724597k123240O00452J600565Q35101n8408l56127K90770
4063a2364942K118308L379771J647074j550784j619048J759758L195842K08342
4055c225679k244114N7506L185057J433288l054582l531243R67693M878004M631667
4046C097597K202879M10889l81122o00810m38563p65009k056674k710563j191072
4037b432448R47971J073725m84221j402732j289661j479772j953070j712484j283175
4028a0015867j599103j425245P21201L115253K941997J014730N48939J845871
$$ plain form
4020 -2852224 -669120 35533 -604147 -1679583 -3517931 -6122254 -7297461 -5089471 -1178804
4011 -1178804 597573 -1369413 -5421192 -9304803 -11965198 -13079139 -12606234 -10930652
4003 -10930652 -8523417 -5651333 -2800072 -535677 1437377 3806484 5804120 5529219
3995 5529219 2779813 -394128 -2760087 -5107455 -7243870 -6842056 -3554989 -1449234
3987 -1449234 -4105104 -9268778 -11780161 -10359007 -8026270 -6974482 -6763434 -6925119 -7475475
3978 -7475475 -6956050 -3831145 -239709 -575803 -5330054 -9763908 -10029901 -7427839 -4988059
3969 -4988059 -3021789 -478700 1810998 2215194 1195366 432706 -140110 -2041516 -5353041
3960 -5353041 -8272256 -9593783 -9876647 -9906067 -9562764 -8798269 -8470566 -9219166 -10139085
$$ packed form
4020b852224K183104P04653o39680j075436j838348k604323j175207K207990L910667
4011a178804J776377j966986m051779l883611k660395j113941M72905J675582
4003a0930652K407235K872084K851261K264395J973054K369107J997636k74901
3995E529219k749406l173941k365959k347368k136415M01814L287067K105755
3987a449234k655870n163674k511383J421154K332737J051788K11048j61685n50356
3978g475475N19425L124905L591436l36094m754251m433854k65993K602062K439780
3969d988059J966270K543089K289698M04196j019828p62660n72816j901406l311525
3960e353041k919215j321527k82864k9420L43303P64495L27703p48600r19919
$$ plain form
3951 -10139085 -9656651 -7709546 -6053505 -5813223 -5492836 -2672946 2398102 6391640 6704741
3942 6704741 4373686 2174814 1054901 -31899 -1662483 -3256168 -4542164 -5897493
3934 -5897493 -7166108 -7677996 -7533521 -7517672 -7829779 -8309428 -9589470 -12147583 -14354472
3925 -14354472 -13717939 -10445186 -7613960 -7217751 -8145699 -8704189 -8734905 -8198696 -6205025
3916 -6205025 -3091905 -1155529 -1309745 -1205012 853091 2114374 -1239618 -8070132 -13109891
3907 -13109891 -13559492 -11549114 -9713726 -7684261 -4326220 -701476 1337453 1895850
3899 1895850 2347647 2832991 2306209 656388 -911906 -1689102 -2282893 -3229042 -3880390
3890 -3880390 -3496426 -2816300 -3396180 -5214439 -5971921 -3716426 213896 2030785 -421999
$$ packed form
3951a0139085M82434J947105J656041K40282L20387K819890N071048L993538L13101
3942F704741k331055k198872j119913j086800j630584j593685j285996j355329
3934e897493j268615n11888J44475J5849l12107m79649j280042k558113k206889
3925a4354472O36533L272753K831226L96209r27948n58490l0716N36209J993671
3916f205025L113120J936376j54216J04733K058103J261283l353992o830514n039759
3907a3109891m49601K010378J835388K029465L358041L624744K038929N58397
3899A895850M51797M85344n26782j649821j568294p77196n93791r46149o51348
3890c880390L83964O80126n79880j818259p57482K255495L930322J816889k452784
$$ plain form
3881 -421999 -5282540 -8821668 -9232726 -7686829 -6316368 -6045671 -6164549 -5340888 -3092518
3872 -3092518 -536190 630676 56689 -956794 -1256711 -1003543 -666256 -138176 326924
3863 326924 -307282 -2040834 -2917122 -1655247 -14160 -313224 -1523160 -629349 2392062
3854 2392062 4076115 2495110 -188844 -1316275 -1061450 -567885 472183 1996468 1767237
3845 1767237 -1338202 -3780554 -943532 6044004 10858485 10089108 7260876 6993044 8248148
3836 8248148 6535226 1193529 -3233099 -3116937 -147352 1801347 1983100 2671298 4734264
3827 4734264 5988099 4485212 1389749 -748978 -1232060 -999721 -34608 2725010 6652719
3818 6652719 8854572 7607067 4894334 3873960 4708059 4785708 2802095 609100 477921
$$ packed form
3881d21999m860541l539128m11058J545897J370461K70697j18878Q23661K248370
3872c092518K556328J166866n73987j013483k99917K53168L37287N28080M65100
3863C26924o34206j733552q76288J261875J641087k99064j209936Q93811L021411
3854B392062J684053j581005k683954j127431K54825M93565J040068J524285k29231
3845A767237l105439k442352K837022O987536M814481p69377k828232k67832J255104
3836H248148j712922n341697m426628J16162K969585J948699J81753O88198K062966
3827D734264J253835j502887l095463k138727m83082K32339R65113K759618L927709
3818F652719K201853j247505k712733j020374Q34099P7649j983613k192995j31179
$$ plain form
3809 477921 2195692 4005309 5263535 6607703 7953013 8111189 6886337 6096315 7253372
3800 7253372 8935817 8042003 3788852 -956640 -3004317 -2305160 -1013422 -126995 1157749
3791 1157749 3013693 3935415 2868933 938300 -79734 -129288 -562077 -1905088 -3052898
3782 -3052898 -2718904 -1005567 623798 711567 -761052 -2241090 -2236632 -1097050 -593361
3773 -593361 -1691317 -3598629 -5227723 -6466430 -7366507 -7210523 -5502976 -3210663 -1943907
3764 -1943907 -2304182 -3753233 -5357613 -5738707 -3277638 2040698 7407448 9396288 7427826
3755 7427826 3918810 1230898 -241833 -1228084 -2466809 -4581759 -7510157 -9658639
3747 -9658639 -9055807 -5967416 -3174236 -2912461 -4404728 -5023100 -3163876 440146 3423005
$$ packed form
3809D77921J717771J809617J258226J344168J345310J58176j224852p90022J157057
3800G253372J682445q93814m253151m745492k047677O99157J291738Q86427J284744
3791A157749J855944R21722j066482j930633j018034m9554m32789j343011j147810
3782c052898L33994J713337J629365Q7769j472619j480038M458J139582N03689
3773e93361j097956j907312j629094j238707r00077J55984J707547K292313J266756
3764a943907l60275j449051j604380l81094K461069N318336N366750J988840j968462
3755G427826l509016k687912j472731r86251j238725k114950k928398k148482
3747i658639O02832L088391K793180K61775j492267o18372J859224L604022K982859
$$ plain form
3738 3423005 3350369 -516312 -6305174 -10853213 -12372776 -11482922 -9674922 -7644054 -5392445
3729 -5392445 -3080972 -1154714 84101 846791 1908463 3769142 5272966 4071401
3721 4071401 -276438 -4673907 -5939154 -5188443 -6212621 -9747926 -12533488 -12593753 -11867932
3712 -11867932 -11865140 -10166497 -4382699 2682594 5485017 2500519 -2554925 -5869094 -7031067
3703 -7031067 -7301483 -7028264 -5663479 -2887171 746986 3422808 2818322 -1300892 -5756660
3694 -5756660 -7001115 -5203912 -3538491 -3745979 -4530341 -4338520 -3423487 -2596665 -1949868
3685 -1949868 -1630909 -2218237 -3447054 -3923402 -2896839 -1180867 242607 1324606 2140926
3676 2140926 2286271 1766148 1382006 1587608 1964090 2336421 3321001 5166173 7030756
$$ packed form
3738C423005p2636l866681n788862m548039j519563Q89854J808000K030868K251609
3729e392445K311473J926258J238815P62690J061672J860679J503824j201565
3721D071401m347839m397469j265247P50711j024178l535305k785562o0265P25821
3712a1867932K792J698643N783798P065293K802423k984498n055444l314169j161973
3703g031067k70416K73219J364785K776308L634157K675822o04486m119214m455768
3694e756660j244455J797203J665421k07488p84362J91821R15033Q26822O46797
3685a949868L18959n87328j228817m76348J026563J715972J423474J081999Q16320
3676B140926J45345n20123l84142K05602L76482L72331R84580J845172J864583
$$ plain form
3667 7030756 8021196 8178601 8068406 8123080 8484688 8684354 7735396 5704013 4683316
3658 4683316 6430478 9386394 10293785 8670506 6947071 5913738 3431040 -1095839
3650 -1095839 -4475055 -4288367 -2707682 -2823163 -3702110 -2652082 -423075 88250 -643359
3641 -643359 871959 4922808 7028465 4167958 -756018 -2853013 -1333669 598672
3633 598672 402451 -1545738 -3649062 -5010716 -5524959 -5363520 -4939616 -5017832 -6422798
3624 -6422798 -9172014 -11638513 -11280612 -7218816 -1768239 1772357 2713827 3069449 4197171
3615 4197171 5153322 4913752 4433423 5225813 7022879 8206787 7993861 7117145 6747360
3606 6747360 7563909 9387341 10849745 9956338 6131770 1576795 -495389 807481 3234075
$$ packed form
3667G030756R90440J57405j10195N4674L61608J99666r48958k031383j020697
3658D683316J747162K955916R07391j623279j723435j033333k482698m526879
3650a095839l379216J86688J580685j15481q78947J050028K229007N11325p31609
3641f43359J515318M050849K105657k860507m923976k096995J519344J932341
3633E98672j96221j948189k103324j361654n14243J61439M23904p8216j404966
3624f422798k749216k466499L57901M061796N450577L540596R41470L55622J127722
3615D197171R56151k39570m80329P92390J797066J183908k12926q76716l69785
3606F747360Q16549J823432J462404q93407l824568m554975k072184J302870K426594
$$ plain form
3597 3234075 4097224 3064094 1792946 1391543 1193691 288758 -533132 546287 3568439
3588 3568439 5735385 4212587 -397810 -4590209 -5974359 -5451298 -4984059 -4750143 -3849305
3579 -3849305 -2826136 -3456074 -5837193 -7407304 -5827464 -1907079 1356214 2088272 849462
3570 849462 -991086 -2823403 -4419824 -5182967 -4711581 -3606455 -2820258 -2356832 -1373682
3561 -1373682 372180 1829905 1747405 292078 -621212 1072122 5172676 8563890 8053000
3552 8053000 4247617 1281596 1765137 3545353 3200591 1221449 826662 2312412 2220444
3543 2220444 -1210767 -5289369 -7180274 -7763624 -8757946 -8797010 -5769771 -1335049 608314
3534 608314 -627924 -1898796 -1016389 775307 1437792 649591 -913376 -2631970 -3634310
$$ packed form
3597C234075Q63149j033130j271148m01403j97852r04933q21890J079419L022152
3588C568439K166946j522798m610397m192399j384150N23061M67239K33916R00838
3579c849305J023169o29938k381119j570111J579840L920385L263293P32058j238810
3570H49462j840548j832317j596421p63143M71386J105126P86197M63426R83150
3561a373682J745862J457725q2500j455327r13290J693334M100554L391214n10890
3552H053000l805383k966021M83541J780216l44762j979142l94787J485750r1968
3543B220444l431211m078602j890905n83350r94322l9064L027239M434722J943363
3534F08314j236238j270872Q82407J791696O62485p88201j562967j718594j002340
$$ plain form
3525 -3634310 -3234172 -2184343 -1958050 -2643493 -3201610 -3683585 -5087477 -6935631 -7340360
3516 -7340360 -5922072 -4397666 -3701089 -2823677 -1256429 -206516 -305328 -317845 579389
3507 579389 1195029 306532 -1495474 -3079718 -4107292 -4087275 -2175473 837684 2442340
3498 2442340 1679471 338094 -455538 -2141616 -5218582 -6740947 -4411136 -924056 -576311
3489 -576311 -2972741 -3955190 -2121954 -492367 -1398360 -3258700 -3548028 -2306961 -1310679
3480 -1310679 -1531527 -2642303 -3876768 -4466052 -3859070 -1944385 1138715 4888931 7637127
3471 7637127 7037031 2726469 -2365258 -4824972 -4111166 -1892112 562905 2484993 2637620
3462 2637620 902295 -190601 1552720 4080401 3259661 -1234857 -5301347 -5861469 -3918260
$$ packed form
3525c634310M00138J049829K26293o85443n58117m81975j403892j848154m04729
3516g340360J418288J524406O96577Q77412J567248J049913r8812j2517Q97234
3507E79389O15640q88497j802006j584244j027574K0017J911802L013157J604656
3498B442340p62869j341377p93632j686078l076966j522365K329811L487080L47745
3489e76311k396430r82449J833236J629587r05993j860340k89328J241067R96282
3480a310679k20848j110776j234465n89284O06982J914685L083100L750216K748196
3471G637127o00096m310562n091727k459714P13806K219054K455017J922088J52627
3462B637620j735325j092896J743321K527681q20740m494518m066490n60122J943209
$$ plain form
3453 -3918260 -1745708 -40400 1264244 2002776 2593775 3648698 4168979 2487293 -530648
3444 -530648 -1898591 -767378 530967 463350 266315 814047 692592 -927411 -2364447
3435 -2364447 -2235222 -1614192 -1637566 -1609425 -1307402 -2296520 -4772173 -5975982 -4252445
3426 -4252445 -1843629 -902898 234255 3374527 5991986 4760873 1442499 564409 2573183
3417 2573183 4061138 4039192 4973474 7370527 8082722 5150891 510010 -3320816 -5908347
3408 -5908347 -7213828 -6543915 -4572307 -3556936 -4192944 -4719538 -4099942 -3367607 -2843037
3399 -2843037 -1045300 2197032 4443123 4145030 2826826 2096449 1201855 -545372 -1721016
3390 -1721016 -1495847 -1727302 -3624437 -4809470 -2924733 -64954 92741 -1873463 -2095764
$$ packed form
3453c918260K172552J705308J304644P38532N90999J054923N20281j681686l017941
3444e30648j367943J131213J298345o7617j97035N47732j21455j620003j437036
3435b364447J29225O21030k3374K8141L02023r89118k475653j203809J723537
3426d252445K408816R40731J137153L140272K617459j231113l318374q78090K008774
3417B573183J487955k1946R34282K397053P12195k931831m640881l830826k587531
3408e908347j305481O69913J971608J015371o36008n26594O19596P32335N24570
3399b843037J797737L242332K246091k98093j318204p30377q94594j747227j175644
3390a721016K25169k31455j897135j185033J884737K859779J57695j966204k22301
$$ plain form
3381 -2095764 530834 3186417 3859040 3362164 2208816 -658076 -4774575 -7259312 -6866818
3372 -6866818 -6040193 -6728012 -6763018 -3332680 1754725 3752944 1413711 -1508515 -1623536
3363 -1623536 96057 959296 826172 1479690 2917499 2878169 292345 -2857921 -4122270
3354 -4122270 -3618654 -3152495 -3261578 -2920703 -1972546 -1911948 -3549200 -5400006 -5622164
3345 -5622164 -4620896 -4333199 -5380658 -6408214 -6325022 -5868649 -6370611 -7849965 -9058964
3336 -9058964 -8961153 -7528240 -5339498 -3038059 -1193535 -174291 82477 -99511 -733709
3327 -733709 -2297250 -4853985 -7235079 -7785242 -6181389 -3906135 -2427619 -1506878 -160769
3318 -160769 1167878 830016 -1324217 -2793117 -1028314 3407724 7292974 8132118 6256631
$$ packed form
3381b095764K626598K655583O72623m96876j153348k866892m116499k484737L92494
3372f866818Q26625o87819l5006L430338N087405J998219k339233k922226j15021
3363a623536J719593Q63239j33124O53518J437809l9330k585824l150266j264349
3354d122270N03616M66159j09083L40875R48157O0598j637252j850806k22158
3345e622164J001268K87697j047459j027556Q3192M56373n01962j479354j208999
3336i058964R7811J432913K188742K301439J844524J019244K56768j81988o34198
3327g33709j563541k556735k381094n50163J603853K275254J478516R20741J346109
3318a60769J328647l37862k154233j468900J764803M436038L885250Q39144j875487
$$ plain form
3309 6256631 3693024 1962299 1405410 1935268 3520882 5771902 7614312 7994019 6972014
3300 6972014 5660877 4801256 3850412 2018489 -180592 -1340118 -1167893 -1110972 -2465002
3291 -2465002 -4523679 -5310852 -3888951 -1357303 405222 579581 -122705 -619132 -758897
3282 -758897 -1116706 -1591133 -1084332 763201 2238324 1142831 -2479594 -6301976 -8242066
3273 -8242066 -7817276 -5208043 -788500 3953081 6772843 6894178 5585677 3860758 1294808
3264 1294808 -1852592 -3353809 -1757478 1106294 2598809 3037556 4341922 5730202
3256 5730202 4089047 -937021 -5298440 -5439734 -2667166 -880550 -1458148 -2325667 -1364215
3247 -1364215 1087261 3167741 3682638 2950781 2040590 1615831 1645464 2111130 3352118
$$ packed form
3309F256631k563607j730725n56889N29858J585614K251020J842410L79707j022005
3300F972014j311137q59621r50844j831923k199081j159526J72225N6921j354030
3291b465002k058677p87173J421901K531648J762525J74359p02286m96427j39765
3282g58897l57809m74427N06801J847533J475123j095493l622425l822382j940090
3273h242066M24790K609233M419543M741581K819762J21335j308501j724919k565950
3264A294808l147400j501217J596331K863772J492515M38747J304366J388280
3256E730202j641155n026068m361419j41294K772568J786616n77598q67519R61452
3247a364215K451476K080480N14897p31857r10191m24759K9633M65666J240988
$$ plain form
3238 3352118 5132370 5988894 4686045 2098433 270690 -457777 -1803919 -4561544 -6983262
3229 -6983262 -7227459 -6017662 -5369790 -5622779 -5417974 -4133864 -2563510 -1113735 1021107
3220 1021107 4265572 7420385 8908637 8664144 7971875 7692069 7350898 6015454 3525119
3211 3525119 636847 -1682853 -2772291 -2331904 -511546 1968849 4219737 5897321
3203 5897321 7189481 8032792 7942929 6855274 5384657 3823931 1800564 -379777 -1216485
3194 -1216485 -153025 801148 -547846 -3270807 -4657116 -4470774 -4980806 -6396227 -5633158
3185 -5633158 -1257992 3389183 4636744 3663722 3950992 5269846 4291439 748683 -1291799
3176 -1291799 680095 4089380 5442108 5003135 4880227 4838977 3194027 615006 -283535
$$ packed form
3238C352118J780252Q56524j302849k587612j827743p28467j346142k757625k421718
3229f983262k44197J209797O47872k52989K04805J284110J570354J449775K134842
3220A021107L244465L154813J488252k44493o92269k79806l41171j335444k490335
3211C525119k888272k319700j089438M40387J820358K480395K250888J677584
3203E897321J292160Q43311q9863j087655j470617j560726k023367k180341q36708
3194a216485J063460R54173j348994k722961j386309J86342n10032j415421P63069
3185e633158M375166M647175J247561r73022K87270J318854r78407l542756k040482
3176a291799J971894L409285J352728m38973j22908m1250j644950k579021q98541
$$ plain form
3167 -283535 939622 1757191 658683 -470506 814558 4016235 6462317 6489913 4550557
3158 4550557 1952189 -166120 -1113546 -1173437 -1572178 -2843429 -3621746 -2334166 291638
3149 291638 2043972 2432557 3090160 4591433 5102827 3345341 829371 -600168 -1620445
3140 -1620445 -3555638 -5187479 -4413656 -2245452 -1741650 -2948199 -2473166 985069 4192844
3131 4192844 4348088 3456900 5002777 8362289 9678481 7298318 3572648 1675213 2869253
3122 2869253 6476470 10338388 11544453 8811743 4192228 820846 -639409 -1564247
3114 -1564247 -2134676 -1054858 1616925 3892526 4417039 3357175 621618 -4041882 -8537003
3105 -8537003 -9039120 -4797300 -11651 1014392 -1104012 -2472884 -1086299 1604918
$$ packed form
3167b83535J223157Q17569j098508j129189J285064L201677K446082K7596j939356
3158D550557k598368k118309r47426n9891l98741j271251p78317J287580K625804
3149B91638J752334L88585O57603J501273N11394j757486k515970j429539j020277
3140a620445j935193j631841P73823K168204N03802j206549M75033L458235L207775
3131D192844J55244q91188J545877L359512J316192k380163l725670j897435J194040
3122B869253L607217L861918J206065k732710m619515l371382j460255r24838
3114a564247n70429J079818K671783K275601N24513j059864k735557m663500m495121
3105h537003n02117M241820M785649J026043k118404j368872J386585K691217
$$ plain form
3097 1604918 3247514 2843380 1030956 -496278 -383433 633733 245646 -2350936 -5228372
3088 -5228372 -6645281 -7515518 -9335820 -11239870 -11226086 -9070727 -5749228 -1108213 5180724
3079 5180724 11075231 13586317 12739652 11378248 10852220 9718575 7183992 4783843 3461196
3070 3461196 1867933 -580818 -1486055 1182193 5287890 6944800 5777216 4830063 5436100
3061 5436100 5260338 2469019 -743087 -987856 1231592 1898438 -858332 -3848715 -3084497
3052 -3084497 554911 2322467 -45890 -3692016 -5190063 -5005855 -5251134 -5203838 -2540989
3043 -2540989 1735840 3438401 987358 -2160867 -2349214 -306396 1014528 929336 861151
3034 861151 1085424 276043 -2033810 -4432635 -5000553 -2654599 2112758 6653253 7502761
$$ packed form
3097A604918J642596m04134j812424j527234J12845J017166l88087k596582k877436
3088e228372j416909q70237j820302j904050J3784K155359L321499M641015O288937
3079E180724N894507K511086q46665j361404n26028j133645k534583k400149j322647
3070C461196j593263k448751r05237K668248M105697J656910j167584r47153O06037
3061E436100j75762k791319l212106k44769K219448O66846k756770k990383P64218
3052c084497L639408J767556k368357l646126j498047J84208k45279M7296K662849
3043b540989M276829J702561k451043l148225j88347K042818J320924q5192o8185
3034H61151K24273q09381k309853k398825n67918K345954M767357M540495Q49508
$$ plain form
3025 7502761 4140001 549262 969655 4632640 6873666 5143211 1600917 -291595
3017 -291595 598684 3244273 5932422 6742275 4617779 1087994 -790212 -286510 -39957
3008 -39957 -1904128 -3569267 -1479593 3901557 8108347 7897240 4582894 1804772 1429037
2999 1429037 2337579 2331220 415229 -2509716 -4729315 -5444706 -5434357 -5908418 -6920393
2990 -6920393 -7315061 -6244551 -4312802 -2955207 -2864062 -3396083 -3669423 -3868035 -4855813
2981 -4855813 -6482916 -7044500 -4925764 -312060 5176375 9958520 13026505 13738118 12026999
2972 12026999 8450507 3477316 -2366473 -6973595 -7157536 -2800140 1022227 -707092
2964 -707092 -6073255 -8169580 -4094090 1932192 5415040 7055313 8832586 8898100 4748993
$$ packed form
3025G502761l362760l590739M20393L662985K241026j730455l542294j892512
3017b91595Q90279K645589K688149Q09853k124496l529785j878206N03702K46553
3008c9957j864171j665139K089674N381150M206790k11107l314346k778122l75735
2999A429037R08542o359j915991k924945k219599p15391J0349m74061j011975
2990f920393l94668J070510J931749J357595R1145n32021k73340j98612r87778
2981d855813j627103n61584K118736M613704N488435M782145L067985P11613j711119
2972A2026999l576492m973191n843789m607122j83941M357396L822367j729319
2964g07092n366163k096325M075490O026282L482848J640273J777273O5514m149107
$$ plain form
2955 4748993 -1155831 -3867103 -2908537 -2187078 -3332500 -3727887 -1819937 -137842 -1314577
2946 -1314577 -4234814 -5983536 -5365938 -3056998 -284242 1464856 1458924 1451283 4091384
2937 4091384 8454569 9807916 5697511 -143668 -2386278 -707136 912975 132454
2929 132454 -1528513 -1938213 -974042 523940 2249184 3946917 4662348 3423516 450108
2920 450108 -2620346 -3933760 -3320318 -2857698 -4644450 -8132164 -10992436 -12460196 -13684422
2911 -13684422 -14464342 -12536157 -7556773 -2967702 -1509328 -1254329 960312 4176680
2903 4176680 5007796 3409165 2758644 4455006 6235278 6215944 5070895 3430272 526886
2894 526886 -3193436 -5042528 -3443974 -186688 2132119 2993219 3065788 2509539 1615441
$$ packed form
2955D748993n904824k711272R58566P21459j145422l95387J907950J682095j176735
2946a314577k920237j748722O17598K308940K772756J749098n932p641K640101
2937D091384M363185J353347m110405n841179k242610J679142J620111p80521
2929A32454j660967m09700R64171J497982J725244J697733P15431j238832k973408
2920D50108l070454j313414O13442M62620j786752l487714k860272j467760j224226
2911a3684422p79920J928185M979384M589071J458374K54999K214641L216368
2903D176680Q31116j598631o50521J696362J780272j9334j145049j640623k903386
2894E26886l720322j849092J598554L257286K318807Q61100P2569n56249q94098
$$ plain form
2885 1615441 1278681 1394057 560521 -1218294 -1470739 1390724 5386538 7472953 7160080
2876 7160080 5778163 3781366 1067603 -1272942 -1961856 -1516983 -1124892 -404634 1444797
2867 1444797 3092989 2308960 -547308 -2769019 -2995482 -2268632 -1409094 -29238 1329446
2858 1329446 821133 -1687954 -3474244 -2459853 -199284 348960 -1176171 -2512527 -1990395
2849 -1990395 -81882 1976006 3600163 4666649 4849711 3607476 665419 -3431392
2841 -3431392 -7263588 -9545960 -10360531 -10758584 -10987347 -10139552 -8093525 -6517389 -6607210
2832 -6607210 -6646644 -3641110 2576820 8480787 10631485 9114166 6560004 4932755 4380957
2823 4380957 4407386 4639737 4555080 3789043 2998392 3308759 4465008 4560909 2298627 -1319514
$$ packed form
2885A615441l36760J15376q33536j778815k52445K861463L995814K086415l12873
2876G160080j381917j996797k713763k340545o88914M44873L92091P20258J849431
2867A444797J648192p84029k856268k221711k26463P26850Q59538J379856J358684
2858A329446n08313k509087j786290J014391K260569N48244j525131j336356N22132
2849a990395J908513K057888J624157J066486J83062j242235k942057m096811
2841c431392l832196k282372q14571l98053k28763Q47795K046027J576136q9821
2832f607210l9434L005534O217930N903967K150698j517319k554162j627249n51798
2823D380957K6429K32351q4657p66037p90651L10367J156249R5901k262282l618141
$$ plain form
2813 -1319514 -4333655 -6066691 -7038820 -7353836 -6492589 -4420196 -1646278 1641938 5261394
2804 5261394 8089553 9011217 8808102 9293962 10246156 9268198 5601923 1997773 1247790
2795 1247790 2591201 3460588 3291018 3214204 3051825 1523394 -717364 -1104326 1124184
2786 1124184 3521866 3653770 1787762 -560259 -2761130 -4342052 -3961662 -1237221 1421233
2777 1421233 1098000 -1645958 -3064681 -944542 2523372 3430363 700926 -3047905 -4728570
2768 -4728570 -3881879 -2503253 -2502034 -3779008 -4618319 -3592927 -964912 1660286 2903781
2759 2903781 2754172 2161133 1712027 1072587 -209429 -1821376 -2938613 -2954701 -1572598
2750 -1572598 1191486 4259613 5364815 3101148 -968830 -3711748 -4071760 -3773985 -4211932
$$ packed form
2813a319514l014141j733036r72129l15016Q61247K072393K773918L288216L619456
2804E261394K828159R21664k03115M85860R52194r77958l666275l604150p49983
2795A247790J343411Q69387j69570p6814j62379j528431k240758l86962K228510
2786A124184K397682J31904j866008k348021k200871j580922L80390K724441K658454
2777A421233l23233k743958j418723K120139L467914R06991k729437l748831j680665
2768d728570Q46691J378626J219j276974q39311J025392K628015K625198J243495
2759B903781j49609n93039m49106o39440j282016j611947j117237j6088J382103
2750a572598K764084L068127J105202k263667m069978k742918l60012K97775m37947
$$ plain form
2741 -4211932 -4747680 -4912017 -5870140 -7908667 -8584764 -5949250 -2171530 -1065168 -2878714
2732 -2878714 -4612259 -5060166 -6077363 -8419341 -9790837 -8494552 -6309012 -5889941 -7242945
2723 -7242945 -8450255 -8254964 -6358596 -2750921 1498811 4083310 3881784 2589146 2382224
2714 2382224 2993755 2787785 1787435 1622172 2845062 4124270 4122351 2781192 662903
2705 662903 -1824312 -4291840 -6126581 -6550421 -4948417 -1759839 1007912 1576437 1203002
2696 1203002 3377776 8982498 14035436 14222077 10369640 7157031 7253121 9154577 10385559
2687 10385559 10275003 9318890 7930043 6385468 4593690 1878697 -1556304 -3408902
2679 -3408902 -1671292 1910277 3296401 1391420 -869061 -1422241 -2047212 -4592015 -6832827
$$ packed form
2741d211932n35748j64337r58123k038527o76097K635514L777720J106362j813546
2732b878714j733545m47907j017197k341978j371496J296285K185540M19071j353004
2723g242945j207310J95291J896368L607675M249732K584499k01526j292638k06922
2714B382224O11531k05970j000350j65263J222890J279208j919j341159k118289
2705F62903k487215k467528j834741m23840J602004L188578K767751N68525l73435
2696A203002K174774N604722N052938J86641l852437l212609R6090J901456J230982
2687A0385559j10556r56113j388847j544575j791778k714993l435001j852598
2679c408902J737610L581569J386124j904981k260481n53180o24971k544803k240812
$$ plain form
2670 -6832827 -4996955 782756 6257224 7981887 6269983 3326839 592200 -1460049
2662 -1460049 -2524820 -2609950 -2327066 -2207996 -1938768 -824131 968045 2082911 1366663
2653 1366663 -448995 -1161597 258422 2092606 1991979 259818 -469125 1098557 3249195
2644 3249195 3915919 3407532 3332735 4037553 4538926 4231628 3315046 2077311 938931
2635 938931 588636 844943 135977 -2318650 -4483967 -3696314 -634219 1172924 80687
2626 80687 -1854702 -2693901 -3694740 -6589677 -9732645 -9847468 -6967265 -4751290 -5460978
2617 -5460978 -7013260 -6089931 -2344795 1892941 4755732 5981787 5739321 4261115 2718164
2608 2718164 2835592 4928570 7152246 7308257 5015838 1883622 -20214 218122 1684589
$$ packed form
2670f832827J835872N779711N474468J724663j711904k943144k734639k052249
2662a460049j064771q5130K82884J19070K69228J114637J792176J114866p16248
2653A366663j815658p12602J420019J834184j00627j732161p28943J567682K150638
2644C249195O66724n08387p4797P04818N01373l07298r16582j237735j138380
2635I38931l50295K56307p08966k454627k165317P87653L062095J807143j092237
2626H0687j935389q39199j000839k894937l142968j14823K880203K215975p09688
2617e460978j552282R23329L745136M237736K862791J226055k42466j478206j542951
2608B718164J17428K092978K223676J56011k292419l132216j903836K38336J466467
$$ plain form
2599 1684589 2437679 1563914 464181 1230463 3560370 4512801 2209823 -1181326 -1570480
2590 -1570480 2216882 7112134 9556737 9267005 8380052 7828686 6256725 2769904 -852380
2581 -852380 -2112060 -1233033 -768222 -1652835 -1754035 626737 3909097 5883683 7390887
2572 7390887 10266077 12585432 9968096 2257099 -4864274 -6627222 -4360317 -1837993
2564 -1837993 289871 3209731 5692484 5355545 3112021 2403901 4198297 6189910 6993184
2555 6993184 7710271 8861331 9006635 7401850 5318196 3751043 2250163 849785 647858
2546 647858 1532096 1832027 1236487 1480091 2996239 3640558 2237636 636392 344903
2537 344903 -225503 -2822582 -5950777 -6955827 -5662556 -3532462 -1046992 1514665 2494535
$$ packed form
2599A684589P53090q73765j099733P66282K329907R52431k302978l391149l89154
2590a570480L787362M895252K444603k89732q86953n51366j571961l486821l622284
2581h52380j259680Q79027M64811q84613j01200K380772L282360J974586J507204
2572G390887K875190K319355k617336p710997p121373j762948K266905K522324
2564a837993K127864K919860K482753l36939k243524p08120J794396J991613Q03274
2555F993184P17087J151060J45304j604785k083654j567153j500880j400378k01927
2546F47858Q84238K99931n95540K43604J516148O44319j402922j601244k91489
2537C44903n70406k597079l128195j005050J293271K130094K485470K561657R79870
$$ plain form
2528 2494535 940293 -1122004 -1255279 -78607 559810 1158652 2909679 3974040 1545362
2519 1545362 -3055781 -5620018 -5334614 -5548813 -7743996 -9103095 -7487766 -4910549 -4078142
2510 -4078142 -4782368 -5816906 -7435360 -9538431 -10149577 -8337633 -6326018 -5923456 -4993889
2501 -4993889 -711821 5232456 8259735 7095275 4937133 4353060 4169970 2428261 58416
2492 58416 25065 3764687 9426088 13306219 12931880 9240716 5529393 3732462 2455642
2483 2455642 -303406 -3448646 -3778143 -582809 2826641 2993149 282337 -2039528 -1766514
2474 -1766514 299037 1958749 2184646 1808257 1944856 2123993 558906 -3384896 -7629243
2465 -7629243 -9298563 -8068902 -6462463 -6485568 -7108063 -5969142 -2844175 -129871 96908
$$ packed form
2528B494535j554242k062297j33275J176672O38417N98842J751027J064361k428678
2519A545362m601143k564237K85404k14199k195183j359099J615329K577217Q32407
2510d078142p04226j034538j618454k103071o11146J811944K011615M02562R29567
2501d993889M282068N944277L027279j164460k158142n84073j83090j741709k369845
2492E8416l3351L739622N661401L880131l74339l691164l711323j796931j276820
2483B455642k759048l145240l29497L195334L409450J66508k710812k321865K73014
2474a766514K065551J659712K25897l76389J36599J79137j565087l943802m244347
2465g629243j669320J229661J606439k3105o22495J138921L124967K714304K26779
$$ plain form
2456 96908 -1698039 -3748390 -5420476 -7200803 -8693252 -8329431 -5720724 -2952292 -2287100
2447 -2287100 -3413924 -4379675 -4557165 -4798143 -4882128 -3147352 636042 4025505 4709738
2438 4709738 3027538 581065 -2039006 -4694317 -6423981 -6636601 -6462371 -7002240 -7252994
2429 -7252994 -5868733 -3998646 -3817069 -4832149 -4523487 -2561637 -1357018 -1912911 -2176038
2420 -2176038 -642069 1220993 1787826 2025667 3393841 5052789 5450805 5066578 5176450
2411 5176450 5173309 3618318 1064346 -656229 -1354689 -2289559 -3531981 -4012704 -3888440
2402 -3888440 -4223133 -4370930 -2546545 575491 1778179 -143926 -2418497 -2297423 -655149
2393 -655149 10631 -1085891 -3548598 -7391354 -11587050 -12894252 -9280960 -3610104 -863824
$$ packed form
2456I6908j794947k050351j672086j780327j492449L63821K608707K768432O65192
2447b287100j126824r65751j77490k40978q3985J734776L783394L389463O84233
2438D709738j682200k446473k620071k655311j729664k12620J74230n39869k50754
2429g252994J384261J870087J81577j015080L08662J961850J204619n55893k63127
2420b176038J533969J863062N66833K37841J368174J658948L98016l84227J09872
2411E176450l141j554991k553972j720575o98460r34870j242422m80723J24264
2402c888440l34693j47797J824385L122036J202688j922105k274571J21074J642274
2393f55149O65780j096522k462707l842756m195696j307202L613292N670856K746280
$$ plain form
2384 -863824 -2034843 -3644282 -3222078 -2084857 -1893655 -1430746 1355242 5871346 9277376
2375 9277376 9561529 7144090 4176570 2975516 4263812 6288417 6512849 4595343 2602247
2366 2602247 1959956 1784621 942048 -53336 -485988 -1102215 -2553494 -3530565 -2592965
2357 -2592965 -991861 -1354469 -3890537 -6178542 -6830487 -7211692 -8956172 -11586438 -13391888
2348 -13391888 -13249193 -10871272 -6663493 -2233250 210655 94070 -729849 -375411 718866
2339 718866 863270 -243624 -1305258 -1507113 -1408736 -1609774 -1716707 -1233539 -765954 -1544950
2329 -1544950 -3827622 -6276082 -7148000 -5977595 -3905171 -2378463 -1782911 -1495213 -1015813
2320 -1015813 -654995 -1094927 -2510900 -4120110 -4531442 -2884308 2113 1963199 1551650
$$ packed form
2384h63824j171019j609439M22204J137221J91202M62909K785988M516104L406030
2375I277376K84153k417439k967520j201054J288296K024605K24432j917506j993096
2366B602247o42291j75335q42573r95384m32652o16227j451279r77071R37600
2357b592965J601104l62608k536068k288005o51945l81205j744480k630266j805450
2348a3391888J42695K377921M207779M430243K443905j16585q23919L54438J094277
2339G18866J44404j106894j061634k01855R8377k01038j06933M83168M67585p78996
2329a544950k282672k448460q71918J170405K072424J526708N95552K87698M79400
2320a015813L60818m39932j415973j609210m11332J647134K886421J961086m11549
$$ plain form
2311 1551650 -484111 -2455384 -4104044 -6502423 -9470002 -10623484 -8124221 -3522859
2303 -3522859 -419286 -326861 -1031911 564184 4786365 8907439 10008011 7511569 3185895
2294 3185895 -609771 -2565691 -2958557 -3015952 -3565328 -4133218 -3689081 -2387743 -1848269
2285 -1848269 -3060010 -4641366 -4265637 -1573935 1480129 3049282 2748208 555719 -3690915
2276 -3690915 -8766784 -11749731 -10892099 -7871046 -5671357 -4931653 -3860629 -1192178 2331853
2267 2331853 5121158 6044775 4920178 2941126 2167569 3346912 4879236 5278504 5624034
2258 5624034 7599638 10062857 10184614 7540801 4213809 982395 -3275283 -7857193
2250 -7857193 -9465527 -6727781 -2566087 -189212 729475 1895775 2953359 2729905 1927090
$$ packed form
2311A551650k035761j971273j648660k398379k967579j153482K499263M601362
2303c522859L103573R2425p05050J596095M222181M121074J100572k496442m325674
2294C185895l795666j955920l92866n7395n49376n67890M44137J301338N39474
2285a848269j211741j581356L75729K691702L054064J569153l01074k192489m246634
2276c690915n075869k982947Q57632L021053K199689P39704J071024K668451L524031
2267B331853K789305R23617j124597j979052p73557J179343J532324L99268L45530
2258E624034J975604K463219J21757k643813l326992l231414m257678m581910
2250g857193j608334K737746M161694K376875R18687J166300J057584k23454q02815
$$ plain form
2241 1927090 1875577 2114838 1782292 1981731 3974561 6181646 6057044 4308669 4151981
2232 4151981 6440710 8437855 7803279 5272252 2763690 1039328 56267 -159491 81524
$$ packed form
2241A927090n1513K39261l32546J99439J992830K207085j24602j748375j56688
2232D151981K288729J997145o34576k531027k508562j724362r83061k15758K41015
$$ [...]
##END NTUPLES=NMR SPECTRUM
##END=
