##TITLE=31Pdec_DE-102_m_TFA
CDCl3, 64 sc
 25.8.2025
##JCAMPDX= 6.0         $$ Bruker NMR JCAMP-DX V2.0
##DATA TYPE= NMR SPECTRUM
##DATA CLASS= NTUPLES
##ORIGIN= UXNMR, Bruker Analytische Messtechnik GmbH
##OWNER= root
$$ XWIN-NMR		Version 3.5
$$ Mon Aug 25 14:25:06 2025 Russian Standard Time (UT+4h)  she@DPX200
##.OBSERVE FREQUENCY= 81.013821
##.OBSERVE NUCLEUS= ^31P
##.ACQUISITION MODE= SIMULTANEOUS
##.ACQUISITION SCHEME= undefined
##.AVERAGES= 64
##.DIGITISER RES= 17
##SPECTROMETER/DATA SYSTEM= spect
##.PULSE SEQUENCE= zgpg30
##.SOLVENT NAME= CDCl3
##.SHIFT REFERENCE= (INTERNAL, CDCl3, 0, 198.062)
##AUDIT TRAIL= $$ (NUMBER, WHEN, WHO, WHERE, WHAT)
$$ ##TITLE= Audit trail, XWIN-NMR		Version 3.5
$$ ##JCAMPDX= 5.01
$$ ##ORIGIN= Bruker BioSpin GmbH
$$ ##OWNER= she
$$ F:/spectra/data/she/nmr/P31/2/pdata/1/auditp.txt
$$ ##AUDIT TRAIL=  $$ (NUMBER, WHEN, WHO, WHERE, WHAT)
(   1,<2025-08-25 14:23:38.71 +0400>,<she>,<DPX200>,
      <created by zg, POWCHK disabled, PULCHK disabled
       configuration hash MD5:
       00 E9 B6 7A A2 85 ED C7 34 08 36 98 17 FE 4E 26
       data hash MD5: 32K
       1F 0D D0 FB EE 16 7B E3 ED ED A1 4B FF 15 9D D2>)
(   2,<2025-08-25 14:23:40.89 +0400>,<she>,<DPX200>,
      <Start of raw data processing
       efp BC_mod = 2 LB = 1.5 FT_mod = 6 PKNL = 1 PHC0 = 1601.461 PHC1 = -437.5005 SI = 64K 
       data hash MD5: 64K
       38 58 9B 68 C0 81 A0 1F 79 28 4D E8 29 20 9A 87>)
(   3,<2025-08-25 14:24:11.75 +0400>,<she>,<DPX200>,
      <pk PHC0 = 45.12901 PHC1 = -109.2 
       data hash MD5: 64K
       23 0F 0F DE 07 31 40 6A 83 AB B7 8D F4 0C 97 94>)
(   4,<2025-08-25 14:24:37.34 +0400>,<she>,<DPX200>,
      <pk PHC0 = -45.00447 PHC1 = 99.80048 
       data hash MD5: 64K
       11 EA 6E 9C D3 A7 35 37 F6 01 33 A7 94 43 56 DB>)
$$ ##END=
$$ 
$$ hash MD5
$$ 29 17 CE FC F9 76 9A 8B CF 06 23 BF 4C C0 5F E9
##$RELAX= 
##$RELAX= 
##$RELAX= 
##$RELAX= 
##$RELAX= 
##$RELAX= 
##$RELAX= 
##$RELAX= 
$$ Bruker specific parameters
$$ --------------------------
##$DU= <F:/spectra>
##$EXPNO= 2
##$NAME= <P31>
##$PROCNO= 1
##$TYPE= <nmr>
##$USER= <she>
##$AMP= (0..31)
100 100 100 100 100 100 100 100 100 100 100 100 100 100 100 100 100 100 
100 100 100 100 100 100 100 100 100 100 100 100 100 100 
##$AQSEQ= 0
##$AQ_mod= 1
##$AUNM= <au_zg>
##$AUTOPOS= <>
##$BF1= 81.014009
##$BF2= 200.13
##$BF3= 200.13
##$BF4= 200.13
##$BF5= 200.13
##$BF6= 200.13
##$BF7= 200.13
##$BF8= 200.13
##$BYTORDA= 1
##$CFDGTYP= 0
##$CFRGTYP= 5
##$CHEMSTR= <none>
##$CNST= (0..31)
1 1 145 1 1 1 1 1 1 1 1 1 1 1 1 1 1 1 1 1 1 1 1 1 1 1 1 1 1 1 1 1 
##$CPDPRG= <waltz16>
##$CPDPRG1= <>
##$CPDPRG2= <waltz16>
##$CPDPRG3= <>
##$CPDPRG4= <mlev>
##$CPDPRG5= <mlev>
##$CPDPRG6= <mlev>
##$CPDPRG7= <mlev>
##$CPDPRG8= <mlev>
##$CPDPRGB= <>
##$CPDPRGT= <>
##$D= (0..31)
0 1 0 0 0 0 0 0 0 0.06 0 0.03 2e-05 3e-06 0 0 0.0002 0 0 0 0 0 0 0 0 0 
0 0 0 0 0 0 
##$DATE= 1756117418
##$DBL= (0..7)
120 120 120 11 120 120 24 19 
##$DBP= (0..7)
150 150 150 150 150 150 150 150 
##$DBP07= 0
$$ [...]
##$SUBNAM2= <"">
##$SUBNAM3= <"">
##$SUBNAM4= <"">
##$SUBNAM5= <"">
##$SUBNAM6= <"">
##$SUBNAM7= <"">
##$SUBNAM8= <"">
##$SUBNAM9= <"">
##$SW= 400.765351723535
##$SWIBOX= (0..15)
0 1 3 0 0 0 0 0 0 0 0 0 0 0 0 0 
##$SW_h= 32467.5324675325
##$TD= 32768
##$TD0= 1
##$TE= 0
##$TE2= 300
##$TE3= 300
##$TEG= 300
##$TL= (0..7)
0 120 53 12 22 120 120 120 
##$TP= (0..7)
150 150 150 150 150 150 150 150 
##$TP07= 0
##$TPNAME0= <>
##$TPNAME1= <>
##$TPNAME2= <>
##$TPNAME3= <>
##$TPNAME4= <>
##$TPNAME5= <>
##$TPNAME6= <>
##$TPNAME7= <>
##$TPOAL= (0..7)
0.5 0.5 0.5 0.5 0.5 0.5 0.5 0.5 
##$TPOFFS= (0..7)
0 0 0 0 0 0 0 0 
##$TUNHIN= 0
##$TUNHOUT= 0
##$TUNXOUT= 0
##$USERA1= <user>
##$USERA2= <user>
##$USERA3= <user>
##$USERA4= <user>
##$USERA5= <user>
##$V9= 5
##$VALIST= <valist>
##$VCLIST= <CCCCCCCCCCCCCCC>
##$VD= 0
##$VDLIST= <DDDDDDDDDDDDDDD>
##$VPLIST= <PPPPPPPPPPPPPPP>
##$VTLIST= <TTTTTTTTTTTTTTT>
##$WBST= 1024
##$WBSW= 4
##$XGAIN= (0..3)
0 0 0 0 
##$XL= 0
##$YL= 0
##$YMAX_a= 3513
##$YMIN_a= -4535
##$ZGOPTNS= <>
##$ZL1= 120
##$ZL2= 120
##$ZL3= 120
##$ZL4= 120
##$ABSF1= 0
##$ABSF2= 0
##$ABSG= 0
##$ABSL= 0
##$ALPHA= 0
##$AQORDER= 0
##$ASSFAC= 0
##$ASSFACI= 0
##$ASSFACX= 0
##$ASSWID= 0
##$AUNMP= <proc_1d>
##$AZFE= 0.1
##$AZFW= 0.5
##$BCFW= 0
##$BC_mod= 2
##$BYTORDP= 0
##$COROFFS= 0
##$CY= -3
##$DATMOD= 1
##$DC= 0
##$DFILT= <>
##$DTYPP= 0
##$F1P= 0
##$F2P= 0
##$FCOR= 1
##$FTSIZE= 65536
##$FT_mod= 6
##$GAMMA= 0
##$GB= 0
##$INTBC= 1
##$INTSCL= 9.790993e-09
##$ISEN= 30
##$LB= 1.5
##$LEV0= 0
##$LPBIN= 0
##$MAXI= 10000
##$MC2= 0
##$MEAN= 0
##$ME_mod= 0
##$MI= 50
##$NCOEF= 0
##$NC_proc= -8
##$NLEV= 6
##$NOISF1= 182.463
##$NOISF2= 159.3651
##$NSP= 0
##$NTH_PI= 0
##$NZP= 0
##$OFFSET= 198.0616
##$PC= 4
##$PHC0= 1601.585
##$PHC1= -446.9
##$PH_mod= 1
##$PKNL= yes
##$PPARMOD= 0
##$PSCAL= 0
##$PSIGN= 0
##$REVERSE= no
##$SF= 81.0140089999434
##$SI= 65536
##$SIGF1= 159.3651
##$SIGF2= -187.1042
##$SINO= 113.3802
##$SIOLD= 16384
##$SREGLST= <1H.CDCl3>
##$SSB= 0
##$STSI= 65536
##$STSR= 0
##$SW_p= 32467.5324675325
##$SYMM= 0
##$S_DEV= 0
##$TDeff= 32768
##$TDoff= 0
##$TI= <>
##$TILT= no
##$TM1= 0
##$TM2= 0
##$TOPLEV= 0
##$USERP1= <user>
##$USERP2= <user>
##$USERP3= <user>
##$USERP4= <user>
##$USERP5= <user>
##$WDW= 1
##$XDIM= 65536
##$YMAX_p= 211491987
##$YMIN_p= -256821072
$$ End of Bruker specific parameters
$$ ---------------------------------
##NTUPLES= NMR SPECTRUM
##VAR_NAME=  FREQUENCY,     SPECTRUM/REAL,   SPECTRUM/IMAG
##SYMBOL=    X,             R,               I
##VAR_TYPE=  INDEPENDENT,   DEPENDENT,       DEPENDENT
##VAR_FORM=  AFFN,          ASDF,            ASDF
##VAR_DIM=   65536,         65536,           65536
##UNITS=     HZ,            ARBITRARY UNITS, ARBITRARY UNITS
##FACTOR=    0.49542278885378, 1,            1
##FIRST=     16045.7642231865, 0,            0
##LAST=      -16421.768244346, 0,            0
##MIN=       -16421.768244346, -256821072,   0
##MAX=       16045.7642231865, 211491987,    0
$$ Real data points
##PAGE= N=1
##DATA TABLE= (X++(R..R)), XYDATA
$$ [...]
##PAGE= N=2
##DATA TABLE= (X++(I..I)), XYDATA
7486c189593k808114o38042K99023J391353L549648M773770K393090k778201o360723
$$ -3189593 -5997707 -6635749 -6336726 -4945373 -1395725 3378045 5771135 2992934 -3367789
7477c367789n192935j063745J526899P47296j038733j152872M2460P68146Q75924
$$ -3367789 -8560724 -9624469 -8097570 -7350274 -8389007 -9541879 -9499419 -8731273 -7855349
7468g855349J156716R52055p22669k238793p78088K963870M759946K639168l93610
$$ -7855349 -6698633 -5746578 -6469247 -8708040 -9486128 -6522258 -1762312 876856 483246
7459D83246j052994j44834P1799K5180J126379K087354P08064j861939k434296
$$ 483246 -569748 -714582 -642783 -617603 508776 2596130 3304194 1442255 -992041
7450i92041q46182k3852r38969j150376Q24780K906888K564348O9808k618057
$$ -992041 -1838223 -1862075 -2801044 -3951420 -3126640 -219752 2344596 2414404 -203653
7441b03653m154649l913103j831516O78306J554256R50479J370137L698471N181177
$$ -203653 -4358302 -8271405 -10102921 -9424615 -7870359 -6919880 -5549743 -1851272 3329905
7432C329905L170973q26276l043155k276143n85388K01543L73944O31385N44511
$$ 3329905 6500878 5674602 2631447 355304 -230084 -28541 345403 976788 1521299
7423A521299m14295j516193j483503j31622J418106K067188J738476R48362n4663
$$ 1521299 1107004 -409189 -1892692 -2024314 -606208 1460980 3199456 4147818 4093155
7414D093155j184299j906772j679779j055798j240152k155027k187872o19192
$$ 4093155 2908856 1002084 -677695 -1733493 -2973645 -5128672 -7316544 -7935736
7406g935736J059088J444357J466764K586816L882392L185852N84329j512331
$$ -7935736 -6876648 -5432291 -3965527 -1378711 2503681 5689533 6273862 4761531
7398D761531j682584p50036K40133J114894J456255O05961o89077o20457J035690
$$ 4761531 3078947 2328911 2569044 3683938 5140193 5746154 5057077 4436620 5472310
7389E472310K332656J807759J70303j124387j506399j174868p46923j064600j952317
$$ 5472310 7804966 9612725 9783028 8658641 7152242 5977374 5230451 4165851 2213534
7380B213534j637414P39430K832251J909852p04640j234155Q88755K651668K631607
$$ 2213534 576120 1315550 4147801 6057653 5353013 4118858 5007613 7659281 10290888
7371A0290888K226731J402489j735569n836927o182729k053620J083993m2273
$$ 10290888 12517619 13920108 12184539 6347612 164883 -1888737 -804744 -847017
7363h47017j295288J438742M826834L818037M56840J19210J949350N69133m092426
$$ -847017 -2142305 -703563 4123271 7941308 8398148 8517358 10466708 11035841 6943415
7354F943415o234451l516822n715J172254J693406K878192K622378j8132k194941
$$ 6943415 708964 -2807858 -2813573 -1641319 52087 2930279 5552657 5534525 3339584
7345C339584j938227j161146j396122p28873J950853L453146P92997l500987m333780
$$ 3339584 1401357 240211 -1155911 -1884784 66069 3519215 4312212 811225 -3522555
7336c522555p52063L363421M326611K007054j109205k508439j808500j042977
$$ -3522555 -4274618 -911197 3415414 5422468 4313263 1804824 -3676 -1046653
7328a046653j921997l090170k177272j38832j79271k119829k048737J161264L508374
$$ -1046653 -2968650 -6058820 -8236092 -8374924 -8554195 -10674024 -12722761 -11561497 -8053123
7319h053123K311115N07737J229689K297508M71538k273618j833456J046774K176604
$$ -8053123 -5742008 -5234271 -4004582 -1707074 -1235536 -3509154 -5342610 -4295836 -2119232
7310b119232Q53671J45511R31745P94734j024628k217594j518873j59411J250889
$$ -2119232 -1265561 -1120050 -188305 606429 -418199 -2635793 -4154666 -4314077 -3063188
7301c063188L238670M358501J969266k716602m667507j925839J433640J345168
$$ -3063188 175482 4533983 6503249 3786647 -880860 -2806699 -1373059 -27891
7293b7891r74129k330958k559083k924341k487723M3846K773988K832549R93486
$$ -27891 -1002020 -3332978 -5892061 -8816402 -11304125 -11260279 -8486291 -5653742 -4660256
7284d660256M03602J409290J363854m93674j640468m69779J328180J849461J739626
$$ -4660256 -4256654 -2847364 -1483510 -1977184 -3617652 -4087431 -2759251 -909790 829836
7275H29836K217489K495862J163538j266533l067431l603193l260519j951244
$$ 829836 3047325 5543187 6706725 5440192 2372761 -1230432 -4490951 -6442195
7267f442195M43716K610344K739218R94640o30936j140043j520590k440704k756088
$$ -6442195 -5998479 -3388135 -648917 345723 -285213 -1425256 -2945846 -5386550 -8142638
7258h142638j434707M60546J208872R14964R74563J644072J794111R02598k07248
$$ -8142638 -9577345 -9116799 -7907927 -6992963 -6018400 -4374328 -2580217 -1677619 -1884867
7249a884867o33590j31312J252196K833112K839635K51584k789954k692273P40509
$$ -1884867 -2518457 -2649769 -1397573 1435539 4275174 4526758 1736804 -955469 -214960
7240b14960L468098K508387j43999p95011O80135J408960J66311j370814j664096
$$ -214960 3253138 5761525 5617526 4822515 5502650 6911610 7077921 5707107 4043011
7231D043011j051161k64909O40907J469797J676922J308865P39252m82366k841321
$$ 4043011 2991850 2726941 3367848 4837645 6514567 7823432 8562684 8080318 5238997
7222E238997m999993m794674k431868o43766j005119k005769j608855J14171J927503
$$ 5238997 239004 -4555670 -6987538 -7631304 -8636423 -10642192 -12251047 -12136876 -10209373
7213a0209373L292035M033820L577680J829476k02016j623708k445312k540206
$$ -10209373 -6917338 -2883518 694162 2523638 2321622 697914 -1747398 -4287604
7205d287604j363594M89045J263205O86721O54912J909919K333125N68135j027422
$$ -4287604 -5651198 -5162153 -3898948 -3212227 -2557315 -647396 1685729 2253864 1226442
7196A226442M8438J894285Q83069k326218l554091j573682L78686J20257n43422
$$ 1226442 1274880 3169165 4052234 1726016 -1828075 -3401757 -3023071 -2902814 -3446236
7187c446236J98853R76610J81300r51223o96704J18723j7064l82970M27472J649775
$$ -3446236 -3247383 -2270773 -2089473 -3040696 -3737400 -3618677 -3635741 -4018711 -3591239 -1941464
7177a941464J629686O50605L605n01503j513889j863965k38028J761696J362731
$$ -1941464 -311778 338827 342432 -159071 -1672960 -3536925 -3774953 -2013257 -650526
7168f50526j033906k369797j554962l51971L76475J797450L881269M509663K957926
$$ -650526 -1684432 -4054229 -5609191 -5961162 -5584687 -3787237 94032 4603695 7561621
7159G561621J128147Q5009j351923l040340k246141J525524L903513J413617k797907
$$ 7561621 8689768 8774777 7422854 4382514 2136373 3661897 7565410 8979027 6181120
7150F181120l136422L41646K511435J068976q23630k31427J431395J469720j30939
$$ 6181120 3044698 3386344 5897779 6966755 6143125 5911698 7343093 8812813 8681874
7141H681874j693264k502847k646445j839079j03435J402095J518296M11057r07046
$$ 8681874 6988610 4485763 1839318 239 -103196 1298899 2817195 3228252 2321206
7132B321206j636801j418920m31945M61926O00483N65009J212589J878025J129326
$$ 2321206 684405 -734515 -1166460 -704534 -104051 460958 1673547 3551572 4680898
7123D680898p44954j887351j712405j587974k239381k565728j766904o13012K85515
$$ 4680898 3935944 2048593 336188 -1251786 -3491167 -6056895 -7823799 -8436811 -8151296
7114h151296J439380K682927K505037N24643j250670j085956K65992J312335J870233
$$ -8151296 -6711916 -4028989 -1523952 -999309 -2249979 -3335935 -3069943 -1757608 112625
7105A12625J928113O20773j755057k823547j558559o49378k639513n381816m686393
$$ 112625 2040738 2661511 906454 -1917093 -3475652 -4125030 -6764543 -12146359 -16832752
7096a6832752n40371K804357K760587J151176O18167J176439J329736N43560m34911
$$ -16832752 -17373123 -14568766 -11808179 -10657003 -10038836 -8862397 -7532661 -6989101 -7424012
7087g424012n35163P39840K468190K746337J148077j46074O31302J868899J099521
$$ -7424012 -7959175 -7219335 -4751145 -2004808 -856731 -1002805 -371503 1497396 2596917
7078B596917n76987L9396K636814L070977m37046m215194l979886k12336L097835
$$ 2596917 2019930 2059326 4696140 7767117 7330071 3114877 -865009 -1077345 2020490
7069B020490L175032M17822k671418l214650k34512L620479M198284P06388l182816
$$ 2020490 5195522 5613344 2941926 -272724 -507236 3113243 7311527 8017915 4835099
7060D835099l911738j746269R73455K811600K984815P08409k919231m388909j738198
$$ 4835099 923361 -822908 150547 2962147 5946962 6655371 3736140 -652769 -2390967
7051b390967K301159L502985J373606j108944j897647j506539r43761n65211q09220
$$ -2390967 -89808 3413177 4786783 3677839 1780192 273653 -670108 -1235319 -2044539
7042b044539j870046k581377j438032J170051L162000L110941J245231j369413
$$ -2044539 -3914585 -6495962 -7933994 -6763943 -3601943 -491002 754229 -615184
7034f15184l354843l434504j830290n72931r34540j464227l05226J645200K137288
$$ -615184 -3970027 -7404531 -9234821 -9807752 -10742292 -12206519 -12511745 -10866545 -8729257
7025h729257J194143P19301J129506J257726J241399K281059L401178J921925
$$ -8729257 -7535114 -6815813 -5686307 -4428581 -3187182 -906123 2495055 4416980
7017D416980j988886m544160l511292j152854k94058l70042L24335J032484J38292
$$ 4416980 2428094 -2116066 -5627358 -6780212 -7074270 -7444312 -7119977 -6087493 -5949201
7008e949201j345812r66171J335511L228790L364045K433645J236500j23822j243715
$$ -5949201 -7295013 -8261184 -6925673 -3696883 -332838 2100807 3337307 3213485 1969770
6999A969770j561826j431480j407534q35728R73974K591192J802497q86775k512812
$$ 1969770 407944 -1023536 -2431070 -3266798 -2292824 298368 2100865 1214090 -1298722
6990a298722j822299p18290p06981m37601J576247L819395L574812P86576j898805
$$ -1298722 -3121021 -3839311 -4546292 -4983893 -3407646 411749 3986561 4773137 2874332
6981B874332k452586j211615L31408J057188P23732N3584R2882P25390N67728
$$ 2874332 421746 -789869 -458461 598727 1322459 1376043 1468925 2194315 2762043
6972B762043p06771j186050M15483J909741K92796l258215m258707j320621J597037
$$ 2762043 2055272 869222 1284705 3194446 3487242 229027 -4029680 -5350301 -3753264
6963c753264R42036j358299j162795J689332L700009L168064J904156J470746
$$ -3753264 -2811228 -4169527 -5332322 -3642990 57019 3225083 5129239 6599985
6955F599985R03740p64638k178883j539090N93745J953636J391045j18589r98694
$$ 6599985 7503725 6739087 4560204 3021114 3614859 5568495 6959540 6840951 5842257
6946E842257q05096m21228p66527j383706q14547J128484K289447O56250k596431
$$ 5842257 5037161 4615933 3849406 2465700 1651153 2779637 5069084 5725334 3128903
6937C128903m258059l120985r39268P20870K173674L386425K686041m46561l279935
$$ 3128903 -1129156 -4250141 -5189409 -4468539 -2294865 1091560 3777601 3331040 51105
6928E1105k940849m60003O84857o05151k085542j823206m25580P72597J641961
$$ 51105 -2889744 -3349747 -2664890 -3270041 -5355583 -7178789 -7604369 -6831772 -5189811
6919e189811K470649K793787K125899R34596n2828q81664j901716k719417k459086
$$ -5189811 -2719162 74625 2200524 3135120 3082292 2200628 298912 -2420505 -4879591
6910d879591j040102M23977Q32864N21021R79495K832407M548793M067695J623015
$$ -4879591 -5919693 -5495716 -4662852 -4141831 -3162336 -329929 4218864 8286559 9909574
6901I909574l05549l19937m1218j654988m584946o099039m702214j500445J510237
$$ 9909574 9604025 9284088 9242870 7587882 3002936 -3096103 -7798317 -9298762 -7788525
6892g788525L098556K882650J284846k69745k83402J200438K610761K616520J174757
$$ -7788525 -4689969 -1807319 -522473 -792218 -1075620 124818 2735579 5352099 6526856
6883F526856j088817l494238n102808m923861k883644p5620K255536L600068M031798
$$ 6526856 5438039 1943801 -3159007 -8082868 -10966512 -11042132 -8786596 -5186528 -1154730
6874a154730L726619K789840J245355p46337k405740k478440n03531K217362L472482
$$ -1154730 2571889 5361729 6607084 5860747 3455007 976567 473036 2690398 6162880
6865F162880J988684j591390n056022n915459l402995L55174K260325J827926
$$ 6162880 8151564 6560174 1504152 -4411307 -7814302 -7459128 -5198803 -3370877
6857c370877J459674K551016L410240K407765Q49435M01768j84090k613961n014293
$$ -3370877 -1911203 639813 4050053 6457818 7307253 7709021 7524931 4910970 -103323
6848a03323m235167j240080P2789q09842m62674K148797L583117J783595n18702
$$ -103323 -4338490 -5578570 -5505781 -6315623 -6778297 -4629500 -1046383 737212 218510
6839B18510p15081m76952j827322k749637o82417K437206K973914J458175J187089
$$ 218510 -496571 -973523 -2800845 -5550482 -6232899 -3795693 -821779 636396 1823485
6830A823485K256479J650262j066201k669842j470548L96513R45034J036345J526950
$$ 1823485 4079964 5730226 4664025 1994183 523635 920148 1865182 2901527 4428477
6821D428477Q93328j962231m719882m071076j78440L399171L913037J962644j70712
$$ 4428477 5321805 3359574 -1360308 -5431384 -5609824 -2210653 1702384 3665028 3494316
6812C494316j368992k157241k905843k684075o75753J784372K112608j44914k368642
$$ 3494316 2125324 -31917 -2937760 -5621835 -6297588 -4513216 -2400608 -2545522 -4914164
6803d914164k338884j177180j223255k273635k161917l96353J245509J740023
$$ -4914164 -7253048 -8430228 -9653483 -11927118 -14089035 -14485388 -13239879 -11499856
6795a1499856K114866L203140M020571L228094R45798j505888k772729k236188
$$ -11499856 -9384990 -6181850 -2161279 1066815 2012613 506725 -2266004 -4502192
6787d502192o11096L29733k63026r62267n5887J677594K055896Q95325J0371j901
$$ -4502192 -5113288 -4783555 -5046581 -6008848 -6064735 -4387141 -2331245 -1435920 -1425549 -1427450
6777a427450k75989p55893J76269K234305K522752m327k216631j251839J093769
$$ -1427450 -1703439 -2459332 -2283063 -48758 2473994 2469667 253036 -998803 94966
6768I4966J205023r20158k198596j353976r8408K33881K49316M65331L75904J58460
$$ 94966 1299989 379831 -1818765 -3172741 -3271149 -3037268 -2787952 -2322621 -1946717 -1788257
6758a788257R65262K575138K815619O42911j799950j768081M52399K045125J257102
$$ -1788257 -822995 1752143 4567762 5210673 3410723 1642642 2095041 4140166 5397268
6749E397268r44666k605401k776571j580932L99528K064429K083243L71664j190082
$$ 5397268 4452602 1847201 -929370 -2510302 -2110774 -46345 2036898 2408562 1218480
6740A218480q20754M66441j75564l227955n310361l375159R07958L137193J951949
$$ 1218480 397726 864167 688603 -2539352 -7849713 -11224872 -10316914 -7179721 -5227772
6731e227772K71828N65656J630782J391691N76221J309244L229429L489506O79551
$$ -5227772 -4955944 -4390288 -2759506 -1367815 -791594 517650 3747079 7236585 7916136
6722G916136l008407m126072j683231J836737K910178N03655k735951l275578
$$ 7916136 4907729 781657 -901574 935163 3845341 4348996 1613045 -1662533
6714a662533p07819J928427K024230K67136j038914j062866n85203j68427K74575
$$ -1662533 -2370352 -441925 1582305 1849441 810527 -252339 -837542 -1005969 -731394
6705g31394P27609J189630J938181K563547J685728r42641l075787k573655n64439
$$ -731394 -3785 1185845 3124026 5687573 7373301 6430660 3354873 781218 216779
6696B16779J02260r99244j645340o80874N88405J025093J218838J701613J805424
$$ 216779 319039 -680205 -2325545 -3006419 -2418014 -1392921 -174083 1527530 3332954
6687C332954J197067N97420J42097r48899k208076j766772L59218J307421m33631
$$ 3332954 4530021 5127441 5269538 4320639 2112563 345791 705009 2012430 1578799
6678A578799k252840j363850O10857L21678j498004r34825K589904M797319K675701
$$ 1578799 -674041 -2037891 -1427034 -1105356 -2603360 -3538185 -948281 3849038 6524739
6669F524739j287757k930723j854666o42858m52035j13280J092503K198526K147904
$$ 6524739 5236982 2306259 451593 -191265 -643300 -756580 335923 2534449 4682353
6660D682353R05598j097030l131024l721411j703200J695940L260909J296955
$$ 4682353 5587951 4490921 1359897 -2361514 -4064714 -2368774 892135 2189090
6652B189090k161030l705278k541054r50316r63779j834103j332231J230898M103439
$$ 2189090 28060 -3677218 -6218272 -7168588 -8132367 -9966470 -11298701 -10067803 -5964364
6643e964364N067849L676288J311116n64788j675760k356371k289391o92670K009206
$$ -5964364 -896515 2779773 4090889 3526101 1850341 -506030 -2795421 -3488091 -1478885
6634a478885L596377K189159j219424l508403k973236j023142K12210O84639J573466
$$ -1478885 2117492 4306651 3087227 -421176 -3394412 -4417554 -4205344 -3520705 -1947239
6625a947239K635758K358669N76138j058196j608501j968670k637509k306053
$$ -1947239 688519 3047188 3623326 2565130 956629 -1012041 -3649550 -5955603
6617e955603j15191K264338K708163J668131J054132R87855J45387j111659q08527
$$ -5955603 -6070794 -3806456 -1098293 569838 1623970 2611825 2757212 1645553 837026
6608H37026J129925K289887J613888J032816J708473J429354j692190n100091
$$ 837026 1966951 4256838 5870726 6903542 8612015 10041369 8349179 3249088
6600C249088m751883j159832J065499k81069k286866j608695R87164K405642J525019
$$ 3249088 -1502795 -2662627 -1597128 -1878197 -4165063 -5773758 -4786594 -2380952 -855933
6591h55933j60090j031487q18046j34630K93594K81539N52816J719023K656916
$$ -855933 -1016023 -2047510 -2865556 -3000186 -2706592 -2425053 -1872237 -153214 2503702
6582B503702J381333j718525l304351j298818J827503K098674n98936k636941
$$ 2503702 3885035 2166510 -1137841 -2436659 -609156 1489518 890582 -1746359
6574a746359j808649K08114R89987N77827L72505O32997O55124L59114J39980
$$ -1746359 -3555008 -3346894 -2356907 -1779080 -1406575 -773578 -118454 240660 380640
6565C80640k65903j296793k187038j504301O86997K375167J941981J62531r56689
$$ 380640 114737 -1182056 -3369094 -4873395 -4186398 -1811231 130750 293281 -663408
6556f63408q43782p36558j335825j391885L86461K792235L025377K83789k866070
$$ -663408 -1507190 -2243748 -3579573 -4971458 -4584997 -1792762 1232615 1516404 -1349666
6547a349666l373887j092836J431341J901391K71042j699259k186982q81683P93247
$$ -1349666 -4723553 -5816389 -4385048 -2483657 -2212615 -3911874 -6098856 -6980539 -6187292
6538f187292J370984J224250J799951K916238K506224j19995k545609k324935
$$ -6187292 -4816308 -3592058 -1792107 1124131 3630355 3510360 964751 -1360184
6530a360184l17672R56227J019709J171881J448724N90374j180053j975551j105005
$$ -1360184 -1677856 -721629 298080 1469961 2918685 3509059 2329006 353455 -751550
6521g51550R1916M70200P2995j042551k619119k946652o14966K348807K328213
$$ -751550 -659634 -189434 -116439 -1158990 -3778109 -6724761 -7339727 -4990920 -2662707
6512b662707l78464j535835M60434K022186M16181j671697p77026J611743J895838
$$ -2662707 -3041171 -4577006 -4116572 -2094386 -1678205 -3349902 -4126928 -2515185 -619347
6503f19347K61293n88024o02391j659018k899252j619316J499939K671376Q67986
$$ -619347 -358054 -946078 -1548469 -3207487 -6106739 -7726055 -6226116 -3554740 -2686754
6494b686754q46334n86912j35439q91607j197402L51609K039057J631903m42500
$$ -2686754 -3533088 -4120000 -4255439 -5147046 -6344448 -5992839 -3953782 -2321879 -2764379
6485b764379k302331k969754k078858O32317L957137N256543L400797J41370k377431
$$ -2764379 -5066710 -8036464 -10115322 -9483005 -5525868 -269325 3131472 3272842 895411
6476H95411l548976l097200o95550J958873J705037j526381l581157j790952J055992
$$ 895411 -2653565 -5750765 -6446315 -4487442 -2782405 -4308786 -7889943 -9680895 -8624903
6467h624903J237308k92958m38717L55841n38397k339729j533543J975593L969758
$$ -8624903 -7387595 -7680553 -8119270 -7763429 -8301826 -10641555 -12175098 -10199505 -6229747
6458f229747K054710j127074k124369r46430M01332J034487J210075J149189J161333
$$ -6229747 -4175037 -5302111 -7426480 -8372910 -7971578 -6937091 -5727016 -4577827 -3416494
6449c416494J467939J219992o18000l037842l778409k740441j999742j736942
$$ -3416494 -1948555 -728563 -1346563 -4384405 -8162814 -10903255 -12902997 -14639939
6441a4639939O22899N548973Q850694O733721J186652k602558k576048o62526
$$ -14639939 -14017040 -8468067 382627 7116348 8303000 5700442 3124394 2461868
6433B461868J208448K561087K633212P73202j308488r29917J344021J885720o46361
$$ 2461868 3670316 6231403 8864615 9637817 8329329 7399412 8743433 10629153 9982792
6424I982792l094346k516847m58645k10396j797295k521695j474402n97561j292292
$$ 9982792 6888446 4371599 3912954 3702558 1905263 -616432 -2090834 -2688395 -3980687
6415c980687k468679k558757j536038j51392J242110K213127K055826J157976
$$ -3980687 -6449366 -9008123 -10544161 -10695553 -9453443 -7240316 -5184490 -4026514
6407d026514J207089K619331L039535M57321k954713k781364J563327N335679
$$ -4026514 -2819425 -200094 2839441 3296762 342049 -2439315 -875988 4459691
6399D459691M323267O0225k743141k334107r22165m31565k88306K17701J67312
$$ 4459691 8782958 8843183 6100042 3765935 2843770 2412205 2123899 2341600 2508912
6390B508912j019989j854899q16153J053564J370350l24303k052791j996554m29795
$$ 2508912 1488923 -365976 -1182129 -128565 1241785 917482 -1135309 -3131863 -3561658
6381c561658R20146O25966j211541k889897k607121n95726Q84958M16410o44267
$$ -3561658 -2641512 -2015546 -3227087 -6116984 -8724105 -9319831 -8434873 -8018463 -8662730
6372h662730k91914J021124J238566J17765m78221J47457L40380q93698j789714
$$ -8662730 -8954644 -7933520 -6694954 -6577189 -7055410 -6907953 -6567573 -7461271 -9250985
6363i250985l26481K589104M222864L510549J806891N65060j62268q78980j540431
$$ -9250985 -9577466 -6988362 -2765498 745051 2551942 3117002 2954734 2075754 535323
6354E35323j640761q43590N20984J373582Q20641m40762n24117J104736K505678
$$ 535323 -1105438 -1949028 -1428044 -54462 766179 325417 -198700 906036 3411714
6345C411714J807218j84806j476999j940475k643671k811296m60682L485977M801570
$$ 3411714 5218932 5034126 3557127 1616652 -1027019 -3838315 -4298997 -813020 3988550
6336C988550J325002l544455m841700j975213J513408K937005K668720J832800
$$ 3988550 5313552 1769097 -3072603 -5047816 -3534408 -597403 2071317 3904117
6328C904117M74998j319028k397460j752540J13339J716792K016549J118897N2967
$$ 3904117 4379115 3060087 662627 -1089913 -976574 740218 2756767 3875664 3928631
6319C928631k31558j19433j052133l143191l963317j485705K216078K686251r62223
$$ 3928631 3697073 3577640 2525507 -617684 -4581001 -6066706 -3850628 -1164377 -2126600
6310b126600m276236l064760J268322M020655L313741J408874O84795J082315
$$ -2126600 -6402836 -9467596 -8199274 -4178619 -864878 543996 1228791 2311106
6302B311106J700796K331951K508732J200626j204164k392328j264344j10927
$$ 2311106 4011902 6343853 8852585 10053211 8849047 6456719 5192375 5081448
6294E081448j560676m368271m789642j883237J284162K222366K057820K627600
$$ 5081448 3520772 -847499 -5637141 -7520378 -6236216 -4013850 -1956030 671570
6286F71570L092791J831882j00163m16813M01823j78767k124758k361182K06929
$$ 671570 3764361 5596243 5496080 5079267 5481090 5302323 3177565 816383 1023312
6277A023312K505521J918972K22198L35669J477753Q11288j524276k642594j691881
$$ 1023312 3528833 5447805 5670003 6005672 7483425 8294713 6770437 4127843 2435962
6268B435962q52773j277445j412336l00743N89631L62132O72304K605632L976788
$$ 2435962 1583189 305744 -1106592 -1407335 -817704 -455572 216732 2822364 6799152
6259F799152K430763m77896j348418j20650N6874j904293l158582j433065J212382
$$ 6799152 9229915 8752019 7403601 7282951 7339825 5435532 2276950 843885 2056267
6250B056267J124783j907290m493640m056726j557751M21129Q77998Q70432J520585
$$ 2056267 3181050 1273760 -3219880 -7276606 -8834357 -8413228 -7535230 -6664798 -5144213
6241e144213K480567K461184R28745q93434r38848J333352L572154K589573j561536
$$ -5144213 -2663646 -202462 726283 -167151 -1105999 227353 3799507 6389080 4827544
6232D827544m692671l198205J013049K524331n59260m196297m088943j153157
$$ 4827544 134873 -3063332 -2050283 474048 -85212 -4281509 -8370452 -9523609
6224i523609P76994N02091k11566l84420n32013l01372J141346K495367J600416
$$ -9523609 -8746615 -8244524 -8456090 -8840510 -9372523 -9673895 -8532549 -6037182 -4436766
6215d436766m53276k60267K112383K411708j013019l807340j823600K701994M665743
$$ -4436766 -4890042 -5150309 -3037926 -626218 -1639237 -5446577 -7270177 -4568183 97560
6206I7560L109823R44864k24313q76979o01292J294716K703649M61295m503045
$$ 97560 3207383 4152247 3927934 3050955 2449663 3744379 6448028 6909323 2406278
6197B406278p415276n782407k160040k5079J98053l1281J16824Q07128J992725
$$ 2406278 -5008998 -10791405 -12951445 -12976524 -12778471 -12809752 -12692928 -11885800 -9893075
6188i893075K741581J745739o08709k144286j526223L24948J783828K099111J318910
$$ -9893075 -7151494 -5405755 -6014464 -8158750 -9684973 -9360025 -7576197 -5477086 -4158176
6179d158176J34980k25985N71173J076540K83328j93641J394360L305894K474054
$$ -4158176 -4023196 -4249181 -3678008 -2601468 -2318140 -2511781 -1117421 2188473 4662527
6170D662527m00861j853282j447873j972182l535232k821400L49884J435807j107109
$$ 4662527 4261666 2408384 960511 -1011671 -4546903 -7368303 -7018419 -5582612 -6689721
6161f689721k154269J840139N988429L968435j870158l787356J14969M303375
$$ -6689721 -8843990 -7003851 -1015422 2953013 1082855 -2704501 -2589532 1713843
6153A713843M527895K105302m59219k464680k874248k87783L584632M684757K163921
$$ 1713843 6241738 8347040 7887821 5423141 2548893 2261110 5845742 10530499 12694420
6144A2694420o05633j497936j961521k736486j889890P25453J465878j570714
$$ 12694420 12088787 10590851 8629330 5892844 4002954 4728407 6194285 4623571
6136D623571m685038l830712q05170k58602k580912l864620j938670J301248L292958
$$ 4623571 -61467 -3892179 -4697349 -4955951 -7536863 -11401483 -13340153 -12038905 -8745947
6127h745947L351839J759447q88898k954228k582946O1682K823805M050916L848934
$$ -8745947 -5394108 -3634661 -4523559 -7477787 -10060733 -9999051 -7175246 -3124330 724604
6118G24604K983221J946638J098876M49375n94742k074096k497884o41111J924602
$$ 724604 3707825 5654463 6753339 7202714 6607972 4533876 2035992 1394881 3319483
6109C319483K074444p51801l498388l291717p46047J472081K020189J510675P09797
$$ 3319483 5393927 4642126 1143738 -2147979 -2894026 -1421945 598244 2108919 2818716
6100B818716k65774j108619j100162j88569O21646O05978M33194J032536J631100
$$ 2818716 2552942 1444323 344161 155592 777238 1383216 1816410 2848946 4480046
6091D480046K80404l068964n305185l507587R73597L683976K501615n1868p30405
$$ 4480046 4760450 1691486 -3613699 -7121286 -6147689 -2463713 37902 -13966 -744371
6082g44371K27623M66448n27573j227694j059883r76144r86111L37855L077850
$$ -744371 -516748 -50300 -577873 -1805567 -2865450 -3841594 -4827705 -4489850 -1412000
6073a412000M860020L875757J417004j05816m11178q94624j842951k125538j450088
$$ -1412000 3448020 7323777 8740781 8634965 8223787 7329163 5486212 3360674 1910586
6064A910586r92729j396704j726451j139918l70073n67658j471586j770447q94324
$$ 1910586 917857 -478847 -2205298 -3345216 -3715289 -4282947 -5754533 -7524980 -8419304
6055h419304M67568J490383K063980K444696K627295K274165J072120q06490k467674
$$ -8419304 -7951736 -6461353 -4397373 -1952677 674618 2948783 4020903 3214413 746739
6046G46739k828174j763065m80805k87818j112052j660457q90679J023181K892065
$$ 746739 -2081435 -3844500 -4325305 -4613123 -5725175 -7385632 -8276311 -7253130 -4361065
6037d361065L271279J528632j144273k295465p74854J604494K040463O8822k262018
$$ -4361065 -1089786 438846 -705427 -3000892 -3775746 -2171252 -130789 -61967 -2323985
6028b323985l096648k089895M78081L615966M731274J785182k842511l824165
$$ -2323985 -5420633 -7510528 -7032447 -3416481 1314793 3099975 257464 -3566701
6020c566701N428L123863O58232m518778n777967j847519K484854L788989L304328
$$ -3566701 -3561273 -437410 220822 -4297956 -10075923 -11923442 -9438588 -5649599 -2345271
6011b345271K731396J564422j07263m85133L21114n45140l569214m648396j094228
$$ -2345271 386125 1950547 1843284 1358151 1679265 1134125 -2435089 -7083485 -8177713
6002h177713L400408L638493L78267j319089K43068J783836P67017j334994k130551
$$ -8177713 -4777305 -1138812 -760545 -2079634 -1836566 -52730 714287 -620707 -2751258
5993b751258j423080k33489Q70340J529317J499297J405757K058268K831870K337884
$$ -2751258 -4174338 -4407827 -3537487 -2008170 -508873 896884 2955152 5787022 8124906
5984H124906O30501j058646k518232m263152n236015l558475L4337K330581K080111
$$ 8124906 8755407 7696761 5178529 915377 -4320638 -7879113 -7844776 -5514195 -3434084
5975c434084J582225K641422L657617K526912Q1977j513477j932038k019315j554113
$$ -3434084 -1851859 789563 4447180 6974092 7056069 5542592 3610554 1591239 37126
5966C7126p1335J263072J039393N1528j1749L11369r83103l590270m484515k004680
$$ 37126 -34209 1228863 2268256 2319784 2308035 2619404 1636301 -1953969 -6438484 -8443164
5956h443164J587640K709250N34887k346202k803665l14486K482395K540261j6763
$$ -8443164 -6855524 -4146274 -3611387 -5957589 -8761254 -9075740 -6593345 -4053084 -4069847
5947d069847j853320o50417J816384K261392M23802j152189j207955r30564r23433
$$ -4069847 -5923167 -6573584 -4757200 -2495808 -2072006 -3224195 -4432150 -5362714 -6286147
5938f286147O2851K323352L709943K676217Q00583K41426K81582j169809l644026
$$ -6286147 -6223296 -3899944 -190001 2486216 3286799 3528225 3809807 2639998 -1004028
5929a004028m404095k552276l38607J99556j93704K02559J390581K174215K284780
$$ -1004028 -5408123 -7960399 -8299006 -8099450 -8293154 -8090595 -6700014 -4525799 -2241019
5920b241019K400624K519719J875032N75252l2385P56686J735626J316859k07756
$$ -2241019 159605 2679324 4554356 5129608 5097223 5853909 7589535 8906394 8698638
5911H698638j028427l60631N08054J22077j189423k087501k219577k305321k593737
$$ 8698638 7670211 7309580 7817634 7939711 6750288 4662787 2443210 137889 -2455848
5902b455848k532332j982133j425900o79340J138181L601144M411758K214876
$$ -2455848 -4988180 -6970313 -8396213 -9075553 -7937372 -4336228 75530 2290406
5894B290406j058889k380137j560566j059806j964946k373463n46540K255678
$$ 2290406 1231517 -1148620 -2709186 -3768992 -5733938 -8107401 -8653941 -6398263
5886f398263L542303K888243J729448O46165j128720l475277m584312l225600
$$ -6398263 -2855960 32283 1761731 2407896 1279176 -2196101 -6780413 -10006013
5878a0006013n82527J174517J345045P31599j08081j255605k145915j348847J573505
$$ -10006013 -10588540 -9414023 -8068978 -7337379 -7445460 -8701065 -10846980 -12195827 -10622322
5869a0622322M758441N543817L160437o06304l258394l556767j900560L92195
$$ -10622322 -5863881 -320064 2840373 2234069 -1024325 -4581092 -6481652 -6089457
5861f089457J919687J937832P71241o25796j568093j815081j026681J098546L788237
$$ -6089457 -4169770 -2231938 -1460697 -2086493 -3654586 -5469667 -6496348 -5397802 -1609565
5852a609565N125340L834539Q06943j822853k848423k625849j922171j083571
$$ -1609565 3515775 7350314 8157257 6334404 3485981 860132 -1062039 -2145610
5844b145610l75869k64372r02720j688388j673133n30909P45757L91599k050357
$$ -2145610 -2521479 -2785851 -3688571 -5376959 -7050092 -7581001 -6835244 -6443645 -8494002
5835h494002m162606k650955K235827N905948M785849J123676o1351K073108L569349
$$ -8494002 -12656608 -15307563 -13071736 -7165788 -2379939 -1256263 -1317614 755494 4324843
5826D324843J992801l62973q36332l83652q69176j365718k75339J067949M43229
$$ 4324843 6317644 5954671 5118339 4734687 3865511 2499793 2224454 3292403 3735632
5817C735632j073990o97719J113168J180261r87257k212725q08471R09271O60513
$$ 3735632 2661642 1963923 3077091 4257352 3270095 1057370 248899 1158170 1818683
5808A818683l95725j82022R29420J396016J224609J307744J445297R23126K9280
$$ 1818683 1422958 1240936 2170356 3566372 4790981 6098725 7544022 8467148 8496428
5799H496428n41204q56978j144336j106619q55790j185149j940379j760291n28297
$$ 8496428 7955224 7098246 5953910 4847291 3991501 2806352 865973 -894318 -1422615
5790a422615q8769j092489j407944L18247J869244R37241p26020m9542K024410
$$ -1422615 -1511384 -2603873 -4011817 -3693570 -1824326 -887085 -1613105 -1662647 361763
5781C61763J862375r53832l052077k560398j095406l6053J318100K827271K477063
$$ 361763 2224138 1270306 -1781771 -4342169 -5437575 -5473628 -4155528 -1328257 1148806
5772A148806L7024j380211M41300L458595M295433K459176k54175k556460l875210
$$ 1148806 1185830 -194381 246919 3705514 8000947 10460123 10205948 7649488 3774278
5763C774278l591985k140998j331252j750486j580658R9821R59099r89812l324583
$$ 3774278 182293 -1958705 -3289957 -5040443 -6621101 -6521280 -5562181 -6551993 -9876576
5754i876576k161427J891200M359743L246922J174523O78723P68179l61315j835509
$$ -9876576 -12038003 -10146803 -5787060 -2540138 -1365615 -686892 81287 -280028 -2115537
5745b115537j427232J028154L353421L596942J783155m55842j280644r5622J884285
$$ -2115537 -3542769 -2514615 838806 4435748 6218903 5763061 4482417 4386795 6271080
5736F271080K785880J924398J49087j430469k340475k536533k202700j803574
$$ 6271080 9056960 10981358 11130445 9699976 7359501 4822968 2620268 816694
5728H16694j655685j549124j337430j387127j680446j298771M3625R53592M92898
$$ 816694 -838991 -2388115 -3725545 -5112672 -6793118 -8091889 -8048264 -7094672 -6601774
5719f601774K54105J921385L634577K029128k163431m237729k151463O60733Q84916
$$ -6601774 -6347669 -4426284 -791707 1237421 -926010 -5163739 -7315202 -6654469 -5769553
5710e769553Q5296J016085K375531J221897j408354j770093M53060J637474J00438
$$ -5769553 -5684257 -4668172 -2292641 -1070744 -2479098 -4249191 -3796131 -2158657 -2058219
5701b058219j542953j003349K51248L3662q68869l29019J600186K995578K825837
$$ -2058219 -3601172 -4604521 -4353273 -4319611 -5188480 -5517499 -3917313 -921735 1904102
5692A904102J620489J52090j047724j434065r62245m29379m25208n23155k31402
$$ 1904102 3524591 3676681 2628957 1194892 232647 -196732 -621940 -1145095 -1376497
5683a376497R1140R5250K76795R69148J428608J022474M23686M15010M01966n13679
$$ -1376497 -1285357 -1190107 -913312 55836 1484444 2506918 2930604 3345614 3747580 3233901
5673C233901j804681k340300k127490j610831j47101K707893N040430M263823
$$ 3233901 1429220 -911080 -3038570 -4649401 -4796502 -2088609 2951821 7215644
5665G215644R17584j743589k169361j830271j657920m29974J839628K226518o70555
$$ 7215644 8133228 6389639 4220278 2390007 732087 302113 2141741 4368259 3697704
5656C697704l240700j382726L085236M527712J422274j957806k213022r95525
$$ 3697704 457004 -925722 2159514 6687226 8109500 6151694 3938672 2943147
5648B943147r20720j153338L9553J198150j35648k668295k697232J70690K325168
$$ 2943147 2022427 869089 908642 2106792 1971144 -697151 -3394383 -3223693 -898525
5639h98525J614255J0027l67148n27252j731773k211189l025K702890J852324
$$ -898525 715730 725757 358609 -168643 -1900416 -4111605 -4114630 -1411740 440584
5630D40584k295602m982070l497909m89261O70211O40030J809030L602800L343763
$$ 440584 -1855018 -6837088 -10334997 -10824258 -10154047 -9514017 -7704987 -4102187 -758424
5621g58424Q16377j124802n22891J557688L118567L261115J743123j336594m565996
$$ -758424 57953 -1066849 -1589740 -32052 3086515 6347630 8090753 6754159 2188163
5612B188163n700268m114530j474527O61013K351279L713234L781380K221625
$$ 2188163 -3512105 -7626635 -9101162 -8440149 -6088870 -2375636 1405744 3627369
5604C627369M88065l29356j310834l488370n168632l869118k71385K176422J582381
$$ 3627369 4115434 3786078 2475244 -1013126 -6181758 -10050876 -10322261 -8145839 -6563458
5595f563458m69357j415233l26656K064344M139744L989335J065387k354517l102025
$$ -6563458 -7032815 -8448048 -8774704 -6710360 -2570616 1418719 2484106 129589 -2972436
5586b972436r77233J092062J244903R49458K029193L484509L057613O32573j767109
$$ -2972436 -3949669 -2857607 -1612704 -663246 1365947 4850456 7908069 8540642 6773533
5577F773533k611326j951202n12002Q55920J315980R40668R76730J988152K410974
$$ 6773533 4162207 2211005 1699003 2554923 3870903 4811571 5788301 7776453 10187427
5568A0187427N29023k589201l971423k556557l78863L58548k68185r88744j347951
$$ 10187427 10716450 8127249 4155826 1599269 1220406 1578954 1310769 322025 -1025926
5559a025926j621487j795617j727474j664510j662950j031840O81869K539356
$$ -1025926 -2647413 -4443030 -6170504 -7835014 -9497964 -10529804 -9847935 -7308579
5551g308579L077633K240416J464077J661955K013026J262176m10830j599120
$$ -7308579 -4230946 -1990530 -526453 1135502 3148528 4410704 3999874 2400754
5543B400754j553584j046017j073659j337194p26103Q01642J646476M14201j992872
$$ 2400754 847170 -198847 -1272506 -2609700 -3335803 -2534161 -887685 -473484 -2466356
5534b466356k902757q56401K333411L225397O56998k661954l200763q37340J245020
$$ -2466356 -5369113 -6225514 -3892103 -666706 -9708 -2671662 -5872425 -6709765 -5464745
5525e464745J067925N50952K332575N186076N027303N71929m325271n106522j747383
$$ -5464745 -4396820 -3845868 -1513293 3672783 8700086 9272015 4946744 -159778 -1907161
5516a907161J806370K405951M19883j769695k494840j881295j069892o65794L0874
$$ -1907161 -100791 2305160 2725043 955348 -1539492 -3420787 -4490679 -5156473 -5125599
5507e125599J765767L381264K514780r88541l806824k799544J013325L785462
$$ -5125599 -3359832 21432 2536212 1547671 -2259153 -5058697 -4045372 -259910
5499b59910L437869J157349j013972j921022r79848J376249K718830O48913l474758
$$ -259910 3177959 4335308 3321336 1400314 420466 1796715 4515545 5164458 1689700
5490A689700n306526l138014l08682l78632k249133k402249j22662K285043L223050
$$ 1689700 -3616826 -6754840 -7063522 -7442154 -9691287 -12093536 -12216198 -9931155 -6708105
5481f708105K805933R76488k153801m274540k580486J830820M344981K774106
$$ -6708105 -3902172 -2925684 -5079485 -9354025 -11934511 -10103691 -5758710 -2984604
5473b984604R5821k79360P97792N37448j059318j718837p89309L05804Q02474
$$ -2984604 -2888783 -3168143 -2370351 -1832903 -2892221 -4611058 -5400367 -5094563 -4292089
5464d292089J084265Q90504k50085r85884N86660L333645L645992M19927l152598
$$ -4292089 -3207824 -2317320 -2567405 -3553289 -2966629 367016 4013008 4432935 1280337
5455A280337l873427k123371J20501K164712L557418K726065n53712l136389k074965
$$ 1280337 -2593090 -4716461 -4595960 -2431248 1126170 3852235 3298523 162134 -1912831
5446a912831Q76548J510573o37733j701703O16534L702115L757439N71180k841181
$$ -1912831 -1036283 474290 -163443 -1865146 -1248612 2453503 6210942 6782122 3940941
5437C940941l850994k305450n1525P93666k02782j328334r87551l8299m43065
$$ 3940941 89947 -2215503 -2267028 -1473362 -1676144 -3004478 -3992029 -4030328 -4473393
5428d473393j997328k416187o80305J815037L578572M234731L319064O26910j787823
$$ -4473393 -6470721 -8886908 -9567213 -7752176 -4173604 61127 3380191 4007101 2219278
5419B219278j162620J416562J514625j905357m049102j415775K303311J569404
$$ 2219278 1056658 2473220 3987845 2082488 -1966614 -3382389 -1079078 490326
5411D90326k516979m086327j388890J522105J829500J400931K050334K119789
$$ 490326 -2026653 -6112980 -7501870 -5979765 -4150265 -2749334 -699000 1420789
5403A420789J81065j504194l11221K205288K149049j316148m805255m715653q83259
$$ 1420789 1601854 97660 -213561 1991727 4140776 2824628 -1980627 -6696280 -7579539
5394g579539L610949N323880L300527l57332k776562l019572k106681j033657
$$ -7579539 -3968590 1355290 4655817 4298485 1521923 -1497649 -3604330 -4637987
5386d637987p2052L66098p0479n22845L14100K020904K728755J888459J029980
$$ -4637987 -4710039 -4343941 -4414420 -4937265 -4623165 -2602261 126494 2014953 3044933
5377C044933J309892K014891K014046J048010p76207k914112l572993j341056
$$ 3044933 4354825 6369716 8383762 9431772 8655565 5741453 2168460 827404
5369H27404J853445K178085p07705k721744j407023L79486o21033k589493j734061
$$ 827404 2680849 4858934 4151229 1429485 22462 401948 -219085 -2808578 -4542639
5360d542639J377121K868107J708899L98211m8294j167342k624456j452738K506933
$$ -4542639 -3165518 -297411 1411488 1809699 1761405 594063 -2030393 -3483131 -976198
5351i76198M637621J924756k014961j955409J189116J966604j182415l705040
$$ -976198 3661423 5586179 3571218 1615809 2804925 4771529 3589114 -115926
5343a15926j947673J660322K651933Q10797o44782m24403j44557l58801O71594
$$ -115926 -2063599 -403277 2248656 3059453 2414671 1990268 1845711 1486910 2158504
5334B158504L149003L901349P38581l479229m097509r74073J570001R88532m54969
$$ 2158504 5307507 9208856 9947437 6468208 2370699 1396626 2966627 3955159 3500190
5325C500190J57550J964234K019616k25774k361421k407117j027834k64215j084139
$$ 3500190 3657740 5621974 7641590 7415816 5054395 2647278 1619444 1355229 271090
5316B71090k447218k480576o42493J377294J498167j37723j427867j231752o10576
$$ 271090 -2176128 -4656704 -5299197 -3921903 -2423736 -2561459 -3989326 -5221078 -5831654
5307e831654o93677q97834k91815O09103P50756K98352J60613M49766O33749O23947
$$ -5831654 -6525331 -7423165 -7714980 -7105877 -6355121 -6056769 -5896156 -5446390 -4812641 -4188694
5297d188694N58998Q8178r36005j550954p39543Q57912J437688K15513j690744
$$ -4188694 -3629696 -3541518 -4477523 -6028477 -6768020 -5910108 -4472420 -4256907 -5947651
5288e947651k479078j227059J418064L542432L367437R53815j739379k721491
$$ -5947651 -8426729 -9653788 -8235724 -4693292 -1325855 -372040 -2111419 -4832910
5280d832910j443770J406705M396063N564991L830421P52070p51706j69205k2107
$$ -4832910 -6276680 -4869975 -473912 5091079 8921500 9673570 8921864 8752659 8730552
5271H730552j824770l671320l380285j761401o38288K40429J671552K283170N76739
$$ 8730552 6905782 3234462 -145823 -1907224 -2545512 -2305083 -633531 1649639 2226378
5262B226378j629217j270546J171631K402485J445537M80521N29743K5215j589343
$$ 2226378 597161 -673385 498246 2900731 4346268 4826789 5356532 5381747 3792404
5253C792404k310243r78976O15544N20469q11802k004724k642627k528708j216821
$$ 3792404 1482161 503185 1118729 1639198 827396 -1177328 -3819955 -6348663 -7565484
5244g565484N38862R39400j37241o68343K15969Q23892O0624n44797K95329J165027
$$ -7565484 -7026622 -6087222 -6224463 -6892806 -6676837 -5852945 -5792321 -6337118 -6041789 -4876762
5234d876762N06627m50430K76243K128741L115709K789846J880453M16599j409280
$$ -4876762 -4370135 -4820565 -4544322 -2415581 700128 3489974 5370427 5787026 4377746
5225D377746j982203n75346L76181j622944m691944m647821j169278J672829J411631
$$ 4377746 2395543 1820197 2196378 573434 -4118510 -8766331 -9935609 -8262780 -6851149
5216f851149K31868R10641K819187L735508L200622K025435L11426j837925k929554
$$ -6851149 -6619281 -5708640 -2889453 846055 4046677 6072112 6383538 4545613 1616059
5207A616059j688828N79145J284449k4255j354394j378472r89684j205584j160529
$$ 1616059 -72769 506376 1790825 1766570 412176 -966296 -1955980 -3161564 -4322093
5198d322093N60373L383669M859153L308564l98517l751560m684961k792715O65162
$$ -4322093 -3761720 -378051 4481102 7789666 7391149 3639589 -1045372 -3838087 -3172925
5189c172925L472052L788202J634036r73162j944681j260766p34838j599020k910895
$$ -3172925 299127 4087329 5721365 4748203 2803522 1542756 807918 -791102 -3701997
5180c701997k716479m53787K241199L121015J537111r62784k217877j569139k07409
$$ -3701997 -6418476 -6872263 -4631064 -1510049 27062 -935722 -3153599 -4722738 -4930147
5171d930147N35480O52658Q27326R99930N57234k68564l78285N08442J161516
$$ -4930147 -4394667 -3742009 -2914683 -1914753 -1357519 -1626083 -2004368 -1495926 -334410
5162c34410M66935r74216j629732r83089O4534N43459M61977M61135R45829J722995
$$ -334410 132525 -841691 -2471423 -3454512 -3389978 -2846519 -2384542 -1923407 -977578 745417
5152G45417K197004J786685L72312j481764k808007k888608j738571k2898J457802
$$ 745417 2942421 4729106 5101418 3619654 811647 -2076961 -3815532 -3838430 -2380628
5143b380628K257767K450020K451136K556384K391957J008654j860718m616111
$$ -2380628 -122861 2327159 4778295 7334679 9726636 10735290 8874572 4258461
5135D258461m890793k452796N7114M27584j28667Q95288K957804K931301P6906
$$ 4258461 -632332 -3085128 -3028014 -2600430 -2729097 -1833809 1123995 4055296 4132202
5126D132202k369555j780961K96178R80746K20436j92562K8136l3682r7606O12542
$$ 4132202 1762647 -18314 277864 1258610 1479046 1286484 1314620 1280938 1183332 1795874
5116A795874J060607l58025k581052k659587N9028K929414L501864J922718l88034
$$ 1795874 2856481 2498456 -82596 -2742183 -2683155 246259 3748123 5670841 5282807
5107E282807k358882l168069k447568j116271n05098m78740N2729Q81388O34408
$$ 5282807 2923925 -244144 -2691712 -3807983 -4313081 -4791821 -4739092 -3857704 -3223296
5098c223296q03338j902518j684912n70477R18369K417901K809813J160695j350219
$$ -3223296 -4026634 -5929152 -7614064 -8184541 -7266172 -4848271 -2038458 -877763 -2227982
5089b227982k455407j758942p18193K4746R76922J760329J377508M27462M08986
$$ -2227982 -4683389 -6442331 -7160524 -7135778 -6158856 -4398527 -3021019 -2593557 -2184571
5080b184571R31272L76880r26611j280151r90395j603608k086306j6197L297496
$$ -2184571 -1253299 -876419 -1803030 -3083181 -4073576 -5677184 -7763490 -7779687 -4482191
5071d482191L627990N20735j729303r85372n691n70009l60136J710968K484501
$$ -4482191 -854201 -333466 -2062769 -3048141 -3053832 -3623841 -3983977 -2273009 211492
5062B11492K56905j574494l99023R78610j07296r20590J236310K927303P1112
$$ 211492 468397 -1106097 -1505120 -526510 -633806 -1554396 -318086 2609217 2680329
5053B680329m211277m004822k26032J066532j644860m078666l712960k163139
$$ 2680329 -1530948 -5535770 -5761802 -4695270 -6340130 -10418796 -14131756 -16294895
5045a6294895l38668K530490M784551L214612j072560k978654o73805K208339
$$ -16294895 -16633563 -14103073 -9318522 -6103910 -7176470 -10155124 -10828929 -8620590
5037h620590K581668J535264Q98410N27828K47467O46521R73721j80583j643455
$$ -8620590 -6038922 -4503658 -3605248 -3077420 -2829953 -2183432 -1209711 -1390294 -3033749
5028c033749r48719R53220O98011j411082j291940J936562L983354K152024p53981
$$ -3033749 -3982468 -3029248 -2331237 -3742319 -5034259 -3097697 885657 3037681 2283700
5019B283700j523448j050214j192984j263377n32653o03613k291298l298450j880930
$$ 2283700 760252 -289962 -1482946 -2746323 -3278976 -3882589 -6173887 -9472337 -11353267
5010a1353267P0661L91434K68359J607678L351844L445925K309440J429497M16669
$$ -11353267 -11282606 -10891172 -10622813 -9015135 -5663291 -2217366 92074 1521571 1938240
5001A938240j645942l502626l149849q66242J343221K201993J458132n80874k161461
$$ 1938240 292298 -3210328 -6360177 -7226419 -5883198 -3681205 -2223073 -2803947 -4965408
4992d965408q80989K584588L923793J010539k075017l83244M278922N352902P01866
$$ -4965408 -5846397 -3261809 661984 1672523 -402494 -785738 3493184 8846086 9547952
4983I547952m580240n407136k866113j085116r85637m24205Q79937L99542k555653
$$ 9547952 4967712 -439424 -3305537 -4390653 -5376290 -5800495 -4920558 -4521016 -7076669
4974g076669m448006k037541K562352M300374J980673n35960j86932J513792J744550
$$ -7076669 -11524675 -13562216 -10999864 -6699490 -4718817 -5254777 -5441709 -3927917 -2183367
4965b183367L79503j104349k035232j801351O61726M277796N365148K463730r65461
$$ -2183367 -1803864 -2908213 -4943445 -6744796 -6083070 -1805274 3559874 6023604 5058143
4956E058143j532955p25579j332888k199909q78235J209494J136341k01718r0604
$$ 5058143 3525188 2799609 1466721 -733188 -1611423 -401929 734412 532694 442090
4947D42090P59779J22222p76811K53067J175900q08586k915716r03021K556885
$$ 442090 1201869 1324091 547280 800347 1976247 1167661 -1748055 -2651076 -94191
4938i4191J648126k009821j619676K506855K784653k594320o407785m465451j353372
$$ -94191 1553935 -455886 -2075562 431293 3215946 621626 -5786159 -10251610 -11604982
4929a1604982r59529m37678K402226M225505L060256K138931K658399P01792m234137
$$ -11604982 -12564511 -13002189 -10599963 -6374458 -3314202 -1175271 1483128 2184920 -2049217
4920b049217n952512j893173J396913j179084n072273m555244j807849r47990
$$ -2049217 -8001729 -9894902 -8497989 -9677073 -14749346 -19304590 -21112439 -22060429
4912b2060429j47977L221620N956616M541963J667726R26679O72299j078985j743138
$$ -22060429 -22208406 -18986786 -13030170 -8488207 -6820481 -5893802 -5221503 -6300488 -8043626
4903h043626K34633J349492j07378k88332K097492K170497j418331k689813L9158
$$ -8043626 -7808993 -6459501 -6566879 -6855211 -4757719 -2587222 -4005553 -6695366 -6656208
4894f656208l35755n849498p455718j161453L189936p54654m056196J63713K953070
$$ -6656208 -6991963 -12841461 -20297179 -21458632 -18268696 -19023350 -23079546 -22915833 -19962763
4885a9962763k636785o189145M81552N167524l049808j1365318o434913j581499
$$ -19962763 -22599548 -28788693 -28307141 -23139617 -26189425 -37554743 -43989656 -45571155
4877d5571155j1641369k0237295j0161021p814017m5377148q6932689n6399650
$$ -45571155 -57212524 -77449819 -87610840 -95424857 -140802005 -227734694 -284134344
4870b84134344M7804809J28313747J10243235L5038289q128185m48360R895505
$$ -284134344 -236329535 -108015788 2227447 37265736 29137551 28689191 38584696
4863C8584696j633067j0840558k048970O020117m17264p747285m349707J19989
$$ 38584696 36951629 26111071 24062101 30082218 29664954 21917669 17567962 17687951
4855A7687951k656293m266162J122275M192586j320686o586651m234156n20437
$$ 17687951 15031658 10765496 11887771 16080357 14759671 8173020 3938864 3418427
4847C418427j522326k220132J543908L919247P18509k046415M22757L063296J402962
$$ 3418427 1896101 -324031 1219877 5139124 5857633 3811218 4233975 7297271 8700233
4838H700233j92719J732051K215196k048023m931529j384432L080992J722110
$$ 8700233 8507514 10239565 12454761 10406738 5475209 4090777 7171769 8893879
4830H893879k332308k529714K44836J254139P32796J567125K718247J709102r1212
$$ 8893879 6561571 4031857 4276693 5530832 6263628 7830753 10549000 12258102 12166890
4821A2166890k80787M1350q76688j856147j880004k513373l866159l023084K31077
$$ 12166890 11886103 11927453 11050765 9194618 7314614 4801241 935082 -2088002 -1856925
4812a856925J688049K24502P49096N295034P760206L206673l526903n004854k032822
$$ -1856925 -168876 55626 804722 6099756 13859962 17066635 13539732 8534878 6502056
4803F502056n05439j500658j626260l64288j53298q50601k30827J101658O29903
$$ 6502056 5996617 4495959 2869699 2505411 2352113 1501512 1270685 2372343 3002246
4794C002246j126611j326263K22679J003640J28276r30713j354089j500021j049593
$$ 3002246 1875635 549372 772051 1775691 1903967 973254 -380835 -1880856 -2930449
4785b930449N09754K173496K583320K110961J797584J343934O3449j354756j765064
$$ -2930449 -2420695 -247199 2336121 4447082 6244666 7588600 7652049 6297293 4532229
4776D532229j133873p402J185554J587833N85426n71279l24786p8821k373634
$$ 4532229 3398356 3390954 4576508 6164341 6749767 6178488 5853702 5774881 3401247
4767C401247n492335m565946N97328L893112J598152k251013k440708R722J001052
$$ 3401247 -2091088 -6657034 -6059706 -2166594 -568442 -2819455 -5260163 -5250441 -4249389
4758d249389M8718m91419J10154J244352L097079N009157M486210J173735j204279
$$ -4249389 -4200671 -4692090 -4581936 -3337584 -240505 4768652 9254862 10428597 9224318
4749I224318j97774J463964Q26438l40833K14621J59492k924282n618680l425023
$$ 9224318 9026544 10490508 11316946 10976113 11190734 11350226 8425944 2807264 -617759
4740f17759J346093K955696J390151J256370K912281K077871j784430l968811
$$ -617759 728334 3684030 5074181 6330551 9242832 11320703 9536273 5567462
4732E567462k557503j298927k494371l140767r98912R43323j87508j713475K76530
$$ 5567462 3009959 1711032 -783339 -3924106 -4923018 -3979695 -4167203 -5880678 -5604148
4723e604148M107242M678359J153026j787400n61328K805154M039443K250140
$$ -5604148 -1496906 3181453 4334479 2547079 1985751 4790905 8830348 11080488
4715A1080488J80772k85080m97819k178243m086467l513656k45366L131603M517654
$$ 11080488 11261260 10976180 10478361 8300118 4213651 699995 454629 3586232 8103886
4706H103886L704835R79399k814831n020280l503389n76054o09828l060933k708242
$$ 8103886 11808721 12788120 9973289 4953009 1449620 873566 263738 -2797195 -5505437
4697e505437J577798L952605P17088l250545k048644K041658K942803O41855k12157
$$ -5505437 -3927639 24966 742054 -2508491 -4557135 -2515477 427326 1069181 857024
4688H57024R21777N04942j341810n73197K892645L942035N00472l011590k680720
$$ 857024 1778801 2283743 941933 368736 3261381 7203416 7703888 4692298 2011578
4679B011578m19714L06597k83713k43784K92496J43690m46931p14339r35485j369923
$$ 2011578 1591864 1898461 1614748 1370964 1663460 1807150 1360219 645880 -289605 -1659528
4669a659528j255519j56656J105842J652829J305329l180j836558k441026n28093
$$ -1659528 -2915047 -3071703 -1965861 -313032 992297 989117 -847441 -3288467 -3816560
4660c816560K225519K855220J182310l30076n71585p04359j137629q02258K02699
$$ -3816560 -1591041 1264179 2446489 2116413 1544828 840469 -297160 -1099418 -896719
4651h96719L41424n40860j108485j415193k524066l070497k66418M749260O777455
$$ -896719 -555295 -1096155 -2204640 -3619833 -6143899 -9214396 -9480814 -4731554 2045901
4642B045901L547544q92291j875282J22297J665886J266532l00878j947108k298926
$$ 2045901 5593445 4701154 2825872 2948169 4614055 5880587 5579709 3632601 1333675
4633A333675l15757K085381R37890l791831o244737k046700M930063P181249L282565
$$ 1333675 1017918 3103299 4041189 249358 -5995379 -8042079 -3112016 4069233 7351798
4624G351798j242774k053745o59929l33016j090753p56022J047122K195511J030009
$$ 7351798 6109024 4055279 3395350 3062334 1971581 1215559 2262681 4458192 5488201
4615E488201j347609k284136p73993J295284J570394J32850j202427j803757k447836
$$ 5488201 4140592 1856456 1082463 2377747 3948141 4080991 2878564 1074807 -1373029
4606a373029k807551j368820J327116K058380o49395l632304l035534K98280K096644
$$ -1373029 -4180580 -5549400 -4222284 -2163904 -2813299 -6445603 -9481137 -9182857 -7086213
4597g086213O43852j305080q81385J117771K058040J473110J426340L197486N211508
$$ -7086213 -6442361 -7747441 -8628826 -7511055 -5453015 -3979905 -2553565 643921 5855429
4588E855429M968690K158657j223464l488678m609732m859772l784879j470323
$$ 5855429 10824119 12982776 11759312 8270634 3660902 -1198870 -4983749 -6454072
4580f454072N67180J112222Q93599J189444J766442J620275Q13703Q6919m03509
$$ -6454072 -5886892 -4774670 -3881071 -2691627 -925185 695090 1508793 1595712 1192203
4571A192203n12622M63156K127103K321814K20295j662788j149799j97001j644509
$$ 1192203 679581 1142737 3269840 5591654 5811949 4149161 2999362 2802361 1157852
4562A157852l910003l167653K39557K214141J295081j44360r60493k290009l153418
$$ 1157852 -2752151 -5919804 -5680247 -3466106 -2171025 -2315385 -3275878 -5565887 -8719305
4553h719305p50151L512105M154568Q8185k808777o91009K341218J504336q15319
$$ -8719305 -9469456 -5957351 -1802783 -1714598 -4523375 -5214384 -2873166 -1368830 -2184149
4544b184149P8947K807298K796243O42243P33180K835950J894381l358926p575913
$$ -2184149 -2105202 702096 3498339 4140582 4873762 7709712 9604093 6245167 -1330746
4535a330746o275867j578414J648927J919417J122794Q06056Q17502O25539L57626
$$ -1330746 -7606613 -9185027 -7536100 -5616683 -4493889 -3687833 -2870331 -2244792 -1887166
4526a887166O33725J740531K809097K268460k53329l082581m271287l485712j588562
$$ -1887166 -1253441 487090 3296187 5564647 5311318 2228737 -2042550 -5528262 -7116824
4517g116824L64705R21441j177788m714940n974373k939696J762206M011359L112888
$$ -7116824 -6752119 -5830678 -7008466 -11723406 -17697779 -20637475 -18875269 -14863910 -11751022
4508a1751022J637718J469595K125440K336871J505144R462q85151l27640L64041
$$ -11751022 -10113304 -8643709 -6518269 -4181398 -2676254 -2666792 -3551943 -3879583 -3515542
4499c515542q80879l052997k551971J062564L365555J614359p76395L4818J816599
$$ -3515542 -4396421 -7449418 -10001389 -8938825 -5573270 -3958911 -4735306 -4700488 -2883889
4490b883889N10846k061653j016143K759600L468961l9738k461366j006797L65014
$$ -2883889 -2373043 -4434696 -5450839 -2691239 777722 737984 -1723382 -2730179 -2365165
4481b365165j731817m303785l181364L82816K364403K013609J322768Q23629k43726
$$ -2365165 -4096982 -8400767 -11582131 -11199315 -8834912 -6821303 -5498535 -4674906 -4918632
4472d918632j060567k7500K250183L498565K878201J509526M31828k11160m73959
$$ -4918632 -5979199 -6006699 -3756516 -257951 2620250 4129776 4561604 4350444 3876485
4463C876485n60802r39573j421836r67725N73708J616098Q75434q60332k168068
$$ 3876485 3315683 2376110 954274 -13451 560257 2176355 3051789 2191457 23389
4454B3389k920161l376903k671308j17253K718977L202548Q31918k043937k709735
$$ 23389 -2896772 -6273675 -8944983 -9062236 -6343259 -3140711 -2308793 -4352730 -7062465
4445g062465n47922K611699M005633K437492k01572q52741P48569J510106n93152
$$ -7062465 -7610387 -4998688 -993055 1444437 1242865 390124 1138693 2648799 2055647
4436B055647l254299k839586O15874L645998L857714J933962m43973k262864k720759
$$ 2055647 -1198652 -4038238 -3422364 223634 4081348 6015310 5571337 3308473 587714
4427E87714j482627J11860K01222o97932j81056J891376K370955m13489l397024
$$ 587714 -894913 -783053 -581831 -1279763 -1460819 430557 2801512 2388023 -1009001
4418a009001k886699l0083J082820l51717j301555l89181K01607o46358m69561
$$ -1009001 -3895700 -3925783 -2842963 -3194680 -4496235 -4885416 -4683809 -5330167 -5799728
4409e799728K380004N204941M924986K897050K143293J908591o03148m246821
$$ -5799728 -3419724 1785217 6710203 9607253 11750546 13659137 13055989 8809168
4401H809168m672434j261202J427063M06408j765938j671661Q8574J114965J056505
$$ 8809168 4136734 2875532 4302595 4709003 2943065 1271404 1359978 2474943 3531448
4392C531448N04459j140709l687311m432884j675890J929380K765555J384511
$$ 3531448 4035907 2895198 -792113 -5224997 -6900887 -4971507 -2205952 -821441
4384h21441R05012J717890J574964J93897j67370J127224J856499N47995j544135
$$ -821441 83571 1801461 3376425 3570322 3402952 4530176 6386675 6934670 5390535
4375E390535k831283l285847l156914k036943j87593R93947P94437J78900L21251
$$ 5390535 2559252 -726595 -3883509 -5920452 -6108045 -5114098 -4319661 -4140761 -3819510
4366c819510J177963J843663J439041k90708k367310l003654j676987n5046L39316
$$ -3819510 -2641547 -797884 641157 350449 -2016861 -5020515 -6697502 -6752548 -6413232
4357f413232K41144P62208Q40714r09905k911584k324331L73638J789134P57255
$$ -6413232 -6172088 -5409880 -4569166 -5479071 -8390655 -10714986 -10341348 -8552214 -7794959
4348g794959k01835O98215J772270R36417j029770j959247j180843N41523K417376
$$ -7794959 -7996794 -7298579 -5526309 -4589892 -5619662 -7578909 -8759752 -8218229 -5800853
4339e800853L646130L332594J668149K48239J81430O18889l8105j994734l628246
$$ -5800853 -2154723 1177871 2846020 3094259 3275689 3894578 3856473 1861739 -1766507
4330a766507k936076M56736M326403N485888L135603k25564k070330k636729l052720
$$ -1766507 -4702583 -4245847 80556 5566444 8702047 8476483 6406153 3769424 716704
4321G16704k519324L7279K800370K792685L59732j185527l73878R48079J119937
$$ 716704 -1802620 -1765341 1035029 3827714 4187446 3001919 2628041 3576120 4696057
4312D696057O44443J97870m88947j102471p12629J12236k91803j596495j451401
$$ 4696057 5340500 5538370 5049423 3946952 3234323 3346559 3054756 1458261 6860
4303F860P36499K606803K274232M90903j364519k883678l363703j621212J678201
$$ 6860 743359 3350162 5624394 6115297 4750778 1867100 -1496603 -3117815 -1439614
4294a439614L727373K786030o7540k865591m371979l657193p14637K147261K332800
$$ -1439614 2287759 5073789 5006249 2140658 -2231321 -5888514 -6603151 -4455890 -2123090
4285b123090P47173N84689K154876K550555R43615n8808M73584r3847k653932
$$ -2123090 -1375917 -791228 1363648 3914203 4857818 4799010 5272594 5178747 2524815
4276B524815l641890o08771L386279M356961K924089J586596k87812m234331p781687
$$ 2524815 -1117075 -1725846 1660433 6017394 8941483 10528079 10240267 6005936 -1775751
4267a775751o775034j785322K196556K447558J180588J175266K135939K534944
$$ -1775751 -8550785 -10336107 -8139551 -5691993 -4511405 -3336139 -1200200 1334744
4259A334744K477492K924791L339191J961138j408220m116726l395575k25831
$$ 1334744 3812236 6737027 10076218 12037356 10629136 6512410 3116835 2891004
4251B891004J320009n16140k539048j404262J058191O99511k194701l310646j150115
$$ 2891004 4211013 3694873 1155825 -248437 809754 1509265 -685436 -3996082 -5146197
4242e146197J047681Q63461j07663J21946R52881J352457J646889J806760R91962
$$ -5146197 -4098516 -3235055 -3342718 -3220772 -2267891 -915434 731455 2538215 3530177
4233C530177k53615m26566n8927p38467j203051J052996M171807L409263j001331
$$ 3530177 3276562 2849996 2791069 2052602 849551 1902547 6074354 9483617 8482286
4224H482286l418947j636588J60059o91300j142216R10625K469249J647790J573728
$$ 8482286 5063339 3426751 3586810 2895510 1753294 2663919 5133168 6780958 8354686
4215H354686L825321M317100O07320k757744j583188R71109L68542j760404j945116
$$ 8354686 12180007 16497107 17104427 14346683 12763495 13734604 14103146 12342742 10397626
4206A0397626j462277k383612k144527J349507L988190J674292k171627k193696
$$ 10397626 8935349 6551737 4407210 5756717 9744907 11419199 9247572 7053876
4198G053876J73219N44652k79065N82907J128716j575177m365230k823568M89313
$$ 7053876 7227095 7771747 7492682 8075589 9204305 7629128 3263898 440330 929643
4189I29643N48681j074731J96742K956340K818898R06377Q66289J082448j442808
$$ 929643 1478324 403593 600335 3556675 6375573 7281950 8148239 9230687 7787879
4180G787879l425729p99221K294057n461m023317k664590J335345K11250m306899
$$ 7787879 4362150 3562929 5856986 5851525 1828208 -836382 498963 710213 -3596686
4171c596686m024973Q45105K926924J661727K724495N263544L407030r53742p90511
$$ -3596686 -7621659 -6776554 -3849630 -2187903 536592 5800136 9207166 8253424 7462913
4162G462913K189651O72382l150997j089380M339357L501971j769357j305840
$$ 7462913 9652564 10324946 7173949 6084569 10423926 13925897 12156540 10850700
4154A0850700L394489K173076k470283O63287P714194N412685p47193N843874
$$ 10850700 14245189 16418265 13947982 14611269 22325463 27738148 26990955 32834829
4146C2834829J7378015J1743373K516113L0167304Q4571760Q9608569N291665
$$ 32834829 50212844 61956217 64472330 94639634 179211394 268819963 274111628
4139B74111628r7903194j20366173o0736706l817850J568885j1854444n685247
$$ 274111628 176208434 55842261 -4894445 -8712295 -7143410 -18997854 -24683101
4132b4683101P878571N701746k158894J731554P941286J486807q302089o026486
$$ -24683101 -16804530 -11102784 -13261678 -11530124 -3588838 -2102031 -10404120 -16430606
4124a6430606J742194R81834l766986o77407N704613L741714l028060k988307
$$ -16430606 -14688412 -13706578 -17473564 -18150971 -12446358 -8704644 -11732704 -14721011
4116a4721011K485307L294826o94118j751073M41131M81639o34839J437122L833726
$$ -14721011 -12235704 -8940878 -9634996 -11386069 -10944938 -10463299 -11098138 -9661016 -5827290
4107e827290J305926l003308l042536j039506k004291k696788J962778O831670
$$ -5827290 -4521364 -7524672 -10567208 -11606714 -13611005 -16307793 -14345015 -7513345
4099g513345L722913l601311m675651N38382K798158j71387j585025Q29974J650797
$$ -7513345 -3790432 -7391743 -12067394 -11529012 -8730854 -8902241 -10487266 -9657292 -8006495
4090h006495r78310k189902k24891O05849j096103q73474L056182O148599N008297
$$ -8006495 -8984805 -11174707 -11399598 -10793749 -11889852 -12763326 -9707144 -3558545 1449752
4081A449752J981301J40860o26798r43849m95868l56419k126268m369104m321787
$$ 1449752 3431053 3571913 2945115 2001266 1505398 1148979 -977289 -5346393 -9668180
4072i668180k732275k330233k504888p55371J743576J824961M94838J221084K982153
$$ -9668180 -12400455 -14730688 -17235576 -17990947 -16247371 -14422410 -13927572 -12706488 -9724335
4063i724335J679130k019750l212188j161590r7751j135318o20676K283934L555643
$$ -9724335 -8045205 -10064955 -13277143 -14438733 -14536484 -15671802 -16292478 -14008544 -10452901
4054a0452901J780885Q51904K705967L786026J765272j38395Q87306K240845P74283
$$ -10452901 -8672016 -7820112 -5114145 -1328119 437153 298758 1186064 3426909 4201192
4045D201192j719155j930744m91983j57054j153931j746854j477213j099160q41036
$$ 4201192 2482037 551293 59310 -97744 -1251675 -2998529 -4475742 -5574902 -6415938
4036f415938o88606q90636r68500l6166J182279R66603k56985k20390J153221
$$ -6415938 -7104544 -7995180 -8963680 -8999846 -7817567 -6850964 -7107949 -7328339 -6175118
4027f175118J311385m21168j452090l94979O74691K50740J27260J690834K668101
$$ -6175118 -4863733 -5284901 -6736991 -7131970 -6457279 -6206539 -6079279 -4388445 -1720344
4018a720344N79256k849195l751492j229187K087014L626826L050266J516962
$$ -1720344 -1141088 -3990283 -7741775 -8970962 -6883948 -3257122 -206856 1310106
4010A310106L20203o1568j93497n19939k53551J293269K757326K113775k49951
$$ 1310106 1630309 1568741 1375244 855305 601754 1895023 4652349 6766124 6516173
4001F516173k141717k983865l906486m565426l137531P6688K373637K740642K901679
$$ 6516173 4374456 1390591 -2515895 -7081321 -10218852 -10142164 -7768527 -5027885 -2126206
3992b126206L368664K168696q81875k346519j04860K889661K622305m68598k784830
$$ -2126206 1242458 3411154 2529279 182760 77900 2967561 5589866 5121268 2336438
3983B336438k704736j756260j669154k458633k945655j862272R29984L680205
$$ 2336438 -368298 -2124558 -3793712 -6252345 -9198000 -11060272 -10130288 -6450083
3975f450083M317708L102664K079516J715361M04971k168748l893761l459166
$$ -6450083 -2132375 970289 3049805 4765166 5170137 3001389 -892372 -4351538
3967d351538k078497q42488Q49092K828413L141131J390363K57275J448259K750284
$$ -4351538 -6430035 -7272523 -6423431 -3595018 -453887 936476 1193751 2642010 5392294
3958E392294J582879r51543k224741k068952j794845j247099J22476R10655l62212
$$ 5392294 6975173 6023630 3798889 1729937 -64908 -1312007 -1189531 -278876 -641088
3949f41088k267210k361983j064803p11597j555523j632909j80072J483285K249180
$$ -641088 -2908298 -5270281 -6335084 -7046681 -8602204 -10235113 -10415185 -8931900 -6682720
3940f682720K115160J164160j31702o7711K429144N303344N112928J443496k399088
$$ -6682720 -4567560 -3403400 -3535102 -3602813 -1173669 4129675 9242603 10686099 8287011
3931H287011l361162j695619J19313J53989j414934k603482j689682M66817J144518
$$ 8287011 4925849 3230230 3349543 3503532 2088598 -514884 -2204566 -1737749 -593231
3922e93231m65113j831053p79903J290416J970810J729387K370887L081334J591693
$$ -593231 -1058344 -2889397 -3669300 -2378884 -408074 1321313 3692200 6773534 8365227
3913H365227j262386j885068P48250L404862L203724J115723l63338o41764o56037
$$ 8365227 7102841 5217773 5966023 9370885 12574609 13690332 13326994 12685230 12029193
3904A2029193r07197j366838k077045k690865k464325j533613j100563j624724
$$ 12029193 11121996 9755158 7678113 4987248 2522923 989310 -111253 -1735977
3896a735977j984405j175505K96732J481097K270369K724449K190886K54531k120620
$$ -1735977 -3720382 -4895887 -4599155 -3118058 -847689 1876760 4067646 4322177 2201557
3887B201557l446829l269195k059983j24846K307662M133027L745410R37542k153258
$$ 2201557 -1245272 -4514467 -6574450 -6699296 -4391634 -258607 3486803 4424345 2271087
3878B271087k808851o29211J820924J789891m60241k028694j052031J042091J648712
$$ 2271087 -537764 -1166975 653949 2443840 1983599 -45095 -1097126 -55035 1593677
3869A593677M42173n38600N6759J143343R20290o12269j668923j021081L10766
$$ 1593677 2035850 1497250 1554009 2697352 3617642 3005373 1336450 315369 626135
3860F26135J18736k250792m684790m342514p74416L517183N537972M289116J100839
$$ 626135 744871 -1505921 -6190711 -10533225 -11307641 -7790458 -2252486 2036630 3137469
3851C137469j570556j782369K98629K228372J713057o89626k374491k088220r81159
$$ 3137469 1566913 -215456 83173 2311545 4024602 3334976 960485 -1127735 -2108894
3842b108894k34912L05836N74303l91325k341712l048137j249222J255185K072714
$$ -2108894 -2343806 -2037970 -1463667 -1854992 -4196704 -7244841 -8494063 -7238878 -5166164
3833e166164J276142L62338k48973p21255k31327J857890M196452M868727L854601
$$ -5166164 -3890022 -3527684 -3776657 -4497912 -4729239 -2871349 1325103 6193830 10048431
3824A0048431K371716Q30837p66420j675653j693174k248170l991879m810588
$$ 10048431 12420147 13250984 12484564 10808911 9115737 6867567 2875688 -1934900
3816a934900k868531o5087O95434K13532J190185K856857J920858j427525l263566
$$ -1934900 -4803431 -4868518 -4173084 -3959552 -2769367 87490 2008348 580823 -2682743
3807b682743k264946j499100k518479k420394Q53624M508344N236419M093954
$$ -2682743 -4947689 -6446789 -8965268 -11385662 -10532038 -6023694 -787275 3306679
3799C306679L698516L520877J700480p42691j509476j315883k571980m590366
$$ 3306679 7005195 10526072 12226552 11483861 9974385 8658502 6086522 1496156
3791A496156m123165p12429K183847K170980Q68154O01318P80959m85438k789830
$$ 1496156 -2627009 -3339438 -1155591 1015389 1883543 2484861 3265820 2780382 -9448
3782i448l597153j683332J157320K253301J173718K7117O43217K225915K663539
$$ -9448 -3606601 -5289933 -4132613 -1879312 -705594 -678477 -35260 2190655 4854194
3773D854194J720829J316315K268063K663776Q42505j557939j690965J51308Q09274
$$ 4854194 6575023 7891338 10159401 12823177 13665682 12107743 10416778 10568086 11377360
3764A1377360r79376k596179j508336P21985M39457k872737n572186m512348j034618
$$ 11377360 10397984 7801805 6293469 7015454 7454911 4582174 -990012 -5502360 -6536978
3755f536978R60098Q1414j087576K16267L162662M384713K074002k145284n210961
$$ -6536978 -5576880 -5495466 -6583042 -6366775 -3204113 1180600 3254602 1109318 -4101643
3746d101643n414057l119692K30449L161462M628972M199206K229981o4216j219225
$$ -4101643 -9515700 -12635392 -12404943 -9243481 -4614509 -415303 1814678 1750462 531237
3737E31237q71603l17259q46446j720569j195940M26468Q18858o11618j351542
$$ 531237 -340366 -657625 -1504071 -3224640 -4420580 -3994112 -3175254 -3786872 -5138414
3728e138414K78281K132898J507224o46718j646786j465408j725605j714032M44622
$$ -5138414 -4860133 -2727235 -1220011 -1866729 -3513515 -4978923 -6704528 -8418560 -7973938
3719g973938L262991L055051j44137k266997j549579o18272r44807n2012L303004
$$ -7973938 -4710947 -1655896 -1800033 -4067030 -5616609 -6234881 -7179688 -7231700 -3928696
3710c928696N570978L456480q22382k847322j982109p56967n89362j346993l119448
$$ -3928696 1642282 5098762 4276380 1429058 -553051 -1310018 -1899380 -3246373 -6365821
3701f365821n262964n484589k782389M97450K056067K702543L370269K306712
$$ -6365821 -11628785 -17113374 -19895763 -19398313 -17342246 -14639703 -11269434 -8962722
3693h962722j013196k488534J075455N642032M919985j11776k911486j612446
$$ -8962722 -9975918 -12464452 -11388997 -5746965 -826980 -938756 -3850242 -5462688
3685e462688p15982k325853k798217l6090K311027J072523j232556r76487R45381
$$ -5462688 -6178670 -8504523 -11302740 -11338830 -9027803 -7955280 -9187836 -10164323 -9218942
3676i218942J667249J166666J020536J064335N48185L83944J339957K024411J245883
$$ -9218942 -7551693 -6385027 -5364491 -4300156 -3751971 -3368027 -2028070 -3659 1242224
3667A242224L29557O20116Q15787o16895k368716k265733n65787J134224K457391
$$ 1242224 1571781 2191897 3007684 2390789 22073 -2243660 -2809447 -1675223 782168
3658G82168L379501K854372Q59771k63752P27394J302359j014834m249117m872784
$$ 782168 4161669 7016041 7875812 7612060 8339454 9641813 8626979 4377862 -494922
3649d94922l172815j860193j023226J070585L194145K058851j988537m656032
$$ -494922 -3667737 -5527930 -6551156 -5480571 -2286426 -227575 -2216112 -6872144
3641f872144l683454j160561P17500K150107L024209J853412q40295j707721P53938
$$ -6872144 -10555598 -11716159 -10998659 -8848552 -5824343 -3970931 -4811226 -6518947 -5765009
3632e765009L711623M185432K866688J691039N53207r72082j326059M64358J971316
$$ -5765009 -2053386 2132046 4998734 6689773 7242980 6270898 4944839 5409197 7380513
3623G380513N31057k174131k210222O55193K573148J193116j552137k795778k096032
$$ 7380513 7911570 5737439 3527217 4182410 6755558 7948674 6396537 3600759 1504727
3614A504727n42253J029102J657802K56930k322839k954473q4793L191191K403178
$$ 1504727 962474 1991576 3649378 3906308 1583469 -1371004 -1455797 1735394 4138572
3605D138572k181223n302185l339138J105051K968095J356007k08901M75644J426639
$$ 4138572 1957349 -3344836 -6683974 -5578923 -2610828 -1254821 -1463722 -988078 438561
3596D38561K16447k083193k654244r95296R12413J542448Q86965p12688k653414
$$ 438561 655008 -1428185 -4082429 -5077725 -4165312 -2622864 -1735899 -2448587 -5102001
3587e102001l350827j607146J279425K698137K043727R91825O11102M14025K97533
$$ -5102001 -8452828 -10059974 -8780549 -6082412 -4038685 -3046860 -2435758 -2021733 -1724200
3578a724200Q93512J607663R46435n87025p43232M78035K81280k055487l231398
$$ -1724200 -830688 776975 1723410 1136385 393153 871188 1152468 -903019 -4134417
3569d134417j115637J494247J423365L31600J378316L193445K029486j532656
$$ -4134417 -5250054 -3755807 -2332442 -2000842 -622526 2570919 4600405 3067749
3561C067749l238850k095700j404841k412231k197669N83120K802234K157337
$$ 3067749 -171101 -2266801 -3671642 -6083873 -8281542 -7698422 -4896188 -2738851
3553b738851J017057J870996K725243Q23155k008088j966131P33657K647087K563040
$$ -2738851 -1721794 149202 2874445 3697600 1689512 -276619 457038 3104125 5667165
3544E667165K051759J428623m83555k689262k500035l85992j74918k948023m654758
$$ 5667165 7718924 9147547 8663992 5974730 3474695 3088703 2913785 -34238 -4688996
3535d688996k145931J795199K609582O63515N6283K034763L490728K043850p55135
$$ -4688996 -6834927 -5039728 -2430146 -1766631 -1710348 324415 3815143 5858993 5103858
3526E103858k196167j808312q03491j34229l59473j702117k860909j462230K479936
$$ 5103858 2907691 1099379 295888 161659 -197814 -1899931 -4760840 -6223070 -3743134
3517c743134N050699K861851j858525l543681o75223K263456J292771j638037
$$ -3743134 1307565 4169416 2310891 -1232790 -1908013 355443 1648214 10177
3509A0177k017599O62342K779780J985063l71629k077493k511744j863521l65945
$$ 10177 -2007422 -1345080 1434700 3419763 3048134 970641 -1541103 -3404624 -3770569
3500c770569J001274J167818R15902J934710L367925K121888k090543n000317
$$ -3770569 -2769295 -1601477 -685575 1249135 4617060 6738948 4648405 -351912
3492c51912l336095M18247J697866K29629p07301J5625L70124m59266n94244R44744
$$ -351912 -3688007 -3269760 -1571894 -1342265 -2049566 -2033941 -1663817 -2123083 -2717327 -1772583
3482a772583K404743K195452J017294k1157j042885j962374j647494L2738J226305
$$ -1772583 632160 2827612 3844906 3823749 2780864 818490 -829004 -796266 430039
3473D30039O73695l37123m6672J169300J715030J100700K9511q25620j075896
$$ 430039 1103734 766611 719939 1889239 3604269 4704969 4734480 3908860 2832964
3464B832964o83132n36265j634098l044397k489672J32326J988207J408637L59901
$$ 2832964 2149832 1613567 -20531 -3064928 -5554600 -5422274 -3434067 -2025430 -1665529
3455a665529R01567J643424M69550j298925q81257J164924J768784L44408o19137
$$ -1665529 -763962 879462 1349012 50087 -831170 333754 2102538 2446946 1827809
3446A827809J30536J124329J241978R85437K55224j757085l661126k411925J722110
$$ 1827809 1958345 3082674 4324652 5310089 5565313 3808228 147102 -2264823 -542713
3437e42713M074473J665810k409534l254132n87002J912918J981199N08179j023575
$$ -542713 3531760 5197570 2788036 -466096 -1053098 859820 2841019 3349198 2325623
3428B325623j897411j433498L98477J726369N89101j846199k240138K36999K403202
$$ 2325623 428212 -1005286 -606809 1119560 1708661 -137538 -2377676 -2140677 262525
3419B62525J261371k087397m075260l001787l08355J782382K464838K264497J869596
$$ 262525 1523896 -563501 -4638761 -7640548 -7948903 -6166521 -3701683 -1437186 432410
3410D32410J457108P75122l20231j329045j330656j31955R77045L06770k125405
$$ 432410 1889518 2664640 2344409 1015364 -315292 -447247 529798 836568 -1288837
3401a288837m167332l787912j360410J067899K443104L406337M240728L774964
$$ -1288837 -5456169 -9244081 -10604491 -9536592 -7093488 -3687151 553577 4328541
3393D328541J398556j124192j534834j63603N98773l04550j493639j591757j019640
$$ 4328541 5727097 4602905 3068071 2904468 3503241 3198691 1705052 113295 -906345
3384i06345p57331p61234m28777L86297J464523K431246K475708R31559j435320
$$ -906345 -1663676 -2424910 -2853687 -2467390 -1002867 1428379 3904087 4835646 3400326
3375C400326k891928k955773k834738l093361k459174l126K864680L900329K599488
$$ 3400326 508398 -2447375 -5282113 -8375474 -10834648 -10837774 -7973094 -4072765 -1473277
3366a473277K45246j569839j529664Q70386L969755M510875J421030k028941j922744
$$ -1473277 -1228031 -2797870 -4327534 -3457148 512607 5023482 6444512 4415571 2492827
3357B492827J198067L197089J915962n93616j618741j111350m99984j52180M25547
$$ 2492827 3690894 6887983 8803945 8210329 6591588 5480238 4980254 4828074 5253621
3348E253621R34384M23334j099807k281858j927600m21654P08145N99560J9572
$$ 5253621 6188005 6611339 5511532 3229674 1302074 880420 1588565 2188125 2207697
3339B207697J31393O79695L42752j109525k220278j850223o07336L52914P29885
$$ 2207697 2339090 3018785 3361537 2252012 31734 -1818489 -2425825 -2072911 -1343026
3330a343026M97713o68143k228405k455249q05174O52853P794j409643q80126
$$ -1343026 -845313 -1513456 -3741861 -6197110 -7002284 -6349431 -6341637 -7751280 -8631406
3321h631406J541053L102477K326463O05902k72515j78653O4058k41067j436815
$$ -8631406 -7090353 -3987876 -1661413 -1055511 -1328026 -1506679 -1442621 -1683688 -3120503
3312c120503k877531k685251J67245L718253M802480K855542J23566j577886k133844
$$ -3120503 -5998034 -8683285 -8516040 -4797787 4693 2860235 2983801 1405915 -727929
3303g27929j488866N57506K680930K819625J181645J4230o3569p55245k467437
$$ -727929 -2216795 -1659289 1021641 3841266 5022911 5037141 4973572 4218327 1750890
3294A750890l065989j528334P7823J500m08792O55671K274721K418139J009154
$$ 1750890 -1315099 -2843433 -2765610 -2764110 -3172902 -2517231 -242510 2175629 3184783
3285C184783n72925j510537j460995j78840J229424O31811j870239l139555j364478
$$ 3184783 2611858 1101321 -359674 -538514 690910 1322721 -547518 -3687073 -5051551
3276e051551J036438J102074l95301j025239q14663j111960j229409K09035J916979
$$ -5051551 -4015113 -2913039 -3308340 -4333579 -5148242 -6260202 -7489611 -7280576 -5363597
3267e363597J597578K0425j58624J052540J319875M39879N67894J926498K164400
$$ -5363597 -3766019 -3745594 -3904218 -2851678 -1531803 -1091924 -524030 1402468 3566868
3258C566868N82416o69168n50038p94573k295973l048337j449807R92332K059693
$$ 3566868 4149284 3480116 2930078 2135505 -160468 -3208805 -4658612 -3666280 -1606587
3249a606587J723089R96855m9171j402306j979154j106311J93433P43352P43383
$$ -1606587 116502 1113357 1064186 -338120 -2317274 -3423585 -3230152 -2486800 -1743417
3240a743417O50148J6109j294181k086564j330547M08453J990702K943977K867012
$$ -1743417 -1093269 -1077160 -2371341 -4457905 -5788452 -5379999 -3389297 -445320 2421692
3231B421692J136395j618584l142881k033447L64693J584009O30063j756770m128867
$$ 2421692 3558087 1939503 -1203378 -3236825 -2872132 -1288123 -658060 -2414830 -6543697
3222f543697m739876k379767J920477N068733M949478K497942O0622j168830j328746
$$ -6543697 -11283573 -13663340 -11742863 -6674130 -1724652 773290 833912 -334918 -1663664
3213a663664q29693j69872J22876J03889J46858l7548p33122o92952J526351M489939
$$ -1663664 -2493357 -2663229 -2540353 -2436464 -2289606 -2327154 -3060276 -3753228 -2226877 2263062
3203B263062M859524K177454k72814n04823m32488j747139k787465k084851j501979
$$ 2263062 7122586 9300040 9027226 8522403 8089915 6342776 3555311 1470460 -31519
3194c1519k466749k401543Q75502M102339L008085l77797n97796K338742L233803
$$ -31519 -2498268 -4899811 -4024309 78030 3086115 2708318 2110522 4449264 7683067
3185G683067O83075r26774L64878N83349k602634m836214j988336K527454K549900
$$ 7683067 8366142 7439368 7804246 8387595 5784961 948747 -1039589 1487865 4037765
3176D037765j742641m748903l687610j003272O56057J308082J428561P70163m4171
$$ 4037765 2295124 -2453779 -6141389 -7144661 -6488604 -5180522 -3751961 -2981798 -3025969
3167c025969J77429Q70142M49409m71151L08821K310783K158254j137262l937274
$$ -3025969 -2848540 -1978398 -1528989 -2000140 -1691319 619464 2777718 1640456 -2296818
3158b296818l006979P40J541439J247655R52935N22251j514259l851556l014198
$$ -2296818 -5303797 -5303057 -3761618 -2513963 -1561028 -1038777 -2553036 -6404592 -9418790
3149i418790J192590M335027L053511o51091k779651k558841j784533r04483R55467
$$ -9418790 -8226200 -3891173 -837662 -1488753 -4268404 -6827245 -8611778 -9516261 -8560794
3140h560794K920713K767679O28166o89789J51788J167338M00516j306488k304361
$$ -8560794 -5640081 -2872402 -2244236 -2934025 -2782237 -1614899 -1214383 -2520871 -4825232
3131d825232k609985k552194j040069K355860N076092M163906N88147j665004
$$ -4825232 -7435217 -9987411 -11027480 -8671620 -3595528 568378 1156525 -508479
3123e08479p88726R04404O16008j374211k583543j493984Q70017J992394M99504
$$ -508479 -1297205 -392801 223207 -1151004 -3734547 -5228531 -4358514 -2366120 -1866616
3114a866616j852815j666832J715086M636929L648060K32813j529543r55531r45348
$$ -1866616 -3719431 -5386263 -3671177 965752 4613812 4846625 3317082 2361551 1416203
3105A416203k408098k565321K4559K531918K166345L90889R0059Q92901M62062
$$ 1416203 -991895 -3557216 -3532657 -1000739 1165606 1556495 1646554 2539455 3001517
3096C001517j123688j561814k02264J222967J543298J236421N66098r20609k681273
$$ 3001517 1877829 316015 113751 1336718 2880016 4116437 4682535 3761926 1080653
3087A080653l125788j909201n67771k82284m87866k38018M10695R07868R41375
$$ 1080653 -2045135 -3954336 -4522107 -4804391 -5292257 -5530275 -5119580 -4211712 -3270337
3078c270337L37678n95336n75904J208905L028935K100416j137456k619351j08369
$$ -3270337 -2932659 -3527995 -4103899 -2894994 133941 2234357 1096901 -1522450 -1630819
3069a630819L143001K650974r61032l045069j708393Q6408j90850q20854O32842
$$ -1630819 1512182 4163156 3202124 157055 -1551338 -1464930 -1655780 -2476634 -1843792
3060a843792K719224K151775q63129k637212j237971J163746J780923N87426q45243
$$ -1843792 875432 3027207 2164078 -473134 -1711105 -547359 1233564 1820990 975747
3051I75747j806377k297822k004340r86963l08258n87708r21813m68164Q1473
$$ 975747 -830630 -3128452 -5132792 -6119755 -6428013 -7015721 -7937534 -8405698 -8324225
3042h324225R146K11711J537544K753960K352590J254190J136027J031054j204991
$$ -8324225 -8315079 -8103368 -6565824 -3811864 -1459274 -205084 930943 1961997 757006
3033G57006m448255n017768k329193j50762r17441k263042j185141J491484L363057
$$ 757006 -3691249 -8709017 -11038210 -11188972 -12106413 -14369455 -15554596 -14063112 -10700055
3024a0700055M382057N398265M977560J449983l017985m209207j555422J281592
$$ -10700055 -6317998 -919733 4057827 5507810 2489825 -1719382 -3274804 -1993212
3016a993212J791891J413107K073051K831465J752389o92706k082766j271660
$$ -1993212 -201321 1211786 3284837 6116302 7868691 7175985 5093219 3821559
3008C821559K81892M36970j091100k432470j857470p4820O22674l23822p41262
$$ 3821559 4103451 4540421 3449321 1016851 -840619 -915439 -292765 -616587 -1357849
2999a357849Q93275K599796J493982j630755k920376p53036K081192K365528N61348
$$ -1357849 -464574 2135222 3629204 1998449 -921927 -1674963 406229 2771757 3333105
2990C333105n15598K40818J236204Q61309l01220m23803J033277K459088K031275
$$ 3333105 2817507 3058325 4294529 5155838 4854618 4430815 5464092 7923180 9954455
2981I954455O2926j421683j406189j016638j561476k741695l551978l609161k628269
$$ 9954455 10017381 8595698 7189509 6172871 4611395 1869700 -1682278 -5291439 -7919708
2972g919708j45467K900084M035758K520840R65923J428557J884442k58311l010503
$$ -7919708 -8065175 -5165091 -1129333 1391507 2357430 3785987 5670429 5412118 2401615
2963B401615k491811K92721N36667k338695l263632L46520M393333M723029L024759
$$ 2401615 -90196 202525 739192 -1599503 -4863135 -4516615 -123282 4599747 7624506
2954G624506K437995J718781j409313m527534l729550m58805N07908j247924j804403
$$ 7624506 10062501 11781282 10371969 5844435 2114885 1656080 2163988 916064 -888339
2945h88339k44465n2307k321275l304911q49565J763796J374442J11523J366463
$$ -888339 -1132804 -1185111 -3506386 -6811297 -7660862 -5897066 -4522624 -4411101 -3044638
2936c044638L843123L696442N71184k330066k960307j853988J01067K049330K190753
$$ -3044638 798485 4494927 5066111 2736045 -224262 -2078250 -1977183 72147 2262900
2927B262900k09413k383356j117952J993292K153402j411872l893802j954306
$$ 2262900 2053487 -329869 -1447821 545471 2698873 1287001 -2606801 -4561107
2919d561107J499389J984024k78130j829190j438935o39166j07190J017814K556194
$$ -4561107 -3061718 -1077694 -1355824 -3185014 -4623949 -5263115 -5370305 -4352491 -1796297
2910a796297L015616K087059J085337P39344N58200L91710O09849P84945K46650
$$ -1796297 1219319 3306378 4391715 5131059 5689259 6080969 6690818 7475763 7722413
2901G722413k03759O06745J615246P01240j500537k038270l42241Q35059O6481
$$ 7722413 7518654 8125399 9740645 10441885 8941348 6903078 6560837 7395896 7462377
2892G462377p52452n50206j420913m404823o469773m885649j632668L8610O85994
$$ 7462377 6709925 6159719 4738806 333983 -6135790 -11021439 -12654107 -12615497 -11929503
2883a1929503K332407L568596J832869j020147o42253K803374M482914J974696
$$ -11929503 -9597096 -6028500 -4195631 -5215778 -5858031 -3054657 1428257 3402953
2875C402953j876586l640249k818996l24726K553695L306931M74142k854335k166961
$$ 3402953 1526367 -2113882 -4932878 -5257604 -2703909 603022 1077164 -1777171 -3944132
2866c944132J467092K473490m61803k397301n16500J542593N23198j123217m93173
$$ -3944132 -2477040 -3550 -465353 -2862654 -3379154 -1836561 -1313363 -2436580 -2929753
2857b929753N41419k67695q60778N69599J071016j501724k921898R11376N753527
$$ -2929753 -2388334 -2656029 -3516807 -2947208 -1876192 -3377916 -6299814 -5388438 365089
2848C65089M693357p27639l006997o18675Q21585j141723k744444k084248k080292
$$ 365089 5058446 4330807 1323810 705135 1526720 384997 -2359447 -4443695 -6523987
2839f523987l301018j565237M035262P566154M792531m22351k505981j874507
$$ -6523987 -9825005 -11390242 -7354980 211174 5003705 4581354 2075373 200866
2831B00866j721161j703325L4020K045687J935174R13301J267840J586139o76727
$$ 200866 -1520295 -3223620 -3189600 -1143913 791261 1704562 2972402 4558541 3881814
2822C881814l679003l244682M74936L053358K285808N08939J95482Q11523P11970
$$ 3881814 202811 -3041871 -2566935 486423 2772231 3281170 3476652 4288175 5000145
2813E000145n52594k355848l436558k325637P42355K890530J767710r60698j700368
$$ 5000145 4447551 2091703 -1344855 -3670492 -2928137 -37607 1730103 769405 -930963
2804i30963O0192J483248Q37887n27908p98312K35502K007999L805472M208378
$$ -930963 -870771 612477 1450364 922456 124144 359646 2367645 6173117 10381495
2795A0381495K067836j432364l508887l046405j632926j159706j860623k721448
$$ 10381495 12449331 11016967 7508080 4461675 2828749 1669043 -191580 -2913028
2787b913028k370609J55944L897303N718190L596920l04825k184162j768829k092875
$$ -2913028 -5283637 -5127693 -1230390 4487800 8084720 7779895 5595733 3826904 1734029
2778A734029m149391n140107l023642K72519J843668J581660J119442R61993O49455
$$ 1734029 -2415362 -7555469 -10579111 -10306592 -8462924 -6881264 -5761822 -4799829 -4150374
2769d150374M01527P33369J258014J249270P24670Q5768m55531m96752K90616
$$ -4150374 -3748847 -3015478 -1757464 -508194 216476 302244 -153287 -650039 -359423
2760c59423R73744P3358j748498j699403J082877L440565K168642j410510l162618
$$ -359423 614321 687679 -1060819 -2760222 -1677345 1763220 3931862 2521352 -641266
2751f41266j516283J237013K596980K460568J846606J017392k88298j881698l170014
$$ -641266 -2157549 -920536 1676444 4137012 5983618 7001010 6712712 4831014 1661000
2742A661000l746423l621180l088865k405280j569809o49597n8976K10677J252907
$$ 1661000 -2085423 -5706603 -8795468 -11200748 -12770557 -13420154 -13479130 -13268453 -12015546
2733a2015546L731966N925033N393012K867628J726296K588386J803318k328741
$$ -12015546 -8283580 -2358547 3034465 5902093 7628389 10216775 12020093 9691352
2725I691352n291574k442781L031234L657990j453289n030263k100515L288774
$$ 9691352 4399778 1956997 4988231 8646221 7192932 2162669 62154 3350928
2717C350928M555520J486394j194272j311610r70605j957935l274992l376235
$$ 3350928 7906448 9392842 8198570 6886960 5916355 3958420 683428 -2692807
2709b692807k160136l46296J306793K002611J528191Q18166P91237J005081N20252
$$ -2692807 -4852943 -5199239 -3892446 -1889835 -361644 456522 1247759 2252840 2773092
2700B773092n45374j434392j874428j620717k8439K456483L679567K439232M31726
$$ 2773092 2227718 793326 -1081102 -2701819 -2730258 -273775 3405792 5845024 6276750
2691F276750m20227q56017j896147j625488J714498M882499K958136k665571n090146
$$ 6276750 5856523 5000506 3104359 1478871 3193369 8075868 11034004 8368433 3278287
2682C278287j794776J831025J111457j233247p60380J149088N06391j935715k222645
$$ 3278287 1483511 3314536 4425993 3192746 2432366 3581454 4087845 2152130 -70515
2673g0515j61676P51245n49459j727500j759989j766317j268603J377169M389178
$$ -70515 -232191 519054 -30405 -1757905 -3517894 -5284211 -6552814 -5175645 -786467
2664g86467L502948j213665m252858k276794J456486K503593J031298m72547j542802
$$ -786467 2716481 1502816 -2750042 -5026836 -3570350 -1066757 -35459 -508006 -2050808
2655b050808k525703k097379M26954K542548J695773p71519j831094j178029m35504
$$ -2050808 -4576511 -6673890 -6246936 -3704388 -2008615 -2780134 -4611228 -5789257 -6224761
2646f224761K72129J642178K541099J480741k71561l44157Q73862J229673P03284
$$ -6224761 -5952632 -4310454 -1769355 -288614 -560175 -904332 -30470 1199203 1902487
2637A902487Q73526J410502R08621M89426K247593M371798K697423k260129m945539
$$ 1902487 2776013 4186515 5095136 5584562 7832155 12203953 14901376 12641247 7695708
2628G695708l061216j103490k797295m821984k377932K641458M325230J635283
$$ 7695708 4634492 3531002 733707 -4088277 -6466209 -3824751 500479 2135762
2620B135762p51933m626J506665J146554j48413p51397j465510l214288m152425
$$ 2135762 1383829 1379203 2885868 4032422 3884009 3132612 1667102 -1547186 -5699611
2611e699611k067094J667071L415765K172654N73263Q01254J802423J513116J2130
$$ -5699611 -7766705 -6099634 -2683869 -511215 62048 863302 2665725 4178841 4190971
2602D190971j032277q68036L2422J384268K919989L146318N20928l610476n382294
$$ 4190971 3158694 2290658 2323080 3707348 6627337 9773655 10294583 6684107 1301813
2593A301813l011069N74918J348733p70400k434465j716215k12920j69498j410765
$$ 1301813 -1709256 -1134338 214395 -556005 -2990470 -4706685 -4919605 -5089103 -6499868
2584f499868j921298m01331K415156M442300M020603J484694j082745k020148
$$ -6499868 -8421166 -8822497 -6407341 -1965041 2055562 3540256 2457511 437363
2576D37363j541587n57104R20994K977549M296393L231205J35109k828698l950574
$$ 437363 -1104224 -1661328 -740334 2237215 6533608 9764813 9899922 7071224 3120650
2567C120650k860645r922K966350L329759J73882l283248l171937m31173N13335
$$ 3120650 260005 250083 3216433 6546192 6720074 3436826 264889 -166284 347051
2558C47051j384265k281143K5189K321500J340149p31020K02267L510416M849560
$$ 347051 -1037214 -3318357 -3293168 -971668 368481 -362539 -160272 3350144 8199704
2549H199704K613956m87331j993725k349911k598062k333386r77394P96746J792180
$$ 8199704 10813660 10326329 8332604 5982693 3384631 1051245 73851 870597 2662777
2540B662777J372927l05396k040072j849802R87669M255532M692414J726298j917113
$$ 2662777 4035704 3730308 1690236 -159566 828103 5083635 9776049 11502347 9585234
2531I585234l394850k420807p86616k77533j149124k054163j710391q10921j105367
$$ 9585234 6190384 3769577 2982961 2705428 1556304 -497859 -2208250 -3019171 -4124538
2522d124538k163570j207143K374695M829380L075981k05353k73920K325406K748166
$$ -4124538 -6288108 -7495251 -5120556 -291176 2784805 2579452 2305532 4630938 7379104
2513G379104j55566j998402j61601K048942J109941j080233q49105J069461J134661
$$ 7379104 7223538 5225136 5063535 7112477 8222418 7142185 6293080 7362541 8497202
2504H497202j029307k349810j323670K49194N81382M1367l58729l36212J19207
$$ 8497202 7467895 5118085 3794415 4043609 4624991 4666358 4307629 3971417 4090624
2495D090624P41449N00314j099225k437926j559167O14609J217407k21819j007510
$$ 4090624 4832073 5332387 4233162 1795236 236069 850678 2068085 1846266 838756
2486H38756L87671J893418J300620j45801J32622J824330K173176J12695k358307
$$ 838756 1226427 3119845 4420465 4274664 4407286 6231616 8404792 8517487 6159180
2477F159180l080125k144587q79119J12019J000173J653814J454397J34486j575922
$$ 6159180 3079055 934468 55349 167368 1167541 2821355 4275752 4410238 2834316
2468B834316k328378j477205j11550q2818j458552j857306L70969K943704J742979
$$ 2834316 505938 -971267 -1082817 -1165635 -2624187 -4481493 -4110524 -1166820 576159
2459E76159l467231p558517n795839K69368M594642L782529M45832p32313J501065
$$ 576159 -2891072 -10449589 -16245428 -15976060 -11381418 -7598889 -7153057 -7885370 -6384305
2450f384305M375029M931859L146317J268149R69677J769532K172775J607645
$$ -6384305 -2009276 2922583 6068900 7337049 8306726 10076258 12249033 13856678
2442A3856678N17222r97878l197285n091072m516393j030954K574597L269114
$$ 13856678 14373900 13376022 10178737 5087665 571272 -459682 2114915 5384029
2434E384029J337858p58843k027041l084457l400917j499494J760413L107770
$$ 5384029 6721887 5963044 3936003 851546 -2549371 -4048865 -2288452 819318
2426H19318J178265j543588k285961j153221N21144K388498L835979L044577k25391
$$ 819318 1997583 453995 -1831966 -2985187 -2464043 -75545 3760434 6805011 6579620
2417F579620k884506k216006K61872J297231O86222M77657P08479m37236k683053
$$ 6579620 3695114 1479108 1740980 3038211 3724433 4202090 4910569 4473333 1790280
2408A790280l460745j899545R0832J122469J811238K444817K024356M60611p87381
$$ 1790280 -1670465 -3570010 -3479178 -2356709 -545471 1899346 3923702 4384313 3596932
2399C596932j076536j285627j605230j135142k59320o17566j881826j569847P42039
$$ 3596932 2520396 1234769 -370461 -1505603 -1764923 -2382489 -4264315 -5834162 -5092123
2390e092123K176032J161748M8055Q35206J454048n60779l257015k936425p9250
$$ -5092123 -2916091 -1754343 -1706288 -871082 582966 22187 -3234828 -6171253 -6250503
2381f250503J360843L3536j163251J08824K287141K481738L82364j549770q61404
$$ -6250503 -4889660 -4856124 -6019375 -5910551 -3623410 -1141672 -759308 -2309078 -3170482
2372c170482K386849N405735N267841K227163m32902n69447K84046j97707j576211
$$ -3170482 -783633 4622102 9889943 12117106 11684204 11114757 11398803 11201096 9624885
2363I624885k133112k227891l197897l934039j995708J977102M295727L189562
$$ 9624885 7491773 5263882 2065985 -1868054 -3863762 -1886660 2409067 5598629
2355E598629P64244p61767j827746l277973m047037k931900p12414J232306K785484
$$ 5598629 6362873 5601106 3773360 495387 -3551650 -6483550 -7195964 -5963658 -3178174
2346c178174L962292L573599R71085k063466l127756k138514q26067j24157J81034
$$ -3178174 784118 4357717 5328802 3265336 137580 -2000934 -2827001 -2951158 -2770124
2337b770124n7553j158745k200345j807061m18893J44148l20824J27118K265680
$$ -2770124 -2827677 -3986422 -6186767 -7993828 -8412721 -8268573 -8589397 -8462279 -6196599
2328f196599L840673K605852j51510j191815J98814J522838R34332m31141p80976
$$ -6196599 -2355926 249926 98416 -1093399 -894585 628253 1562585 1131444 350468
2319C50468k89720N3833N41261J671228K216389Q66192q80484l81469J604927
$$ 350468 60748 114581 655842 2327070 4543459 5409651 4529167 4147698 5752625
2310E752625J314489k179892m857459l421307q5541J115423L19849M84774J692335
$$ 5752625 7067114 4887222 29763 -3391544 -3477085 -2361662 -2041813 -1557039 135296
2301A35296J215319r90955j351838J556277M113889K811508m77856j277632R36555
$$ 135296 1350615 359660 -992178 564099 4677988 7489496 7011640 5734008 6670563
2292F670563K002737j104399o028629p663031m028698J661905M820323M251887
$$ 6670563 8673300 7568901 1540272 -6122759 -10151457 -8489552 -3669229 582658
2284E82658K170068L74039j307959k553317j594345J361145K529819m79529m205280
$$ 582658 2752726 3126765 1818806 -734511 -2328856 -967711 1562108 1082579 -3122701
2275c122701l774676k50174J273593J22400P59768M354173N902022K353756k087674
$$ -3122701 -6897377 -7147551 -5873958 -5751558 -4991790 -637617 5264405 7618161 5530487
2266E530487k660313j108189j263372j826904M94203L628363K589725k036379
$$ 5530487 2870174 1761985 498613 -1328291 -834088 2794275 5384000 3347621
2258C347621m553186k920509q89234p74516k42110J976232K928612Q50329j165249
$$ 3347621 -1205565 -4126074 -5015308 -5789824 -6031934 -4055702 -1127090 -276761 -1442010
2249a442010m09141N89700j500268m660167m283803k03064L353199L878566K750936
$$ -1442010 -1851151 -1261451 -2761719 -7421886 -11705689 -11908753 -8555554 -4676988 -1926052
$$ [...]
##END NTUPLES=NMR SPECTRUM
##END=
