##TITLE=31Pdec_DE-102_ch_8_TFA
CDCl3, 64 sc
 27.8.2025
##JCAMPDX= 6.0         $$ Bruker NMR JCAMP-DX V2.0
##DATA TYPE= NMR SPECTRUM
##DATA CLASS= NTUPLES
##ORIGIN= UXNMR, Bruker Analytische Messtechnik GmbH
##OWNER= root
$$ XWIN-NMR		Version 3.5
$$ Wed Aug 27 16:11:56 2025 Russian Standard Time (UT+4h)  she@DPX200
##.OBSERVE FREQUENCY= 81.013821
##.OBSERVE NUCLEUS= ^31P
##.ACQUISITION MODE= SIMULTANEOUS
##.ACQUISITION SCHEME= undefined
##.AVERAGES= 64
##.DIGITISER RES= 17
##SPECTROMETER/DATA SYSTEM= spect
##.PULSE SEQUENCE= zgpg30
##.SOLVENT NAME= CDCl3
##.SHIFT REFERENCE= (INTERNAL, CDCl3, 0, 198.062)
##AUDIT TRAIL= $$ (NUMBER, WHEN, WHO, WHERE, WHAT)
$$ ##TITLE= Audit trail, XWIN-NMR		Version 3.5
$$ ##JCAMPDX= 5.01
$$ ##ORIGIN= Bruker BioSpin GmbH
$$ ##OWNER= she
$$ F:/spectra/data/she/nmr/P31/2/pdata/1/auditp.txt
$$ ##AUDIT TRAIL=  $$ (NUMBER, WHEN, WHO, WHERE, WHAT)
(   1,<2025-08-27 16:10:33.98 +0400>,<she>,<DPX200>,
      <created by zg, POWCHK disabled, PULCHK disabled
       configuration hash MD5:
       00 E9 B6 7A A2 85 ED C7 34 08 36 98 17 FE 4E 26
       data hash MD5: 32K
       6F 52 AB C0 E9 CD C6 12 72 88 A7 86 FF 3C 7D 17>)
(   2,<2025-08-27 16:10:36.98 +0400>,<she>,<DPX200>,
      <Start of raw data processing
       efp BC_mod = 2 LB = 1.5 FT_mod = 6 PKNL = 1 PHC0 = 1593.038 PHC1 = -446.9 SI = 64K 
       data hash MD5: 64K
       A4 3E F2 81 E5 1C 1C C4 C0 69 10 B8 EF BB 3C 89>)
(   3,<2025-08-27 16:11:02.57 +0400>,<she>,<DPX200>,
      <pk PHC0 = 3.964235 PHC1 = 0 
       data hash MD5: 64K
       0D D7 41 5B D5 24 E0 81 E4 37 8A DF 2E CF 08 D9>)
(   4,<2025-08-27 16:11:09.73 +0400>,<she>,<DPX200>,
      <abs ABSG = 5 
       data hash MD5: 64K
       AC 22 BE 01 F6 29 66 10 8F AD B0 7F 6A 91 EA AD>)
$$ ##END=
$$ 
$$ hash MD5
$$ BF 4C 1C 58 8F 87 3B 54 2B B2 33 DC D5 4A 83 9B
##$RELAX= 
##$RELAX= 
##$RELAX= 
##$RELAX= 
##$RELAX= 
##$RELAX= 
##$RELAX= 
##$RELAX= 
$$ Bruker specific parameters
$$ --------------------------
##$DU= <F:/spectra>
##$EXPNO= 2
##$NAME= <P31>
##$PROCNO= 1
##$TYPE= <nmr>
##$USER= <she>
##$AMP= (0..31)
100 100 100 100 100 100 100 100 100 100 100 100 100 100 100 100 100 100 
100 100 100 100 100 100 100 100 100 100 100 100 100 100 
##$AQSEQ= 0
##$AQ_mod= 1
##$AUNM= <au_zg>
##$AUTOPOS= <>
##$BF1= 81.014009
##$BF2= 200.13
##$BF3= 200.13
##$BF4= 200.13
##$BF5= 200.13
##$BF6= 200.13
##$BF7= 200.13
##$BF8= 200.13
##$BYTORDA= 1
##$CFDGTYP= 0
##$CFRGTYP= 5
##$CHEMSTR= <none>
##$CNST= (0..31)
1 1 145 1 1 1 1 1 1 1 1 1 1 1 1 1 1 1 1 1 1 1 1 1 1 1 1 1 1 1 1 1 
##$CPDPRG= <waltz16>
##$CPDPRG1= <>
##$CPDPRG2= <waltz16>
##$CPDPRG3= <>
##$CPDPRG4= <mlev>
##$CPDPRG5= <mlev>
##$CPDPRG6= <mlev>
##$CPDPRG7= <mlev>
##$CPDPRG8= <mlev>
##$CPDPRGB= <>
##$CPDPRGT= <>
##$D= (0..31)
0 1 0 0 0 0 0 0 0 0.06 0 0.03 2e-05 3e-06 0 0 0.0002 0 0 0 0 0 0 0 0 0 
0 0 0 0 0 0 
##$DATE= 1756296633
##$DBL= (0..7)
120 120 120 11 120 120 24 19 
##$DBP= (0..7)
150 150 150 150 150 150 150 150 
##$DBP07= 0
##$DBPNAM0= <>
##$DBPNAM1= <>
$$ [...]
##$SUBNAM3= <"">
##$SUBNAM4= <"">
##$SUBNAM5= <"">
##$SUBNAM6= <"">
##$SUBNAM7= <"">
##$SUBNAM8= <"">
##$SUBNAM9= <"">
##$SW= 400.765351723535
##$SWIBOX= (0..15)
0 1 3 0 0 0 0 0 0 0 0 0 0 0 0 0 
##$SW_h= 32467.5324675325
##$TD= 32768
##$TD0= 1
##$TE= 0
##$TE2= 300
##$TE3= 300
##$TEG= 300
##$TL= (0..7)
0 120 53 12 22 120 120 120 
##$TP= (0..7)
150 150 150 150 150 150 150 150 
##$TP07= 0
##$TPNAME0= <>
##$TPNAME1= <>
##$TPNAME2= <>
##$TPNAME3= <>
##$TPNAME4= <>
##$TPNAME5= <>
##$TPNAME6= <>
##$TPNAME7= <>
##$TPOAL= (0..7)
0.5 0.5 0.5 0.5 0.5 0.5 0.5 0.5 
##$TPOFFS= (0..7)
0 0 0 0 0 0 0 0 
##$TUNHIN= 0
##$TUNHOUT= 0
##$TUNXOUT= 0
##$USERA1= <user>
##$USERA2= <user>
##$USERA3= <user>
##$USERA4= <user>
##$USERA5= <user>
##$V9= 5
##$VALIST= <valist>
##$VCLIST= <CCCCCCCCCCCCCCC>
##$VD= 0
##$VDLIST= <DDDDDDDDDDDDDDD>
##$VPLIST= <PPPPPPPPPPPPPPP>
##$VTLIST= <TTTTTTTTTTTTTTT>
##$WBST= 1024
##$WBSW= 4
##$XGAIN= (0..3)
0 0 0 0 
##$XL= 0
##$YL= 0
##$YMAX_a= 4609
##$YMIN_a= -3854
##$ZGOPTNS= <>
##$ZL1= 120
##$ZL2= 120
##$ZL3= 120
##$ZL4= 120
##$ABSF1= 198.0616
##$ABSF2= -202.7028
##$ABSG= 5
##$ABSL= 3
##$ALPHA= 0
##$AQORDER= 0
##$ASSFAC= 0
##$ASSFACI= 0
##$ASSFACX= 0
##$ASSWID= 0
##$AUNMP= <proc_1d>
##$AZFE= 0.1
##$AZFW= 0.5
##$BCFW= 0
##$BC_mod= 2
##$BYTORDP= 0
##$COROFFS= 0
##$CY= -3
##$DATMOD= 1
##$DC= 0
##$DFILT= <>
##$DTYPP= 0
##$F1P= 0
##$F2P= 0
##$FCOR= 1
##$FTSIZE= 65536
##$FT_mod= 6
##$GAMMA= 0
##$GB= 0
##$INTBC= 1
##$INTSCL= 9.790993e-09
##$ISEN= 30
##$LB= 1.5
##$LEV0= 0
##$LPBIN= 0
##$MAXI= 10000
##$MC2= 0
##$MEAN= 0
##$ME_mod= 0
##$MI= 50
##$NCOEF= 0
##$NC_proc= -9
##$NLEV= 6
##$NOISF1= 182.463
##$NOISF2= 159.3651
##$NSP= 0
##$NTH_PI= 0
##$NZP= 0
##$OFFSET= 198.0616
##$PC= 4
##$PHC0= 1597.002
##$PHC1= -446.9
##$PH_mod= 1
##$PKNL= yes
##$PPARMOD= 0
##$PSCAL= 0
##$PSIGN= 0
##$REVERSE= no
##$SF= 81.0140089999434
##$SI= 65536
##$SIGF1= 159.3651
##$SIGF2= -187.1042
##$SINO= 113.3802
##$SIOLD= 16384
##$SREGLST= <1H.CDCl3>
##$SSB= 0
##$STSI= 65536
##$STSR= 0
##$SW_p= 32467.5324675325
##$SYMM= 0
##$S_DEV= 0
##$TDeff= 32768
##$TDoff= 0
##$TI= <>
##$TILT= no
##$TM1= 0
##$TM2= 0
##$TOPLEV= 0
##$USERP1= <user>
##$USERP2= <user>
##$USERP3= <user>
##$USERP4= <user>
##$USERP5= <user>
##$WDW= 1
##$XDIM= 65536
##$YMAX_p= 314754521
##$YMIN_p= -311440691
$$ End of Bruker specific parameters
$$ ---------------------------------
##NTUPLES= NMR SPECTRUM
##VAR_NAME=  FREQUENCY,     SPECTRUM/REAL,   SPECTRUM/IMAG
##SYMBOL=    X,             R,               I
##VAR_TYPE=  INDEPENDENT,   DEPENDENT,       DEPENDENT
##VAR_FORM=  AFFN,          ASDF,            ASDF
##VAR_DIM=   65536,         65536,           65536
##UNITS=     HZ,            ARBITRARY UNITS, ARBITRARY UNITS
##FACTOR=    0.49542278885378, 1,            1
##FIRST=     16045.7642231865, 0,            0
##LAST=      -16421.768244346, 0,            0
##MIN=       -16421.768244346, -311440691,   0
##MAX=       16045.7642231865, 314754521,    0
$$ Real data points
##PAGE= N=1
##DATA TABLE= (X++(R..R)), XYDATA
$$ [...]
##PAGE= N=2
##DATA TABLE= (X++(I..I)), XYDATA
6642b0725569o58745N235119Q632769O702104K941204J359062J475035J245014
6634F205993P40093K51103j579607m740869o023031l195521J528456M762942N860562
6625C810121M992594R44885n338693q394981m515515J869702L486309K94491j597699
6616d448786j38976L33913k389412m446617k861576l62899J47055O05525L128604
6607a0433169N038791L541781J543197L072282N659557L629278k300106n151544
6599D600067j692759L454298M902268K641987o35423l704994n758288n052170
6591a245014j747352N70928q37451l975252m922580k749149O40307L613939N126640
6582e524984L684533p87124m928408m920217j290363J844717K134362R40230K470
$$ plain form
6642 -20725569 -21384314 -16149195 -7516426 -814322 2126882 3485944 4960979 6205993
6634 6205993 6946086 7197189 5617582 876713 -5146318 -8341839 -6813383 -2050441 3810121
6625 3810121 8802715 9747600 4408907 -3986074 -8501589 -6631887 -3145578 -2851087 -4448786
6616 -4448786 -4587762 -4253849 -6643261 -11089878 -13951454 -14314353 -14167298 -13561773 -10433169
6607 -10433169 -5394378 -1852597 -309400 2762882 8422439 12051717 9751611 4600067
6599 4600067 2907308 6361606 11263874 13905861 13270438 9565444 3807156 -1245014
6591 -1245014 -2992366 -2421438 -3258889 -7234141 -12156721 -14905870 -14265563 -10651624 -5524984
6582 -5524984 -1840451 -2627575 -7555983 -12476200 -13766563 -11921846 -9787484 -8847254 -8844784
6573h844784p20337j019501P24258M587930O961417L994291l307517r479486j0210206
6564a7313935o095289o78666L533060O117474P136021O443071M645807L084616
6556F872159K095759O01731j528552k213512k76587J304499j490543p122453q731547
6547a0489046l014875M332737N553215J084224j766083J37636J600482j884600
6539d446310n943916l182416M950273Q286283J311412q456688r336578l76380
6531a7194320P428448N187632l031118o304993j143114M844465L720892k589279
6523i081387n585235j369240N091704O829670K949322j587314k451905j77070
6515e381455J805509J631156N81574O99407J920850K279954O44207j784567l094589
$$ plain form
6573 -8844784 -9565121 -10584622 -9860364 -5272434 1688983 5683274 2375757 -7103729 -17313935
6564 -17313935 -23409224 -24087890 -20554830 -14437356 -7301335 -858264 3787543 6872159
6556 6872159 8967918 9569649 8041097 5827585 5550998 6855497 5364954 -1757499 -10489046
6547 -10489046 -13503921 -9171184 -3617969 -2533745 -4299828 -4162192 -2561710 -4446310
6539 -4446310 -10390226 -13572642 -8622369 -336086 975326 -7481362 -16817940 -17194320
6531 -17194320 -9765872 -4578240 -7609358 -13914351 -15057465 -10213000 -6492108 -9081387
6523 -9081387 -14666622 -16035862 -10944158 -4114488 -1165166 -2752480 -5204385 -5381455
6515 -5381455 -3575946 -1944790 -1363216 -663809 1257041 3536995 4181202 2396635 -697954
6506f97954k860934j840025k42895K166646M329108M020817O97078k943007l660260
6497a031426j557881J53808o22523k405449k743864j889095j913522k662164j315431
6488a5987547K889417O014995M120505q50640l268050j553386J12313j376179
6480i898572l656749l649595k741417l250219k773165K360981R139487R598048
6472d871201J759131o485073p024460r19993M870067O503046N198814L008801
6464B039132J157271J169970L337946M616915J961646k517715l659352o40852
6456G464961J845028O53012j685675j619094L79840J843100K181987J695152m42697
6447A2315614l791994m668782p49008L837054K737062l522564p420669m463711
$$ plain form
6506 -697954 -3558888 -5398913 -5641808 -3475162 853946 4874763 5571841 2628834 -1031426
6497 -1031426 -2589307 -2435499 -3058022 -5463471 -8207335 -10096430 -12009952 -14672116 -15987547
6488 -15987547 -13098130 -7083135 -2962630 -3813270 -7081320 -8634706 -8522393 -9898572
6480 -9898572 -13555321 -17204916 -19946333 -23196552 -25969717 -23608736 -14469249 -4871201
6472 -4871201 -3112070 -9597143 -16621603 -17541596 -12671529 -6168483 -969669 2039132
6464 2039132 3196403 4366373 7704319 12321234 14282880 11765165 8105813 7464961
6456 7464961 9309989 9963001 8277326 6658232 7038072 8881172 11063159 12758311 12315614
6447 12315614 8523620 3854838 3105830 6942884 9679946 6157382 -1263287 -5726998
6439e726998J072514K663028J50527j506052J40679K459259K329000J46099j518414
6430B09642j451306r39170j778181l501594l119471J210554O359239O372068l06876
6421C054905p958609j0042365o557734k156862J132719M884319Q501471P867763
6413a274393J874822l885411l483833J612489M670697K389696j800917k967437
6405b864287m94473K001792J153267k297014l860278k60954N717646P345518K231743
6396H672960l929891m525382p18561R68027j562839l749659k365167l64612j244316
6387h819440k988663j632458J910928L107447Q70512q29492J092180M381244M212132
6378A304390j079922p781196r749942m077599N209106J0060800O569704p29543
$$ plain form
6439 -5726998 -4654484 -1991456 -1840929 -3346981 -3206302 -747043 1581957 1728056 209642
6430 209642 -1241664 -2180834 -3959015 -7460609 -10580080 -9369526 -3010287 3361781 3054905
6421 3054905 -4903704 -14946069 -21503803 -23660665 -22527946 -17643627 -9142156 -1274393
6413 -1274393 600429 -3284982 -6768815 -5156326 -485629 1904067 103150 -2864287
6405 -2864287 -3358760 -1356968 -203701 -2500715 -6360993 -6621947 -904301 6441217 8672960
6396 8672960 4743069 217687 -500874 467153 -1095686 -4845345 -7210512 -7575124 -8819440
6387 -8819440 -11808103 -13440561 -11529633 -8422186 -7551674 -8381166 -7288986 -2907742 1304390
6378 1304390 224468 -7556728 -17306670 -21384269 -16175163 -6114363 455341 -274202
6370b74202m464581k867144J84696K142964M261565O707498O227897J434659l278897
6361A0074455k932034R81323K444534r84711n532745o584071l803263n63883l67831
6352g268226l782289p078108m727775M066251J2206719J1822204M403061p28628
6344H913209J023065L775823O89758n939512q976003p092272n007478m980264
6336a7593674m538635k498866j017527n51777J475434M996842N660103J731906
6328a2336194k165315j730636R20726J879419K044030M010219N713416L307930
6320A643595j432842k827868J52858K811086K207547J13841j932841m663279o872993
6311a0800896n025132N44743M177800K550901p58666j358501j53229J85681M80183
$$ plain form
6370 -274202 -4738783 -7605927 -7421231 -5278267 -1016702 5690796 11918693 13353352 10074455
6361 10074455 7142421 8123744 10568278 9583567 4050822 -2533249 -6336512 -6900395 -7268226
6352 -7268226 -11050515 -18128623 -22856398 -18790147 -6583428 5238776 9641837 8913209
6344 8913209 9936274 13712097 14401855 8462343 -513660 -7605932 -12613410 -17593674
6336 -17593674 -22132309 -24631175 -25648702 -26200479 -24725045 -19728203 -14068100 -12336194
6328 -12336194 -14501509 -16232145 -15311419 -13432000 -11387970 -7377751 -1664335 1643595
6320 1643595 210753 -2617115 -2464257 346829 2554376 2668217 735376 -3927903 -10800896
6311 -10800896 -15826028 -15281285 -11103485 -8552584 -9311250 -10669751 -10822980 -10637299 -10157116
6302a0157116K326203L667069J907385j160914k060953r38405Q3614J255900L266395
6293a810822L656596N71035k285480n06710L090094K132146k923728n405817l087461
6284f570147m48162L06661K208306N636384N883142J871407p56191N49216M15613
6275I096229m074421o382298j268579M878429L746891r26929o8713M263088J807505
6266A1071202p593358j1776524m895988L440736K808832l753275o637824l611493
6258b0947692L09188J952647J964825O77931j949627l905143l108106l42563K848767
6249b2499773O555024R656715Q242275J330003m985870m364139J007604L735859
6241a322302J577762j080435j038953K50884J099739J976822K451019L87781m179157
$$ plain form
6302 -10157116 -7830913 -4163844 -2256459 -3417373 -5478326 -6416731 -6333117 -5077217 -1810822
6293 -1810822 1845774 2416809 131329 -375381 2714713 4846859 1923131 -3482686 -6570147
6284 -6570147 -7018309 -6711648 -4503342 1133042 7016184 8887591 8131400 8680616 9096229
6275 9096229 5021808 -1360490 -2629069 2249360 5996251 5069322 5000609 9263697 11071202
6266 11071202 3477844 -8298680 -13194668 -9753932 -6945100 -10698375 -17336199 -20947692
6258 -20947692 -20638504 -18685857 -16721032 -16043101 -17992728 -21897871 -25005977 -25348540 -22499773
6249 -22499773 -15944749 -6288034 1954241 3284244 -1701626 -6065765 -5058161 -1322302
6241 -1322302 255460 -824975 -1863928 -1613044 -513305 1463517 3914536 4302317 123160
6232A23160p846359p897035m981928j235938J678588K649589K105750K672756
6224a2731417N768839Q261969O327263J813784j00984O68764j123145o893094
6216A991979j0927650q691316k998730J237826L487090N165581N244461K651071
6208b839688m11438j642305k019548k354169l21728M564614P027766K984358k671361
6199B316501k034267L918341O585516K303049l619266o057568o071946n680898
6191h340538l367830J491475M944635L661043L10898m25270J345249J979889O80705
6182B280256N86149L674286P500760P699739K623750m560848q256346n912559
6174E635187j224416j64369l585369o151005l487346K221398N431998L847849
$$ plain form
6232 123160 -7723199 -15620234 -20602162 -21838100 -20159512 -17509923 -15404173 -12731417
6224 -12731417 -6962578 1299391 7626654 9440438 9339454 10008218 8885073 1991979
6216 1991979 -8935671 -17626987 -20625717 -19387891 -15900801 -10735220 -5490759 -2839688
6208 -2839688 -3251126 -4893431 -6912979 -9267148 -9588876 -5024262 2003504 4987862 2316501
6199 2316501 282234 4200575 10786091 13089140 9469874 3412306 -2659640 -8340538
6191 -8340538 -11708368 -10216893 -5272258 -1611215 -1300317 -1725587 -380338 1599551 2280256
6182 2280256 2866405 6540691 14041451 21741190 24364940 19804092 11547746 5635187
6174 5635187 4410771 4246402 661033 -5489972 -8977318 -6755920 -1323922 2523927
6166B523927j27258k854181k455271L89046L021090L167571J579959P69674O24050
6157F638607j909233p247706j0369251o428514K746986J0368682J1382075N660782
6149A0842428k865010p742359l916366N758951J0506072L244510r290807j3589414
6141g051995n887918M260921P262354L918207O02539O9307Q67772J522685J092827
6132F656699j495916n103554o014602l136158n77316j479571k620601J59889M268473
6123i342657M168486Q20150P2629K032232J02006p349923j2176015p797475R18349
6114b8552218N064201M178138M153270N754107L746414k532745n974145k014198
6106a6177176M084480M638565L3708l071432j575072J138524J587147R20821J908656
$$ plain form
6166 2523927 2396669 -457512 -2912783 -2523737 497353 3664924 5244883 6014557 6638607
6157 6638607 4729374 -2518332 -12887583 -19316097 -16569111 -6200429 5181646 10842428
6149 10842428 7977418 235059 -3681307 2077644 12583716 15828226 6537419 -7051995
6141 -7051995 -12939913 -8678992 -1416638 2501569 3104108 3173415 4041187 5563872 6656699
6132 6656699 5160783 57229 -5957373 -9093531 -9670847 -11150418 -13771019 -13611130 -9342657
6123 -9342657 -5174171 -4354021 -4281392 -2249160 -2147154 -9497077 -21673092 -29470567 -28552218
6114 -28552218 -23488017 -19309879 -15156609 -9402502 -5656088 -8188833 -14162978 -16177176
6106 -16177176 -12092696 -7454131 -7420423 -10491855 -12066927 -10928403 -9341256 -8420435 -6511779
6097f511779M204619M886599K679680l28488j588004j517578k605603n106072
6089e886626n688703k011210L032167M507718K116353J67397Q98873J970199J625846
6080G32014J730095L223294L064426m89506l455675j873770J058067o06653n862727
6071b480435p754265l613848J843813M241203M526403M806656M526904L029171
6063I125602J664427J318396J398702K302241M594554N053654p04165r913733
6055A4839678j3483334q305957k164524j910866l555159n97405L928420K562814
6047h686333l260488m820190N1711M056836K266321j462831k241611j238451j686483
6038a7021519l226585l625744k143602J324708O656882J1001019R996931L882463
$$ plain form
6097 -6511779 -2307160 2579439 5259119 4930631 3342627 1825049 -780554 -5886626
6089 -5886626 -11575329 -13586539 -10554372 -6046654 -3930301 -3762904 -2864031 -893832 732014
6080 732014 2462109 5685403 8749829 8260323 4804648 2930878 3988945 3382292 -2480435
6071 -2480435 -10234700 -13848548 -12004735 -7763532 -3237129 1569527 6096431 9125602
6063 9125602 10790029 12108425 13507127 15809368 20403922 25457576 24753411 14839678
6055 14839678 1356344 -6949613 -9114137 -11025003 -14580162 -15177567 -11249147 -8686333
6047 -8686333 -11946821 -16767011 -16715300 -12658464 -10392143 -11854974 -14096585 -15335036 -17021519
6038 -17021519 -20248104 -23873848 -26017450 -24692742 -18035860 -7034841 2962090 6844553
6030F844553j558189k567994j844756k648919l032846j93800L076072J703494
6022b22385l603692o757925m592723n04548R88200J5312K1998K482080M923207
6013g250476M349212J473130o3984R19446R45154k507157n446286k161965N061286
6004d681640P096164O21529o327767n287960J150836M121740J208046j877299
5996c976351p62792K550132M227296L137794J51397l026473l770788j089794J363164
5987a196415j062177o658143q172586k619086M136290N272666J655675r54991
5979i598767k99696J132460J495564J484127R98192j648428n848750p484598l860995
5970b3630891K319928O358515P495748Q636745J0687036J0522078N852746n44331
$$ plain form
6030 6844553 5286364 2718370 873614 -1775305 -4808151 -5001951 -1925879 -222385
6022 -222385 -3826077 -10584002 -15176725 -15681273 -14693073 -14677761 -14655763 -12173683 -7250476
6013 -7250476 -2901264 -1428134 -1492118 -572672 372482 -2134675 -7580961 -9742926 -4681640
6004 -4681640 2414524 3036053 -3291714 -8579674 -7428838 -3307098 -2099052 -3976351
5996 -3976351 -4739143 -2189011 2038285 5176079 5327476 2301003 -1469785 -2559579 -1196415
5987 -1196415 -2258592 -8916735 -17089321 -19708407 -15572117 -10299451 -8643776 -9598767
5979 -9598767 -9898463 -8766003 -7270439 -5786312 -4788120 -6436548 -12285298 -19769896 -23630891
5970 -23630891 -21310963 -14952448 -7456700 1180045 11867081 22389159 28241905 27697574
5962B7697574l985678l923159l895302n716257o924832n098110j843254k66872
5954c955890m69542l96094L2030r23875k541291j210426M014543Q235176N918697
5945H703328j935146q595991r240256n182988l38876L418188N713835N267844
5937b190062J423609k895862l474443n76485R80842r86960k179529J834806P969907
5928i4177Q780009K701784l406291l273917Q72082J999506k229720o701437n452948
5919f805109J014022O031166M113361k717090p010270m528478R46771K937548
5911f018079N01723j859399j426061k84963o65049j390745r00679m68774j682643
5902a4194669k871352q62400M632121J0271810J2093376Q412873J040420n597430
$$ plain form
5962 27697574 23711896 19788737 15893435 10177178 3252346 -1845764 -3689018 -3955890
5954 -3955890 -4425432 -4821526 -4789496 -5713371 -8254662 -9465088 -5450545 2784631 8703328
5945 8703328 6768182 -1827809 -11068065 -16251053 -16589929 -13171741 -7457906 -2190062
5937 -2190062 -766453 -3662315 -7136758 -7713243 -6732401 -7719361 -9898890 -8064084 -94177
5928 -94177 8685832 11387616 7981325 4707408 5579490 7578996 5349276 -1352161 -6805109
5919 -6805109 -5791087 240079 4353440 1636350 -5373920 -9902398 -8955627 -6018079
5911 -6018079 -5516356 -7375755 -8801816 -9086779 -9751828 -11142573 -12043252 -12512026 -14194669
5902 -14194669 -17066021 -17928421 -13296300 -3024490 9068886 17481759 18522179 12924749
5894A2924749p982704o649566m299983j438439K853607O187081M099481k438235
5886C255991o204876l491611N56110N40587n70489K472342O833681N197278k272527
5877F316486p626166o675000l379120j676297n9976L209789N561882M304861J039750
5868A016209j319838k519106l241473k616122k45410J826117J679643Q4832j207037
5859f542185j523667l57624K738699N734500M791657k94789m191131k441575K362771
5850B76656L813898k88964n798039p330083l535793K193139N038509L398661N83729
5841a648287N77131K433557J745323k057824l970574r00681L085324K386504k221057
5832e70584n254867m100250p44928K787998O140445P727350M759963j928640o354970
$$ plain form
5894 12924749 4942045 -1707521 -6007504 -7445943 -4592336 1594745 5694226 3255991
5886 3255991 -2948885 -6440496 -5884386 -5343799 -5914288 -3441946 3391735 8589013 6316486
5877 6316486 -1309680 -7984680 -11363800 -13040097 -13100073 -9890284 -4328402 -23541 1016209
5868 1016209 -303629 -2822735 -6064208 -8680330 -8925740 -7099623 -5419980 -5335148 -6542185
5859 -6542185 -8065852 -8423476 -5684777 49723 4841380 4546591 355460 -2086115 276656
5850 276656 4090554 3801590 -1996449 -9326532 -12862325 -10669186 -5630677 -2232016 -1648287
5841 -1648287 -1071156 1362401 3107724 1049900 -2920674 -3821355 -736031 1650473 -570584
5832 -570584 -5825451 -9925701 -10670629 -7882631 -1742186 5985164 10745127 8816487 2461517
5823B461517l761523K698755M749046r10572p795564p283778K08087N543289L151016
5814i39727j592525p50702M422541O166372K552075m24748N46520J332324j059162
5805A0252968k610654J62353L071546R22149l456159l964554j677052k648145
5797E2452o733737o702664N14759Q491062R606009L779087l480416p785345q077790
5788a0336583n155511q48088K585206L876227L081904O27118k518491m111257
5780a2799475k306501J736384M732815M787476K538226n15705k791544k524319
5772g142643N39553L675466L736959Q00079k741396n495519o795567m782792J112383
5763a7093477O576076O087932O12804k954032j109324J964968J284439j953889
$$ plain form
5823 2461517 -1300006 1398749 6147795 5237223 -2558341 -9842119 -9634032 -4090743 -939727
5814 -939727 -2532252 -3282954 1139587 7305959 9858034 9433286 9979806 11312130 10252968
5805 10252968 7642314 7804667 10876213 11798362 8342203 4377649 2700597 52452
5797 52452 -6681285 -13383949 -12869190 -4378128 5227881 9006968 5526552 -2258793 -10336583
5788 -10336583 -15492094 -16340182 -13754976 -9878749 -6796845 -6169727 -8688218 -12799475
5780 -12799475 -15105976 -13369592 -8636777 -3849301 -1311075 -1826780 -4618324 -7142643
5772 -7142643 -6603090 -2927624 809335 1609414 -1131982 -6627501 -13423068 -18205860 -17093477
5763 -17093477 -10517401 -4429469 -3816665 -6770697 -7880021 -5915053 -4630614 -6584503
5755f584503l124800p86987K626619M780325N271452M587330L354422K025887
5747A2149745K38483k512984m969334m613247j095296K535083L243033J254927
5739F230410j152809k643337l305683l233089k041319K64729K437642K408583
5731a034873l77405k819392o29922N461036Q714224M720460j803214l057961R13329
5722A0086282L125675P05496j713547o73134Q10896o13289l045844l493676k760002
5713B428857k405559j188750J479710K506066k55709l840119m698943l864453
5705i838900l448315j973631J678368L493682j26671m815324l313206L292840
5697a5051157O565386K834893k542569m000039k368770n68470J614698N087180
$$ plain form
5755 -6584503 -9709303 -10496290 -7869671 -3089346 2182106 6769436 10123858 12149745
5747 12149745 12388228 9875244 4905910 292663 -802633 1732450 4975483 6230410
5739 6230410 5077601 2434264 -871419 -4104508 -6145827 -5881098 -3443456 -1034873
5731 -1034873 -1412278 -4231670 -4861592 599444 9313668 14034128 12230914 9172953 10086282
5722 10086282 13211957 13917453 12203906 11530772 12341668 11728379 8682535 5188859 2428857
5713 2428857 23298 -1165452 314258 2820324 2564615 -1275504 -5974447 -9838900
5705 -9838900 -13287215 -15260846 -13582478 -10088796 -10215467 -15030791 -18343997 -15051157
5697 -15051157 -8485771 -5650878 -8193447 -12193486 -14562256 -15130726 -13516028 -8428848
5689h428848P715269O614464K256911k051198l673170k599352j091816j554770
5681b812510l420134k919360J918813P217527P311720K050604l384750n205527
5673G56383l775028o34513K422754J903347l820744q995087n290916N629886J1207934
5664e95984L917527p795471j0374505k572979M967301N099673J404035k57682
5656f208085k36178j921154m735832m823426j173968K730297L712181K644699
5648a0011466K009109J571578q84803m913453o758375m695891j971365j782280
5640b7436946k035221J048269O126424Q406369P079219N644101M971987K100686
5632E904888l017143n833554m535759l074147l849987l340340J008985N302077
$$ plain form
5689 -8428848 -713579 5900885 8157796 6106598 2433428 -165924 -1257740 -2812510
5681 -2812510 -6232644 -9152004 -7233191 -15664 7296056 9346660 5961910 756383
5673 756383 -3018645 -3653158 -1230404 672943 -3147801 -12142888 -17433804 -11803918 -595984
5664 -595984 3321543 -4473928 -14848433 -17421412 -12454111 -7354438 -5950403 -6208085
5656 -6208085 -6444263 -8365417 -13101249 -17924675 -19098643 -16368346 -12656165 -10011466
5648 -10011466 -8002357 -6430779 -7315582 -12229035 -18987410 -23683301 -25654666 -27436946
5640 -27436946 -29472167 -28423898 -22297474 -13891105 -6811886 -1167785 3804202 5904888
5632 5904888 2887745 -2945809 -7481568 -10555715 -14405702 -17746042 -16737057 -11434980
5624a1434980N547613M104228M058437K501079l357798p912140l904229N026754
5616e371036P823912J541180n355639n882062k342277N81563K633213M641807
5608a729339M897798K665364M71788j49584r13599k552383k913312j341290j44009
5599a708566K03614J911290L939977J661805m426223o506934n96407O473757O832780
5590G785093K465584j10706o01070k689381n385073n067506l250941l812460m565598
5581a5232058l97402O377340Q022719L853236J441265L933697N308038J302357
5573A4609192l367154l176159j28115J192385J145485K223669L257242J800948
5565A7557493r93482k522972k866722k796832q49242L362514N898643L201470
$$ plain form
5624 -11434980 -5887367 -1783139 2275298 4776377 1418579 -6493561 -10397790 -5371036
5616 -5371036 2452876 3994056 -1361583 -7243645 -9585922 -9004359 -6371146 -1729339
5608 -1729339 3168459 5833823 6305611 6156027 5242428 2690045 -223267 -1564557 -1708566
5599 -1708566 -1504952 406338 4346315 6008120 1581897 -4925037 -5521444 952313 7785093
5590 7785093 10250677 10139971 9538901 6849520 1464447 -3603059 -6854000 -10666460 -15232058
5581 -15232058 -15629460 -9252120 -1229401 2623835 4065100 7998797 13306835 14609192
5573 14609192 11242038 8065879 7937764 9130149 10275634 12499303 15756545 17557493
5565 17557493 16564011 14041039 11174317 8377485 7528243 10890757 16789400 19990870
5557A9990870k135594m560291k628885Q72339L592710M380773J729342l954944
5549A7286320q289042p637035m342787k851723k611050k65865K599040O51804
5541e460338n760459q809911l208154O607653J1919655R059618J263696n773001
5533a61241q060414n393631j328908K01103r31593j664805l70773J562144K755594
5524a3392524L455295L640334K554955R33307P95337K113324K472220R44441m91699
5515C024990k84614P06151J258963R46593j050517m724583o621870l098137K933398
5506f909626M031650j024412m597364j651026K560558J551639j588823J33131
5498g494273N379192O582405K220451j811946k639758l412526m886109k924383
$$ plain form
5557 19990870 17855276 13294985 10666100 11538439 15131149 19511922 21241264 17286320
5549 17286320 8997278 1360243 -2982544 -5834267 -8445317 -8711182 -6112142 -5460338
5541 -5460338 -11220797 -20030708 -23238862 -16631209 -4711554 4348064 5611760 -161241
5533 -161241 -8221655 -13615286 -14944194 -14743091 -15674684 -17339489 -17710262 -16148118 -13392524
5524 -13392524 -9937229 -6296895 -3741940 -2808633 -2013296 100028 2572248 3516689 3024990
5515 3024990 2740376 3446527 4705490 5652083 4601566 -123017 -6744887 -9843024 -6909626
5506 -6909626 -2877976 -3902388 -8499752 -10150778 -7590220 -6038581 -7627404 -7494273
5498 -7494273 -2115081 4467324 6687775 4875829 2236071 -1176455 -6062564 -8986947
5490h986947K598909M655690l33272n560762l421961L335350O605713M888900
5482C781620L018013K761583J623886N7378J802201N912666N803232r86763q252855
5473A5520961r976580q306588q055591p926341l542760L459596O443366L641492
5465h742445N79512J248236K552094L28814l733901m977180k327313J920864O289847
5456f861472R744495R107379K207923o600765r365674m390268J226130J031387
5448c900865k776566l941563j452737K37534j159487k751398j704817M86321J090443
5439a5873135Q60065K578897N693661N706702L46775n800076n748745R04674O540594
5430d790588M726137j628430m377658r42746L122822K597135o88495j675834O53807
$$ plain form
5490 -8986947 -6388038 -1732348 -2065620 -7626382 -11048343 -7712993 -1107280 3781620
5482 3781620 6799633 9561216 11185102 11242480 13044681 18957347 24760579 23773816 15520961
5473 15520961 5544381 -2762207 -10817798 -18744139 -22286899 -18827303 -12383937 -8742445
5465 -8742445 -8162933 -6914697 -4362603 -4033789 -7767690 -12744870 -15072183 -13151319 -6861472
5456 -6861472 2883023 11990402 14198325 7597560 -1768114 -6158382 -4932252 -3900865
5448 -3900865 -6677431 -10618994 -12071731 -11834197 -12993684 -15745082 -17449899 -16963578 -15873135
5439 -15873135 -15013070 -12434173 -6740512 -1033810 -687035 -6487111 -12235856 -11331182 -4790588
5430 -4790588 -64451 -1692881 -6070539 -7013285 -3890463 -1293328 -1981823 -3657657 -3003850
5421c003850K956997K758717J052567K05987J227249K796077K135488j964764
5413H164468o343173n993996p68310L371194K151733j187251j530817j35119j640130
5404c911401m715671k843164M746960R819742N972567k603320p322250o100680
5396f957217l261084j446312O71638L317127L603492P0689m193847m925405j439689
5387a4560608L275811N949531N368256K259212j752836m816120n181769j972087
5379a1430610L428656P091388N311149j395200p947833r294437m898653J610695
5371a7524845O075185O436896L289069o52598k459845j787810j185022k544599
5363a0353569m268749l518432l80073K209465K330358R31915j34950j24911P43204
$$ plain form
5421 -3003850 -46853 2711864 3764431 3970418 5197667 7993744 10129232 8164468
5413 8164468 1821295 -4172701 -4941011 -1569817 581916 -605335 -2136152 -2271271 -3911401
5404 -3911401 -8627072 -11470236 -6723276 3096466 9069033 6465713 -856537 -6957217
5396 -6957217 -10218301 -11664613 -10992975 -7675848 -4072356 -4001667 -8195514 -13120919 -14560608
5387 -14560608 -11284797 -5335266 32990 2292202 539366 -4276754 -9458523 -11430610
5379 -11430610 -8001954 -910566 4400583 3005383 -4942450 -14236887 -19135540 -17524845
5371 -17524845 -11449660 -5012764 -1723695 -2376293 -4836138 -6623948 -7808970 -10353569
5363 -10353569 -14622318 -18140750 -18520823 -16311358 -13981000 -13049085 -13184035 -13308946 -12565742
5354a2565742J824848K176734J501626R84843J692992K337193P56538k155304
5346c446272k637242O25191L839788K959207m84417j213005K579912O569092N622217
5337A4414471k6673n167998n370775j268390K728771L194314P68518j316475j176098
5328F779665o8573k75386k102318l743680l745372k655220j957906j971261j472102
5319a1212153N04610L091877M534184M527341M421206M599255L167648j149129
5311A2484839n863362o861737l575960L25660J668242P56012p53187j899263j262352
5302d981108K693481P859537Q557922K796193l564898m151430r09452k35982k414857
5293E649406j975733J705703K272288k694770o173542j965827N367685O921287
$$ plain form
5354 -12565742 -10740894 -8564160 -7062534 -6077691 -4384699 -2047506 -1290968 -3446272
5346 -3446272 -6083514 -5458323 -1618535 1340672 856255 -356750 2223162 8792254 14414471
5337 14414471 14387798 9219800 3849025 2580635 5309406 8503720 9272238 7955763 6779665
5328 6779665 6711092 6435706 4333388 589708 -3155664 -5810884 -7768790 -9740051 -11212153
5319 -11212153 -10707543 -7615666 -3081482 1445859 5867065 10466320 13633968 12484839
5311 12484839 6621477 -240260 -3816220 -3490560 -1822318 -1066306 -1819493 -3718756 -4981108
5302 -4981108 -2287627 5571910 14129832 16926025 13361127 9209697 8300245 8064263 5649406
5293 5649406 3673673 5379376 7651664 4956894 -1216648 -3182475 2185210 9106497
5285I106497J827119l217131m326867l736812l631904k952706j079662K79743
5277g731723K62169L83026J902725M331970O758684Q086108O471727J626703l000248
5268A9091141l841686k255256k024219k857563j469159J361616J027655k718868
5260F313661m327325j457873R34811r44663l194553j063056K722724K568653o59704
5251H92675j659172m6700p05401m782698o728454k285610N053930Q179750M433839
5242B352159k386826o410575m531031J984372R072864J2770766J1168221M875409
5234B8895359k886701p226761n378047m39162J235550k246131n826176m571923
5226A556008m04199J139153j307480l849655k966867Q90384M917002O641676N106084
$$ plain form
5285 9106497 10933616 7716485 3389618 -347194 -3979098 -6931804 -8011466 -7731723
5277 -7731723 -7469554 -7086528 -5183803 -851833 5906851 13992959 20464686 22091389 19091141
5268 19091141 15249455 12994199 10969980 8112417 6643258 8004874 9032529 6313661
5260 6313661 1986336 528463 1463274 518611 -2675942 -3738998 -1016274 1552379 892675
5251 892675 -766497 -813197 -1518598 -6301296 -13029750 -15315360 -10261430 -2081680 2352159
5242 2352159 -34667 -6445242 -10976273 -8991901 80963 12851729 24019950 28895359
5234 28895359 26008658 18781897 13403850 12964688 14200238 11954107 6127931 1556008
5226 1556008 1151809 2290962 983482 -2866173 -5833040 -4942656 -25654 6616022 11722106
5217A1722106J136671l554269p968628j1303448j0970956m507780N087965R811037
5209a0547302N600382k061255m828040j133355M273794P484451P706995M756521
5201A1252191o15531m986210n460369l927418m099883n301847l555528J722977
5193a4971618O351156O631623K666295k862859o097146l722025K979761P436757
5185a588056N134027k59654k331288q49034M8064l16677M0524n60062m823164
5176e505320q618872m830136M340930Q067432K118914n116459n050658M41849
5168a4152320M618045M984153K533933j623958m378215j384772N715181Q713153
5160E025200M207591m65006J794782O802629N836210j205472o823855p037637
$$ plain form
5217 11722106 12858777 9304508 1335880 -9967568 -20938524 -25446304 -20358339 -10547302
5209 -10547302 -4946920 -7008175 -11836215 -12969570 -8695776 -1211325 6495670 11252191
5201 11252191 10636660 5650450 190081 -3737337 -7837220 -13139067 -16694595 -14971618
5193 -14971618 -8620462 -1988839 677456 -2185403 -8282549 -12004574 -9024813 -1588056
5185 -1588056 3545971 3286317 955029 105995 154059 -162618 -122094 -682156 -5505320
5176 -5505320 -14124192 -18954328 -14613398 -6545966 -4427052 -9543511 -14594169 -14152320
5168 -14152320 -9534275 -4550122 -2016189 -3640147 -8018362 -9403134 -3687953 5025200
5160 5025200 9232791 8767785 10562567 17365196 23201406 21995934 15172079 8134442
5152H134442m286390j178524J784602L072366R25674k569130l232618r09971M55125
5143B195576p97014j635328N40159L445403K541620k894314p827016o527807L55068
5134a0603653N729420M744385R40453J41740J175973j023220m931983l706798
5126g533683K483876M890311p5647m866433l347419k18006j215736k338187K402575
5117i818349R080418R551192M578609J525813J938357R17925k864197n519062
5109I390706n579421n197985m139647k55678M119792L717104j081345l918810
5101b945284j687600J879274K796781J553331J25245j012536j729577j692645
5093b713011j418686j117620N58808L673360M944671K194482j564615k559485
$$ plain form
5152 8134442 3848052 2669528 4454130 7526496 8452170 5883040 2650422 1740451 2195576
5143 2195576 1398562 -236766 303393 3748796 6290416 3396102 -4430914 -10958721 -10603653
5134 -10603653 -4874233 -129848 810605 952345 2128318 1105098 -3826885 -7533683
5126 -7533683 -5049807 -159496 -235143 -5101576 -8448995 -8667001 -9882737 -12220924 -9818349
5117 -9818349 -737931 8813261 13391870 14917683 16856040 17773965 14909768 9390706
5109 9390706 3811285 -1386700 -5526347 -5782025 -1662233 2054871 973526 -2945284
5101 -2945284 -4632884 -2753610 43171 1596502 1721747 709211 -1020366 -2713011
5093 -2713011 -4131697 -5249317 -4690509 -1017149 3927522 6122004 4557389 1997904
5085A997904j865062j975925j294285K158137M853262K332394k936646n144355
5077a874576m116034l542310k770236J556744P349029Q839281N655668K494813
5069A3592379Q67645j111402k201298K51933L300659J903007j639311j018922
5061A3944690K354574J220139m257275n984158j499676K811330L372428L278657
5053A5240709K845576k016428r227887j0190022l868099L03094k075670l768466
5045a2757193K5424L280259J565284P40479M780419O314799m68223p405450m298104
5036h222306M616702P815272L930598N57696M73176L72278M442J891717L973539
5027A5413114J939750k610004m421974l118629k015664r14616K168815M515145
$$ plain form
5085 1997904 132842 -1843083 -3137368 -979231 3874031 6206425 3269779 -1874576
5077 -1874576 -5990610 -9532920 -12303156 -10746412 -3397383 5441898 11097566 13592379
5069 13592379 14460024 13348622 11147324 11399257 14699916 16602923 14963612 13944690
5061 13944690 16299264 17519403 13262128 7277970 5778294 8589624 11962052 15240709
5053 15240709 18086285 16069857 6841970 -3348052 -7216151 -6913057 -8988727 -12757193
5045 -12757193 -12731769 -9451510 -7886226 -7145747 -2365328 3949471 3481248 -3924202 -8222306
5036 -8222306 -3605604 4209668 8140266 8697962 9171138 9543416 9547858 11439575 15413114
5027 15413114 17352864 14742860 10320886 7202257 5186593 4271977 6440792 10955937
5019A0955937K043381k654585l459974m50525J057272j79974n43256Q97034J456342
5010I121652R37671J625965K505123K34578m202612o226631m947280l559702k743208
5001g254444k26789K861914K070820k601553n211558k334368K058298K585068
4993h052612p24860l912066m242554j810949J672594L966046L697414J824754
4985g582233P71656J696927L306202L348292R55411k147206l110064j627597r21392
4976e310004k817834l716273K78690N686620N281279p11638m220769j448319K303369
4967d674879K524804K111297L866647M313780P88127k298096j021077K48418m026164
4958A832857j0447979j1288195n739735K99055K958734K906809J625929M37898
$$ plain form
5019 10955937 12999318 10344733 6884759 6434234 7491506 7311532 6768276 7665310 9121652
5010 9121652 10059323 11685288 14190411 14424989 10222377 3995746 -951534 -4511236 -7254444
5001 -7254444 -7481233 -4619319 -2548499 -5150052 -10361610 -12695978 -10637680 -8052612
4993 -8052612 -8777472 -12689538 -16932092 -18743041 -17070447 -13104401 -9406987 -7582233
4985 -7582233 -6810577 -5113650 -1807448 1540844 2496255 349049 -2761015 -4388612 -5310004
4976 -5310004 -8127838 -11844111 -11565421 -5878801 -597522 -1309160 -5529929 -6978248 -4674879
4967 -4674879 -2150075 -38778 3827869 8141649 8929776 6631680 5610603 5859021 1832857
4958 1832857 -8615122 -19903317 -25643052 -25343997 -22385263 -19478454 -17852525 -17414627
4950a7414627R35974K403003J814993n89222l12633L705291O136900L680478N6746
4941D16903j291418k197151l214261o49666M499165M184114l272124p408452j668268
4932a0601158N010535K764179l043859k213186K818555L349887O42117J538870
4924B65940M055584J862580j753532J123235P860645Q993456L996160K30538o15297
4915B6019309k209883l262046m81009J770987k205854p289697m841065J898343
4907I399085L133790r96761k869762j783116k232867k867721q29787q25738n812354
4898e685231o877570J935797Q737458J982374p483652l829232N730775M732323
4890g56958k048917L69693O503177J776399n682216Q50045J0598473K169118j2630413
$$ plain form
4950 -17414627 -16478653 -14075650 -12260657 -12849879 -13162512 -9457221 -3320321 360157 416903
4941 416903 -874515 -3071666 -6285927 -6935593 -2436428 1747686 -1524438 -8932890 -10601158
4932 -10601158 -5590623 -2826444 -5870303 -8083489 -5264934 -1915047 -1272930 265940
4924 265940 4321524 6184104 4430572 5553807 13414452 22407908 26404068 26634606 26019309
4915 26019309 23809426 20547380 20066371 21837358 19631504 12341807 7500742 9399085
4907 9399085 12532875 11536114 8666352 6883236 4650369 1782648 952861 127123 -5685231
4898 -5685231 -12562801 -10627004 -1889546 92828 -7390824 -11220056 -5489281 -756958
4890 -756958 -2805875 -2436182 4066995 5843394 161178 1011223 11609696 13778814 1148401
4881A148401o157799J1838223R566142m287632N897287K8844340K1153073M823423
4873G2825458N7157786J65914611J91999696N1949415j38545117j99526492j15051009
4866H6724348k3455806j0529958k7091818j3138908R143615K479864j3199766
4859A0931571o592214O962649J559345r752978m822442M287642j960921j0346604
4851i733952K10960J7410701J5667592p09435p805777j834541J483203k930035
4843A1758716o451329o391164o520615m528114K659865P993140M371021k363855
4835E27665m058147m013774p056101p381746l46842N402345K234355j819016K138421
4826a4372840O471889J010550o766127l472994P368150J1982694Q168284L572080
$$ plain form
4881 1148401 -5009398 6828825 16394967 12107335 18004622 46848962 68002035 72825458
4873 72825458 129983244 295897855 487897551 539846966 401301849 201775357 86724348
4866 86724348 63268542 52738584 25646766 12507858 21651473 24131337 10931571
4859 10931571 4339357 11302006 12861351 3108373 -1714069 2573573 612652 -9733952
4851 -9733952 -9522992 7887709 23555301 22845866 15040089 13205548 14688751 11758716
4843 11758716 5307387 -1083777 -7604392 -12132506 -9472641 -1479501 2891520 527665
4835 527665 -3530482 -7544256 -14600357 -21982103 -22328945 -16926600 -14692245 -16511261 -14372840
4826 -14372840 -7900951 -6890401 -13656528 -17129522 -9761372 2221322 10389606 13961686
4818A3961686n69303p046620j0606674n207545K222010J560544k593239O07667
4810g671474P445108N414678l910538o541666M81082N128140Q42983n115277n866894
4801i793858l278678M1758M320306O342572J698017n147916m823608J598237L381059
4792e662111k020329m718518N74430N788303L361017j826042j384286L677404
4784b210132O067873L047354j592125l064676M71228O563612R248519M745898
4776B3277551k644440m678300o7758L784967J459400l307880l935519l66784J580743
4767A5101980j608684o646688p317289j844744M566555N627283J622273j538015
4759G962671o34446J692383K681169K926870K243599j770883p659886q845418
$$ plain form
4818 13961686 13392383 6345763 -4260911 -9468456 -7246446 -5685902 -8279141 -7671474
4810 -7671474 -226366 5188312 1277774 -5263892 -4782810 345330 1188313 -3926964 -9793858
4801 -9793858 -13072536 -13030778 -8710472 -2367900 -669883 -5817799 -10641407 -9043170 -5662111
4792 -5662111 -7682440 -12400958 -11826528 -6038225 -2677208 -4503250 -5887536 -2210132
4784 -2210132 3857741 6905095 5312970 2248294 2719522 9283134 18531653 23277551
4776 23277551 20633111 15954811 15887053 19672020 21131420 17823540 13888021 13521237 15101980
4767 15101980 13493296 6846608 -470681 -2315425 2251130 7878413 9500686 7962671
4759 7962671 7328225 9020608 11701777 14628647 16872246 15101363 7441477 -1403941
4751a403941l029536L063753L504624J588549K394816L364869R9511m135968l884422
4742A562255k147481n610791j1894009j1653042k582490P695171J2575878J2190576
4734A36067Q305825J646614m726364o402999l503990m33712N51053Q86292J577344
4725a963870K302006L316942L671605M1779p377572j1361812o851710m2235N7247
4716a8207620m003286k237964N864766R788182M442042k446883k666315J695874
4708g771204M248561M107907M652625O807717P754147M405879l302868j0871221
4700A0031543j1810207m744329L626917O248606M044367K301474K101074J147415
4692A2946860j68250m53081k107503o912932r790074n412008J692449L020300
$$ plain form
4751 -1403941 -4433477 -1369724 2134900 3723449 6118265 9483134 9582645 5446677 1562255
4742 1562255 -585226 -6196017 -18090026 -29743068 -32325558 -24630387 -12054509 136067
4734 136067 8441892 10088506 5362142 -1040857 -4544847 -4978559 -4427506 -3541214 -1963870
4725 -1963870 338136 3655078 7326683 7368462 -9110 -11370922 -18222632 -18264867 -18207620
4716 -18207620 -22210906 -24448870 -18584104 -8795922 -4353880 -6800763 -9467078 -7771204
4708 -7771204 -3522643 585264 5237889 12045606 19799753 24205632 20902764 10031543
4700 10031543 -1778664 -6522993 -2896076 3352530 7396897 9698371 11799445 12946860
4692 12946860 12778610 12325529 10218026 3305094 -6484980 -11896988 -10204539 -7184239
4684g184239m02317r02493J511100p4197m824777l706194M289456Q718981M670765
4675B096085P81927M387734R732199Q204985J159884m915067q295063r861870
4667C290814p849195j986620K631662K389160J026327K904976N232296K812598
4659A0452018l540440q541866q856156m155477L846041R823712P517215j790750
4651D754297q423281o056281P05565M281856L676668J519566j960067n844090
4643g345767n109640K439403R934465R385385L048737R0898L761542Q119931O781803
4634C1106757m1988o993025q740627m421736J072216J923747j392835k940036
4626I572473l65137J884165N97017q45806Q49523K340874q23560o220249p773260
$$ plain form
4684 -7184239 -7586556 -8489049 -6977949 -7052146 -11876923 -15583117 -11293661 -2574680 2096085
4675 2096085 2878012 7265746 16997945 25202930 26362814 21447747 13152684 3290814
4667 3290814 -4558381 -6545001 -3913339 -1524179 -497852 2407124 7639420 10452018
4659 10452018 6911578 -1630288 -10486444 -14641921 -10795880 -972168 6545047 4754297
4651 4754297 -3668984 -9725265 -9019700 -4737844 -1061176 458390 -1501677 -7345767
4643 -7345767 -12455407 -10016004 -81539 9303846 12352583 12443481 16205023 24324954 31106757
4634 31106757 31064769 24071744 15331117 10909381 11981597 13905344 12512509 9572473
4626 9572473 9207336 11091501 11688518 10842712 11692235 14033109 13209549 6989300 -783960
4617g83960m314464N4367K280906K941491L810992N581536O728551L947410l355182
4608A6891647r329807p763668j952413j095096n642294n622863K889261R968064
4600a657169O973405j34456j351664J817505J805298o59688N70305M067740K756224
4591A4187500l039424n620770k584757N27956M27395m09209j054511l926531p716067
4582i208418o859982n17612N017974N449671L828263M187966N358936M108560
4574A1365358L09723l576882n300898l859532m07624J646371L22163j693190p95252
4565a989763J685660J594331j092175k360965r09218K69418n64804j500958j031251
4556e899725m20311r86246k282210l584558m355029l247173M34958M511857N881968
$$ plain form
4617 -783960 -5098424 -5044057 -2763151 178340 3989332 9570868 16299419 20246829 16891647
4608 16891647 7561840 -201828 -2154241 -3249337 -8891631 -14514494 -11625233 -1657169
4600 -1657169 5316236 5181780 3830116 5647621 7452919 6793231 7363536 11431276 14187500
4591 14187500 11148076 5527306 2942549 3470505 3897900 3488691 2434180 -1492351 -9208418
4582 -9208418 -16068400 -16586012 -11568038 -6118367 -2290104 1897862 7256798 11365358
4574 11365358 11675081 8098199 2797301 -1062231 -1469855 176516 498679 -1194511 -1989763
4565 -1989763 -304103 1290228 198053 -2162912 -3072130 -2802712 -3367516 -4868474 -5899725
4556 -5899725 -6320036 -7306282 -9588492 -13173050 -17528079 -20775252 -20340294 -15828437 -9946469
4547i946469M143336R35843k711650n479429m467096J199838P266387Q990298
4539f8942P189105N542147M071724L31189m688990p279361o555553m359707j113115
4530f931503K987916M391482K069o367061p569211k755825K359076M161508L882610
4521e838939K334131j194260m474115l484596J036644M135919M216151L961459
4513F92394L622268N74105l531429l000082K164115M193976j154496p633825p118151
4504a1191125j86298O114989P218276L987344k94694k749866k687704k148448
4496a937526k755339k333738J785768O742713O534723O26306n285515p606400
4488d229008q000878p431805l912778J658053M117585J668569r59920k08369J159865
$$ plain form
4547 -9946469 -5803133 -4867290 -7578940 -13058369 -17525465 -16325627 -9059240 -68942
4539 -68942 7120163 12662310 16734034 17065223 12376233 5096872 -1458681 -5818388 -6931503
4530 -6931503 -3943587 447895 449964 -5917097 -13486308 -16242133 -13883057 -9721549 -5838939
4521 -5838939 -3504808 -4699068 -9173183 -12657779 -11621135 -7485216 -3269065 692394
4513 692394 4314662 4888767 1357338 -1642744 521371 4715347 3560851 -4072974 -11191125
4504 -11191125 -11377423 -5262434 1955842 5943186 5648492 2898626 210922 -1937526
4496 -1937526 -4692865 -7026603 -5240835 1501878 8036601 8662907 3377392 -4229008
4488 -4229008 -12229886 -19661691 -23574469 -21916416 -17798831 -16130262 -17090182 -17298551 -16138686
4479a6138686J37755r58568O39726K596548J523704j210573k134636j009488L80808
4470a6173410J947895M207643N790495N055488K413412o42627k637221j750001
4462a788326K193992N191474L190178r72795o86524L572778L779725k926179q819663
4453B734660o938982p19816K718610K468598J524480N47091j62692K014101O547645
4444A0733695O955865J56189o456558m721581J954677M096785M01623k336715
4436A0783980j422381j361755m829537q263373p644859l094496K854573P068208
4428e909640O401247R87356l942443l850027r87457k79240j520785j241985l6839
4419a0379813j394984m568151n357907l311256j584444l21233K898777O367022
$$ plain form
4479 -16138686 -16000931 -16959499 -16319773 -13723225 -12199521 -13410094 -15544730 -16554218 -16173410
4470 -16173410 -14225515 -10017872 -4227377 828111 3241523 2598896 -38325 -1788326
4462 -1788326 405666 5597140 8787318 7814523 7127999 10700777 14480502 11554323 2734660
4453 2734660 -4204322 -4924138 -2205528 263070 1787550 2334641 2171949 4186050 10733695
4444 10733695 17689560 17845749 11389191 6667610 8622287 12719072 13120695 10783980
4436 10783980 9361599 7999844 3170307 -5093066 -12737925 -15832421 -12977848 -5909640
4428 -5909640 491607 1478963 -2463480 -6313507 -7300964 -7580204 -9100989 -10342974 -10379813
4419 -10379813 -11774797 -16342948 -21700855 -25012111 -26596555 -26917788 -24019011 -17651989
4411a7651989N478432J130855o45169J445208K197649j35078l08235M035855O781395
4402B328923K877287k928732l152795J265771L349573N21181l647507o247031
4394e633330p516725p151298l751205J349709M278449L975874L695697N528165
4386e224664O722809M021907p37812k799227j370970n97790k950241n294081l967942
4377a2198011q20735k02690j590842l17312M209638O460355K998161k042225k925752
4368f429413N1511K571997K735095J541121l00817j886223q58345L027581N297636
4359E750143K289368k775642m142992j943450p12845j183403m6743K631072K586349
4350B451857j181581m313613l995511k465412j974654j507538m06698k17612q39439
$$ plain form
4411 -17651989 -12173557 -11042702 -11687871 -10242663 -8045014 -8180092 -8488327 -4452472 2328923
4402 2328923 5206210 2277478 -875317 390454 3740027 4261208 613701 -5633330
4394 -5633330 -13150055 -20301353 -24052558 -22702849 -18424400 -14448526 -10752829 -5224664
4386 -5224664 1498145 5520052 4782240 1983013 612043 14253 -2935988 -8230069 -12198011
4377 -12198011 -13018746 -13221436 -14812278 -15129590 -10919952 -4459597 -1461436 -3503661 -6429413
4368 -6429413 -6377902 -3805905 -1070810 470311 169494 -1716729 -2575074 452507 5750143
4359 5750143 8039511 5263869 1120877 -822573 -1535418 -2718821 -2765564 -134492 2451857
4350 2451857 1270276 -3043337 -7038848 -9504260 -11478914 -12986452 -13393150 -13610762 -14450201
4341a4450201L07750L150641L940078J697521N33884K662500M329721K315719
4333D487613n98444j063015j312359m553586q111513p166536k575663J077045
4325a9816458L184358O557514J0360549J0307041O253440L358183M122442M713156
4317B9040225J579986k936540m791694m445206n109794o938007o806222l391191
4309c798443N18835J263600j752639n634702o490637k501852M240090Q743165
4301e412583P179138Q62469m326637l603498J439665M286258J045108m508796
4293c038876n259709K67874N868462N489506M31679l442904l493650j988151j186332
4284f352101p74769m98407j404999k963702k354139J130435L901139L134250J499718
$$ plain form
4341 -14450201 -14142451 -10991810 -7051732 -5354211 -4820327 -2157827 2171894 4487613
4333 4487613 3889169 2826154 1513795 -3039791 -11151304 -18317840 -20893503 -19816458
4325 -19816458 -16632100 -10074586 285963 10593004 16846444 20204627 24327069 29040225
4317 29040225 30620211 27683671 22891977 18446771 13336977 6398970 -407252 -3798443
4309 -3798443 -3279608 -2016008 -3768647 -9403349 -15893986 -18395838 -14155748 -5412583
4301 -5412583 1766555 2629024 -1697613 -5301111 -3861446 424812 1469920 -3038876
4293 -3038876 -8298585 -8030711 -2162249 3327257 3758936 316032 -3177618 -5165769 -6352101
4284 -6352101 -7126870 -7625277 -9030276 -11993978 -14348117 -13217682 -9316543 -6182293 -4682575
4275d682575L242449P344018Q846347O267053L234291K398257K039287J7717k736688
4266B5970156m472930m994846l933055j32696M840032O116628J752761l437438
4258B1708612m053391j595436j474294m450620n978543l469138L76140J825574
4250B888904J88048k550554l258932N90519P431869J0752330N789685l271594
4242A8560275p111882k574958L906311M805242k93569n829274o586755k349737
4234B525653J638570j83865n875719o361577K173583J0300705O933367m208001
4226F942716r186282l677012K657984K596968M72377J146461J167809k744664
4218f23643n896756l791506m08543p90025k120449J66896L451110K884368O1907
$$ plain form
4275 -4682575 -1440126 5903892 14750239 21017292 24251583 26649840 28689127 28706844 25970156
4266 25970156 21497226 16502380 12569325 12436629 17276661 23393289 25146050 21708612
4258 21708612 17655221 16059785 14585491 10134871 4156328 687190 1063330 2888904
4250 2888904 3076952 526398 -2732534 -2142015 5289854 16042184 21831869 18560275
4242 18560275 11448393 8873435 12779746 17584988 17291419 11462145 4875390 2525653
4234 2525653 4164223 3980358 -1895361 -8256938 -6083355 4217350 11150717 6942716
4226 6942716 -2243566 -5920578 -3262594 -665626 -193249 953212 2121021 -623643
4218 -623643 -6520399 -10311905 -10720448 -11510473 -13630922 -13464026 -10012916 -7128548 -7066641
4209g066641p36524j39397m92966j12795K316088L038691J77883o46733M202447
4200E40053P668025K454110n664566o105497l92699J246271k959998n143275k442028
4191a0799604m71845j660364j379523K492208N628384M814329J715916j818687
4183a479186n151284n697274j548742L350122L630657P84402J23027J861610K667903
4174a458765K859455L896136K714538k381632n026625l27340M435233O73140n771076
4165c86936l733412M091683O984720N919443R381752J3845839Q640417k299626
4157D2443880m837730P09706J467969k918119j477884K879800k952879j2941674
4149B2373069p594756Q117040P876091q556829j0847086P639132J5838762L498007
$$ plain form
4209 -7066641 -7803165 -7942562 -8435528 -8548323 -6232235 -3193544 -3015661 -3662394 540053
4200 540053 8208078 10662188 4997622 -1107875 -1500574 -254303 -3214301 -8357576 -10799604
4191 -10799604 -11271449 -12931813 -14311336 -11819128 -6190744 -1376415 339501 -1479186
4183 -1479186 -6630470 -12327744 -13876486 -10526364 -6895707 -6111305 -5988278 -4126668 -1458765
4174 -1458765 1400690 5296826 8011364 5629732 603107 275767 4711000 5384140 -386936
4165 -386936 -4120348 -28665 6956055 12875498 22257250 36103089 44743506 42443880
4157 42443880 37606150 38315856 39783825 36865706 35387822 38267622 35314743 22373069
4149 22373069 14778313 22895353 30771444 22214615 11367529 19006661 34845423 38343430
4141C8343430K346325J7880668l560720q6007880j50138284j03345104K1126917
4134b63354648R5809545O6046929O236436l719943J9970061K2041362J414225
4127e5556033n750198N035589R288922L344367M025108J0131171M907103q426958
4119c3000929q709086O532048J6230127R465089j059758k904336j45818l58475
4111a3951138k043832j327335M24110O47271l11480j264631j017540J907762N725443
4102a1211370N245621K64571j884005J698467K781160m376689j1144178p160575
4094b5786998K589257N865513K267707P17897K514383J318754k547616k252998
4086a5314101J718502J544244l408432m814266O8135L954129K312293k36655L52427
$$ plain form
4141 38343430 40689755 58570423 55009703 -30998177 -181136461 -284481565 -263354648
4134 -263354648 -167545103 -101498174 -95261738 -98981681 -79011620 -56970258 -55556033
4127 -55556033 -61306231 -56270642 -46981720 -43637353 -39612245 -29481074 -24573971 -33000929
4119 -33000929 -41710015 -35177967 -18947840 -9482751 -10542509 -13446845 -13592663 -13951138
4111 -13951138 -15994970 -17322305 -16898195 -16250924 -16562404 -17827035 -18844575 -16936813 -11211370
4102 -11211370 -5965749 -5701178 -7585183 -5886716 -3105556 -7482245 -18626423 -25786998
4094 -25786998 -23197741 -17332228 -15064521 -14346624 -11832241 -10513487 -13061103 -15314101
4086 -15314101 -13595599 -12051355 -15459787 -20274053 -20205918 -16251789 -13939496 -14176151 -13823724
4077a3823724J170449l73017j297341Q56311L607751M620666N010387M933647
4069D705129K149325k387083l714811o51047J373045j442788n322642m896751
4061a0187623j081817P94560j707682n621753o176484j664056M475658O845375
4053a4323822M483647K146942L189624M334624J251907l985060o223853n231295
4045a4357286m316794l285743K67952M100244L351849p95630k003076J087211
4037a5951273K961903Q97924o76402J906754N424046M852585J21887m965201p095103
4028a2522880m970596K81172N054296O430517N525351M905510M078047J567987
4020A0349404m93649O92163K733093J339300k011731k641699j418263k781330
$$ plain form
4077 -13823724 -12653275 -13026292 -14323633 -13467322 -9859571 -5238905 -228518 4705129
4069 4705129 6854454 4467371 752560 101513 1474558 31770 -5290872 -10187623
4061 -10187623 -11269440 -10474880 -12182562 -17804315 -23980799 -25644855 -21169197 -14323822
4053 -14323822 -9840175 -7693233 -4503609 -168985 1082922 -2902138 -9125991 -14357286
4045 -14357286 -18674080 -21959823 -21691871 -17591627 -14239778 -15035408 -17038484 -15951273
4037 -15951273 -12989370 -12091446 -12767848 -10861094 -5437048 -584463 -462576 -5427777 -12522880
4028 -12522880 -17493476 -17212304 -12158008 -5727491 -202140 4703370 8781417 10349404
4020 10349404 9855755 10547918 13281011 14620311 12608580 9966881 8548618 5767288
4012E767288m967085j689475N929659R077046M712482n23721k273886l976404
4004A2055904p051605o666879k442120k230513q228248j0148014j246185Q821012
3996a7136648Q170747J257456M77193N551982N590078j528382o448438m992978
3988i058990l804369o617249p032494k42308P408393P147204J02202n058064l373242
3979b0528917K014543M791390K078068k690201k921922L158049Q541271N131026
3971d26693n118567j1491333p475972K183120Q475368P716265K597679k237322
3963e777455l500551j073989J805117K195448J343489K134137L533786K076571
3955B736553j418821k253301J99220J047955j553205k686391Q81963M274280J624893
$$ plain form
4012 5767288 800203 -889272 5040387 14117433 18829915 18306194 16032308 12055904
4004 12055904 5004299 -1662580 -4104700 -6335213 -14563461 -24711475 -25957660 -17136648
3996 -17136648 -8965901 -7708445 -7231252 -1679270 3910808 2382426 -4066012 -9058990
3988 -9058990 -12863359 -19480608 -26513102 -26755410 -19347017 -12199813 -12097611 -17155675 -20528917
3979 -20528917 -18514374 -13722984 -11644916 -14335117 -17257039 -14098990 -5557719 -426693
3971 -426693 -5545260 -17036593 -24512565 -22329445 -13854077 -6137812 -3540133 -5777455
3963 -5777455 -9278006 -10351995 -8546878 -6351430 -5007941 -2873804 659982 2736553
3955 2736553 1317732 -935569 -736349 311606 -1241599 -3927990 -3046027 1228253 2853146
3946B853146m652163p420164m904724j656466j003277j751738j926323j381522
3938b1843231n09382L91962M95526k47568J17995K804215N335395M448242J073395
3929g933451r16261k92725P60206J083781J737167K383832O59424l353685n652558
3920a1524270l665211l65148k08439k621849k670938J927488P086991O963131
3912e078245J209483m162388l771378P21741L203787J535797Q7437K613750O137617
3903B497601N206154j12400m584353m939826k432360J025595M571759O064324
3895G296494L067755k418326m729326j989556J360137J636981J062375K713644
3887H000178M583042L034408q58957l038411k464797j134442J03148J435997J376725
$$ plain form
3946 2853146 -1799017 -9219181 -14123905 -15780371 -16783648 -18535386 -20461709 -21843231
3938 -21843231 -22352613 -21960651 -21465125 -21712693 -21594698 -18790483 -13455088 -9006846 -7933451
3929 -7933451 -8849712 -9142437 -8382231 -7298450 -5561283 -3177451 -2518027 -5871712 -11524270
3920 -11524270 -15189481 -15554629 -15763068 -18384917 -21055855 -19128367 -12041376 -5078245
3912 -5078245 -3868762 -8031150 -11802528 -11080787 -7877000 -6341203 -6253766 -3640016 2497601
3903 2497601 7703755 7591355 3007002 -1932824 -4365184 -3339589 1232170 7296494
3895 7296494 10364249 7945923 3216597 1227041 2587178 4224159 5286534 8000178
3887 8000178 12583220 15617628 14758671 11720260 9255463 8121021 8224169 9660166 11036891
3878A1036891j271119l812801k594849J230028L417156L310312L683673M315573
3870A9314864J726920l672822o189841l078099Q96588L04332l646616o058030
3862d02704n154288k530369O42865L816903N262028L661140O41269j010055r53950
3853C972839j013006k037357k839172j730312J743862N594608N845148N46551
3845A0083161o264838p924526l632158J71832j140040m158698l454956K13774
3837a6106449K230384J650646J282886K058812K393997K197486K744521K995862
3829A448145N68165l571948n454332l457676J25171K848105M082239L543282J477551
3820A608702O6908R38444J697569q85438m706889m520995o50409M37374l715611
$$ plain form
3878 11036891 9765772 5952971 3358122 4588150 8005306 11315618 14999291 19314864
3870 19314864 21041784 17368962 11179121 8101022 8997610 9301942 5655326 -402704
3862 -402704 -5556992 -8087361 -7444496 -3627593 1634435 5295575 5936844 4926789 3972839
3853 3972839 2959833 922476 -1916696 -3647008 -1903146 3691462 9536610 10083161
3845 10083161 3818323 -4106203 -7738361 -7566529 -8706569 -12865267 -16320223 -16106449
3837 -16106449 -13876065 -12225419 -10942533 -8883721 -6489724 -4292238 -1547717 1448145
3829 1448145 2016310 -1555638 -7009970 -10467646 -10342475 -7494370 -3412131 131151 1608702
3820 1608702 1675610 2614054 4311623 3426185 -1280704 -5801699 -6452108 -6014734 -9730345
3811i730345o573874j701090P326184J0942242N553184k830588o425336l797055
3803g236678M01006J746140P18653R55843L604409N355817L238814r00164l374665
3794D509175m067608m937134m770886q67044M388861M958842N91944j528215K349847
3785F27782N947168K081623o021127q503929j940571O674360Q586365K229149
3777I680820o286234r159331m013189L332940M704727n27840m254141l81873O964435
3768F0314R620609O238490K022339K22678l32771n70319R086R8122k136610m250025
3758A0981913j823900L361305L615461l617480j0676255r669254k980606J247953
3750i560863Q49431Q33050M139586P368589O751885L375874J92192k308319m485422
$$ plain form
3811 -9730345 -16304219 -18005309 -10679125 263117 5816301 2985713 -3439623 -7236678
3803 -7236678 -6835672 -5089532 -4370879 -3415036 189373 5545190 8784004 7883840 4509175
3794 4509175 441567 -4495567 -9266453 -10133497 -5744636 -785794 -193850 -1722065 627782
3785 627782 6574950 8656573 2635446 -5868483 -7809054 -1134694 7451671 9680820
3777 9680820 3394586 -5764745 -9777934 -6444994 -1740267 -2268107 -6522248 -6904121 60314
3768 60314 9680923 15919413 17941752 18164430 17831659 17261340 17270426 17368548 15231938 10981913
3758 10981913 9158013 12519318 16134779 12517299 1841044 -7828210 -10808816 -9560863
3750 -9560863 -8711432 -7878382 -3738796 3629793 10381678 13757552 13949744 11641425 7156003
3741G156003m748701k330252q64021m268116r349582p948404J694709J0692751
3733i965613J0295431K933569k512787l439752m803830q706224j0436128o875240
3725c3510574k023745k75082M11655L776526P857864P883597L936429K80116j339292
3716a3002506k513851l360648k151153M41092J603995J199195J789389L414029
3708a2580458L070229N53056O3287L683027P168175N293991j176046o649175p067581
3699g641495k884406K679965O100755N438031J884314j071801j312128j98193
3691B995042r1426j037718j407411q47640o61609j271404q91829K336021P207479
3682F329505R396422N594750k119237p417789o374483j849276M41483q38796j884065
$$ plain form
3741 7156003 2407302 77050 -786971 -5055087 -14404669 -22353073 -20658364 -9965613
3733 -9965613 329818 3263387 750600 -2689152 -7492982 -16199206 -26635334 -33510574
3725 -33510574 -35534319 -35809401 -35397746 -31621220 -23763356 -15879759 -11943330 -11663214 -13002506
3716 -13002506 -15516357 -18877005 -21028158 -20587066 -18983071 -17783876 -15994487 -12580458
3708 -12580458 -9510229 -8957173 -8893886 -5210859 1957316 7251307 6075261 -573914 -7641495
3699 -7641495 -10525901 -7845936 -1745181 3692850 5577164 4505363 3193235 2995042
3691 2995042 2903616 1865898 458487 -389153 -1050762 -2322166 -3213995 -877974 6329505
3682 6329505 15725927 21320677 19201440 11783651 5409168 3559892 4001375 3162579 1278514
3673A278514J77240L571304N048193L920453J329610k139540n773547p231522
3665A80705m606436J84183K456360n0971m531555o546051n023058k579703j398945
3656b1915471n70460J754132M938571O201291M010316k49712l817281m488292
3648a4136906j611649K817071M485811J035586l813768l837561J052557L772121
3640a0236738q0052n385300m340697K894026Q939034Q783699M185804m11072k143490
3631B205214n75438J930897J383327k869753n720363k812583K358702K989282
3623a110715q85827l026982j245952m6057k091874l955414k599102R212J397115
3614a3555596K182537K645109J291943n45152J279946N954280O428712J22964
$$ plain form
3673 1278514 1455754 5027058 10075251 13995704 15325314 13185774 7412227 180705
3665 180705 -4425731 -4241548 -1785188 -1836159 -6367714 -12913765 -17936823 -20516526 -21915471
3656 -21915471 -22485931 -20731799 -15793228 -9591937 -5581621 -5831333 -9648614 -14136906
3648 -14136906 -15748555 -12931484 -8445673 -7410087 -11223855 -15061416 -14008859 -10236738
3640 -10236738 -10316790 -15702090 -20042787 -17148761 -8209727 573972 4759776 4348704 2205214
3631 2205214 1629776 3560673 4944000 2074247 -3646116 -6458699 -4099997 -1110715
3623 -1110715 -1996542 -5023524 -6269476 -6315533 -8407407 -12362821 -14961923 -14952711 -13555596
3614 -13555596 -11373059 -8727950 -7436007 -7981159 -6701213 -746933 5681779 5804743
3606E804743n664019m492518o05789j144940m122530k668969K385899L367898
3598g140225j981147p209041o337446l3572P206489J0404438N662046n271102
3590d699560j2721862q180391M297885J2190356R862458L007866j955829m540979
3582b740056m952820j267355M433250N108179r18362n331554j340446N863030
3574a146134O870252J929947n80537K532216N102149J415972n573398q249195
3566B301272l701517L105070N129369J352911k179975n89829K720657J231129
3558I369087l717090l782341L152813Q107148L733271m574253o665260j822991
3550C800384K481275K760854K343458L303325L392490J599189L20123Q00580J487982
$$ plain form
3606 5804743 140724 -4351794 -4957583 -6102523 -10225053 -12894022 -10508123 -7140225
3598 -7140225 -9121372 -16330413 -22667859 -22701431 -15494942 -5090504 571542 -4699560
3590 -4699560 -17421422 -25601813 -21303928 -9113572 748886 3756752 1800923 -2740056
3582 -2740056 -7692876 -8960231 -4526981 581198 -337164 -5668718 -7009164 -1146134
3574 -1146134 5724118 7654065 7073528 9605744 14707893 16123865 10550467 2301272
3566 2301272 -1400245 1704825 6834194 8187105 6007130 5417301 8137958 9369087
3558 9369087 5651997 1869656 5022469 13129617 16862888 12288635 5623375 3800384
3550 3800384 6281659 9042513 11385971 14689296 18081786 19680975 20001098 20801678 22289660
3541B2289660J627658J837444R55646k722172o959453p564124n027813l680272
3533G56574m087289k536405J306236L202277K290741K899810O009446O513531
3525A6354921K443446q76795m36926j196119n995349q055249k167006L782519
3517C853442m57299r968793j0375451N33314R464047P173004k57111l154229j047098
3508d236174J428345L012242M096566K872722p68358k395855M40089L174893R40510
3499H564980l668009m809016j868793J460076L267781L330824K23091n595941
3491I04993q584240m397464K593221M520704J218498o99878J009078J809692k20008
3482a845404o80943K593063M370462O9716o190026o956393j704092L459750M682042
$$ plain form
3541 22289660 23917318 25754762 26710408 23988236 17028783 9464659 4436846 756574
3533 756574 -3330715 -5867120 -4560884 -1358607 932134 3831944 9841390 16354921
3525 16354921 18798367 17921572 17484646 16288527 10293178 2237929 70923 3853442
3517 3853442 3396143 -6572650 -16948101 -16414787 -6950740 222264 -34847 -3189076 -4236174
3508 -4236174 -2807829 204413 4300979 7173701 6405343 4009488 4449577 7624470 8564980
3499 8564980 4896971 87955 -1780838 -320762 2947019 6277843 6500934 904993
3491 904993 -7679247 -12076711 -9483490 -4962786 -3744288 -4444166 -3435088 -1625396 -1845404
3482 -1845404 -2526347 66716 4437178 4506894 -1683132 -8639525 -10343617 -6883867 -2201825
3473b201825M030979M308481M344664J282817m323175p801890n243368J562967
3465d040350O274224M641283j070963n210783m863514j413215K204437L455077
3457b3804J120176k705575l108619J509822N435726K535577m066419n265244J028286
3448c540074O974463O459095K585255K90695j526453n188023p320109l689511
3440d954662K575276M602470J801165j14157J782463M408242M373257J608955
3432A6083009k900664q150754j1401136r956996n460164k447789k059426j161614
3424b7455534J689802L765549K926455Q89546N9453N33171J810545M038184N793093
3415e949736M146382o54109l577670p07058N393554Q730509O547351P92967n093014
$$ plain form
3473 -2201825 1829154 6137635 10482299 11765116 7441941 -359949 -5603317 -4040350
3465 -4040350 2233874 6875157 5804194 593411 -4270103 -5683318 -3478881 -23804
3457 -23804 1096372 -1609203 -4717822 -3208000 2227726 4763303 696884 -4568360 -3540074
3448 -3540074 3434389 9893484 12478739 12769434 11242981 6054958 -1265151 -4954662
3440 -4954662 -2379386 2223084 4024249 3910092 5692555 10100797 14474054 16083009
3432 16083009 13182345 5031591 -6369545 -16326541 -21786705 -24234494 -26293920 -27455534
3424 -27455534 -25765732 -22000183 -19073728 -18184182 -18124729 -17591558 -15781013 -11742829 -5949736
3415 -5949736 -1803354 -2457463 -6035133 -6742191 -1348637 7381872 13929223 14722190 9629176
3406I629176q242991o748790j067732N146829P770941O038524K706559P89900
3398A6022416R33945J465433L83376k243169l907254k734501m06757Q8154p84247
3389H817396K5057K014208L59256o112180j0344268n214189N855625J1717914
3381G118819O870844k448553o519202k865029K949368M596928R28041m113877
3373F517339n903087l725528j258082j882130m096907l389059J391159N903657
3365f442638N594407J164886k847096l667711k511980j636225j194152R9754K230347
3356i210408L372293K612129K017261M239704Q009536Q220500K072472o360014
3348A4973473r943859o324075Q8508L550704K211788j832418n134539n218657
$$ plain form
3406 9629176 1386185 -5362605 -6430337 -1283508 6487433 12525957 15232516 16022416
3398 16022416 16956361 18421794 18805170 16562001 12654747 9920246 9513489 9601643 8817396
3389 8817396 8842453 10856661 11215917 5103737 -5240531 -10454720 -4599095 7118819
3381 7118819 13989663 11541110 5021908 2156879 5106247 9703175 10631216 6517339
3373 6517339 614252 -3111276 -4369358 -6251488 -10348395 -13737454 -12346295 -6442638
3365 -6442638 -848231 316655 -2530441 -6198152 -8710132 -10346357 -11540509 -11440755 -9210408
3356 -9210408 -5838115 -3225986 -1208725 3030979 11040515 19261015 21333487 14973473
3348 14973473 5029614 -1294461 -1205953 2344751 4556539 2724121 -2410418 -7629075
3340g629075k628722q88267k025637k579629J968769Q561270Q170879j173835
3332A775753q979810n547901L968506O513045l20199n879174l058940K234451
3324i294269K052764j354970p84992L873403O232223L343733j600524n133810
3316b666442o185477l777187K099540P290211O629594J056476l129660k839697
3308a522642j288764j487488j625861Q11017M306946N274996K115845m130739
3300B453310j0398584j2153860p097554O37151M118073K632872K248036N722404
3292a1838152P819397M097017j447002k585195M502J588701J539118K340507L335258
3283D854151K082294O2728M79283J643149q01194n623517o672020k176501K744655
$$ plain form
3340 -7629075 -10257797 -11146064 -13171701 -15751330 -13782561 -5221291 2949588 1775753
3332 1775753 -7204057 -12751958 -8783452 -2270407 -2590606 -8469780 -11528720 -9294269
3324 -9294269 -7241505 -8596475 -9381467 -5508064 724159 4067892 2467368 -2666442
3316 -2666442 -8851919 -12629106 -10529566 -3239355 3390239 4446715 1317055 -1522642
3308 -1522642 -2811406 -4298894 -5924755 -5113738 -806792 4468204 6584049 2453310
3300 2453310 -7945274 -20099134 -27196688 -26559537 -22441464 -19808592 -17560556 -11838152
3292 -11838152 -4018755 78262 -1368740 -3953935 -3949433 -2360732 -821614 1518893 4854151
3283 4854151 6936445 6999173 7478456 9121605 8320411 2696894 -3975126 -6151627 -3406972
3274c406972L699921J581848j239770l767521m537184k357081K14345m64642k455235
3265a2732291m66387M554209N521110Q15666k416359k03675J382755k975620p834659
3256a4355251n559174R34729K924104m26086k370067o34589J41820j947172k720656
3247b4012342l4114K225080J232379J37078K171698M764450L857826P06152j76144
3238i127937J942922L325637J899137M19030K059421N019614M201322j509229
3230H229917o147370l373924M698828Q973897M401257m142335q885319q200583
3222d445632n292243j545244L466039P187408N399539j133101o130813n228020
3214g722067m77329L331939L496800j274n022290p450115m507493Q80874K645297
$$ plain form
3274 -3406972 292949 1874797 635027 -3132494 -7669678 -10026759 -9812414 -10277056 -12732291
3265 -12732291 -13198678 -8644469 -3123359 -2307693 -4724052 -4927727 -3544972 -6520592 -14355251
3256 -14355251 -19914425 -18979696 -16055592 -16481678 -18851745 -19486334 -19344514 -21291686 -24012342
3247 -24012342 -24046456 -21821376 -20588997 -20451919 -18280221 -13515771 -9657945 -8951793 -9127937
3238 -9127937 -7185015 -3859378 -1960241 -1541211 518210 5537824 9739146 8229917
3230 8229917 2082547 -1291377 3407451 12381348 16782605 12640270 3754951 -4445632
3222 -4445632 -9737875 -11283119 -7817080 -629672 4769867 3636766 -2494047 -7722067
3214 -7722067 -8199396 -4867457 -1370657 -1371931 -6394221 -13844336 -18351829 -17470955 -14825658
3205a4825658j30798j471326K716780Q199260Q416586L949618J322285L403653
3197A1580400N583276K572199m122676p885741n351863q63394j135500o200012
3189e823311q475568k516760O894910J0089103M734414j934963l406086j242581
3181a680842q7894k44733P15431K299010J972600K21986J06850J972449K626609
3172G901466M53086j965884j668418N82153J601294p6037k675691l344445j117887
3163c10363K165757L731991K552782j38746k690200m238218m087217j751237J537584
3154c227867L227325K716983K424936L829298M365083R23883m874416q032634
3146A352591o321025k146096J467684L625354M110894K626885N82023N22449K094973
$$ plain form
3205 -14825658 -14956456 -16427782 -13711002 -5511742 2904844 6854462 8176747 11580400
3197 11580400 17163676 19735875 15613199 7727458 2375595 1512201 376701 -5823311
3189 -5823311 -14298879 -16815639 -9920729 168374 4902788 2967825 -438261 -1680842
3181 -1680842 -1768736 -2013469 -1298038 1000972 2973572 3195558 3302408 5274857 7901466
3172 7901466 8354552 6388668 4720250 5302403 6903697 6827660 4151969 807524 -310363
3163 -310363 1855394 5587385 8140167 8001421 5311221 1073003 -3014214 -4765451 -3227867
3154 -3227867 -542 2716441 5141377 8970675 13335758 14259641 9385225 1352591
3146 1352591 -4968434 -7114530 -5646846 -2021492 2089402 4716287 5298310 5820759 7915732
3137G915732J375049l512253q485051q172833l000330J597574K431018J768687
3129h082407K920311N562827O871878N315280J632834k714523o266027p248358
3121b008185m359334J514080P058389Q672184N218993q93481n351580n404319
3113D446747k204493P42681J619933J761670K580667K736680L24562l052645l189570
3104E766232J195120O120138O784930K820596k128739m777871m782240l848962
3096G149204l551584l667527k378202Q63544K920463K6093o089246q718361n021905
3087a8467521n31728r82632l299356o54880N846616Q207090M163059M30367R88153
3078d300832N14896n342834j0435315o615075K820614O897461K224509l830348
$$ plain form
3137 7915732 9290781 5778528 -2706523 -10879356 -13879686 -12282112 -9851094 -8082407
3129 -8082407 -5162096 400731 7272609 12587889 14220723 11506200 5240173 -2008185
3121 -2008185 -6367519 -4853439 2204950 10877134 16096127 15202646 9851066 4446747
3113 4446747 2242254 2984935 4604868 6366538 8947205 11683885 12008447 8955802 5766232
3104 5766232 6961352 13081490 19866420 22687016 20558277 15780406 10998166 7149204
3096 7149204 3597620 -69907 -2448109 -1584565 1335898 1361991 -4727255 -13445616 -18467521
3087 -18467521 -18999249 -19981881 -23281237 -23936117 -18089501 -9882411 -5719352 -5288985 -4300832
3078 -4300832 -3785936 -9128770 -19564085 -26179160 -23358546 -16461085 -14236576 -18066924
3070a8066924m836916k048783J620309O327203J0884869J0512713L709392l468250
3062D633613m723515j493221P17283M95960J34322j19768j888426m154715m110440
3053a0508907j930442j57158J026262L152240M654032K291440k110958k357291
3045e940782K716275O270054L191131k371228l783486j957107k613275o067737
3037a0556155o563971j755029L299422L485590M57485n01893K512190O687005
3029b935356Q383902O383312K326678q49054j780488k315437m877509q295045
3021c958997q672573m831671J7308L068708N167290P398551P798172M681456Q03802
3012A1472046L12632K818042M229477K797609N76694r58607k791574n002945n133508
$$ plain form
3070 -18066924 -22903840 -24952623 -23332314 -17005111 -6120242 4392471 8101863 4633613
3062 4633613 -89902 -1583123 -865840 -369880 -235558 -355326 -2243752 -6398467 -10508907
3053 -10508907 -12439349 -12596507 -11570245 -8418005 -3763973 -1472533 -3583491 -5940782
3045 -5940782 -3224507 3045547 6236678 3865450 81964 -1875143 -4488418 -10556155
3037 -10556155 -17120126 -18875155 -15575733 -12090143 -11632658 -12134551 -9622361 -2935356
3029 -2935356 5448546 11831858 14158536 13309482 11528994 9213557 4336048 -3958997
3021 -3958997 -12631570 -17463241 -17445933 -14377225 -9209935 -1811384 5986788 10668244 11472046
3012 11472046 11784678 14602720 18832197 21629806 22206500 21247893 18456319 13453374 8319866
3003H319866j836445K225989L230706O69778k590503l948890l568065l448665
2995i46229m522159m944541k215605K605846M789606J931458j910644j314283
2987f526551K626119L796430J75427l387474k590523P92094K889010L010673K207008
2978B992213L47492k099275k665046p13966L94757j452679l072021j465155K13113
2969g520567k066037m920513j906963N113888P105432J147821n345552o091586
2961a4484077l969195l577718k917590J388402N964279N132205M23067j603850
2953a3644477M63245J834300K83820q53857M45891J255390o02791k203914j44593
2944a3166986L931331N597020L145011j628991o084855p994312o121723j875910
$$ plain form
3003 8319866 6483421 8709410 11940116 12609894 10019391 6070501 2502436 -946229
2995 -946229 -5468388 -10412929 -12628534 -10022688 -5233082 -3301624 -5212268 -6526551
2987 -6526551 -3900432 -104002 71425 -3316049 -5906572 -5114478 -2225468 785205 2992213
2978 2992213 3339705 1240430 -1424616 -2138582 -1743825 -3196504 -6268525 -7733680 -7520567
2969 -7520567 -9586604 -14507117 -16414080 -11300192 -4194760 -3046939 -8392491 -14484077
2961 -14484077 -18453272 -22030990 -24948580 -23560178 -17595899 -12463694 -12040627 -13644477
2953 -13644477 -13181232 -11346932 -11063112 -11916969 -11471078 -10215688 -10818479 -13022393 -13166986
2944 -13166986 -9235655 -3638635 -493624 -2122615 -8207470 -16201782 -22323505 -24199415
2936b4199415J023542M61839j583129j676218J392906O309985J0391659J0200559
2928B321728M090588m258631q158804n840999k424767j571658r1221M826073Q297356
2919b810335M771377j374377j151676M646206O059048l00247n935874l885431
2911A8691J663043L790172K698829J440411p35749m035275l942805R22626L109424
2902D929367k607349q308672l808319O109209P918160M28667m312450j549846
2894a201233m79893o481609j0878884n873104K312465M710928M208787P916682
2886e765861J2581872R828615J176145m376051n132834p138418j0767348q968074
2878a8561954n68198N666213M081186K31665J171893M962511N287804J171379
$$ plain form
2936 -24199415 -23175873 -22714034 -24297163 -25973381 -24580475 -18270490 -7878831 2321728
2928 2321728 6412316 2153685 -6005119 -11846118 -14270885 -15842543 -15933764 -11107691 -2810335
2919 -2810335 1961042 586665 -565011 4081195 10140243 9839996 3904122 18691
2911 18691 1681734 5471906 8170735 9611146 8875397 4840122 897317 1819943 4929367
2902 4929367 2322018 -5986654 -9794973 -3685764 4232396 4661063 348613 -1201233
2894 -1201233 -1681126 -8162735 -19041619 -24914723 -22602258 -17891330 -13682543 -5765861
2886 -5765861 6816011 16644626 17820771 13444720 8311886 1173468 -9593880 -18561954
2878 -18561954 -19130152 -13463939 -9382753 -9151088 -7979195 -3016684 2271120 3442499
2870C442499l196793m696959l156333k4232J612463j085593n925311o415899n29964
2861a9976122M986596L056639m048381p815396m085931L577122R399295J0284929
2853d621249O443280R11632k156265j603224p31399k318732m222173l144687m48321
2844a1891138J96698p69874N8453K373328K442656L37639O13444L985269M553449
2835A899924j010360o821864n557086Q00180M047071J704692n77418J305230L961691
2826b47940K494801k125265m981896l779191l82096K481712L282894J675415r57770
2817b539336j747630M78176K973781K475218L6851o03539Q18554M38726l158991
2808h28190n568044k531006L318598N240694R30635m941684o682549l310760K175715
$$ plain form
2870 3442499 245706 -4451253 -7607586 -7631818 -6019355 -7104948 -13030259 -19446158 -19976122
2861 -19976122 -14989526 -11932887 -15981268 -23796664 -27882595 -24305473 -14906178 -4621249
2853 -4621249 1822031 2733663 577398 -1025826 -1757225 -4075957 -8298130 -11442817 -11891138
2844 -11891138 -11694440 -12464314 -12405861 -10032533 -7589877 -7252238 -6638794 -2653525 1899924
2835 1899924 889564 -5932300 -11489386 -10689206 -6642135 -4937443 -5514861 -4209631 -247940
2826 -247940 2246861 121596 -4860300 -8639491 -9021587 -6539875 -3256981 -1581566 -2539336
2817 -2539336 -4286966 -3808790 -835009 1640209 1677060 1073521 1892075 2330801 -828190
2808 -828190 -6396234 -8927240 -5608642 -367948 562687 -4378997 -11061546 -14372306 -12196591
2799a2196591O779807R264409R328527O900836K534537k158547n047977m884868
2791A0520133k293405Q65313L027538L412176J534473k316708o082495p238251
2783A428774n729921l827676k347835N48826N207213P785857M733025j559470
2775F238793m871667k450214K556660N614252N137609K478158K8450o07263l84072
2766A3740706k154242o391096r157327p265869l655124l295122m944310k574834
2758b5697218M710460J0166975Q760652L723813R29204J314034K246544K444650
2750H599114J841181j39800k574404k345372J092633L432717J603435j373128
2742A0136376j780390j580366l929841n895650k636616L356073M939311J488590
$$ plain form
2799 -12196591 -5416784 3847625 13176152 20076988 22611525 20452978 15405001 10520133
2791 10520133 8226728 9092041 12119579 15531755 17066228 14749520 8667025 1428774
2783 1428774 -4301147 -8128823 -10476658 -9927832 -4720619 3065238 7798263 6238793
2775 6238793 1367126 -1083088 1473572 7087824 12225433 14703591 14732041 14124778 13740706
2766 13740706 11586464 5195368 -3961959 -11227828 -14882952 -18178074 -23122384 -25697218
2758 -25697218 -20986758 -10819783 -2059131 1664682 2593886 3907920 6154464 8599114
2750 8599114 10440295 10300495 7726091 5380719 6473352 9906069 11509504 10136376
2742 10136376 8355986 6775620 2845779 -3049871 -5686487 -2330414 2608897 4097487
2734D097487n87577R83553R58624l354911o650706m376772j20240J012683P39156
2725g298703L103649N905422L653786l015595p334241n136476J503853Q426597
2717a91708J2024860Q733005j888830j2911471j4817485o595900K584900M773462
2709h289167J754644j56654J008660K939308M006742L633333O06398m301077o488779
2700e286592l472666m97766l816487r512431p028406M719640J3127450Q401527
2692c365731k702114o522574q80983M775485N110346M874495P944529R646865
2684A8880318M747467l343680p241526n490140k099314J029221N055798Q640392
2676B0178536P527363Q34209o540871r325548o818253j732598K774874M002757
$$ plain form
2734 4097487 3509910 4493463 5452087 2097176 -4553530 -8930302 -9050542 -8037859 -7298703
2725 -7298703 -4195054 1710368 5364154 2348559 -4985682 -10122158 -8618305 -191708
2717 -191708 11833152 20566157 18677327 5765856 -9051629 -15647529 -13062629 -8289167
2709 -8289167 -6534523 -6691177 -5682517 -2743209 1263533 4896866 5503264 1202187 -5286592
2700 -5286592 -8759258 -9257024 -13073511 -22585942 -29614348 -24894708 -11767258 -3365731
2692 -3365731 -6067845 -12590419 -13471402 -8695917 -3585571 1288924 9233453 18880318
2684 18880318 23627785 20284105 13042579 7552439 5453125 6482346 11538144 20178536
2676 20178536 27705899 28540108 21999237 12673689 5855436 4122838 6897712 10900469
2668A0900469R00585l912824n843443l723018j305242j790077l307018k103136
2660a0183704J815671M978098N120560K930775K0025k178378k072972O27716L061816
2651D119607J628076l066819o118190m163862Q66855M965986O690289O812337
2643A1734279N478417K460215q65566k679331l550086n348900p253484n939602
2635e964058q87923L381643K617502j543966l897706k500426l17815k84565j670017
2626a1067331k322030k207920k827991m103787l785899l32662M559996P171252
2618a4916372N752467K801831K341989M812191O143127K990533k402106m414148
2610C109512n79228N868349R682887Q170750K535364l216089m894845k023707
$$ plain form
2668 10900469 11801054 7888230 2044787 -1678231 -2983473 -4773550 -8080568 -10183704
2660 -10183704 -8368033 -3389935 1730625 4661400 4681425 2503047 430075 1057791 4119607
2651 4119607 5747683 2680864 -3437326 -7601188 -6734333 -1768347 4921942 11734279
2643 11734279 17212696 19672911 18807345 16128014 12577928 7229028 -24456 -5964058
2635 -5964058 -6851981 -3470338 -852836 -2396802 -6294508 -8794934 -9112749 -9397314 -11067331
2626 -11067331 -13389361 -15597281 -18425272 -22529059 -26314958 -26647620 -22087624 -14916372
2618 -14916372 -9163905 -6362074 -4020085 792106 6935233 9925766 7523660 3109512
2610 3109512 2530284 8398633 18081520 26252270 28787634 25571545 20676700 18652993
2602A8652993P58142j377473o933505r411593n718701J77398L318299L625176
2594C090736L116342J098940l386445o662537l522244M619502R430280N254931
2586A3039505m071497r864658p932303j475035L811262N343949M481620L333176
2578F666019K006056n08297l476716m282411j879113J239261J959124K13793j804145
2569A33571k784090k700025j328606J111962K629205J512997o24379o61007J274502
2560a435870J868072j86305k208465j796932j11879P86986J325072K809884M147914
2551E198477K774316j579265n943914p108022m665577j105478P32704M29546M7410
2542a1219803R43065J415964p33848l879749l638851R97134N421093N148017J602221
$$ plain form
2602 18652993 19411135 18033662 11100157 1688564 -4030137 -3852739 -534440 3090736
2594 3090736 6207078 7306018 3919573 -2742964 -6265208 -1645706 7784574 13039505
2586 13039505 8968008 -896650 -8828953 -10303988 -6492726 -1148777 3332843 6666019
2578 6666019 8672075 8163778 4687062 404651 -1474462 -235201 1723923 1937716 133571
2569 133571 -2650519 -5350544 -6679150 -5567188 -2937983 -1424986 -2049365 -2710372 -1435870
2560 -1435870 432202 245897 -1962568 -3759500 -3871379 -3084393 -1759321 1050563 5198477
2551 5198477 7972793 6393528 449614 -6658408 -11323985 -12429463 -11696759 -11267213 -11219803
2542 -11219803 -10276738 -8860774 -9594622 -13474371 -17113222 -16116088 -10694995 -5546978 -3944757
2533c944757l48574P45882J560273n54487l538219l404957L21193L671988K890549
2524b601109r90411l202834q61320L617643N562919L560387L51352j314223j599515
2515B522889j853070j920270n95019K161972M705102N197015L110347m61847l781406
2506I085713n979546p250119p126129l869959K583375Q054037P582951J972420
2498E052743k076219J78948N856214Q419018N334510l38470m460855n441727m080496
2489H443666k072520p87719k94767K19815M58597j311069n248297q030381o267674
2480a4890349j217721K414066K518159J948175L785456O257484M623916k104708
2472C334478q355637p410744O93207Q389416Q713097K873690k230127l048478
$$ plain form
2533 -3944757 -4293331 -3547449 -1987176 -2541663 -6079882 -9484839 -9163646 -5491658 -2601109
2524 -2601109 -3591520 -6794354 -7655674 -4038031 1524888 5085275 5436627 4122404 2522889
2515 2522889 669819 -1250451 -1845470 316502 5021604 10218619 13328966 12867119 9085713
2506 9085713 3106167 -4143952 -11270081 -15140040 -12556665 -4502628 3080323 5052743
2498 5052743 2976524 3155472 9011686 17430704 22765214 22426744 17965889 12524162 8443666
2489 8443666 6371146 5583427 5288660 5508475 5967072 4656003 -592294 -8622675 -14890349
2480 -14890349 -16108070 -13694004 -11175845 -9227670 -5442214 815270 5439186 3334478
2472 3334478 -5021159 -12431903 -11738696 -3349280 5363817 8237507 6007380 2958902
2464B958902k564802l917777m935188k119409K661122L991952Q21281j923972
2456e027891o85639J663251N91369k990180l890985K4798N042294O659307M789074
2447F175398K481653J270610j30334l049806o578328q280040o242057o84407N330970
2438i706341P354146L683756j910590l830108j414330O10683o55107k213610q50982
2429h932483P07998k016132p006473p488954j924530L449480L704966J679002
2421a7827126K354582N088349N677394L436193J503632J127675N2332k939232
2413a526201n360233m395252q61964J919332K343363K014749K843066L971110
2405I47970L090335N28793l25511K061843M387879L027508l95551j635277p39750
$$ plain form
2464 2958902 394100 -3523677 -8458865 -10578274 -7917152 -3925200 -3103919 -5027891
2456 -5027891 -5713530 -4050279 -3458910 -6449090 -10340075 -10315277 -5272983 1386324 6175398
2447 6175398 8657051 9927661 9797327 6747521 169193 -8110847 -14352904 -15037311 -9706341
2438 -9706341 -2352195 1331561 -579029 -4409137 -5823467 -5212784 -5867891 -8081501 -8932483
2429 -8932483 -8224485 -10240617 -17247090 -24736044 -26660574 -23211094 -19506128 -17827126
2421 -17827126 -15472544 -10384195 -4706801 -1270608 233024 1360699 1413031 -1526201
2413 -1526201 -6886434 -11281686 -12143650 -10224318 -7880955 -5866206 -3023140 947970
2405 947970 4038305 4567098 4241587 6303430 10691309 13718817 13323266 11687989 10948239
2396A0948239j616636m811862o002370k971253R62257K568462K898130L181995
2388E156962J532033k556779n068386l435454j567868l704155o918124n817663
2380b2379434j714232j37823j076155O60921N591344P735516M100965p51258k012263
2371i982419o74367N06977J683419K983418J659685l327301p258524n025879J314337
2362a8120654M821799K730480p83509j128119Q72482J218134j213241l130357
2354a4732985j428334K341962L732001J304103j437085r48160J822004L748514
2346e597980M165225M201594L228148j26162m075688m783650j508803K779048
2338a718268N798023P268991O183662J520747l766526m636873j347502J54939
$$ plain form
2396 10948239 9331603 4519741 -1482629 -4453882 -3491625 -923163 1974967 5156962
2388 5156962 6688995 4132216 -936170 -4371624 -5939492 -9643647 -16561771 -22379434
2380 -22379434 -24093666 -24231489 -25307644 -24646723 -19055379 -11319863 -7218898 -7970156 -9982419
2371 -9982419 -10656786 -10149809 -8466390 -5482972 -3823287 -7150588 -14409112 -19434991 -18120654
2362 -18120654 -13298855 -10568375 -11351884 -12480003 -11607521 -10389387 -11602628 -14732985
2354 -14732985 -16161319 -13819357 -10087356 -8783253 -10220338 -11168498 -9346494 -5597980
2346 -5597980 -1432755 2768839 5996987 5870825 1795137 -2988513 -4497316 -1718268
2338 -1718268 4079755 11348746 17532408 19053155 15286629 10649756 9302254 9457193
2330I457193k666573m920817k645736L59685r12314l874006k542582K284626M061470
2321a399054P38330k774710k881097j800247k113719k397992j094447j00801r65154
2312a4788891j207578J463893M166949K859738n51208o52157K421429K562488
2304c725337k148684n155473j361299L868339J992973n462376q545236l155079
2296b3692172M161296P171629P829892R420649R119127L620414l043012m517768
2288A0070055j706026l79012j764980k699080l067023n017383n775196j99996
2280a0538641Q661879J0542606K183507p305767q841987l955230R61300L893354
2272d398979N547424M693469J239020q25200O21332J180038l022051p832917o983252
$$ plain form
2330 9457193 6790620 1869803 -775933 -416248 -1328562 -5202568 -7745150 -5460524 -1399054
2321 -1399054 -660724 -3435434 -6316531 -8116778 -10230497 -12628489 -13722936 -13823737 -14788891
2312 -14788891 -15996469 -14532576 -10365627 -7505889 -8057097 -8709254 -6287825 -3725337
2304 -3725337 -5874021 -11029494 -12390793 -8522454 -6529481 -11991857 -20537093 -23692172
2296 -23692172 -19530876 -12359247 -4529355 4891294 14010421 17630835 14587823 10070055
2288 10070055 8364029 7985017 6220037 3520957 453934 -4563449 -10338645 -10538641
2280 -10538641 -1876762 8665844 10849351 3543584 -5298403 -9253633 -8292333 -4398979
2272 -4398979 1148445 5841914 7080934 6255734 6877066 8057104 5035053 -2797864 -9781116
2263i781116j894362J263687J475644K588099M989574N117886K779544J838738
2255H377694K979224K120369k513259o998011p134138l259889J599823M957228
2247A29041N439773L273186O90654o32399j905861m198368m876058j318268L420810
2238B2510M000871R28962n76782N22501j6587l214424m343218j200382J699797
2229b176752O87622j086386M66404L338606L194542O11059m68959P71743J639579
2220F977458O63810j068736k407558l035458k746648j990112j856125j824375
2212g287744M32590N076601Q433461P659252M409457J151774l008680q930053
2204G936658j2714668r626692j516218M727178N846439M666059L843571K193703
$$ plain form
2263 -9781116 -11675478 -10411791 -8936147 -6348048 -1358474 3759412 6538956 8377694
2255 8377694 11356918 13477287 10964028 3966017 -3168121 -6428010 -4828187 129041
2247 129041 5568814 8842000 9532654 8900255 6994394 2796026 -2080032 -3398300 22510
2238 22510 4023381 4952343 4375561 4898062 4881475 1667051 -2676167 -3876549 -2176752
2229 -2176752 -1489130 -2575516 -2109112 1229494 4424036 5035095 4566136 5337879 6977458
2220 6977458 7641268 6572532 4164974 1129516 -1617132 -3607244 -5463369 -7287744
2212 -7287744 -6855154 -1778553 6654908 14314160 18723617 19875391 16866711 7936658
2204 7936658 -4778010 -14404702 -15920920 -11193742 -5347303 -681244 3162327 5356030
2196E356030j426673m901235n711590m006110j072955K501905N582068O259119
2188B580559M792431M101036N245257N133573J316268l550939n352330m468488
2180I797367m097993m156178j722718K585221L889530K82757l686614l411644
2172e20272n27844M58813r64815j674450l45787J398754K380259K793506K327170
2163E325334P88280J479J374071K146461j431960p122763q104600k700429K528037
2154g196090J991713j392191j482794K219662N271090N031143K506067n45699
2146F402901k641830k494616j055669j434234l808407l634086J215438N345721
2138b104782L337030j109832n34371M097721M741371p73611n661695n255375k983975
$$ plain form
2196 5356030 3929357 -971878 -6683468 -10689578 -11762533 -9260628 -3678560 2580559
2188 2580559 7372990 11474026 16719283 21852856 23169124 19618185 14265855 9797367
2180 9797367 5699374 1543196 -179522 2405699 6295229 6577986 2891372 -520272
2172 -520272 -1048116 -589303 -1554118 -3228568 -3574355 -2175601 204658 2998164 5325334
2163 5325334 6113614 6115093 7489164 9635625 8203665 1080902 -7023698 -9724127 -7196090
2154 -7196090 -5204377 -6596568 -8079362 -5859700 -588610 4442533 6948600 6402901
2146 6402901 3761071 1266455 210786 -1223448 -5031855 -8665941 -7450503 -2104782
2138 -2104782 1232248 122416 -411955 3685766 8427137 7653526 1991831 -3263544 -6247519
2129f247519k696917k638553r34013l14308k469050l264328R04227O264925O791749
2120d603787L044780M46407Q95882J334365l83545k734898l568336k719891j435245
2111i724268q27569m86750J643273O054600Q696912N335270o99659j077682N009797
2102A3923924P901209J665328n802226m282592K840034L832492l248384q264013
2094H565772m761572J983544M849017L951532K103026j355355p009916j0861861
2086b535813q639341j654169N363434R503408R808667N550632j823406p381987
2078H191425p073902k264983K363016L803503J861397k119851n195656l992304
2070d427355J044998M535970K286169l160715n985931m413829j411330M58338
$$ plain form
2129 -6247519 -8944436 -11582989 -12517002 -12831310 -15300360 -18564688 -17660461 -11395536 -4603787
2120 -4603787 -1559007 -1112600 -216718 1117647 734102 -2000796 -5569132 -8289023 -9724268
2111 -9724268 -10551837 -11038587 -9395314 -3340714 5356198 10691468 9991809 8914127 13923924
2102 13923924 21825133 23490461 17688235 13405643 16245677 20078169 16829785 8565772
2094 8565772 3804200 5787744 10636761 14588293 16691319 15335964 8326048 -2535813
2086 -2535813 -11175154 -12829323 -7465889 2037519 11846186 17396818 15573412 8191425
2078 8191425 1117523 -1147460 1215556 5019059 6880456 4760605 -435051 -4427355
2070 -4427355 -3382357 1153613 3439782 279067 -5706864 -10120693 -11532023 -11073685
2062a1073685J371555K180368L198222M644759N717862M111573p50820n179128
2054D220706n274504k422797p59836j65637K964971P810755Q179823J844339m768894
2045A1628926n186009j689550n57494k064535j488114J711380K722630k6002j598123
2036C453109J591972N894341O112640L116318J233776P48605j579392n283455
2028A5287914n173327O74015O222967M263278m118622j0474961r196094l546592
2020f061422k30996n52056q8688L493537O254191L656711k334881n479215l540370
2011d883189k80118J073003J875540L651178L812947l54365n964821p246617l222296
2002a1538738J211765J950906Q2465r83395L3487J858316K898464K792867K327388
$$ plain form
2062 -11073685 -9702130 -7521762 -4323540 321219 6039081 10150654 9399834 4220706
2054 4220706 -1053798 -3476595 -4236431 -4402068 -1437097 6373658 14553481 16397820 11628926
2045 11628926 6442917 4753367 4195873 2131338 643224 2354604 5077234 5051232 3453109
2036 3453109 5045081 10939422 17052062 20168380 21402156 22150761 20571369 15287914
2028 15287914 10114587 10788602 17011569 21274847 17156225 6681264 -2514830 -6061422
2020 -6061422 -6292418 -6844474 -6933162 -3439625 2814566 6471277 4136396 -1342819 -4883189
2011 -4883189 -5163307 -4090304 -2214764 1436414 5249361 4894996 -1069825 -8316442 -11538738
2002 -11538738 -10326973 -8376067 -8293602 -9276997 -9243510 -7385194 -4486730 -1693863 633525
1993F33525J967988N99822k717543n423716l157409L160647N894628O25986n864118
1984d280190l740714N634614J0906722O207096k024311n332913l213835J63282
1976D319751K555490K818689q28643o801610q936698m218076K124837L954268
1968e011992K719768L326184N238758M145190J92613k018803q66677O00679K17658
1959H543378r96859k142282l705917n242916n195689l036396P93217N743104R477681
1950D237321Q039508J443283l745549k085339L203645N493515M314542L154338
1942B4055264R16076n698843j2712437j1637303k749878L764259K412863p24075
1934b374074O23022L228402J575027k320208k935177l08657J166797j70154k442978
$$ plain form
1993 633525 2601513 3201335 483792 -4939924 -8097333 -4936686 957942 1583928 -4280190
1984 -4280190 -8020904 -2386290 8520432 14727528 12703217 7370304 4156469 4319751
1976 4319751 6875241 9693930 8865287 2063677 -6873021 -11091097 -8966260 -5011992
1968 -5011992 -2292224 1033960 6272718 10417908 10610521 8591718 7725041 8325720 8543378
1959 8543378 7546519 5404237 1698320 -3544596 -8740285 -11776681 -10983464 -5240360 4237321
1950 4237321 12276829 13720112 9974563 7889224 11092869 16586384 20900926 24055264
1942 24055264 24971340 19272497 6560060 -5077243 -7827121 -4062862 -1649999 -2374074
1934 -2374074 -1751052 1477350 3052377 732169 -2203008 -2511665 -1344868 -1515022 -3958000
1925c958000l887575l415086m53526K595822J507229k944727l932424J653521
1917a2834766P373913O253767Q29453j839099q68387l41119r54788n08255j96037
1908c085318k447692m133206k52337O250165P015905J209111k804879o33334K026529
1899C144944J50311j917145J543646P091719O720219m34622p568423r640812p533202
1890h443365l601261J327678N688046O357691K273756l332062o045904m735349
1882a0510770k032014q69701j205946n26893K297234M686327L477270j44992j507801
1873f337286J145637M076055L627536J583502J984566M565839N198895K320599
1865A8165343r35511j720904j175965j452277j749331k2110K712124K801818j004252
$$ plain form
1925 -3958000 -7845575 -11260661 -11714187 -9118365 -7611136 -10555863 -14488287 -12834766
1917 -12834766 -5460853 792914 1622367 -216732 -1085119 -1426238 -2381026 -2889281 -3085318
1908 -3085318 -5533010 -9666216 -9918553 -3668388 3347517 4556628 1751749 1118415 3144944
1899 3144944 3295255 1378110 2921756 10013475 16733694 16299072 8730649 -910163 -8443365
1890 -8443365 -12044626 -10716948 -5028902 1328789 3602545 270483 -5775421 -10510770
1882 -10510770 -12542784 -13412485 -14618431 -15145324 -12848090 -8161763 -4684493 -4829485 -6337286
1873 -6337286 -5191649 -1115594 2511942 4095444 6080010 10645849 15844744 18165343
1865 18165343 17229832 15508928 14332963 12880686 11131355 11109245 13821369 16623187 15618935
1856A5618935n212248n517734j882282J814528K760400K114114K314981K994560
1848A5005254J370950l511602q749844j0476853p559409j735567M412780Q284803
1840b959488P642735K771522k131941k545036P85766K421647m48456m031619l520226
1831b015096j62038R09856j310448k321909O09056L969702L101670j155780l976500
1822b351487l136882j024437m70683j225805j164849N75346K444681K033713j248438
1813e568841m908576n420044j885013L099818O308703O326704L251572j536708
1805c32385m505910j994002M622009Q346851M195556m371049r680470q890690
1797a2610090n431148k844743j214637O88433L321983O391549Q087123N212441
$$ plain form
1856 15618935 10406687 4888953 3006671 4821199 7581599 9695713 12010694 15005254
1848 15005254 16376204 12864602 4114758 -6362095 -13921504 -15657071 -11244291 -2959488
1840 -2959488 4683247 7454769 5322828 2777792 3563558 5985205 5536749 1505130 -2015096
1831 -2015096 -2177134 -1267278 -2577726 -4899635 -4290579 -320877 2780793 1625013 -2351487
1822 -2351487 -5488369 -6512806 -6983489 -8209294 -9374143 -8798797 -6354116 -4320403 -5568841
1813 -5568841 -10477417 -15897461 -17782474 -14682656 -8373953 -2047249 1204323 -332385
1805 -332385 -4838295 -6832297 -2210288 6136563 10332119 5961070 -3719400 -12610090
1797 -12610090 -18041238 -20885981 -22100618 -21412185 -18090202 -11698653 -3611530 1600911
1789A600911k457948r121773q663243k766751J486982J669509J982397M845646
1781a1424270O885752N244599K045241j59430k190951m572896n004784k649365
1773a1826104k46313J015695L548324P098702O652222J223447j768576K544375
1765H241772O991255K199610q265455j2066162n443352K877600M855973J645538
1757A036779j803027k814375k73782N127182Q479002N108999j425651k841093
1749A0594034J293071K738122j512563m029257k38791K642881k404803r212711
1741a30017p409592P34703L569896j883646o218701k824923L282974N046512L382653
1732b450141K773174L246099K456865J312190J719128J796034r11505l602684
$$ plain form
1789 1600911 -857037 -9978810 -18642053 -21408804 -19921822 -18252313 -16269916 -11424270
1781 -11424270 -4538518 706081 2751322 2591892 400941 -4171955 -9176739 -11826104
1773 -11826104 -12072417 -11056722 -7508398 -409696 6242526 7465973 5697397 8241772
1765 8241772 15233027 17432637 9167182 -2898980 -8342332 -5464732 -608759 1036779
1757 1036779 -766248 -3580623 -3854405 1272777 9751779 14860778 13435127 10594034
1749 10594034 11887105 14625227 13112664 9083407 8844616 11487497 9082694 -130017
1741 -130017 -7539609 -6804906 -3235010 -5118656 -11337357 -14162280 -10879306 -5832794 -2450141
1732 -2450141 323033 3569132 6025997 7338187 9057315 10853349 9941844 6339160
1724F339160j754612K518994K274485l368956o767854k878211L055057L346139
1716B764202j254621m208337l422639k104629j039498K394812O976727P025796
1708G131813J703826j927455O14106L711449L50667o464432q119484l303236J127209
1699e175537J143649j74367O6914K31910p56562l76972K130574K748049p64992
1690i27334l609589l14438O422734Q716039M257805j091768j978331k09236o14657
1681A0651225l526580m764257k053257J811113K900399Q10940k205070m807788
1673a183275o573760n606685j11514P012025R302721M848763j95381L64295M052544
1664A1909733L625455j949775n857911l234342K238223L616098n85089n395357
$$ plain form
1724 6339160 4584548 7103542 9378027 6009071 -758783 -3636994 -581937 2764202
1716 2764202 1509581 -2698756 -6121395 -8226024 -9265522 -6870710 106017 7131813
1708 7131813 8835639 6908184 7522290 11233739 11584406 5119974 -2999510 -6302746 -5175537
1699 -5175537 -4031888 -4206255 -4139341 -3907431 -4663993 -5040965 -2910391 -162342 -927334
1690 -927334 -4536923 -4851361 1571373 10287412 14545217 13453449 11475118 11265882 10651225
1681 10651225 7124645 2360388 307131 2118244 5018643 5829583 3624513 -1183275
1673 -1183275 -7757035 -13363720 -13475234 -6463209 2839512 7688275 7492894 7857189 11909733
1664 11909733 15535188 13585413 7727502 4493160 6731383 10347481 9762392 4367035
1656D367035n643861j476728K030806M44282m621830o700004k128273N089660
1648h638913Q055029N033947K33475j938479l54061L689414P272986O812134J815814
1639B1981346l198295m069507k835104l937226o322573n119083m90639J758457
$$ plain form
1656 4367035 -1276826 -2753554 -722748 -278466 -4900296 -11600300 -13728573 -8638913
1648 -8638913 -583884 4450063 4683538 2745059 2390998 6080412 13353398 20165532 21981346
1639 21981346 18783051 14713544 11878440 7941214 1618641 -3500442 -3991081 -2232624
$$ [...]
##END NTUPLES=NMR SPECTRUM
##END=
