##TITLE=31Pdec_DE-102_ch_7_TFA
CDCl3, 64 sc
 27.8.2025
##JCAMPDX= 6.0         $$ Bruker NMR JCAMP-DX V2.0
##DATA TYPE= NMR SPECTRUM
##DATA CLASS= NTUPLES
##ORIGIN= UXNMR, Bruker Analytische Messtechnik GmbH
##OWNER= root
$$ XWIN-NMR		Version 3.5
$$ Wed Aug 27 14:24:24 2025 Russian Standard Time (UT+4h)  she@DPX200
##.OBSERVE FREQUENCY= 81.013821
##.OBSERVE NUCLEUS= ^31P
##.ACQUISITION MODE= SIMULTANEOUS
##.ACQUISITION SCHEME= undefined
##.AVERAGES= 64
##.DIGITISER RES= 17
##SPECTROMETER/DATA SYSTEM= spect
##.PULSE SEQUENCE= zgpg30
##.SOLVENT NAME= CDCl3
##.SHIFT REFERENCE= (INTERNAL, CDCl3, 0, 198.062)
##AUDIT TRAIL= $$ (NUMBER, WHEN, WHO, WHERE, WHAT)
$$ ##TITLE= Audit trail, XWIN-NMR		Version 3.5
$$ ##JCAMPDX= 5.01
$$ ##ORIGIN= Bruker BioSpin GmbH
$$ ##OWNER= she
$$ F:/spectra/data/she/nmr/P31/2/pdata/1/auditp.txt
$$ ##AUDIT TRAIL=  $$ (NUMBER, WHEN, WHO, WHERE, WHAT)
(   1,<2025-08-27 14:23:24.35 +0400>,<she>,<DPX200>,
      <created by zg, POWCHK disabled, PULCHK disabled
       configuration hash MD5:
       00 E9 B6 7A A2 85 ED C7 34 08 36 98 17 FE 4E 26
       data hash MD5: 32K
       CA D1 7D C4 A1 77 41 A9 5F 76 63 62 EB 31 05 7B>)
(   2,<2025-08-27 14:23:27.71 +0400>,<she>,<DPX200>,
      <Start of raw data processing
       efp BC_mod = 2 LB = 1.5 FT_mod = 6 PKNL = 1 PHC0 = 1601.585 PHC1 = -446.9 SI = 64K 
       data hash MD5: 64K
       E7 40 51 FE 5A 00 13 A1 5B 0F A2 36 8F 4F 75 B1>)
(   3,<2025-08-27 14:23:45.92 +0400>,<she>,<DPX200>,
      <pk PHC0 = -8.547265 PHC1 = 0 
       data hash MD5: 64K
       C1 0C DA 31 0C EB 3E CB 49 F3 8E 46 4A E0 51 6D>)
(   4,<2025-08-27 14:23:52.46 +0400>,<she>,<DPX200>,
      <abs ABSG = 5 
       data hash MD5: 64K
       34 CD F9 48 8D 38 E4 E7 95 2D 20 B6 0F 16 C7 B3>)
$$ ##END=
$$ 
$$ hash MD5
$$ F6 A7 51 F1 EA 68 42 54 E7 D4 14 ED 8B 10 D4 B2
##$RELAX= 
##$RELAX= 
##$RELAX= 
##$RELAX= 
##$RELAX= 
##$RELAX= 
##$RELAX= 
##$RELAX= 
$$ Bruker specific parameters
$$ --------------------------
##$DU= <F:/spectra>
##$EXPNO= 2
##$NAME= <P31>
##$PROCNO= 1
##$TYPE= <nmr>
##$USER= <she>
##$AMP= (0..31)
100 100 100 100 100 100 100 100 100 100 100 100 100 100 100 100 100 100 
100 100 100 100 100 100 100 100 100 100 100 100 100 100 
##$AQSEQ= 0
##$AQ_mod= 1
##$AUNM= <au_zg>
##$AUTOPOS= <>
##$BF1= 81.014009
##$BF2= 200.13
##$BF3= 200.13
##$BF4= 200.13
##$BF5= 200.13
##$BF6= 200.13
##$BF7= 200.13
##$BF8= 200.13
##$BYTORDA= 1
##$CFDGTYP= 0
##$CFRGTYP= 5
##$CHEMSTR= <none>
##$CNST= (0..31)
1 1 145 1 1 1 1 1 1 1 1 1 1 1 1 1 1 1 1 1 1 1 1 1 1 1 1 1 1 1 1 1 
##$CPDPRG= <waltz16>
##$CPDPRG1= <>
##$CPDPRG2= <waltz16>
##$CPDPRG3= <>
##$CPDPRG4= <mlev>
##$CPDPRG5= <mlev>
##$CPDPRG6= <mlev>
##$CPDPRG7= <mlev>
##$CPDPRG8= <mlev>
##$CPDPRGB= <>
##$CPDPRGT= <>
##$D= (0..31)
0 1 0 0 0 0 0 0 0 0.06 0 0.03 2e-05 3e-06 0 0 0.0002 0 0 0 0 0 0 0 0 0 
0 0 0 0 0 0 
##$DATE= 1756290203
##$DBL= (0..7)
120 120 120 11 120 120 24 19 
##$DBP= (0..7)
150 150 150 150 150 150 150 150 
##$DBP07= 0
##$DBPNAM0= <>
##$DBPNAM1= <>
$$ [...]
##$SUBNAM3= <"">
##$SUBNAM4= <"">
##$SUBNAM5= <"">
##$SUBNAM6= <"">
##$SUBNAM7= <"">
##$SUBNAM8= <"">
##$SUBNAM9= <"">
##$SW= 400.765351723535
##$SWIBOX= (0..15)
0 1 3 0 0 0 0 0 0 0 0 0 0 0 0 0 
##$SW_h= 32467.5324675325
##$TD= 32768
##$TD0= 1
##$TE= 0
##$TE2= 300
##$TE3= 300
##$TEG= 300
##$TL= (0..7)
0 120 53 12 22 120 120 120 
##$TP= (0..7)
150 150 150 150 150 150 150 150 
##$TP07= 0
##$TPNAME0= <>
##$TPNAME1= <>
##$TPNAME2= <>
##$TPNAME3= <>
##$TPNAME4= <>
##$TPNAME5= <>
##$TPNAME6= <>
##$TPNAME7= <>
##$TPOAL= (0..7)
0.5 0.5 0.5 0.5 0.5 0.5 0.5 0.5 
##$TPOFFS= (0..7)
0 0 0 0 0 0 0 0 
##$TUNHIN= 0
##$TUNHOUT= 0
##$TUNXOUT= 0
##$USERA1= <user>
##$USERA2= <user>
##$USERA3= <user>
##$USERA4= <user>
##$USERA5= <user>
##$V9= 5
##$VALIST= <valist>
##$VCLIST= <CCCCCCCCCCCCCCC>
##$VD= 0
##$VDLIST= <DDDDDDDDDDDDDDD>
##$VPLIST= <PPPPPPPPPPPPPPP>
##$VTLIST= <TTTTTTTTTTTTTTT>
##$WBST= 1024
##$WBSW= 4
##$XGAIN= (0..3)
0 0 0 0 
##$XL= 0
##$YL= 0
##$YMAX_a= 11389
##$YMIN_a= -6469
##$ZGOPTNS= <>
##$ZL1= 120
##$ZL2= 120
##$ZL3= 120
##$ZL4= 120
##$ABSF1= 198.0616
##$ABSF2= -202.7028
##$ABSG= 5
##$ABSL= 3
##$ALPHA= 0
##$AQORDER= 0
##$ASSFAC= 0
##$ASSFACI= 0
##$ASSFACX= 0
##$ASSWID= 0
##$AUNMP= <proc_1d>
##$AZFE= 0.1
##$AZFW= 0.5
##$BCFW= 0
##$BC_mod= 2
##$BYTORDP= 0
##$COROFFS= 0
##$CY= -3
##$DATMOD= 1
##$DC= 0
##$DFILT= <>
##$DTYPP= 0
##$F1P= 0
##$F2P= 0
##$FCOR= 1
##$FTSIZE= 65536
##$FT_mod= 6
##$GAMMA= 0
##$GB= 0
##$INTBC= 1
##$INTSCL= 9.790993e-09
##$ISEN= 30
##$LB= 1.5
##$LEV0= 0
##$LPBIN= 0
##$MAXI= 10000
##$MC2= 0
##$MEAN= 0
##$ME_mod= 0
##$MI= 50
##$NCOEF= 0
##$NC_proc= -8
##$NLEV= 6
##$NOISF1= 182.463
##$NOISF2= 159.3651
##$NSP= 0
##$NTH_PI= 0
##$NZP= 0
##$OFFSET= 198.0616
##$PC= 4
##$PHC0= 1593.038
##$PHC1= -446.9
##$PH_mod= 1
##$PKNL= yes
##$PPARMOD= 0
##$PSCAL= 0
##$PSIGN= 0
##$REVERSE= no
##$SF= 81.0140089999434
##$SI= 65536
##$SIGF1= 159.3651
##$SIGF2= -187.1042
##$SINO= 113.3802
##$SIOLD= 16384
##$SREGLST= <1H.CDCl3>
##$SSB= 0
##$STSI= 65536
##$STSR= 0
##$SW_p= 32467.5324675325
##$SYMM= 0
##$S_DEV= 0
##$TDeff= 32768
##$TDoff= 0
##$TI= <>
##$TILT= no
##$TM1= 0
##$TM2= 0
##$TOPLEV= 0
##$USERP1= <user>
##$USERP2= <user>
##$USERP3= <user>
##$USERP4= <user>
##$USERP5= <user>
##$WDW= 1
##$XDIM= 65536
##$YMAX_p= 273167851
##$YMIN_p= -120399327
$$ End of Bruker specific parameters
$$ ---------------------------------
##NTUPLES= NMR SPECTRUM
##VAR_NAME=  FREQUENCY,     SPECTRUM/REAL,   SPECTRUM/IMAG
##SYMBOL=    X,             R,               I
##VAR_TYPE=  INDEPENDENT,   DEPENDENT,       DEPENDENT
##VAR_FORM=  AFFN,          ASDF,            ASDF
##VAR_DIM=   65536,         65536,           65536
##UNITS=     HZ,            ARBITRARY UNITS, ARBITRARY UNITS
##FACTOR=    0.49542278885378, 1,            1
##FIRST=     16045.7642231865, 0,            0
##LAST=      -16421.768244346, 0,            0
##MIN=       -16421.768244346, -120399327,   0
##MAX=       16045.7642231865, 273167851,    0
$$ Real data points
##PAGE= N=1
##DATA TABLE= (X++(R..R)), XYDATA
$$ [...]
7502b965529N20780J250440J416286J086171K65239o54257r29040o19313o86393
$$ -2965529 -2444749 -1194309 221977 1308148 1573387 919130 -9910 -629223 -1315616
7493a315616j327137j353384m3603J410584J311070l38983j915863k086549r79708
$$ -1315616 -2642753 -3996137 -4039740 -2629156 -1318086 -1657069 -3572932 -5659481 -6639189
7484f639189L32985J043223J205441J120553M00764j407268l032494j993696J764316
$$ -6639189 -6306204 -5262981 -4057540 -2936987 -2536223 -3943491 -6975985 -8969681 -7205365
7475g205365M455423L016110k52107p81073J296439J324510k357406n460740m083145
$$ -7205365 -2749942 266168 14061 -767012 529427 1853937 -503469 -5964209 -10047354
7466a0047354j05766K341996K491568J893377O64888j452180k396180k09504L096352
$$ -10047354 -10153120 -7811124 -5319556 -3426179 -2761291 -4213471 -6609651 -6819155 -3722803
7457c722803L944252K521504J857603K365756J635862m23853q45559J066596J970393
$$ -3722803 221449 2742953 4600556 6966312 8602174 8178321 7332762 8399358 10369751
7448A0369751j76643k718207k550713p64739m20649j927131l241620l113378j829353
$$ 10369751 10193108 7474901 4924188 4159449 3738800 1811669 -1429951 -4543329 -6372682
7439f372682O5645J805420K182865R68471m44682j134364k009815l628191m324166
$$ -6372682 -6307037 -4501617 -2318752 -1350281 -1794963 -2929327 -4939142 -8567333 -12891499
7430a2891499k521230M82818K261499K661744L117502L520704K459447J98039
$$ -12891499 -15412729 -14929911 -12668412 -10006668 -6889166 -3368462 -909015 -710976
7422g10976j228525j047739n66860o35265m75919L37576P27741q2731j099317
$$ -710976 -1939501 -2987240 -3554100 -4189365 -4665284 -4327708 -3599967 -3682698 -4782015
7413d782015r26595L65377J538289J638742O68934n42534q98596j47392N54154
$$ -4782015 -5708610 -5343233 -3804944 -2166202 -1497268 -2039802 -2938398 -3085790 -2531636
7404b531636N7480r37860p03619Q17093J642254N72518j045881j246930m6865
$$ -2531636 -2474156 -3412016 -4115635 -3298542 -1656288 -1083770 -2129651 -3376581 -3423446
7395c423446Q88889N02619o19758j102915j28933J717113K726156J803339O2900
$$ -3423446 -2534557 -2031938 -2651696 -3754611 -3883544 -2166431 559725 2363064 2425964
7386B425964k90010R66121J359461r58153m194109m673960j366120K659960L624521
$$ 2425964 2135954 3102075 4461536 3503383 -690726 -5364686 -6730806 -4070846 -446325
7377d46325J092321j847795k093315L42773K850143L357994K111604K91818j728435
$$ -446325 645996 -1201799 -3295114 -2952341 -102198 3255796 5367400 5659218 3930783
7368C930783l607542l734206r26098K783154L553537O84162k093728j567714P62218
$$ 3930783 323241 -3410965 -4337063 -1553909 1999628 2683790 590062 -977652 -215434
7359b15434J333583l12138j510941p54727O33399J060438O48913K45980J81173
$$ -215434 1118149 806011 -704930 -1459657 -826258 234180 883093 1129073 1310246
7350A310246M93977J080284J354004R37524N80914R50043Q12695j475802m610401
$$ 1310246 1804223 2884507 4238511 5176035 5756949 6706992 7519687 6043885 1433484
7341A433484n019152j779506J604662J841090J10634k81744J264048K604174K521805
$$ 1433484 -3585668 -5365174 -3760512 -1919422 -1808788 -2090532 -826484 1777690 4299495
7332D299495J857184J375674Q30936J88569j34583l70827j092540j794377j422885
$$ 4299495 6156679 7532353 8363289 8551858 8417275 8046448 6953908 5159531 3736646
7323C736646k90417K75865J85618N56459J305374R60179n90735j391969m15127
$$ 3736646 3446229 3722094 3907712 4464171 5769545 6729724 6138989 4747020 4331893
7314D331893Q10206P42515K0416l09719p99483k028906k782107j907809n56186
$$ 4331893 5142099 5884614 5905030 5595311 4795828 2766922 -15185 -1922994 -2479180
7305b479180l03066l54218Q37384K272140J650900p16416k302485k362941k341567
$$ -2479180 -2782246 -3136464 -2299080 -26940 1623960 907544 -1394941 -3757882 -6099449
7296f099449k326499p44985J790109K216295P1815r91700J046825L049139K043828
$$ -6099449 -8425948 -9170933 -7380824 -5164529 -5092714 -6084414 -5037589 -1988450 55378
7287E5378N52995K220361M796271L036400k451694n186457k316471J392402J107822
$$ 55378 608373 2828734 7625005 10661405 8209711 3023254 706783 2099185 3207007
7278C207007j434396k051893q79036p99964j765130j338684K73460K87887j551597
$$ 3207007 1772611 -279282 -1158318 -1958282 -3723412 -5062096 -4788636 -4500749 -6052346
7269f052346k036760L52047K788112K287555l7981r91721J79303J461324J426743
$$ -6052346 -8089106 -7737059 -4948947 -2661392 -2699373 -3691094 -3511791 -2050467 -623724
7260f23724Q90468J188362K156468K369251J025992p88182j159220J16763Q79691
$$ -623724 266744 1455106 3611574 5980825 7006817 6218635 5059415 5176178 6055869
7251F055869n18687k537076k440020m74568M54142m91144o34716J654969L807152
$$ 6055869 5537182 3000106 560086 85518 539660 48516 -586200 1068769 4875921
7242D875921K701589p07097l046530l094570j876447K25656L030155M249314J585166
$$ 4875921 7577510 6870413 3823883 729313 -1147134 -921478 2108677 6357991 7943157
7233G943157k901406m356838j680535J114480J035368j23947K11154J205927Q95636
$$ 7943157 5041751 684913 -995622 118858 1154226 1030279 1241433 2447360 3342996
7224C342996k24963o29288n34410o55159k58418R41481J060125q67433k093437
$$ 3342996 3118033 2488745 1954335 1299176 1040758 1982239 3042364 2174931 81494
7215H1494J46378L745326M260802J317088j267769j157340M00037J840369K903221
$$ 81494 227872 3973198 8234000 9551088 8283319 7125979 7526016 9366385 12269606
7206A2269606K842664O22767k551149l989507l166059j749819k62664J775132
$$ 12269606 15112270 15735037 13183888 9194381 6028322 4278503 4015839 5790971
7198E790971K705340K00915l760151m258074q65084J313062l00144k043014r84656
$$ 5790971 8496311 8697226 4937075 679001 -186083 1126979 826835 -1216179 -2200835
7189b200835l691j891686l467530q30019L460612M227955J787926K94278K17185
$$ -2200835 -2204526 -4096212 -7563742 -8393761 -4933149 -705194 1082732 1377010 1594195
7180A594195j238974l488893k801070Q80653L271931K495440J108083N69492r55406
$$ 1594195 355221 -3133672 -5934742 -5054089 -1782158 713282 1821365 2390857 1435451
7171A435451l775523m666725j915801J664902K911360K063828O46583q87057j683171
$$ 1435451 -2340072 -7006797 -8922598 -7257696 -4346336 -2282508 -1635925 -2522982 -4206153
7162d206153k64670K306284K569511k8804j613674N7847J840630M77389j981339
$$ -4206153 -4470823 -2164539 404972 376168 -1237506 -1179659 660971 1138360 -842979
7153h42979j761947N32242J542136Q55928R32903K444769L430350K621270O44999
$$ -842979 -2604926 -2072684 -530548 325380 1258283 3703052 7133402 9754672 10399671
7144A0399671j608164l352718l399642j631578r1346l55394j011515j66754J013602
$$ 10399671 8791507 5438789 2039147 407569 316223 -39171 -1050686 -1217440 -203838
7135b03838K97915j331119r52970J297718K179150M36724j448969j293088l8571
$$ -203838 94077 -1237042 -2190012 -892294 1286856 1723580 274611 -1018477 -1057048
7126a057048M26073j75551j210163k347098k960009j988228M69327K591396K783815
$$ -1057048 -630975 -806526 -2016689 -4363787 -7323796 -9312024 -8842697 -6251301 -3467486
7117c467486J427433J55299J5766O48067Q70958Q0735q42597o05744N16497J054739
$$ -3467486 -2040053 -1884754 -1868988 -1220921 -349963 -269228 -1111825 -1717569 -1201072 -146333
7107a46333Q46123J097546J380552n02093m064049m944724j120265K830177J753843
$$ -146333 699790 1797336 3177888 2675795 -1388254 -6332978 -7453243 -4623066 -2869223
7098b869223k292943l224283j38516K291073J896407J373744K041209J335544
$$ -2869223 -5162166 -8386449 -8524965 -6233892 -4337485 -2963741 -922532 413012
7090D13012j632059l460769j986028J96774M63212J70996J048681J662461P63911
$$ 413012 -1219047 -4679816 -6665844 -6469070 -6005858 -5834862 -4786181 -3123720 -2359809
7081b359809L47541J726043K101926q41819m042881l276502J99982J887701R75952
$$ -2359809 -2012268 -286225 1815701 973882 -3068999 -6345501 -6145519 -4257818 -3281866
7072c281866K36719M79166J34536m17395Q25577K893859K455479m01810j599442
$$ -3281866 -3045147 -2565981 -2431445 -2848840 -2023263 870596 3326075 2924265 1324823
7063A324823N52121K631908J509689j183070k127249r30307N79498J408390J618117
$$ 1324823 1876944 4508852 6018541 4835471 2708222 1777915 2357413 3765803 5383920
7054E383920J197733M95237L48231M36874q71491l670901n272757l531791M1967
$$ 5383920 6581653 7076890 7425121 7861995 6990504 3319603 -1953154 -5484945 -5442978
7045e442978K303990K383372J660228Q43772o72488k757623l862400k895932o32393
$$ -5442978 -3138988 -755616 904612 1748384 1075896 -1681727 -5544127 -8440059 -9072452
7036i072452J164375J368317J99459j031587r13479O47125K010069J551543r2559
$$ -9072452 -7908077 -6539760 -6340301 -7371888 -8285367 -7638242 -5628173 -4076630 -4169189
7027d169189m76315J414271L257335K032871j623482l449714q91801L106902L647701
$$ -4169189 -4645504 -3231233 26102 2058973 435491 -3014223 -3906024 -799122 2848579
7018B848579M35507j940340o22442J632477Q75168k287098m098958l212762j636122
$$ 2848579 3284086 1343746 721304 2353781 3228949 941851 -3157107 -6369869 -8005991
7009h005991p40738M04510K351325L781635L677282K758928J714986k936k349489
$$ -8005991 -8746729 -8342219 -5990894 -2209259 1468023 4226951 5941937 5939001 3589512
7000C589512l449587j899506Q26420J972119R49907k77095r0029Q07481O77599
$$ 3589512 139925 -1759581 -933161 1038958 1988865 1711770 1621741 2429222 3106821
6991C106821p65272j911118j365147J23080O27404k53404r43472n19231j98645
$$ 3106821 2341549 430431 -934716 -811636 -184232 -437636 -1381108 -1900339 -2098984
6982b098984j084829j986486j286955K82214R92193J283249K875515N142490N309339
$$ -2098984 -3183813 -5170299 -6457254 -6175040 -5182847 -3899598 -1024083 4118407 9427746
6973I427746K511849j031958l348786m609472n184693m569942l135957k283837
$$ 9427746 11939595 10907637 7558851 2949379 -2235314 -6805256 -9941213 -12225050
6965a2225050j821629R9690L244576M465809K376159k6417L10287K073258K108672
$$ -12225050 -14046679 -13946989 -10702413 -6236604 -3860445 -3886862 -3576575 -1503317 605355
6956F05355J79594j659333k630765l134731k503648j03033K133833J462090j480737
$$ 605355 784949 -874384 -3505149 -6639880 -9143528 -9246561 -7112728 -5650638 -7131375
6947g131375k882340m23701M122982P019144N946710J706120k276057k945661
$$ -7131375 -10013715 -10437416 -6314434 704710 6651420 8357540 6081483 3135822
6939C135822j150628p45856l095826m824224k936851O16490K422386K836282L800753
$$ 3135822 1985194 1239338 -1856488 -6680712 -9617563 -9001073 -6578687 -3742405 58348
6930E8348L984231J166571k238212j864595J082793J164790k192222l452730k16969
$$ 58348 4042579 5209150 2970938 1106343 2189136 3353926 1161704 -2291026 -2507995
6921b507995K898302K271517Q14776J653033K163738n34204l130526j401162J734341
$$ -2507995 390307 2661824 3476600 5129633 7293371 6759167 3628641 2227479 3961820
6912C961820L54002m417161n661470j423748K664200K368373K22771q1464P12307
$$ 3961820 4315822 -101339 -5762809 -7186557 -4522357 -2153984 -1931213 -2012677 -1300370
6903a300370M04375k71822L39149J293845Q01373m80342p75703k96599l66839
$$ -1300370 -895995 -1167817 -828668 465177 1266550 786208 10505 -286094 -652933
6894f52933o78698p6943P57407J17099j510093j671668K05271J595065O12486
$$ -652933 -1331631 -1408574 -651167 -534068 -2044161 -3715829 -3510558 -1915493 -1303007
6885a303007r29804o3821K672687L397465J32774m004709m396766p52643K650747
$$ -1303007 -2232811 -2296632 376055 3773520 3906294 -98415 -4495181 -5247824 -2597077
6876b597077K513150J60206j181957p42614j06992j80861m76924p59996j186998
$$ -2597077 -83927 76279 -1105678 -1848292 -1955284 -2136145 -2613069 -3373065 -4560063
6867d560063j074306K46169J357431M838l062492m004238q60081L536343N207932
$$ -4560063 -5634369 -5388200 -4030769 -4025931 -7088423 -11092661 -11952742 -8416399 -3208467
6858c208467L752720J501560l40218k034549k718480p31298K886231M010498L56117
$$ -3208467 544253 2045813 1705595 -328954 -3047434 -3778732 -892501 3117997 3474114
6849C474114m771294n786120j512526L372488M069037J195142p98386J79356J504491
$$ 3474114 -1297180 -7083300 -8595826 -5223338 -1154301 40841 -757545 -578189 926302
6840I26302K27762k335027k465415M70844L007267K378129l7468j289648r35278
$$ 926302 1154064 -1180963 -3646378 -3175534 -168267 2209862 2172394 882746 -52532
6831e2532n89716o32901J52685J771710K208046L31012k023406k230757k89171
$$ -52532 -642248 -1275149 -1122464 649246 2857292 3188304 1164898 -1065859 -1355030
6822a355030J315549Q56706q44401k084526k489053k678517k528425j217561Q82363
$$ -1355030 -39481 817225 -27176 -2111702 -4600755 -7279272 -9807697 -11025258 -10142895
6813a0142895J803812M25809j567232j491642Q60594K873399K354247l3937j886172
$$ -10142895 -8339083 -7913274 -9480506 -10972148 -10111554 -7238155 -4883908 -4917845 -6804017
6804f804017j530843R51937L992541N231185L248688l85055j923794L12974L352109
$$ -6804017 -8334860 -7382923 -3390382 1840803 5089491 4704436 2780642 3093616 6445725
6795F445725K909433j084411m187143k907751J257024M009685L141330J53726
$$ 6445725 9355158 8270747 4083604 1175853 2432877 6442562 9583892 9737618
6787I737618k129915k289278q80204N83097Q74002j58955j604983k318095j879092
$$ 9737618 7607703 5318425 4438221 5021318 5895320 5736365 4131382 1813287 -65805
6778f5805q41263j01839J7651J49445J173410K883630L575094J572878k590362
$$ -65805 -907068 -1008907 -991256 -841811 331599 3215229 6790323 8363201 5772839
6769E772839n958617n609564j412371L726463O295901M921318J101056k354590
$$ 5772839 -185778 -5795342 -7207713 -3481250 2814651 7735969 8837025 6482435
6761F482435l605618k868917j616128q91332m54309M84505J877211K545378J582589
$$ 6482435 2876817 7900 -1608228 -2499560 -2953869 -2469364 -592153 1953225 3535814
6752C535814j72482q15180J74923J003371m5232j952961k171406l26777J113722
$$ 3535814 3363332 2548152 2723075 3726446 3681214 1728253 -443153 -769930 343792
6743C43792M79417o55022n1127J652272K001613N27813p58550n18810M49808J195365
$$ 343792 823209 168187 117060 1769332 3770945 4298758 3540208 3021398 3471206 4666571
6733D666571J908759K474287J769877k53629j471724l08340J597977J385775r90295
$$ 4666571 6575330 9049617 10819494 10565865 9094141 8785801 10383778 11769553 10779258
6724A0779258k671113j763239M69511J617730R00891o12134j491288j105293o9405
$$ 10779258 8108145 6344906 6814417 8432147 9333038 8720904 7229616 6124323 6054918
6715F054918J13783j373923l237048l176908p70412J861319K793097K439030K046926
$$ 6054918 6168701 4794778 1557730 -1619178 -2389590 -528271 2264826 4703856 6750782
6706F750782J447454k6483j394176j164094m16354j991298n657464o807634k354147
$$ 6750782 8198236 8171753 6777577 5613483 5197129 3205831 -2451633 -9259267 -11613414
6697a1613414L838989M783788n36553n317360l515707K527508N568260K809820
$$ -11613414 -7774425 -2990637 -3527190 -8844550 -12360257 -9832749 -4264489 -1454669
6689a454669j527786k691153r97371L79058M91281Q44145J730514J343336r49050
$$ -1454669 -2982455 -5673608 -6670979 -6291921 -5800640 -4956495 -3225981 -1882645 -2831695
6680b831695k670079j064289L100062N994191M881369Q66014k586954l139923
$$ -2831695 -5501774 -6566063 -3466001 2528190 7409559 8275573 5688619 2548696
6672B548696j322598O32138J112001L28715l95855j97737O35473J363852J639565
$$ 2548696 1226098 1858236 2970237 3298952 2903097 2705360 3340833 4704685 6344250
6663F344250J335797J31813j805232k942600j557432J662559L470317J686466
$$ 6344250 7680047 7811860 6006628 3064028 1506596 3169155 6639472 8325938
6655H325938j896011l674035k663671r76669k26216J96544Q24952O25477p80133
$$ 8325938 6429927 2755892 92221 -884448 -1110664 -914120 -89168 536309 -243824
6646b43824j512106r5873J792102J548618m47581j612423j111398l50376J30713
$$ -243824 -1755930 -1851803 -59701 1488917 1041336 -571087 -1682485 -2032861 -1902148
6637a902148J263145K672274K350475Q5348j548488r74903J73062K40951L36297
$$ -1902148 -639003 2033271 4383746 4469094 2920606 1945703 2118765 2359716 2696013
6628B696013J696415K664683J226191j183356j668788n22118l68105j220574k46409
$$ 2696013 4392428 7057111 8283302 7099946 5431158 4909040 4540935 3320361 3073952
6619C073952L014932M812638K136843l102924o568811o260513l328403R5527K270514
$$ 3073952 6088884 10901522 13038365 9935441 3366630 -2893883 -6222286 -6126759 -3856245
6610c856245K429960J458215R28149O27199j201772m070748m219460K25043N176974
$$ -3856245 -1426285 31930 960079 1587278 385506 -3685242 -7904702 -7679659 -2502685
6601b502685N144609Q14217j809045J06302K687733J749496j088159j650150R993
$$ -2502685 2641924 3456141 1647096 1753398 4441131 6190627 5102468 3452318 3462311
6592C462311Q2645k481801l971784j545416K199346K580823q20942l737507k878055
$$ 3462311 3544956 1063155 -2908629 -4454045 -2254699 326124 -494818 -4232325 -7110380
6583g110380K39847J911462J110682K18540J379506L670567M441010K604006k97546
$$ -7110380 -6870533 -4959071 -3848389 -3629849 -2250343 1420224 5861234 8465240 8167694
6574H167694k080693k104854j241025m45223j07409m63265j632407k982668l281118
$$ 8167694 6087001 3982147 2741122 2295899 2188490 1725225 92818 -2889850 -6170968
6565f170968k075567l97443N45002Q96254J590701K679264L261233K900102J945836
$$ -6170968 -8246535 -8643978 -8098976 -7202722 -5612021 -2932757 328476 3228578 5174414
6556E174414M98068j516221k970783k021007J008557K793034Q01691k983081m102868
$$ 5174414 5672482 4156261 1185478 -835529 173028 2966062 3767753 784672 -3318196
6547c318196j136434K682826L615445J540713p49598j121020O0743J057811P74286
$$ -3318196 -4454630 -1771804 1843641 3384354 2634756 1513736 1574479 2632290 3406576
6538C406576m36765j572208k194139k491773k322623j163640O00528J506990J033244
$$ 3406576 2969811 1397603 -796536 -3288309 -5610932 -6774572 -6174044 -4667054 -3633810
6529c633810O18099J361060J934877P12108j070378q39932J133962K060723J233538
$$ -3633810 -3015711 -1654651 280226 992334 -78044 -917976 215986 2276709 3510247
6520C510247J066371K625992L369549J133665k344838m110411l937044l215583
$$ 3510247 4576618 7202610 10572159 11705824 9360986 5250575 1313531 -1902052
6512a902052j954360L06834K184017K117225J324322K036945L455702K622419
$$ -1902052 -3856412 -3549578 -1365561 751664 2075986 4112931 7568633 10191052
6504A0191052q12589l732707l794544j867999J71656J541380J871803Q77275n16579
$$ 10191052 9378463 5645756 1851212 -16787 154869 1696249 3568052 4445327 3928748
6495C928748q42677m44178r12565j819161r18912J506433J896771j075665l474800
$$ 3928748 3086071 2641893 1729328 -89833 -1008745 497688 2394459 1318794 -2156006
6486b156006j532334K451711L330614N88966j535453q18865L85079o70m46161
$$ -2156006 -3688340 -1236629 2093985 2682951 1147498 328633 713712 713042 266881
6477B66881P46609J952498R63136r94842j193363j19528p42226l190634l787511
$$ 266881 1013490 2965988 3929124 2934282 1740919 1621391 879165 -2311469 -6098980
6468f098980o43396K899819K804587J13217r32460O51907J661772K61067j290999
$$ -6098980 -6742376 -3842557 -1037970 -924753 -1857213 -1205306 456466 717533 -573466
6459e73466q09314K61577j77256r90137L8361J961336K014250K14401q80420n92826
$$ -573466 -1382780 -1121203 -1298459 -2288596 -2250235 -288899 1725351 1939752 1059332 466506
6449D66506o89133j372715n21743K052019L202796J131902j605955k015219r33577
$$ 466506 -222627 -1595342 -2117085 -65066 3137730 4269632 2663677 648458 -285119
6440b85119p80888j264499m67087J163999J199300p63642k260968j402827Q70379
$$ -285119 -1066007 -2330506 -2797593 -1633594 -434294 -1197936 -3458904 -4861731 -3991352
6431c991352K360657K040281O19902m39624m43852k83202j069671j908007p61179
$$ -3991352 -1630695 409586 1029488 589864 146012 -137190 -1206861 -3114868 -3876047
6422c876047J870920K633247K91906j651771n7319K524585J447332k577571m119717
$$ -3876047 -2005127 628120 920026 -731745 -789064 1735521 3182853 605282 -3514435
6413c514435r57896L020667L743665J933877O29010R03801J925917K796091K538893
$$ -3514435 -4472331 -1451664 2292001 4225878 4854888 5758689 7684606 10480697 13019590
6404A3019590L02161k831970m083535k472676l13579R5902o17475p18705j25476
$$ 13019590 13321751 10489781 6406246 3933570 3619991 3715893 3098418 2379713 2254237
6395B254237L55812Q11435J415177J336276K23891n84834k5600R09482J017632
$$ 2254237 2610049 3421484 4836661 6172937 6396828 5811994 5786394 6695876 7713508
6386G713508R82464J707890K066114N92492j720909k677474k090683j509400j437076
$$ 7713508 8695972 10403862 12469976 13062468 11341559 8664085 6573402 5064002 3626926
6377C626926j049047j76930N07775Q90897J188451R40198k2249n44579j6226J4568
$$ 3626926 2577879 2400949 2908724 3799621 4988072 5928270 5906021 5361442 5345216 5359784
6367E359784j521351k497695p34938J508522L66006k952872l189335P66213L814845
$$ 5359784 3838433 1340738 605800 2114322 2480328 -472544 -3661879 -2895666 919179
6358I19179K473394j80849k10427R94880J35019j932160k172350j042727j297880
$$ 919179 3392573 3211724 3001297 3996177 4131196 2199036 26686 -1016041 -2313921
6349b313921k462036j394104J935136L850715K688431R90579R51638J380922P22771
$$ -2313921 -4775957 -6170061 -4234925 -384210 2304221 3294800 4246438 5627360 6350131
6340F350131j55668j17032k1493p96034j446878j045393p41232j655222k518236
$$ 6350131 6194463 6077431 6055938 5259904 3813026 2767633 2026401 371179 -2147057
6331b147057j755837m42863n50729j277365Q490L440222N927619N105198J973652
$$ -2147057 -3902894 -4345757 -4896486 -6173851 -6165361 -2725139 3202480 8307678 10281330
6322A0281330p80943j434496J418J973136K157307k92719l143262l519657j960391
$$ 10281330 9500387 8065891 8067309 10040445 12197752 11905033 8761771 5242114 3281723
6313C281723j686572l447920m025785j271310K197249K698800O63342q19993r74794
$$ 3281723 1595151 -1852769 -5878554 -7149864 -4952615 -2253815 -1590473 -2410466 -3385260
6304c385260j369217j812473j86731L121784M310677J357798k616648l321427
$$ -3385260 -4754477 -6566950 -6753681 -3631897 678780 2036578 -580070 -3901497
6296c901497p45092J576594J491516J71195l54476L83867J442163J723531Q91926
$$ -3901497 -4646589 -3069995 -1578479 -1407284 -1761760 -1377893 64270 1787801 2679727
6287B679727l11965q26137o89634r60799j684133j193834J331694L779557L367384
$$ 2679727 2367762 1541625 851991 -108808 -1792941 -2986775 -1655081 2124476 5491860
6278E491860L46267k452199l361589l081995k262055l77563K227770L451778K082445
$$ 5491860 5838127 3385928 24339 -3057656 -5319711 -5697274 -3469504 -17726 2064719
6269B064719j94407j035849n86974o78505j593155j570189L49358K549910K637399
$$ 2064719 1870312 834463 247489 -431016 -2024171 -3594360 -3245002 -695092 1942307
6260A942307K89688k293215k634917n27023J628005J248236j466618l479893k339853
$$ 1942307 2231995 -61220 -2696137 -3223160 -1595155 -346919 -1813537 -5293430 -7633283
6251g633283Q13259K549979J289122r69165j373867L35609J980415J959938R40193
$$ -7633283 -6820024 -4270045 -2980923 -3950088 -5323955 -4988346 -3007931 -1047993 -107800
6242a07800L73496L32207l86417k293041m127680m011271j399065K266035M717015
$$ -107800 265696 597903 211486 -2081555 -6209235 -10220506 -11619571 -9353536 -4636521
6233d636521M695985K863473R43119r3896p34203j591719k010125r99072O94717
$$ -4636521 59464 2922937 3866056 3772160 3037957 1446238 -563887 -1562959 -868242
6224h68242R78603n90123j665459j70725K582844L442701J508356j069332k227924
$$ -868242 110361 -479762 -2145221 -2315946 266898 3709599 5217955 4148623 1920699
6215A920699k068188j439934l52656J099019J644605K94503j688919j841306L67224
$$ 1920699 -147489 -1587423 -1940079 -841060 803545 1098048 -590871 -2432177 -2064953
6206b064953K630098K547576M94067j053484p57447M4420m89473j877468j942717
$$ -2064953 565145 3112721 3606788 2553304 1795857 1840277 1350804 -526664 -2469381
6197b469381j21223J466500R57510o74586j277796o23840r7843j6774N96562J629689
$$ -2469381 -2590604 -1124104 -166594 -841180 -2118976 -2742816 -2840659 -2857433 -2260871 -631182
6187f31182J455767m76149k345267k119504J73010K881276M255974L218294J43661
$$ -631182 824585 348436 -1996831 -4116335 -3943325 -1062049 3193925 6412219 6555880
6178F555880k570799k358332L00552K075366R95283j316347k590534k922804l153018
$$ 6555880 3985081 1626749 1927301 4002667 4997950 3681603 1091069 -1831735 -4984753
6169d984753k384956K95295L062757L261659J389963K66131M70061k45504k484114
$$ -4984753 -7369709 -7074414 -4011657 -749998 639965 906096 1376157 1130653 -1353461
6160a353461l358995q45386K442273K401044p38631k462741j03787L338509L000091
$$ -1353461 -4712456 -5557842 -3115569 -714525 -1453156 -3915897 -4019684 -681175 2318916
6151B318916j342456m712294l233307J010942L053713J620197n259O11054J951128
$$ 2318916 976460 -3735834 -6969141 -5958199 -2904486 -1284289 -1289548 -678494 1272634
6142A272634J899798J179794J241874J111649p11522k745538k173791O92901K736325
$$ 1272634 3172432 4352226 5594100 6705749 5994227 3248689 1074898 1767799 4504124
6133D504124K576647J727000J144249o3996j708417j547576J063217L126892J760447
$$ 4504124 7080771 8807771 9952020 9888024 8179607 6632031 7695248 10822140 12582587
6124A2582587j751386l791224l078645j370449k19912O96987J800567K007745
$$ 12582587 10831201 7039977 3961332 2590883 2370971 3067958 4868525 6876270
6116F876270J16645k806581l760379j227653K389242L124143L50083k358018k060705
$$ 6876270 6992915 4186334 425955 -801698 1587544 4711687 5061770 2703752 643047
6107F43047k09221J39705r87776j253235k56134J95459l52275m30903K24992J69224
$$ 643047 433826 573531 -414245 -1667480 -1923614 -1728155 -2080430 -2511333 -2286341 -2117117
6097b117117o82520o18039N44756Q74498p2383m34368N5384r11381l543708m212009
$$ -2117117 -2799637 -3417676 -2872920 -1998422 -2070805 -2505173 -2449789 -3361170 -6904878 -11116887
6087a1116887j052157K315445K100743K47256R25206L540541L913414J169724
$$ -11116887 -12169044 -9853599 -7752856 -7505600 -6580394 -3039853 873561 2043285
6079B043285j164735p42134R70837J956426K080089J634957L80975j144942j637871
$$ 2043285 878550 136416 1107253 3063679 5143768 6778725 7159700 6014758 4376887
6070D376887r99264n00912o97203q10703j98648J054690K583909L272216J379101
$$ 4376887 3377623 2876711 2179508 1368805 1170157 2224847 4808756 8080972 9460073
6061I460073k739594n221180k847167K175879M693984L337275J355452R40266
$$ 9460073 6720479 1499299 -1347868 828011 5521995 8859270 10214722 11154988
6053A1154988O33116q91407k232693k026338j290095j262225j289984m98314M52219
$$ 11154988 11788104 10896697 8664004 6637666 5347571 4085346 2795362 2297048 2749267
6044B749267O91361M34783j39606j412824k676233j984079J037538L922700M122751
$$ 2749267 3440628 3875411 3735805 2322981 -353252 -2337331 -1299793 2622907 6745658
6035F745658J704111j372164l137791k466459N178J527644J07103k068419r58926
$$ 6745658 8449769 7077605 3939814 1473355 1478533 3006177 3113280 1044861 85935
6026H5935L099120N018520K084111k200165l454611k173526j359981j378388n56575
$$ 85935 3185055 8203575 10287686 8087521 4632910 2459384 1099403 -278985 -835560
6017h35560J064419J871477J398836L72163p95393j540139p79835J020847J377865
$$ -835560 228859 2100336 3499172 3871335 3075942 1535803 755968 1776815 3154680
6008C154680n14385j962996j122002l75723k026385l332083l21927N240896P596061
$$ 3154680 2640295 677299 -444703 -820426 -2846811 -6178894 -6500821 -1259925 6336136
5999F336136M880802O35796k167696l831418m478502k800812M76102K023637M98356
$$ 6336136 11216938 11852734 9685038 5853620 1375118 -1425694 -949592 1074045 1572401
5990A572401j577748j892024j141588m57584P12499K477852L248095K469500J946439
$$ 1572401 -5347 -1897371 -3038959 -3496543 -2784044 -306192 2941903 5411403 7357842
5981G357842K551602K216489o17426l813007m224723j920652M76123J321052Q50897
$$ 7357842 9909444 12125933 11508507 7695500 3470777 1550125 2026248 3347300 4198197
5972D198197k56676j337034j587938r25793k30033J60197R34011J947946J632135
$$ 4198197 3941521 2604487 1016549 90756 -139277 20920 954931 2902877 4535012
5963D535012m67528k312481k082040o28715L67564R48655J690298J711545K30961
$$ 4535012 4067484 1755003 -327037 -955752 -588188 360467 2050765 3762310 3993271
5954C993271j253879q88466M46624N81875j59433N33409K892794M348933L284113
$$ 3993271 2739392 1850926 2297550 2879425 2719992 3253401 6146195 10495128 13779241
5945A3779241J061907m25309j116435j676031j784995q95153L49718P28322P2713
$$ 13779241 14841148 14415839 13299404 11623373 9838378 8943225 9292943 10021265 10093978
5936A0093978o06572n55029k71876p69846j848047j679411R15214L915174L508441
$$ 10093978 9487406 8932377 8660501 7890655 6042608 4363197 5278411 9193585 12702026
5927A2702026j079077n760015o159473k788574K48518O83761j87724o59948o54547
$$ 12702026 11622949 5862934 -296539 -3085113 -2836595 -2152834 -2340558 -3000506 -3655053
5918c655053k68035J018202K614801K554128M01163j330088l62176K006453K525162
$$ -3655053 -3923088 -2904886 -290085 2264043 2665206 1335118 972942 2979395 5504557
5909E504557K35267k522719l046781r79102J720017K537157M19910l088897n000122
$$ 5504557 5739824 3217105 170324 -808778 911239 3448396 3868306 779409 -4220713
5900d220713l898481j386391J90052O45233J362668K537462K862532J943648J131334
$$ -4220713 -8119194 -9505585 -9315533 -8670300 -7307632 -4770170 -1907638 36010 1167344
5891A167344J307877J419008K43808j534550k275221j710560j098251j310723
$$ 1167344 2475221 3894229 4138037 2603487 328266 -1382294 -2480545 -3791268
5883c791268j807343j545354k47412J324303K095089J828375J510997J932105
$$ -3791268 -5598611 -7143965 -7391377 -6067074 -3971985 -2143610 -632613 1299492
5875A299492J997781l4323l158003l589263J65224M165877L740562K614j889122
$$ 1299492 3297273 3262950 104947 -3484316 -3319092 846785 4587347 4589961 2700839
5866B700839m35550N86742j033845k187396l879K904487K524768j84746j351477
$$ 2700839 2265289 2852031 1818186 -369210 -373089 2531398 5056166 4871420 3519943
5857C519943o26926q21238k123623j714170O80178J644071l46827k424706k121909
$$ 3519943 2893017 2071779 -51844 -1766014 -1085836 558235 211408 -2213298 -4335207
5848d335207r31491r44531j208947J5162K000867L143476L630431M038204L276892
$$ -4335207 -5266698 -6211229 -7420176 -7405014 -5404147 -2260671 1369760 5407964 8684856
5839H684856N74285k155065k550775j064812L73033J379124K211290J515471j731291
$$ 8684856 9259141 7104076 4553301 3488489 3861522 5240646 7451936 8967407 7236116
5830G236116n066886m836591j307795J756022K521883K723060L510165L189766
$$ 7236116 2169230 -2667361 -3975156 -2219134 302749 3025809 6535974 9725740
5822I725740N26765k452746k906008p97643J470666J934728M69728j666609k762364
$$ 9725740 10252505 7799759 4893751 4096108 5566774 7501502 7971230 6304621 3542257
5813C542257j941216j93277N70668k24770j342847j535982o81835Q72695K634602
$$ 3542257 1601041 1407764 1978432 1753662 410815 -1125167 -1807002 -934307 1700295
5804A700295L430151K187193k19825j484124r59054p05967k427043m689054m575230
$$ 1700295 5130446 7317639 7097814 5613690 4654636 3948669 1521626 -3167428 -7742658
5795g742658j357782K677444M682750L666299Q52286j515902j824943j89817J812944
$$ -7742658 -9100440 -6422996 -1740246 1926053 2778339 1262437 -562506 -752323 1060621
5786A060621K474464J113889j557749l807154m086948k454460l71252J244782
$$ 1060621 3535085 4648974 3091225 -715929 -4802877 -7257337 -7628589 -6383807
5778f383807K738697L850494K851668o93006l805203l339279n01170P70685m85390
$$ -6383807 -3645110 205384 3057052 2364046 -1441157 -4780436 -5281606 -4510921 -4996311
5769d996311j378769p2412J917574L040739L789005M135441K429722j106423l008329
$$ -4996311 -6375080 -6447492 -4529918 -1489179 2299826 6435267 8864989 7758566 4750237
5760D750237j298391J163439R20338r79989j370479l00426k50666j461138j897031
$$ 4750237 3451846 4615285 5535623 4555634 3185155 2884729 2634063 1172925 -724106
5751g24106j116439n38553l09036N83346J388827M74661r32588J56443L132550
$$ -724106 -1840545 -2379098 -2688134 -2104788 -715961 -241300 -1173888 -1017445 2115105
5742B115105L626342M4372l591081l379352p36808O80212L70572L00699R49533
$$ 2115105 5741447 5785819 2194738 -1184614 -1921422 -1241210 -870638 -569939 379594
5733C79594J206375Q93926N17220n34056k823291m648403l658642l12338K651786
$$ 379594 1585969 2479895 2997115 2463059 -360232 -5008635 -8667277 -8979615 -6327829
5724f327829L778143L572870K233492l43207k404889j527959J311426K046117
$$ -6327829 -2549686 1023184 3256676 2913469 508580 -1019379 292047 2338164
5716B338164p13817l195595j803719J640027K743576P85982j039327o87001N87058
$$ 2338164 1624347 -1571248 -3374967 -1734940 1008636 1794618 755291 68290 655348
5707F55348J033081N78087k13511j043871j256502l63764M16327o33692k517373
$$ 655348 1688429 2266516 2053005 1009134 -247368 -611132 -194805 -828497 -3345870
5698c345870k152737P53433K364035K43918k446276j330104K473669L781026Q54865
$$ -3345870 -5498607 -4745174 -2381139 -2137221 -4583497 -5913601 -3439932 341094 1195959
5689A195959k368413k139360M63461K263977K581815K822241L178776K276315
$$ 1195959 -1172454 -3311814 -2848353 -584376 1997439 4819680 7998456 10274771
5681A0274771k92519k941858l831537k665532o78778N55144L41609o47657j084193
$$ 10274771 9982252 7040394 3208857 543325 -135453 419691 761300 113643 -970550
5672i70550l30556R83379J595785O07796j713899l597139k909688L11881L125221
$$ -970550 -1301106 -317727 1278058 1885854 171955 -3425184 -6334872 -6022991 -2897770
5663b897770K942142R67730M65623K020722L113754K492269J775769J710939K91052
$$ -2897770 44372 1012102 1477725 3498447 6612201 9104470 10880239 12591178 12882230
5654A2882230l181149n278085k986668J175505K406963N76473k60468J246560
$$ 12882230 9701081 4422996 1436328 2611833 5018796 5595269 5334801 6581361
5646F581361J867945m46059l138878l210006j388403J82530J557382L376214L839189
$$ 6581361 8449306 8003247 4864369 1654363 265960 448490 2005872 5382086 9221275
5637I221275Q98399l403498m365231q18273K972157K704529q07699l412544l044517
$$ 9221275 10119674 6716176 2350945 1532672 4504829 7209358 6401659 2989115 -55402
5628e5402j397135p01701q72951m85991P82494J947386K447684K743837K983647
$$ -55402 -1452537 -2154238 -3027189 -3513180 -2730686 -783300 1664384 4408221 7391868
5619G391868K287242K21034j761063j594455O86598K563832J801463j027225l296714
$$ 7391868 9679110 9900144 8139081 6544626 7231224 9795056 11596519 10569294 7272580
5610G272580l258616j637452l36229j41143k09792L43451J178750J535144J582794
$$ 7272580 4013964 2376512 2040283 1899140 1689348 2032799 3211549 4746693 6329487
5601F329487J902307J970742O53668j602087k711564j840000p75507j222746k196322
$$ 6329487 8231794 10202536 10856204 9254117 6542553 4702553 3927046 2704300 507978
5592E07978j774915k15950P76433J015168J598941K104527P67613k165348l899244
$$ 507978 -1266937 -1482887 -706454 308714 1907655 4012182 4779795 2614447 -1284797
5583a284797k881775r09750k68934q09615j250567j409914j393481m00013J510287
$$ -1284797 -4166572 -5076322 -5345256 -6154871 -7405438 -8815352 -10208833 -10608846 -9098559
5574i098559K084706m556j938190L6045M537849N908491J957569k707924l096625
$$ -9098559 -7013853 -7018409 -8956599 -8920554 -4382705 1525786 3483355 775431 -2321194
5565b321194n38195J30816j955976l011517r03156J915448K764131K476526K722731
$$ -2321194 -2859389 -2728573 -4684549 -7696066 -8599222 -6683774 -3919643 -1443117 1279614
5556A279614K485521K28282k292085j965387N98946J549241l81412j987705o68373
$$ 1279614 3765135 3993417 1701332 -264055 334891 1884132 1502720 -484985 -1153358
5547a153358J717134J921375k61177k751688m214126l985463j067919L795962
$$ -1153358 563776 2485151 2223974 -527714 -4741840 -8727303 -9795222 -5999260
5539e999260O568052L929268j786866m998886l897036j631593n81349M72788K417509
$$ -5999260 568792 4498060 2711194 -2287692 -6184728 -7816321 -8397670 -7924882 -5507373
5530e507373L173212J386959m47481M08815K479133K432240L47673q09362k35642
$$ -5507373 -2334161 -947202 -1394683 -985868 1493265 3925505 4273178 3463816 3228174
5521C228174l02689k227009l829269k821688j47381J456278R02036n62966j265973
$$ 3228174 2925485 698476 -3130793 -5952481 -6099862 -4643584 -3741548 -4304514 -5570487
5512e570487n56939J118475K615810K863841K008887J496316K242170L035967
$$ -5570487 -6127426 -5008951 -2393141 470700 2479587 3975903 6218073 9254040
5504I254040J850679j205058l524608l240766j638923j092186j516673q18166
$$ 9254040 11104719 9899661 6375053 3134287 1495364 403178 -1113495 -1931661
5496a931661J371605K719281J591789p34403k424111l515911m317284l533081
$$ -1931661 -560056 2159225 3751014 3016611 592500 -2923411 -7240695 -10773776
5488a0773776n64389K010933J456528o31133l56777K390161L721065J890573l70756
$$ -10773776 -11338165 -9327232 -7870704 -8501837 -8858614 -6468453 -2747388 -856815 -1227571
5479a227571p80348p63094j738399j803290Q32345L771981L242910n21905l739342
$$ -1227571 -2007919 -2771013 -4509412 -6312702 -5480357 -1708376 1534534 1012629 -2726713
5470b726713l949121j874850P06904K481355K534250R74461o21614q83655j59441
$$ -2726713 -6675834 -8550684 -7843780 -5362425 -2828175 -1853714 -2475328 -3358983 -3518424
5461c518424P70375K114710L654510L559672Q10591k494410l491998k078230k6765
$$ -3518424 -2748049 -633339 3021171 6580843 7391434 4897024 1405026 -673204 -699969
5452f99969J884638L383487K964768k02294l690663m293023k279037k29065J190215
$$ -699969 1184669 4568156 7532924 7330630 3639967 -653056 -2932093 -3161158 -1970943
5443a970943K764295L226002O11707l208304l921449j103315J175006P17646k66622
$$ -1970943 793352 4019354 4631061 1422757 -2498692 -3602007 -2427001 -1709355 -1975977
5434a975977p0239l12892k031272l179351k277639q05323J82206J960345M386080
$$ -1975977 -2046216 -2359108 -4390380 -7569731 -9847370 -10652693 -10470487 -8510142 -4124062
5425d124062M456712J533955k80233J322950K190295j650703o365808n276302
$$ -4124062 332650 1866605 1586372 2909322 5099617 3448914 -2916894 -8193196
5417h193196Q51770M808170L348299M60818m6065N72808N1538p89832l59537O74728
$$ -8193196 -7341426 -2533256 815043 1275861 1229796 1802604 1854142 1064310 704773 1379501
5407A379501Q98199L93645j20838n62976q89068q75619r26774j409138j383981
$$ 1379501 2277700 2671345 2550507 1987531 1098463 222844 -703930 -2113068 -3497049
5398c497049j50556N80690r84228k862430j657568J373679J391645k020393l191836
$$ -3497049 -3647605 -3066915 -4051143 -6913573 -8571141 -7197462 -5805817 -7826210 -11018046
5389a1018046R91870N825877N756685K294976M47159P06477n1211j896682j816968
$$ -11018046 -10026176 -4200299 1556386 3851362 4298521 5004998 4953787 3057105 1240137
5380A240137L69694J394316P7697j211326j278074j800935l171164k985143n59597
$$ 1240137 1609831 3004147 3081844 1870518 592444 -1208491 -4379655 -7364798 -7924395
5371g924395J003542k35515j506721J89598K938785K939639O37313l06697Q12597
$$ -7924395 -6920853 -7156368 -8663089 -8473491 -5534706 -2595067 -1957754 -2264451 -1451854
5362a451854R42360j081480k188883K9914L263069L662090J021966j712176k784265
$$ -1451854 -509494 -1590974 -3779857 -3749943 -486874 3175216 4197182 2485006 -299259
5353b99259k810019k194448k07804K759108M275426K566811j082591l761483l908974
$$ -299259 -3109278 -5303726 -5511530 -2752422 1523004 4089815 3007224 -754259 -4663233
5344d663233k000076O61995K596743K513169O51332p03861L04742K344038K332980
$$ -4663233 -6663309 -6001314 -3404571 -891402 -240070 -943931 -639189 1704849 4037829
5335D037829l60566l077579l561774k432629j138422M34044K716133M476627M125243
$$ 4037829 3677263 599684 -2962090 -5394719 -6533141 -6099097 -3382964 1093663 5218906
5326E218906K108162J66480j150836k449570l450911k899158n56799K154592L581852
$$ 5218906 7327068 7493548 6342712 3893142 442231 -2456927 -3013726 -859134 2722718
5317B722718K935262M59735k243974k817077p65877J162405K26291k302248k860674
$$ 2722718 5657980 6117715 3873741 1056664 290787 1453192 1679483 -622765 -3483439
5308c483439r43366M15654j01710J39748L083977O098494N279898Q09578l445666
$$ -3483439 -4426805 -4011151 -4112861 -3973113 -889136 5209358 10489256 11298834 7853168
5299G853168m563349k772960k8411J706052J491702L75813N83209K438260L303854
$$ 7853168 3289819 516859 488448 2194500 3686202 4062015 4645224 7083484 10387338
5290A0387338J217602j824960k459605p45864K52329q39404k144919j788766k83765
$$ 10387338 11604940 9779980 7320375 6574511 6826840 5987436 3842517 2053751 1769986
5281A769986Q62284R76581N8026j613975l122719l417047k552886j432977l67479
$$ 1769986 2632270 3608851 3666877 2052902 -1069817 -4486864 -7039750 -8472727 -8840206
5272h840206R08040J992452K048857J194602K98483l74248q94991n81582R64524
$$ -8840206 -7932166 -5939714 -3890857 -2696255 -2397772 -2772020 -3667011 -4248593 -3284069
5263c284069K209173J338113o68739j153198j5383L8280j911033l150394j505418
$$ -3284069 -1074896 263217 -405522 -1558720 -1574103 -1535823 -3446856 -6597250 -8102668
5254h102668J167183J570214o56518k918784k905607n68690K172676K920178J066332
$$ -8102668 -6935485 -5365271 -6021789 -8940573 -11846180 -12414870 -10242194 -7322016 -6255684
5245f255684j070642q18768J116367J637768J24492n61652J255236L505465L926936
$$ -6255684 -7326326 -8145094 -7028727 -5390959 -5266467 -5828119 -4572883 -1067418 2859518
5236B859518L089530J962929m07954m214338o669344n534510k594111n76922J107836
$$ 2859518 5949048 7911977 7504023 3289685 -3379659 -8914169 -11508280 -12085202 -10977366
5227a0977366M097630O652961N685269K034326l81051j48353O47504O26619N68312
$$ -10977366 -6879736 -226775 5458494 7492820 7111769 6963416 7610920 8237539 8805851
5218H805851P07385J53892p43846o98618k92046j249186k825825k406226k7594
$$ 8805851 9513236 9667128 8923282 8224664 7932618 6683432 3857607 1451381 1423787
5209A423787J323936N63566p4662N35885M07270j506509k820285j506088P48745
$$ 1423787 2747723 3311289 3236627 3772512 4179782 2673273 -147012 -1653100 -904355
5200i04355J285785J81336r25207j506559j601493o87516Q68578J216182j77729
$$ -904355 381430 562766 -362441 -1869000 -3470493 -4158009 -3289431 -2073249 -2250978
5191b250978j189384m59938K03697p10848j016167J781406N497902N619342J904500
$$ -2250978 -3440362 -3900300 -3696603 -4407451 -5423618 -3642212 1855690 7475032 9379532
5182I379532j246736j196637k04887j111669l013032l205817j419388J84048L85804
$$ 9379532 8132796 6936159 6731272 5619603 2606571 -599246 -2018634 -1834586 -1448782
5173a448782K10001P64418J420272J019834k7631k29526M98551L99400j251388
$$ -1448782 -1238781 -474363 945909 1965743 1938112 1708586 2207137 2606537 1355149
5164A355149k275641l03920L428411N079538K915415r06628l403774l664073k368878
$$ 1355149 -920492 -1224412 2203999 7283537 10198952 9292324 5888550 2224477 -144401
5155a44401n10726P04227N30504j0954P39484K152172J697761j015264l124780
$$ -144401 -655127 49100 579604 568650 1308134 3460306 5158067 4142803 1018023
5146A018023k617469r00430L07220J751731L920439M341290J073152l000886l337648
$$ 1018023 -1599446 -2499876 -2192656 -440925 3479514 7820804 8893956 5893070 2555422
5137B555422l65947J024782j243332l493345j889100K075010L844010J887269
$$ 2555422 2189475 3214257 1970925 -1522420 -3411520 -1336510 2507500 4394769
5129D394769p81045r00195R78248J669549M467j352488J10197K250870N42311
$$ 4394769 3613724 2713529 3691777 5361326 5365793 4013305 4123502 6374372 6916683
5120F916683n001359q498647n587899P13882M278391L700856K359679K227516
$$ 6916683 1915324 -6583323 -12171222 -11457340 -7178949 -3478093 -1118414 1109102
5112A109102J923237P37706L19625J226675J332915n25286k098982j101598J035616
$$ 1109102 3032339 3770045 4089670 5316345 6649260 6123974 4024992 2923394 3959010
5103C959010J218635p73726k273536j746734n22189k23498m09591J88268J254197
$$ 3959010 5177645 4403919 2130383 383649 -138540 -362038 -771629 -583361 670836
5094F70836J165921n28001k214708k246886q94183M79620J336363J927155K026886
$$ 670836 1836757 1308756 -905952 -3152838 -4047021 -3567401 -2231038 -303883 1723003
5085A723003J311429P12998J484810K705456J787759j713180m716686m343870
$$ 1723003 3034432 3747430 5232240 7937696 9725455 8012275 3295589 -1048281
5077a048281j579477J75790q55416l433206n009269l847390l90951K732820L187695
$$ -1048281 -2627758 -2451968 -3307384 -6740590 -11749859 -15597249 -15988200 -13255380 -10067685
5068a0067685J877223J769946L284263L302052J03866l335770l240428j69237
$$ -10067685 -8190462 -6420516 -3136253 165799 269665 -3066105 -6306533 -6475770
5060f475770K271835K287108R64199j35869K0660K052423M752863M883337J117853
$$ -6475770 -4203935 -1916827 -952628 -1088497 -1067837 984586 5737449 10620786 11738639
5051A1738639l023038l181396r6278J718061N27202r40602l54170J103411J203130
$$ 11738639 8715601 5534205 5437927 7155988 7683190 6742588 6388418 7491829 8694959
5042H694959m00611k469306l405761j925761J466892L640084J721163k924384
$$ 8694959 8294348 5825042 2419281 493520 1960412 5600496 7321659 4397275
5034D397275n720839m237630o48812J411056O88638j254929j965116k83219K344391
$$ 4397275 -1323564 -5561194 -6210006 -4798950 -4110312 -5365241 -7330357 -7613576 -5269185
5025e269185L106084J231402r33407j324502q51288j031221j135198j46226O24067
$$ -5269185 -2163101 -931699 -1865106 -3189608 -4040896 -5072117 -6207315 -6353541 -5729474
5016e729474n9954m14640J339019K979473J449055j667723k420567q64060j12797
$$ -5729474 -5789428 -6204068 -4865049 -1885576 -436521 -2104244 -4524811 -5388871 -5501668
5007e501668j09217J954103N267179N465911J743656j781474k842117l495917
$$ -5501668 -5610885 -3656782 1610397 7076308 8819964 7038490 4196373 700456
4999G00456m447602k892786J548593M341244K710511O7544L52448K139209J968197
$$ 700456 -3747146 -6639932 -5091339 -750095 1960416 2027960 2380408 4519617 6487814
4990F487814q24j245566r32331L70771K381688L868918K546808j199399l321229
$$ 6487814 6486990 5241424 4309093 4679864 7061552 10930470 13477278 12277879 8956650
4981H956650j450361J504739J626590q51115l071687l530748k231581L02674J961805
$$ 8956650 7506289 9011028 10637618 9786503 6714816 3184068 952487 1255161 3216966
4972C216966O8630m211141n723698k104986K604966L749568J949387K97243o22058
$$ 3216966 3285596 -925545 -6649243 -8754229 -6149263 -2399695 -450308 -153065 -775123
4963g75123j346934o21618K056349L746019J937282j237913k359517j809158j703946
$$ -775123 -2122057 -2743675 -687326 3058693 4995975 3758062 1398545 -410613 -2114559
4954b114559j324806R69455L215243J921967k222547m831511l706935r89810M03674
$$ -2114559 -3439365 -2469910 745333 2667300 444753 -4386758 -8093693 -9083503 -8679829
4945h679829l7843o97228K62426K767165M093148J877377j974888l206489j330774
$$ -8679829 -8717672 -9414900 -9152474 -6385309 -2292161 -414784 -2389672 -5596161 -6926935
4936f926935J2711n00045j1459K324647K866691R5259j765145M48765L420103
$$ -6926935 -6914224 -7414269 -7425728 -5101081 -2234390 -2139131 -3904276 -3455511 -35408
4927c5408K986841N56127n31804n71951q87121j33593K041468K150673j334134
$$ -35408 2951433 3507560 2975756 2403805 1516684 1383091 3424559 5575232 4241098
4918D241098l841041j585147J945497J879653k71008n90914N0084r97911k257599
$$ 4241098 400057 -1185090 760407 2640060 2369052 1778138 1828222 830311 -1427288
4909a427288j444537n08230j425912j621870N03328R66842k415718m214045k34478
$$ -1427288 -2871825 -3380055 -4805967 -6427837 -5924509 -4957667 -7373385 -11587430 -11821908
4900a1821908M403247M131329K756680N211328P020751K763151k263628p69263
$$ -11821908 -7418661 -3287332 -530652 4680676 11701427 14464578 12200950 11431687
4892A1431687L156389K153773k02103K602417N316326J30979o621097m518333
$$ 11431687 14588076 16741849 16539746 19142163 24458489 24589468 17968371 13450038
4884A3450038J283401k55941m160234O54202P209762K325540m458812M871980
$$ 13450038 14733439 14477498 10317264 10971466 18181228 20506768 16047956 20919936
4876B0919936J9406636J5157520O937808L4688590Q5814054Q6509100L734207
$$ 20919936 40326572 55484092 62421900 97110490 182924544 269433644 273167851
4869B73167851r1021990j07106167n0739846k779055k914335j6106211q458613
$$ 273167851 182145861 75039694 24299848 21520793 18606458 2500247 -5958366
4862e958366M943925K138287n597499q03788P442168L609675n537203n477966
$$ -5958366 -1014441 1123846 -4473653 -5277441 2164727 5774402 237199 -5240767
4854e240767O16850J455759j321866O5918K905066N71220l219175j312744L186936
$$ -5240767 -4623917 -3168158 -4490024 -4424106 -1519040 -947820 -4166995 -5479739 -2292803
4845b292803L005280j22197l4460K002262Q68785k061464k040626k0043J74207
$$ -2292803 712477 590280 555820 2558082 3426867 1365403 -675223 -695266 -521059
4836e21059m28922R91755K351985M75374k299064k192685p73716j228232j891125
$$ -521059 -949981 41774 2393759 2869133 570069 -1622616 -2396332 -3624564 -5515689
4827e515689Q3633K456626J653888o93391r27078K35006Q9317n66879K01944P92671
$$ -5515689 -5432056 -2975430 -1321542 -2014933 -2942011 -2707005 -2617688 -3184567 -2982623 -2189952
4817b189952r71457l122501k643690m14233J211146K464728L730518K901400m39330
$$ -2189952 -3161409 -6283910 -8927600 -9341833 -8130687 -5665959 -1935441 965959 526629
4808E26629k208325J26359K709924J432419j158003m15282K677501L924972K785147
$$ 526629 -1681696 -1555337 1154587 2587006 1429003 1013721 3691222 7616194 10401341
4799A0401341J358322m09622l125876m476531k654052m75525j029787k236942
$$ 10401341 11759663 11350041 8224165 3747634 1093582 618057 -411730 -2648672
4791b648672q84085J216273P11639q65600k05312J194036n120j925836k08930
$$ -2648672 -3532757 -2316484 -1604845 -2470445 -2675757 -1481721 -1486841 -3412677 -3621607
4782c621607L903613M921604J573127k176563l707268l632518k121649R28503
$$ -3621607 282006 5203610 6776737 4600174 892906 -2739612 -4861261 -3932758
4774c932758K923065J353616j333511j044990J074503Q46099j286280j283495
$$ -3932758 -1009693 343923 -989588 -2034578 -960075 -113976 -1400256 -2683751
4766b683751Q47845J421652N81412K028014M969463M086938j044828m040049j615908
$$ -2683751 -1835906 -414254 167158 2195172 7164635 11251573 10206745 6166696 4550788
4757D550788J581199J155612o35977n84870n83491k984872m744884j934827K971997
$$ 4550788 6131987 7287599 6651622 6066752 5483261 2498389 -2246495 -4181322 -1209325
4748a209325L954533J44064l187716k054386J692200L725106K393058m83237k441972
$$ -1209325 2745208 2889272 -298444 -2352830 -660630 3064476 5457534 4974297 2532325
4739B532325k881807k885405l159800l042418j933317n49526L38238J246107K559326
$$ 2532325 -349482 -3234887 -6394687 -9437105 -11370422 -11919948 -11581710 -10335603 -7776277
4730g776277L024921J574468n22832j418338j318943j138375k22242J722964K306483
$$ -7776277 -4751356 -3176888 -3699720 -5118058 -6437001 -7575376 -7797618 -6074654 -3768171
4721c768171k23657k922795j797073J648845K458265J76625q05212R20719J628054
$$ -3768171 -3991828 -6914623 -8711696 -7062851 -4604586 -4427961 -5233173 -4312454 -2684400
4712b684400l55531j191174J837470N164164M144468j64868l122376k787897p67854
$$ -2684400 -3039931 -4231105 -2393635 2770529 6914997 6750129 3627753 839856 72002
4703G2002J172166K270004J964560M60561q50845j113188r49329p74812o0858
$$ 72002 1244168 3514172 5478732 5939293 5088448 3975260 3025931 2251119 2190261
4694B190261Q35581N27838n91096j68117J963764K447330o38740m253606m472196
$$ 2190261 3025842 3553680 2962584 2794467 4758231 7205561 6566821 2313215 -2158981
4685b158981j806516L53343P27729O18238P41982N32101m5313l43293k85040k0056
$$ -2158981 -3965497 -3612154 -2884425 -2266187 -1524205 -992104 -1037417 -1380710 -1665750 -1685806
4675a685806R66533K758609L818157K567613l96452k993295l933257l304410j854337
$$ -1685806 -719273 2039336 5857493 8425106 8028654 5035359 1102102 -2202308 -4056645
4666d056645p38096q95866j586654o87035K411422N357048N470579K806897l79308
$$ -4056645 -4794741 -5690607 -7277261 -7964296 -5552874 -195826 5274753 8081650 7702342
4657G702342k101581j739757j4347J224295N15895j159810j396953J7718O26534
$$ 7702342 5600761 3861004 3846657 5070952 5586847 4427037 3030084 3047802 3674336
4648C674336p02503j876279j178517j48979o93794j651360r28371P32814J038014
$$ 3674336 2971833 1095554 -82963 -231942 -925736 -2577096 -3505467 -2772653 -1734639
4639a734639q097l98292M16702R87681M92648l16667o71441n28318R846N53363
$$ -1734639 -1742736 -2141028 -1724326 -736645 -243997 -560664 -1232105 -1760423 -1750577 -1197214
4629a197214J99272j122625j726747j44842K511133L620049K080620q35412l025051
$$ -1197214 -997942 -2120567 -3847314 -3992156 -1481023 2139026 4219646 3384234 359183
4620C59183l023780q99973J368790J583786K35217P8013J836228K663051N94349
$$ 359183 -2664597 -3564570 -2195780 -611994 -376777 -298764 1537464 4200515 4794864
4611D794864k019345k137064q00715r65283k286847j913922M05383J883169J208068
$$ 4794864 2775519 638455 -162260 -1127543 -3414390 -5328312 -4922929 -3039760 -1831692
4602a831692l5335o32744j088619j301801j62839J712106J845630l65689k353432
$$ -1831692 -1867027 -2499771 -3588390 -4890191 -5053030 -3340924 -1495294 -1860983 -4214415
4593d214415k016309m00675M40250K10367k22364l82377q746J089760K074332
$$ -4214415 -6230724 -6631399 -6191149 -5980782 -6203146 -6585523 -6594269 -5504509 -3430177
4584c430177J582368m223n86426M80322J243219L85548m83921M27144J811525
$$ -3430177 -1847809 -1852032 -2438458 -1958136 -714917 -329369 -813290 -386146 1425379
4575A425379J047093j701978l538544k800013r51936j83402o81661j029951l58536
$$ 1425379 2472472 770494 -2768050 -5568063 -6519999 -6703401 -7385062 -8415013 -8773549
4566h773549P64264J281830Q52619L9145l41841J37135J244203K100405J721354
$$ -8773549 -8009285 -6727455 -5874836 -5835691 -6177532 -6040397 -4796194 -2695789 -974435
4557i74435J84535r37898l09465J039163P62919j243497k227396o10606J375135
$$ -974435 -789900 -1727798 -2037263 -998100 -235181 -1478678 -3706074 -4316680 -2941545
4548b941545J059172m14031j3236K060000K533453K74331k008059k059712j096822
$$ -2941545 -1882373 -2296404 -2309640 -249640 2283813 2558144 550085 -1509627 -2606449
4539b606449j153716j925325j989118j201918n1130J747194M029241M867238K727362
$$ -2606449 -3760165 -5685490 -7674608 -8876526 -8927656 -7180462 -3151221 1716017 4443379
4530D443379o48467j676152O22432L281309L076737M09917j474880q05140M04276
$$ 4443379 3794912 2118760 2741192 6022501 9099238 9509155 8034275 7229135 7633411
4521G633411p37502l444992l689214N6425L808091L065622r09875l068140j853294
$$ 7633411 6895909 3450917 -238297 -181872 3626219 6691841 5781966 2713826 860532
4512H60532m31324n55593O2511K573058L736917J047129k505716k777996r10151
$$ 860532 429208 -126385 -63874 2509184 6246101 7293230 4787514 2009518 1099367
4503A099367r42310k803234k634858M82002L030485K770755J514112J044785L69429
$$ 1099367 157057 -2646177 -5281035 -4799033 -1768548 1002207 2516319 3561104 3930533
4494C930533j105199j244113J375525M272096L977421M84343l366468n429888
$$ 3930533 2825334 1581221 2956746 7228842 11206263 11690606 8324138 2894250
4486B894250n250120l103900k46147J104842J48548j111800p32958J70918m77076
$$ 2894250 -2355870 -5459770 -5705917 -4601075 -4452527 -5564327 -6297285 -6126367 -6603443
4477f603443j842138j257468J336047L015427K193210O44925M86302J360505J676591
$$ -6603443 -8445581 -9703049 -8367002 -5351575 -3158365 -2513440 -2027138 -666633 1009958
4468A009958R40276k42330j299643j965057k192920k157166j650221J26943K900212
$$ 1009958 1950234 1707904 408261 -1556796 -3749716 -5906882 -7557103 -7430160 -4529948
4459d529948M180152K018907j440008k064749L27116J501340n56850k155995M75686
$$ -4529948 -349796 1669111 229103 -1835646 -1508530 -7190 -564040 -2720035 -2244349
4450b244349N071246O213107K519857k349697m668923l575644j64807L110384
$$ -2244349 2826897 9040004 11559861 9210164 4541241 965597 800790 3911174
4442C911174K997295j132989m903161l544484J310937L330428K53386l272820
$$ 3911174 6908469 5775480 872319 -2672165 -1361228 1969200 2222586 -1050234
4434a050234k814204J03279J592637J083281L63695k83387j557727k499940j695120
$$ -1050234 -3864438 -3761159 -2168522 -1085241 -721546 -1004933 -2562660 -5062600 -6757720
4425f757720j79647k17160j637702j948236J3250K621450L722199K782698Q34028
$$ -6757720 -6937367 -7154527 -8792229 -10740465 -10727215 -8105765 -4383566 -1600868 -766840
4416g66840n24197l05826P49722Q37150l69157r83132K01302J599554J269377
$$ -766840 -1291037 -1596863 -847141 -9991 -379148 -1362280 -1160978 438576 1707953
4407A707953j7999k89817K48347j33468j403883j785798p91447K59750P59606
$$ 1707953 1689954 1400137 1648484 1515016 111133 -1674665 -2466112 -2206362 -1446756
4398a446756J488775K569949K918539K071731O70870r98359k929342l819412k002050
$$ -1446756 42019 2611968 5530507 7602238 8273108 7274749 4345407 525995 -1476055
4389a476055J498737L201649J451923j456575k453118j250325L21409R73103P64406
$$ -1476055 22682 3224331 4676254 3219679 766561 -483764 -162355 810748 1575154
4380A575154L75211M91523J081482R84543n95753k211443j634707N73863J306048
$$ 1575154 1950365 2441888 3523370 4507913 3912160 1700717 66010 639873 1945921
4371A945921m95920k024667r14715J003406N48820j870508k829982p42277K195090
$$ 1945921 1450001 -574666 -1489381 -485975 62845 -1807663 -4637645 -5379922 -3184832
4362c184832K936707Q64084k014235l117035j578955R09026J882218R86212J38722
$$ -3184832 -248125 615959 -1398276 -4515311 -6094266 -5185240 -3303022 -2316810 -2178088
4353b178088M96735Q58113K352j130057j119910m04196j13867P7067Q95142J462018
$$ -2178088 -1681353 -823240 -820888 -1950945 -3070855 -3475051 -3588918 -3511851 -2616709 -1154691
4343a154691O57060m97403l19630M95932J27017p56101N5839J873798J421604
$$ -1154691 -497631 -995034 -1314664 -818732 -691715 -1447816 -1391977 481821 1903425
4334A903425j622133l240449j031514J945521J900021o1328l83368J037219J317038
$$ 1903425 281292 -2959157 -3990671 -2045150 -145129 -206457 -589825 447394 1764432
4325A764432j81245j166367q78231j285939k967577l384576j050222J455634J033521
$$ 1764432 1583187 416820 -461411 -1747350 -4714927 -8099503 -9149725 -7694091 -6660570
4316f660570j339014k147156l35733J776394K164904J374948Q99508J099322J378140
$$ -6660570 -7999584 -10146740 -10482473 -8706079 -6541175 -5166227 -4266719 -3167397 -1789257
4307a789257J325499J108622J237251K006142K745697K069931k93528k412250
$$ -1789257 -463758 644864 1882115 3888257 6633954 8703885 8410357 5998107
4299E998107k109467J90778J868249J339778m07681j618756j729526j155578l81729
$$ 5998107 3888640 4079418 5947667 7287445 6879764 5261008 3531482 2375904 1994175
4290A994175J41499R8022k54331m46752o16644r99537q36342O91900K454173K198257
$$ 1994175 2135674 2233696 1979365 1532613 915969 -83568 -919910 -228010 2226163 4424420
4280D424420k02017k302044k532256j938089j532427l85076J927035L266487J784024
$$ 4424420 4222403 1920359 -611897 -2549986 -4082413 -4467489 -2540454 726033 2510057
4271B510057q04903j394802J78325J491983J302798M18113m41326j052886o11050
$$ 2510057 1705154 310352 488677 1980660 3283458 3701571 3260245 2207359 1596309
4262A596309J036088J652906p79971l999023l506428R05989M259041L104781k61934
$$ 1596309 2632397 4285303 3505332 -493691 -4000119 -3094130 1164911 4269692 4007758
4253D007758j939826j510221o84192K44770J550510J764717l66596k777835k309438
$$ 4007758 2067932 557711 -126481 118289 1668799 3433516 3066920 289085 -2020353
4244b020353M17608J636128J12562j092537L52549K220542J122668k179139l664472
$$ -2020353 -1602745 33383 145945 -946592 -594043 1626499 2749167 570028 -3094444
4235c094444j673285J106885J773916Q87596M96354L94396j056326l064193k466084
$$ -3094444 -4767729 -3660844 -1886928 -999332 -502978 -108582 -1164908 -4229101 -6695185
4226f695185J501138N107711M661920J315703r18447p05544k38610r74682j426307
$$ -6695185 -5194047 -86336 4575584 5891287 4972840 4267296 4028686 3054004 1627697
4217A627697J0531K211441K700942Q00782j683492k475108j017140J055588J587421
$$ 1627697 1638228 3849669 6550611 7351393 5667901 3192793 2175653 3231241 4818662
4208D818662K89096j040789j089396o54435n80937L81004L324651N818028M104647
$$ 4818662 5107758 4066969 2977573 2323138 1742201 2123205 5447856 11265884 15370531
4199A5370531j033664l973006j371821L055591L239674j424401n649501n160785
$$ 15370531 14336867 10363861 8992040 12047631 15287305 13862904 8213403 3052618
4191C052618j476651R30475M14085o73437j85997N32339j001726l927215m420180
$$ 3052618 1575967 2506442 2920527 2247090 2061093 2593432 1591706 -2335509 -6755689
4182f755689r27066L388800M706902K986171O20443j333137l084943l683797j658713
$$ -6755689 -7682755 -4293955 412947 3399118 4019561 2686424 -398519 -4082316 -5741029
4173e741029K151075M760815M256854J524535r65845j263125K95390R33114j270246
$$ -5741029 -3589954 1170861 5427715 6952250 5986405 4723280 5018670 5951784 4681538
4164D681538l802178k555418J309612K121269j066216k161222J592231L973512
$$ 4681538 879360 -1676058 -366446 1754823 688607 -1472615 119616 4093128
4156D093128K56557l836349j655036K679564K169052J76199L306436O638747J392361
$$ 4093128 4349685 513336 -1141700 1537864 3706916 3883115 7189551 13828298 15220659
4147A5220659o605670m289508M489797L321288o929486p595909J705046n016630
$$ 15220659 8614989 4325481 8815278 12136566 5207080 -2388829 -683783 -5700413
4139e700413l5494008n3566005k5638901K5886860M8285005K8175631J970140
$$ -5700413 -41194421 -94760426 -120399327 -94512467 -46227462 -18051831 -16081691
4132a6081691j183275P501719P427073J238554O09382K570329j059670n766307
$$ -16081691 -17264966 -9763247 -2336174 -1097620 -488238 2082091 1022421 -4743886
4124d743886l342580J759701N15342m319123l917329R36376K789561J134487J131163
$$ -4743886 -8086466 -6326765 -5811423 -10130546 -14047875 -13111499 -10321938 -9187451 -8056288
4115h056288K652940J678494m85341L53067K228495J96921l646289k939544J640323
$$ -8056288 -5403348 -3724854 -4210195 -3857128 -1628633 -1431712 -5078001 -8017545 -6377222
4106f377222L228200L13734j512668L59873K025700P53685j036122j104590o11222
$$ -6377222 -3149022 -2835288 -4347956 -3988083 -1962383 -1208698 -2244820 -3349410 -3960632
4097c960632m43450M16159J511953O16953j979963l087227j512863M38421J110118
$$ -3960632 -4404082 -3987923 -2475970 -1859017 -3838980 -6926207 -8439070 -8000649 -6890531
4088f890531J518647K482779K977396K160240N84093q61766j318801m9821J792038
$$ -6890531 -5371884 -2889105 88291 2248531 2832624 1970858 652057 602236 2394274
4079B394274J140334k554354m947490k309587K641138M467656K696538J190909
$$ 2394274 3534608 980254 -3967236 -6276823 -3635685 831971 3528509 4719418
4071D719418J397639J320832M00231K66908P87975P1571j583026k106846j807817
$$ 4719418 6117057 7437889 7838120 8105028 8893003 8964574 7381548 5274702 3466885
4062C466885k640785l656581j998201J577779L137059J844939Q55655J380149
$$ 3466885 826100 -2830481 -4828682 -3250903 -113844 1731095 2586750 3966899
4054C966899R46938j374795k932798k130338o81874R9100R30971J313210o59018
$$ 3966899 4913837 3539042 606244 -1524094 -2205968 -2106868 -1175897 137313 -521705
4045e21705l676744l226108J633401N953316N725538K837544P81724l20619j492672
$$ -521705 -4198449 -7424557 -5791156 162160 5887698 8725242 9506966 9186347 7693675
4036G693675j693937k75341N78105p97912k426492j876464r442J098749J231350
$$ 7693675 5999738 5724397 6302502 5504590 3078098 1201634 1192192 2290941 3522291
4027C522291M55231k356586o351251p262388k923260K509351L887414K212406
$$ 3522291 3977522 1620936 -4730315 -11992703 -14915963 -12406612 -8519198 -6306792
4019f306792J989668L488687K912224m69220k724602j539203M85324M72275l69283
$$ -6306792 -4317124 -828437 2083787 1614567 -1110035 -2649238 -2163914 -1691639 -2060922
4010b060922O81638L245849M233119J911959k123374m790876m366769j633769
$$ -2060922 -1379284 1866565 6099684 8011643 5888269 1097393 -3269376 -4903145
4002d903145J179157K441408K252649J791585J879941K195149J613412m96458
$$ -4903145 -3723988 -1282580 970069 2761654 4641595 6836744 8450156 7953698
3994G953698k954287l336468q02140K232571K649562M51379j645637k079657j747573
$$ 7953698 4999411 1662943 860803 3093374 5742936 6194315 4548678 2469021 721448
3985G21448j459496o47431O86000J104096k8454j334725j500319q55708n4817
$$ 721448 -738048 -1385479 -699479 404617 376163 -958562 -2458881 -3314589 -3369406
3976c369406R92582K037277K240156J810078J908204K230564J014435j695645
$$ -3369406 -2376824 -339547 1900609 3710687 5618891 7849455 8863890 7168245
3968G168245l356049k584303q79075L90120J640358K384090N74336l096632l993066
$$ 7168245 3812196 1227893 348818 738938 2379296 4763386 5337722 2241090 -1751976
3959a751976J04557M662425M247647L7950k704787k396133j650808j574708o23009
$$ -1751976 -1647419 3015006 7262653 7300603 4595816 2199683 548875 -1025833 -1648842
3950a648842J205509J723498M95232n06386n83187j019688j785004j248757K78056
$$ -1648842 -443333 1280165 1775397 1269011 685824 -333864 -2118868 -3367625 -3089569
3941c089569N19530m20576L47485L151982M009328N77874l572576l702878l73480
$$ -3089569 -2570039 -2990615 -2643130 508852 4518180 5096054 1523478 -2179400 -2552880
3932b552880K135654K052765J157498N07839j024436l432045m112972j507490
$$ -2552880 -417226 1635539 2793037 3300876 2276440 -1155605 -5268577 -6776067
3924f776067J908639K507235L59159j164300m32581M55200l45525j136626K27323
$$ -6776067 -4867428 -2360193 -2001034 -3165334 -3597915 -3142715 -3488240 -4624866 -4397543
3915d397543J971694P96302k145686k100917J718871M060684J401674k498637
$$ -4397543 -2425849 -1629547 -3775233 -5876150 -4157279 -96595 1305079 -1193558
3907a193558k469769K26073P60058j042804j114476J170122J795836o77079k374127
$$ -1193558 -3663327 -3437254 -2677196 -3720000 -4834476 -3664354 -1868518 -2545597 -4919724
3898d919724o55607J489071O46529j386645r93442J042855R87869j565353l050975
$$ -4919724 -5575331 -4086260 -3439731 -4826376 -5819818 -4776963 -3789094 -5354447 -8405422
3889h405422j529200O12801N42824j001789j151438J054280L637068M239276K532713
$$ -8405422 -9934622 -9321821 -8778997 -9780786 -10932224 -9877944 -6240876 -2001600 531113
3880E31113L4081j589700j606725k53972J480204K282133J606866L94958j91954
$$ 531113 565194 -1024506 -2631231 -2885203 -1404999 877134 2484000 2878958 2687004
3871B687004o55959k322849m405245m013278k88626L468926L717318J141541r68141
$$ 2687004 2031045 -291804 -4697049 -8710327 -8998953 -5530027 -1812709 -671168 -1639309
3862a639309j359453j181142q33813L49301J634983J264650m89964j446397r43954
$$ -1639309 -2998762 -4179904 -5013717 -4664416 -3029433 -1764783 -2254747 -3701144 -4645098
3853d645098l88824j22600J143369L069506L094766M66977j959481j589935O51243
$$ -4645098 -5033922 -5156522 -4013153 -943647 2151119 2618096 658615 -931320 -280077
3844b80077K466716L184588K903623J049331k040208l996799l136976q98829L12638
$$ -280077 2186639 5371227 8274850 9324181 7283973 3287174 150198 -748631 -435993
3835d35993L01402L06540N35225M43624K66204L98384L10606l33955p20134n62140
$$ -435993 -134591 171949 707174 1150798 1417002 1815386 2125992 1792037 1071903 509763
3825E09763j197835l211573m602054l471834j055998K72437O06738J492909K553086
$$ 509763 -688072 -3899645 -8501699 -11973533 -13029531 -12757094 -12150356 -10657447 -8104361
3816h104361K129707O15796J60460J291930K503337K957764K946422J937621q38935
$$ -8104361 -5974654 -5358858 -5198398 -3906468 -1403131 1554633 4501055 6438676 5599741
3807E599741l760722l873154j207271Q46774L65544o89959q3962J339593J624131
$$ 5599741 1839019 -2034135 -3241406 -2394632 -2029088 -2719047 -2803009 -1463416 160715
3798A60715Q47829L75744N41997Q14721R78275O73007q61008l039975l406297
$$ 160715 1008544 1384288 1926285 2741006 3719281 4392288 3531280 491305 -2914992
3789b914992p54188K414544K713364L24949j622291j588144r78682r02194l04488
$$ -2914992 -3669180 -1254636 1458728 1783677 161386 -1426758 -2405440 -3307634 -3612122
3780c612122J530597K827745J596360j117488k290094q89453J042008J447382
$$ -3612122 -2081525 746220 2342580 1225092 -1065002 -1954455 -912447 534935
3772E34935O87998J75679N8155l62963q56407o47642k25425q43478k012909j555930
$$ 534935 1222933 1398612 1456767 1093804 237397 -410245 -635670 -1479148 -3492057 -5047987
3762e047987R11359K518606Q79940k168855k812900m59271J759588J583253K64900
$$ -5047987 -4136628 -1618022 -738082 -2906937 -5719837 -6179108 -4419520 -2836267 -2571367
3753b571367K6572J024689J938565J966721J088734l67533j357202n77154J549828
$$ -2571367 -2544795 -1520106 418459 2385180 3473914 3106381 1749179 1172025 2721853
3744B721853K553251Q85844j881304l235370k935773k299494j398283N76114K597663
$$ 2721853 5275104 6160948 4279644 1044274 -1891499 -4190993 -5589276 -5013162 -2415499
3735b415499K259564n22953k733730k270920o15559r309Q8786J521737L648901
$$ -2415499 -155935 -678888 -3412618 -5683538 -6299097 -6308406 -6219620 -4697883 -1048982
3726a048982L721503R64346k053769k765949j540651l37128J49047O64948J487227
$$ -1048982 2672521 3636867 1583098 -1182851 -2723502 -3060630 -2911583 -2246635 -759408
3717g59408J741628O88145j129251k272613j734013P5406J589843J623738O60883
$$ -759408 982220 1670365 541114 -1731499 -3465512 -3390106 -1800263 -176525 484358
3708D84358R7337K14087r9588j181455j408622O17967L552263M617538L174936
$$ 484358 581695 795782 696194 -485261 -1893883 -1275916 2276347 6893885 10068821
3699A0068821J218263J15434j175963l599106n409433m083346k09159K608654
$$ 10068821 11287084 11402518 10226555 6627449 1218016 -2865330 -3074489 -465835
3691d65835K102428o4020r46083k04530K17188m07752n44502O66324J427025j24353
$$ -465835 1636593 1572573 626490 421960 639148 231396 -313106 353218 1780243 1655890
3681A655890k552092k648412j26681J656639M46742j670345j362180J337444L636306
$$ 1655890 -896202 -3544614 -3671295 -2014656 -1567914 -3238259 -4600439 -3262995 373311
3672C73311M077320L551819K687245Q91923j604193l128304k931911k310155k302301
$$ 373311 4450631 8002450 10689695 11581618 9977425 6849121 3917210 1607055 -695246
3663f95246j989281m31814J169898R93975o01982j535307q71716L22961R46033
$$ -695246 -2684527 -3116341 -1946443 -952468 -1554450 -3089757 -3961473 -3638512 -2692479
3654b692479J187074J447649J099247o34198k824407k994569M1109L893239M552412
$$ -2692479 -1505405 -57756 1041491 407293 -2417114 -5411683 -5370574 -1477335 3075077
3645C075077J200652k306712k068048R73322K725349J574003m04642j510874k352467
$$ 3075077 4275729 1969017 -99031 874291 3599640 5173643 4769001 3258127 905660
3636I05660l052625k051952N23180J449972j011032l615036k296541J958864M633486
$$ 905660 -2146965 -4198917 -3675737 -2225765 -3236797 -6851833 -9148374 -7189510 -2556024
3627b556024L800953J451658m16034j581179j803297o57063N70588j40068k197472
$$ -2556024 1244929 2696587 2280553 699374 -1103923 -1760986 -1190398 -1330466 -3527938
3618c527938k803810j141479O67636J319148J955215L019752K651088L9310k237765
$$ -3527938 -6331748 -7473227 -6805591 -5486443 -3531228 -511476 2139612 2178922 -58843
3609e8843j533412J006379K105230O92289j319374j797839m66500J207671J295468
$$ -58843 -1592255 -585876 1519354 2211643 892269 -905570 -1372070 -164399 1131069
3600A131069p27705l004972l306822k061945j544145j977902j201485J095924
$$ 1131069 403364 -2601608 -5908430 -7970375 -9514520 -11492422 -12693907 -11597983
3592a1597983K154123Q45272J48056K238727M328492L035717K23349j1106J693172
$$ -11597983 -9443860 -8598588 -8450532 -6211805 -1883313 1152404 1375753 1364647 3057819
3583C057819J138831k031830l558013j706546O9329o99941j459154N24664L240544
$$ 3057819 4196650 2164820 -1393193 -3099739 -3030410 -3730351 -5189505 -4664841 -1424297
3574a424297L316833J409224M60939N74042m74547k599713l109260j102644J001806
$$ -1424297 1892536 3301760 3762699 4336741 3862194 1262481 -1846779 -2949423 -1947617
3565a947617J000761m52767j531268j580032q58810M72233J994517K654924J727121
$$ -1947617 -946856 -1399623 -2930891 -4510923 -5369733 -4897500 -2902983 -248059 1479062
3556A479062l26624k410002l673368l625958k168774K4039J767326K460484K483211
$$ 1479062 1152438 -1257564 -4930932 -8556890 -10725664 -10701625 -8934299 -6473815 -3990604
3547c990604K263399J610882M41606m48859j15457J182727K012898J324652l59338
$$ -3990604 -1727205 -116323 325283 -123576 -239033 943694 2956592 4281244 3921906
3538C921906j542654j436358p60195o92563j274936j444896p50403j73905n05825
$$ 3921906 2379252 942894 182699 -509864 -1784800 -3229696 -3980099 -4154004 -4659829
3529d659829o08688J240603M237408M987496J659931k959518m326242j776887
$$ -4659829 -5268517 -4027914 209494 5196990 6856921 3897403 -428839 -2205726
3521b205726O08027n79059l553631l899857o79098K362622K004175k85474r02731
$$ -2205726 -1597699 -2176758 -5730389 -9630246 -10309344 -7946722 -5942547 -6228021 -7130752
3512g130752O97551J680966L32156j577582j704231m67063O6910m95246m90947
$$ -7130752 -6433201 -4752235 -4420079 -5997661 -7701892 -8168955 -8102045 -8597291 -9088238
3503i088238J042192K717661K370591l81766l454661m049763j396212K043696
$$ -9088238 -8046046 -5328385 -2957794 -3339560 -6794221 -10843984 -12240196 -10196500
3495a0196500K810424M26285j777672p73962K233273L567733K019342r3044o14249
$$ -10196500 -7386076 -6959791 -8737463 -9511425 -7278152 -3710419 -1691077 -1784121 -2398370
3486b398370Q3542R19827J873301K729503K182983n5253j853678j324593K92721
$$ -2398370 -2314828 -1395001 478300 3207803 5390786 5335533 3481855 2157262 2449983
3477B449983M42155r99679j998723j761443j424058j461972q95405M08134Q51620
$$ 2449983 2892138 1892459 -106264 -1867707 -3291765 -4753737 -5649142 -5241008 -4389388
3468d389388m65616k098388k132084n15469J405492K635735K912739K211191P80071
$$ -4389388 -4855004 -6953392 -9085476 -9600945 -8195453 -5559718 -2646979 -435788 344283
3459C44283p70884j862091k024699q16306J280262K166091J42923l137697l843817
$$ 344283 -426601 -2288692 -4313391 -5129697 -3849435 -1683344 -1540421 -4678118 -8521935
3450h521935r31135K123924J881718o98806k191907j290162O54447K301357L140483
$$ -8521935 -9453070 -7329146 -5447428 -6146234 -8338141 -9628303 -8973856 -6672499 -3532016
3441c532016K582446P19500n64657L00719J746558R47744j591453k246364L94210
$$ -3532016 -949570 -230070 -794727 -494008 1252550 2200294 608841 -1637523 -1243313
3432a243313L271586L204895J060073k02186J88891N61739k05140j412421j959234
$$ -1243313 2028273 5233168 6293241 6091055 6279946 6841685 6636545 5224124 3264890
3423C264890j612817q77535m35342o17713r68989o47570M50361J489697J837224
$$ 3264890 1652073 774538 339196 -278517 -1247506 -1895076 -1444715 44982 1882206
3414A882206J706454J460797J127534Q41770Q32201P74056K45280j06547O49975
$$ 1882206 3588660 5049457 6176991 7018761 7850962 8625018 8870298 8763751 9413726
3405I413726J624742Q13655j483489k353798o67048P69449m11273k002162n94132
$$ 9413726 11038468 11852123 10368634 8014836 7347788 8117237 7705964 5703802 5109670
3396E109670K614412L243062M11730j991724j272578N16568M14581j121944j761812
$$ 5109670 7724082 10967144 11378874 9387150 8114572 8631140 9045721 7923777 6161965
3387F161965r22039K97300J189980J454807M61138j488942k266471m48129J959027
$$ 6161965 5239926 5537226 6727206 8182013 8643151 7154209 4887738 4439609 6398636
3378F398636J594450j563185l677179j731924K773732N519054L876732p58334
$$ 6398636 7993086 6429901 2752722 1020798 3794530 9313584 13190316 12431982
3370A2431982m579134m945740k586029k94295L88922M07777R36669J356086O43876
$$ 12431982 7852848 2907108 321079 26784 415706 823483 1760152 3116238 3760114
3361C760114m48347m15927M95357P77275K95242L03807Q31179L34055j545417
$$ 3760114 3311767 2895840 3391197 4168472 4463714 4767521 5598700 5932755 4387338
3352D387338l069440l076200k483513k076672r45595J323326K864253J978283
$$ 4387338 1317898 -1758302 -4241815 -6318487 -7264082 -5940756 -3076503 -1098220
3344a098220j25294j175029j155644j418346j539566P9872K806290L837056K095615
$$ -1098220 -1223514 -2398543 -3554187 -4972533 -6512099 -6432227 -3625937 211119 2306734
3335B306734l32391j304932j054156p23365m55919r6560k86366j570329l245221
$$ 2306734 1974343 669411 -384745 -1108110 -1564029 -1660589 -1946955 -3517284 -6762505
3326f762505l958339k968797o52420J548235J983940P24507M0125J372358K716612
$$ -6762505 -10720844 -13689641 -14342061 -12793826 -10809886 -10085379 -10045254 -8672896 -5956284
3317e956284J474588r24804p88584J659341K313433K99047l8734L271896N346669
$$ -5956284 -4481696 -5406500 -6195084 -4535743 -2222310 -1923263 -1961997 1309899 6656568
3308F656568J815685l497670l819194M13362K754500P29755j678789j443543k96659
$$ 6656568 8472253 4974583 1155389 1568751 4323251 5053006 3374217 1930674 1634015
3299A634015k3909N41002J888270J946974J57444o73127R65118K499111J715587
$$ 1634015 1610106 2151108 4039378 5986352 6143796 5470669 6435787 8934898 10650485
3290A0650485M20283P82120J382505K45798j134480n46082N19349p84818l500204
$$ 10650485 11070768 11852888 13235393 13481191 12346711 11800629 12319978 11535160 8034956
3281H034956m104806k079890m56799j016783k271460k437108j646210p77843k32055
$$ 8034956 3930150 1850260 1393461 376678 -1894782 -4331890 -5978100 -6755943 -6987998
3272f987998j84139m47179j66747R62746J738931J180642L04999M42534Q73695
$$ -6987998 -7172137 -7619316 -7786063 -6823317 -5084386 -3903744 -3598745 -3156211 -2282516
3263b282516K36239p85921n70878N77023J209183J496186K447642L179743K063340
$$ -2282516 -2046277 -2832198 -3403076 -2826053 -1616870 -120684 2326958 5506701 7570041
3254G570041O9696l50033N15538P4958j784369k113597J38587K222851J947635
$$ 7570041 7639737 7289704 7805242 7880200 6095831 3982234 4120821 6343672 8291307
3245H291307O62948L11764M60832L6998n82827r61953j681960k425819j488726
$$ 8291307 8954255 9266019 9726851 9763849 9181022 8219069 6537109 4111290 2622564
3236B622564J083274K473336J175240n54064n97257n65612k497599m405451k881715
$$ 2622564 3705838 6179174 7354414 6800350 6203093 5637481 3139882 -1265569 -4147284
3227d147284J256722L704934K503386j76738j836657k126410j423538J34578J594033
$$ -4147284 -2890562 814372 3317758 3141020 1304363 -822047 -2245585 -2111007 -516974
3218e16974J477816j74074j711243k009084j125123Q43197L411097M429493J860935
$$ -516974 960842 786768 -924475 -2933559 -4058682 -3215485 195612 4625105 6486040
3209F486040k625973m458212j765956J936345K205629q14438l084145j931205
$$ 6486040 3860067 -598145 -2364101 -427756 1777873 963435 -2120710 -4051915
3201d051915J067531K310292K00020l243725m510520k307915J127645K789939
$$ -4051915 -2984384 -674092 -474072 -3717797 -8228317 -10536232 -9408587 -6618648
3193f618648K312954J619330J835799K273593K324432K360464K279219J056835
$$ -6618648 -4305694 -2686364 -850565 1423028 3747460 6107924 8387143 9443978
3185I443978j331851l131039l012905j776186q55157m45293j97072m47248j434560
$$ 9443978 8112127 4981088 1968183 191997 -663160 -1108453 -1305525 -1752773 -3187333
3176c187333k404839k792313l157229l638795k912557m97180J367321O60901o96655
$$ -3187333 -5592172 -8384485 -11541714 -15180509 -18093066 -18590246 -17222925 -16562024 -17258679
3167a7258679P33243M099201M579834M28640l851419l504152J03068K014108P69217
$$ -17258679 -16525436 -12426235 -7846401 -7417761 -11269180 -14773332 -14670264 -12656156 -11886939
3158a1886939m62004P14510K691881K788927J015828m12152q3483J184817J476028
$$ -11886939 -12348943 -11634433 -8942552 -6153625 -5137797 -5549949 -5633432 -4448615 -2972587
3149b972587o6030j933912j503397J675595M589719M214430J582236K64746J071586
$$ -2972587 -3038617 -4972529 -6475926 -4800331 -210612 4003818 5586054 5850800 6922386
3140F922386J087276j355947l790630l498963j717158j350670k278247j958982
$$ 6922386 8009662 6653715 2863085 -635878 -2353036 -3703706 -5981953 -7940935
3132g940935J79837J960852J874546O46717o72734j710967j640023M02960L092658
$$ -7940935 -7761098 -5800246 -3925700 -3278983 -3951717 -5662684 -7302707 -6899747 -3807089
3123c807089L473390P77156k262635k913217j418341M87667K000692K821302K241195
$$ -3807089 -333699 443457 -1819178 -4732395 -6150736 -5663069 -3662377 -841075 1400120
3114A400120M23191r23310q96761r67034k287461l038287j058629J981042K217785
$$ 1400120 1823311 900001 3240 -963794 -3251255 -6289542 -7348171 -5367129 -3149344
3105c149344p41980k985161j839872O67767J411030O96448Q18476J723241J146635
$$ -3149344 -3891324 -6876485 -8716357 -8048590 -6637560 -5941112 -5122636 -3399395 -2252760
3096b252760j176318k394672p01468J629816J326711j055491j879565K02116K302212
$$ -2252760 -3429078 -5823750 -6525218 -4895402 -3568691 -4624182 -6503747 -6301631 -3999419
3087c999419J731671k1796J06216J800436J982894l7528j223249N40516L164634
$$ -3999419 -2267748 -2289544 -2183328 -382892 1600002 1562474 339225 879741 4044375
3078D044375L389766J128108j212518k344024k779840k607637r60638J957912
$$ 4044375 7434141 8562249 7349731 5005707 2225867 -381770 -1342408 615504
3070F15504M024508L224572r6926l429645m304223k352165N43736K209019K267072
$$ 615504 4640012 7864584 7767658 4338013 33790 -2318375 -1774639 434380 2701452
3061B701452J906754J829222J468330L99690p00839j047181p11794k17827j91640
$$ 2701452 4608206 6437428 7905758 8305448 7604609 6557428 5845634 5627807 5436167
3052E436167j469015l921115n069018k300152K720807M660477J227279l448669
$$ 5436167 3967152 46037 -5022981 -7323133 -4602326 58151 1285430 -2163239
3044b163239m473506k521483j334326j336869k4979K631362L851658K935710K134716
$$ -2163239 -6636745 -9158228 -10492554 -11829423 -11854402 -9223040 -5371382 -2435672 -300956
3035c00956K226763J393075o01015j199209M37600J454086j51329k266693k232727
$$ -300956 1925807 3318882 2717867 1518658 1956258 3410344 3259015 992322 -1240405
3026a240405q05837q5392L4397O94628J371423R79329R1810l12059q16617k018070
$$ -1240405 -2046242 -2131634 -2097237 -1402609 -31186 948143 1039953 727894 -88723 -2106793
3016b106793k561759j171587P42117J028789J68456J71595J173378J704590J446319
$$ -2106793 -4668552 -5840139 -5098022 -4069233 -3900777 -3729182 -2555804 -851214 595105
3007E95105J129616N55454o07012r38723P77143K406749P60983l043782m219241
$$ 595105 1724721 2280175 1673163 734440 1511583 3918332 4679315 1635533 -2583708
2998b583708j021629K670991K920712P84600k18846O93902J309144l3867k719802
$$ -2583708 -3605337 -934346 1986366 2770966 2552120 3246022 4555166 4521299 1801497
2989A801497m954253n135068k818284N51535K554786K286235J139134N45922K45025
$$ 1801497 -3152756 -8287824 -11106108 -10554573 -7999787 -5713552 -4574418 -4028496 -3783471
2980c783471l26249m60854M89187J398398P87702p11131j077214K08033J615358
$$ -3783471 -4109720 -4570574 -4081387 -2682989 -1895287 -2606418 -3683632 -3475599 -1860241
2971a860241J870814J302416O72376J7543p97110j330098j054356j39442P12276
$$ -1860241 10573 1312989 1985365 2002908 1205798 -124300 -1178656 -1318098 -605822
2962f05822R76439O56153J65545j319L13681P38813P04376N4014o22662k76550
$$ -605822 370617 1026770 1192315 1190996 1504677 2243490 2947866 3001880 2379218 2102668
2952B102668J640202M121322M921149K815045n53898k243275j641138j130108
$$ 2102668 3742870 7864192 12785341 15600386 15046488 12803213 11162075 10031967
2944A0031967k448876l967266l078525j49967J926169J662640L98333k43680k91851
$$ 10031967 7583091 3615825 537300 387333 2313502 3976142 4374475 4130795 3838944
2935C838944l09163j85782O1057j96141q82108q17347K57589O84836n93747j812140
$$ 3838944 3529781 3343999 3405056 3208915 2326807 1509460 1767049 2451885 1858138 45998
2925D5998o63727J975357K855726P74018j914459k530883j005761R17413J730850
$$ 45998 -617729 1357628 4213354 4987372 3072913 542030 -463731 453682 2184532
2916B184532P82300j510941l207062k152696J130993L228687J762287j630113
$$ 2184532 2966832 1455891 -1751171 -3903867 -2772874 455813 2218100 587987
2908E87987l570289l045560j672146q74481p24875j044548j677143j713409j46131
$$ 587987 -2982302 -6027862 -7700008 -8574489 -9299364 -10343912 -12021055 -13734464 -13880595
2899a3880595K499352M435750M506647K780812j98894l258394m290332k206186
$$ -13880595 -11381243 -6945493 -2438846 341966 143072 -3115322 -7405654 -9611840
2891i611840R03978J700779j21539j583572p34125J090720J936501J799868J522525
$$ -9611840 -8707862 -7007083 -7128622 -8712194 -9446319 -8355599 -6419098 -4619230 -3096705
2882c096705J273588J267465J962925K486174J108145j521305k237102r5707J603382
$$ -3096705 -1823117 -555652 1407273 3893447 5001592 3480287 1243185 1147478 2750860
2873B750860L14764j657224j166698L83303k95250k345924k156690J95625Q39380
$$ 2750860 3065624 1408400 241702 625005 329755 -2016169 -4172859 -3977234 -3137854
2864c137854j500655l683578l391574j791155Q534K656419N161792M352018J88066
$$ -3137854 -4638509 -8322087 -11713661 -13504816 -13496282 -10839863 -5678071 -1326053 -1137987
2855a137987k496258o42725K290931J784943q41477j260316O69223J400053J9986
$$ -1137987 -3634245 -4276970 -1986039 -201096 -1042573 -2302889 -1633666 -233613 -213627
2846b13627q12642L5027O10578j57877q79447q97996j497734k754071k453692
$$ -213627 -1026269 -991242 -380664 -538541 -1417988 -2315984 -3813718 -6567789 -9021481
2837i021481K32246K761733K791798J535013J549823K809046K978453O97815k931661
$$ -9021481 -8789235 -6027502 -3235704 -1700691 -150868 2658178 5636631 6334446 3402785
2828C402785n502572n035776j503032K499783L639549J404529j078395o32706
$$ 3402785 -2099787 -7135563 -8638595 -6138812 -2499263 -1094734 -2173129 -2805835
2820b805835K401182M909922M418884J108699k610143l948848k215775J09614
$$ -2805835 -404653 4505269 8924153 10032852 7422709 3473861 1258086 1367700
2812A367700Q3053j625034j374111J937559M604382L260604q4327j054938O96370
$$ 1367700 1450753 -174281 -1548392 389167 4993549 8254153 8169826 7114888 7811258
2803G811258J640714K74113r21577l631J326714P15118j202197k064890j178112
$$ 7811258 9451972 9726085 8804508 8800877 10127591 10842709 9640512 7575622 6397510
2794F397510Q7142L26092q05707k714877l959233l036641k06413K232735K572884
$$ 6397510 6484652 6810744 6005037 3290160 -669073 -3705714 -3912127 -1679392 893492
2785H93492J763449J555377J506858j48608k887328l566002p12914K743129K923095
$$ 893492 2656941 4212318 5719176 5570568 2683240 -882762 -1595676 1147453 4070548
2776D070548K03826j380183p691J269736p40892m107030m151763l57496K600690
$$ 4070548 4274374 2894191 2886500 4156236 3415344 -691686 -4843449 -5200945 -2600255
2767b600255J521852r62580q20351J358852K012975N39186l19794M82818Q61681
$$ -2600255 -1078403 -2040983 -2861334 -1502482 510493 1049679 729885 1212703 2074384
2758B074384j77144n85756R04168K130072Q40717j663943k617136j817243j205121
$$ 2074384 1897240 1311484 2215652 4345724 5186441 3522498 905362 -911881 -2117002
2749b117002j547790j747348q39472R94484K851351L390236J688636j078785k196245
$$ -2117002 -3664792 -5412140 -6251612 -5257128 -2405777 984459 2673095 1594310 -601935
2740f01935r18261K79261m52747j295874J46812K732909L703213L018807K324394
$$ -601935 -1520196 -1240935 -1693682 -2989556 -2842744 -109835 3593378 6612185 8936579
2731H936579J019736k413562n833185m954660k4831L537005K582832J94194J89172
$$ 8936579 9956315 7542753 1709568 -3245092 -3269923 267082 2849914 3044108 3233280
2722C233280J523341J045972j176794k623669k435588j625951m69827J434462
$$ 3233280 4756621 5802593 4625799 2002130 -433458 -2059409 -2529236 -1094774
2714a094774L250460L523081K314370Q56277l62623j495146k060973j556635p81796
$$ -1094774 2155686 5678767 7993137 8849414 8486791 6991645 4930672 3374037 2592241
2705B592241q84174j502365j325787r7976J209838J745734J200842m25526k351197
$$ 2592241 1708067 205702 -1120085 -1218061 -8223 1737511 2938353 2512827 161630
2696A61630l052169j909741o8241J258585K193456K875589K306582J67258j616934
$$ 161630 -2890539 -4800280 -4868521 -3609936 -1416480 1459109 3765691 3932949 2316015
2687B316015j170606M78035R11345q1477n22502N99397K122151K468630J149139
$$ 2316015 1145409 1623444 2534789 2453312 1930810 2530207 4652358 7120988 8270127
2678H270127j158178k929867k912874j789989j416284j560421K53610M011633
$$ 8270127 7111949 4182082 1269208 -520781 -1937065 -3497486 -3243876 767757
2670G67757N321664J366714l857906m394266n91889K120133J544260N47416P83359
$$ 767757 6089421 7456135 3598229 -796037 -1387926 732207 2276467 2823883 3607242
2661C607242J77108k111717l275993j588929N19255M72109p13610r36130k91196
$$ 3607242 3784350 1672633 -1603360 -3192289 -2673034 -2200925 -2914535 -3850665 -4141861
2652d141861K82687R82045J845918J969347J542938J991285K801191J459846j979252
$$ -4141861 -3859174 -2877129 -1031211 938136 2481074 4472359 7273550 8733396 6754144
2643F754144m015852l260736k659917l643007k802194J713341N066386K356255
$$ 6754144 2738292 -522444 -3182361 -6825368 -9627562 -7914221 -2847835 -491580
2635d91580l109579m316021j013986Q79513p30760j568778J062418M079691M161761
$$ -491580 -3601159 -7917180 -8931166 -8051653 -8782413 -10351191 -9288773 -5209082 -1047321
2626a047321K322136P14461p72264k244600j882491Q64956L016261J820543j250745
$$ -1047321 1274815 1989276 1217012 -1027588 -2910079 -2045123 971138 2791681 1540936
2617A540936k735426j798863m23936k14426r53472j575871j176988L44290J892109
$$ 1540936 -1194490 -2993353 -3417289 -3631715 -4585187 -6161058 -7338046 -6993756 -5101647
2608e101647K241913J770092J783424K021343Q56342j515690k498602q87026J018753
$$ -5101647 -2859734 -1089642 693782 2715125 3571467 2055777 -442825 -1329851 -311098
2599c11098O98321j148271k283557k302823k154289j656553K1627K027417K320526
$$ -311098 387223 -761048 -3044605 -5347428 -7501717 -9158270 -9136643 -7109226 -4788700
2590d788700N68182j246094j418893m14246K70933K25916N12050K092934M191532
$$ -4788700 -4220518 -5466612 -6885505 -7299751 -7028818 -6802902 -6290852 -4197918 -6386
2581f386M711012K748930R5126q94801m64705q05764k386418l197367k212638
$$ -6386 4704626 7453556 7548682 6653881 6189176 5383412 2996994 -200373 -2413011
2572b413011j149580j444668j724845k58676J833110K109683L90156j387416k010478
$$ -2413011 -3562591 -5007259 -6732104 -6990780 -5157670 -3047987 -2657831 -4045247 -6055725
2563f055725j647216n12426R90859J567479O95841K39207J909997L851721K794181
$$ -6055725 -7702941 -8215367 -7224508 -5657029 -4961188 -4721981 -2811984 1039737 3833918
2554C833918o70604k504345j377596n62540k145204l156784l90652L863891M760988
$$ 3833918 3163314 658969 -718627 -1281167 -3426371 -6583155 -6973807 -3109916 1651072
2545A651072J950742l84159n0224O61089m04863j945406k161877j895322k403137
$$ 1651072 3601814 3217655 3167431 3828520 3423657 1478251 -683626 -2578948 -4982085
2536d982085k428743m68077J665789R95453j526202j707650J632872M593874L855341
$$ -4982085 -7410828 -7878905 -6213116 -5217663 -6743865 -8451515 -6818643 -2224769 1630572
2527A630572J361011R02941K337666K417096K38257j551388j043777M09645P71263
$$ 1630572 2991583 3894524 6232190 8649286 8887543 7336155 6292378 6702023 7473286
2518G473286Q6987m32029l84084j47905j33388p77930k023424k404300m11281
$$ 7473286 7560273 7128244 6744160 6596255 6462867 5684937 3661513 1257213 845932
2509H45932K674329L536449J511760R827J345116K680319J56420m743552o757438
$$ 845932 3520261 7056710 8568470 8578297 9923413 12603732 12760152 8016600 1259162
2500A259162m107850l69254J085546P18216K3788j131176k519248k206571K10302
$$ 1259162 -2848688 -3217942 -2132396 -1414180 -1390392 -2521568 -5040816 -7247387 -7037085
2491g037085J651114j66340k591290j641259J729037K900052O24094j333050k17055
$$ -7037085 -5385971 -5552311 -8143601 -9784860 -8055823 -5155771 -4531677 -5864727 -6081782
2482f081782J879791J852134J51081p08592J637J126980J750065J349907o29638
$$ -6081782 -4201991 -2349857 -2198776 -2907368 -2905731 -1778751 -28686 1321221 691583
2473F91583l229008l495396q3101L876438M340881J919674O80661J842910K386456
$$ 691583 -2537425 -6032821 -6115922 -2239484 2101397 4021071 4701732 6544642 8931098
2464H931098M90030j464382j035010L54516J28984j148809j037319O61907J755052
$$ 8931098 9421128 7956746 6921736 7276252 7405236 6256427 5219108 5881015 7636067
2455G636067R14875j134031l124943l987443k693864N82295L518034L768235J827207
$$ 7636067 8550942 7416911 4291968 304525 -2389339 -1807044 1710990 5479225 7306432
2446G306432J19981k90969k56514l43756l21471o42506k081659l720145l588201
$$ 7306432 7426413 7135444 6878930 6535174 6213703 5571197 3489538 -230607 -3818808
2437c818808j731631l82962m59321k15025J559168L175060K482365J06275j453143
$$ -3818808 -5550439 -5933401 -6392722 -6607747 -5048579 -1873519 608846 715121 -738022
2428g38022j065501P2197K41776q98537j875817o96016K639196N124621L815362
$$ -738022 -1803523 -1731326 -1489550 -2388087 -4263904 -4959920 -2320724 2803897 6619259
2419F619259q1320k258073r46431Q85734J23640k126458k702894j026449P94573
$$ 6619259 6537939 4279866 3333435 4219169 4342809 2216351 -486543 -1512992 -718419
2410g18419J333131J013261N04842q9919o97184j285491j990120k283300j062531
$$ -718419 614712 1627973 2132815 2042896 1345712 60221 -1929899 -4213199 -5275730
2401e275730J305945K504910J443856L12509J277593K680050J440963j768009
$$ -5275730 -3969785 -1464875 -21019 291490 1569083 4249133 5690096 3922087
2393C922087l182896j586015J88286j6916p11999J36519J749300K117265J049799
$$ 3922087 739191 -846824 -658538 -675454 -1387453 -1250934 498366 2615631 3665430
2384C665430j33057o32000m17112M36626J363427J244179j18386j389109j560902
$$ 3665430 3532373 2900373 2483261 2919887 4283314 5527493 5409107 4019998 2459096
2375B459096j354322j646552j653604j87505K043832L008286J940889M0078j281560
$$ 2459096 1104774 -541778 -2195382 -2382887 -339055 2669231 4610120 4650198 3368638
2366C368638j689881j547505j331079j544196k321625k911556k208884J724K752580
$$ 3368638 1678757 131252 -1199827 -2744023 -5065648 -7977204 -10186088 -10184364 -7431784
2357g431784M785318N229473L590192J7255m019455o067475m589401n70713L251686
$$ -7431784 -2646466 2583007 6173199 6190454 2170999 -3896476 -8485877 -9056590 -5804904
2348e804904M892312M475145L028012P63807k467268n386754n591701k484594
$$ -5804904 -912592 3562553 6590565 7354372 4887104 -499650 -6091351 -8575945
2340h575945J261969K544744J541511J040794K269571L237143J851030r04684
$$ -8575945 -7313976 -4769232 -3227721 -2186927 82644 3319787 5170817 4266133
2332D266133k211601j045860P68431R83422o02441k263564k312329o91681J136515
$$ 4266133 2054532 1008672 1777103 2760525 2158084 -105480 -2417809 -3109490 -1972975
2323a972975J744807J147040M69957K84779j10920j337191k482613j993300M2426
$$ -1972975 -228168 918872 1388829 1673608 1562688 225497 -2257116 -4250416 -4207990
2314d207990J580119J143527j74915k40969J057213J671818M79907j043546j125471
$$ -4207990 -2627871 -1484344 -1659259 -1900228 -843015 828803 1308710 265164 -860307
2305h60307k99878k15556q63046r86185o68613j054603j498590J32517L410093
$$ -860307 -1160185 -1375741 -2238787 -3224972 -3893585 -4948188 -6446778 -6314261 -2904168
2296b904168M514842J385496k677442l055498L14105L789075N161701M730772
$$ -2904168 1610674 2996170 318728 -2736770 -2422665 1366410 6528111 11258883
2288A1258883K453442j874643n557398m392526J322543N588187L782932j507710
$$ 11258883 13712325 11837682 6280284 1887758 3210301 8798488 12581420 11073710
2280A1073710m200053k407860L50935O93719p50482j323897j60135J018543K12690
$$ 11073710 6873657 4465797 4816732 5510451 4759969 3436072 3275937 4294480 4507170
2271D507170k453161m729792m644658k658915r23181n91661p96503l18278Q78537
$$ 4507170 2054009 -2675783 -7320441 -9979356 -10902537 -11494198 -12290701 -12608979 -11730442
2262a1730442K139592L033618L222763K449846J305355J034792J807187K054919
$$ -11730442 -9590850 -6557232 -3334469 -884623 420732 1455524 3262711 5317630
2254E317630M80892j906005k784718j350625O56735R37498o61932j770139k12398
$$ 5317630 5798522 3892517 1107799 -242826 413909 1351407 689475 -1080664 -1293062
2245a293062L012366M535472K864452L43209l71008p3796r46239k176845j107258
$$ -1293062 1719304 6254776 9119228 9462437 9091429 9017633 8071394 5894549 4787291
2236D787291J696518K520959L83066j144163K90248J922997M56384k511800l047377
$$ 4787291 6483809 9004768 9387834 8243671 8533919 10456916 10913300 8401500 5354123
$$ [...]
##END NTUPLES=NMR SPECTRUM
##END=
