##TITLE=31Pdec_DE-102_ch_6_TFA
CDCl3, 64 sc
 28.8.2025
##JCAMPDX= 6.0         $$ Bruker NMR JCAMP-DX V2.0
##DATA TYPE= NMR SPECTRUM
##DATA CLASS= NTUPLES
##ORIGIN= UXNMR, Bruker Analytische Messtechnik GmbH
##OWNER= root
$$ XWIN-NMR		Version 3.5
$$ Thu Aug 28 14:40:27 2025 Russian Standard Time (UT+4h)  she@DPX200
##.OBSERVE FREQUENCY= 81.013821
##.OBSERVE NUCLEUS= ^31P
##.ACQUISITION MODE= SIMULTANEOUS
##.ACQUISITION SCHEME= undefined
##.AVERAGES= 64
##.DIGITISER RES= 17
##SPECTROMETER/DATA SYSTEM= spect
##.PULSE SEQUENCE= zgpg30
##.SOLVENT NAME= CDCl3
##.SHIFT REFERENCE= (INTERNAL, CDCl3, 0, 198.062)
##AUDIT TRAIL= $$ (NUMBER, WHEN, WHO, WHERE, WHAT)
$$ ##TITLE= Audit trail, XWIN-NMR		Version 3.5
$$ ##JCAMPDX= 5.01
$$ ##ORIGIN= Bruker BioSpin GmbH
$$ ##OWNER= she
$$ F:/spectra/data/she/nmr/P31/2/pdata/1/auditp.txt
$$ ##AUDIT TRAIL=  $$ (NUMBER, WHEN, WHO, WHERE, WHAT)
(   1,<2025-08-28 14:38:27.85 +0400>,<she>,<DPX200>,
      <created by zg, POWCHK disabled, PULCHK disabled
       configuration hash MD5:
       00 E9 B6 7A A2 85 ED C7 34 08 36 98 17 FE 4E 26
       data hash MD5: 32K
       05 E4 9F 80 42 00 5F CD A6 6B C8 27 4E 85 29 AA>)
(   2,<2025-08-28 14:39:07.59 +0400>,<she>,<DPX200>,
      <Start of raw data processing
       efp BC_mod = 2 LB = 1.5 FT_mod = 6 PKNL = 1 PHC0 = 1309.529 PHC1 = 309.5 SI = 64K 
       data hash MD5: 64K
       07 08 70 FC F8 3C 61 9E AE A1 CE EC 10 A3 FB E4>)
(   3,<2025-08-28 14:39:16.89 +0400>,<she>,<DPX200>,
      <abs ABSG = 5 
       data hash MD5: 64K
       D8 52 80 38 5C 48 49 C4 0A 97 B8 E5 6F 6F 16 FF>)
$$ ##END=
$$ 
$$ hash MD5
$$ 8E 41 7E 32 D0 A8 5B F6 85 F3 1E FE A8 83 61 67
##$RELAX= 
##$RELAX= 
##$RELAX= 
##$RELAX= 
##$RELAX= 
##$RELAX= 
##$RELAX= 
##$RELAX= 
$$ Bruker specific parameters
$$ --------------------------
##$DU= <F:/spectra>
##$EXPNO= 2
##$NAME= <P31>
##$PROCNO= 1
##$TYPE= <nmr>
##$USER= <she>
##$AMP= (0..31)
100 100 100 100 100 100 100 100 100 100 100 100 100 100 100 100 100 100 
100 100 100 100 100 100 100 100 100 100 100 100 100 100 
##$AQSEQ= 0
##$AQ_mod= 1
##$AUNM= <au_zg>
##$AUTOPOS= <>
##$BF1= 81.014009
##$BF2= 200.13
##$BF3= 200.13
##$BF4= 200.13
##$BF5= 200.13
##$BF6= 200.13
##$BF7= 200.13
##$BF8= 200.13
##$BYTORDA= 1
##$CFDGTYP= 0
##$CFRGTYP= 5
##$CHEMSTR= <none>
##$CNST= (0..31)
1 1 145 1 1 1 1 1 1 1 1 1 1 1 1 1 1 1 1 1 1 1 1 1 1 1 1 1 1 1 1 1 
##$CPDPRG= <waltz16>
##$CPDPRG1= <>
##$CPDPRG2= <waltz16>
##$CPDPRG3= <>
##$CPDPRG4= <mlev>
##$CPDPRG5= <mlev>
##$CPDPRG6= <mlev>
##$CPDPRG7= <mlev>
##$CPDPRG8= <mlev>
##$CPDPRGB= <>
##$CPDPRGT= <>
##$D= (0..31)
0 1 0 0 0 0 0 0 0 0.06 0 0.03 2e-05 3e-06 0 0 0.0002 0 0 0 0 0 0 0 0 0 
0 0 0 0 0 0 
##$DATE= 1756377507
##$DBL= (0..7)
120 120 120 11 120 120 24 19 
##$DBP= (0..7)
150 150 150 150 150 150 150 150 
##$DBP07= 0
##$DBPNAM0= <>
##$DBPNAM1= <>
##$DBPNAM2= <>
##$DBPNAM3= <>
##$DBPNAM4= <>
##$DBPNAM5= <>
##$DBPNAM6= <>
##$DBPNAM7= <>
##$DBPOAL= (0..7)
0.5 0.5 0.5 0.5 0.5 0.5 0.5 0.5 
##$DBPOFFS= (0..7)
0 0 0 0 0 0 0 0 
$$ [...]
##$SUBNAM3= <"">
##$SUBNAM4= <"">
##$SUBNAM5= <"">
##$SUBNAM6= <"">
##$SUBNAM7= <"">
##$SUBNAM8= <"">
##$SUBNAM9= <"">
##$SW= 400.765351723535
##$SWIBOX= (0..15)
0 1 3 0 0 0 0 0 0 0 0 0 0 0 0 0 
##$SW_h= 32467.5324675325
##$TD= 32768
##$TD0= 1
##$TE= 0
##$TE2= 300
##$TE3= 300
##$TEG= 300
##$TL= (0..7)
0 120 53 12 22 120 120 120 
##$TP= (0..7)
150 150 150 150 150 150 150 150 
##$TP07= 0
##$TPNAME0= <>
##$TPNAME1= <>
##$TPNAME2= <>
##$TPNAME3= <>
##$TPNAME4= <>
##$TPNAME5= <>
##$TPNAME6= <>
##$TPNAME7= <>
##$TPOAL= (0..7)
0.5 0.5 0.5 0.5 0.5 0.5 0.5 0.5 
##$TPOFFS= (0..7)
0 0 0 0 0 0 0 0 
##$TUNHIN= 0
##$TUNHOUT= 0
##$TUNXOUT= 0
##$USERA1= <user>
##$USERA2= <user>
##$USERA3= <user>
##$USERA4= <user>
##$USERA5= <user>
##$V9= 5
##$VALIST= <valist>
##$VCLIST= <CCCCCCCCCCCCCCC>
##$VD= 0
##$VDLIST= <DDDDDDDDDDDDDDD>
##$VPLIST= <PPPPPPPPPPPPPPP>
##$VTLIST= <TTTTTTTTTTTTTTT>
##$WBST= 1024
##$WBSW= 4
##$XGAIN= (0..3)
0 0 0 0 
##$XL= 0
##$YL= 0
##$YMAX_a= 15058
##$YMIN_a= -17104
##$ZGOPTNS= <>
##$ZL1= 120
##$ZL2= 120
##$ZL3= 120
##$ZL4= 120
##$ABSF1= 198.0616
##$ABSF2= -202.7028
##$ABSG= 5
##$ABSL= 3
##$ALPHA= 0
##$AQORDER= 0
##$ASSFAC= 0
##$ASSFACI= 0
##$ASSFACX= 0
##$ASSWID= 0
##$AUNMP= <proc_1d>
##$AZFE= 0.1
##$AZFW= 0.5
##$BCFW= 0
##$BC_mod= 2
##$BYTORDP= 0
##$COROFFS= 0
##$CY= -3
##$DATMOD= 1
##$DC= 0
##$DFILT= <>
##$DTYPP= 0
##$F1P= 0
##$F2P= 0
##$FCOR= 1
##$FTSIZE= 65536
##$FT_mod= 6
##$GAMMA= 0
##$GB= 0
##$INTBC= 1
##$INTSCL= 9.790993e-09
##$ISEN= 30
##$LB= 1.5
##$LEV0= 0
##$LPBIN= 0
##$MAXI= 10000
##$MC2= 0
##$MEAN= 0
##$ME_mod= 0
##$MI= 50
##$NCOEF= 0
##$NC_proc= -8
##$NLEV= 6
##$NOISF1= 182.463
##$NOISF2= 159.3651
##$NSP= 0
##$NTH_PI= 0
##$NZP= 0
##$OFFSET= 198.0616
##$PC= 4
##$PHC0= 1309.529
##$PHC1= 309.5
##$PH_mod= 1
##$PKNL= yes
##$PPARMOD= 0
##$PSCAL= 0
##$PSIGN= 0
##$REVERSE= no
##$SF= 81.0140089999434
##$SI= 65536
##$SIGF1= 159.3651
##$SIGF2= -187.1042
##$SINO= 113.3802
##$SIOLD= 16384
##$SREGLST= <1H.CDCl3>
##$SSB= 0
##$STSI= 65536
##$STSR= 0
##$SW_p= 32467.5324675325
##$SYMM= 0
##$S_DEV= 0
##$TDeff= 32768
##$TDoff= 0
##$TI= <>
##$TILT= no
##$TM1= 0
##$TM2= 0
##$TOPLEV= 0
##$USERP1= <user>
##$USERP2= <user>
##$USERP3= <user>
##$USERP4= <user>
##$USERP5= <user>
##$WDW= 1
##$XDIM= 65536
##$YMAX_p= 229511056
##$YMIN_p= -89488943
$$ End of Bruker specific parameters
$$ ---------------------------------
##NTUPLES= NMR SPECTRUM
##VAR_NAME=  FREQUENCY,     SPECTRUM/REAL,   SPECTRUM/IMAG
##SYMBOL=    X,             R,               I
##VAR_TYPE=  INDEPENDENT,   DEPENDENT,       DEPENDENT
##VAR_FORM=  AFFN,          ASDF,            ASDF
##VAR_DIM=   65536,         65536,           65536
##UNITS=     HZ,            ARBITRARY UNITS, ARBITRARY UNITS
##FACTOR=    0.49542278885378, 1,            1
##FIRST=     16045.7642231865, 0,            0
##LAST=      -16421.768244346, 0,            0
##MIN=       -16421.768244346, -89488943,    0
##MAX=       16045.7642231865, 229511056,    0
$$ Real data points
##PAGE= N=1
##DATA TABLE= (X++(R..R)), XYDATA
$$ [...]
7412d43220k60321j299473J223586L265883O39014m036820n496998l203217j63106
$$ -443220 -703541 -2003014 -779428 2486455 3125469 -911351 -6408349 -9611566 -9774672
7403i774672K101549L123599J490345k209802l566451n1333M263823M126329L85291
$$ -9774672 -7673123 -4549524 -3059179 -5268981 -8835432 -8886765 -4622942 -496613 -111322
7394a11322k648135l985324m933134m269080m70421L380817L178461P76085J052944
$$ -111322 -2759457 -6744781 -11677915 -15946995 -16417416 -13036599 -9858138 -9082053 -8029109
7385h029109L163449J673755l656924o374414k979751K203809L894617K279725
$$ -8029109 -4865660 -3191905 -6848829 -13223243 -16202994 -13999185 -10104568 -7824843
7377g824843M20402j19958R81630L252509L996735O74180l994107m142537M48534
$$ -7824843 -7404441 -7524399 -6542769 -3290260 706475 1380655 -2613452 -6755989 -6307455
7368f307455L120134K22336l571587l293030j204544j380428j912289J050564
$$ -6307455 -3187321 -2964985 -6536572 -9829602 -11034146 -12414574 -14326863 -13276299
7360a3276299N020741M134495j093577l864872j083055K841784L413682J962168
$$ -13276299 -8255558 -4121063 -5214640 -9079512 -10162567 -7320783 -3907101 -1944933
7352a944933J766623K379449J103197k082660m225413l489453j337018k56640
$$ -1944933 -178310 2201139 3304336 1221676 -3003737 -6493190 -7830208 -8086848
7344h086848n74590n11607P88765J644245M10030j342847n75340K334449L344807
$$ -8086848 -8661438 -9173045 -8384280 -6740035 -6330005 -7672852 -8248192 -5913743 -2568936
7335b568936M53397l136580l373389m11163K908531N231274O462339N388019J168015
$$ -2568936 -2115539 -5252119 -8625508 -9036671 -6128140 -896866 5565473 10953492 12121507
7326A2121507l678615n208781k865185L07458J900208J914222P10398j681282
$$ 12121507 8442892 3234111 368926 676384 2576592 4490814 5201212 3519930
7318C519930l855483l486225m53613K479922K907591J178206q32789j860962j821262
$$ 3519930 -335553 -3821778 -4275391 -1795469 1112122 2290328 1457539 -403423 -2224685
7309b224685j524619k069731l608069m910378m870613l581683j129038K919976
$$ -2224685 -3749304 -5819035 -9427104 -14337482 -19208095 -22789778 -23918816 -20998840
7301b0998840P243631Q229908M492973N3110m71103J653119J701614p08539j322875
$$ -20998840 -13755209 -5525301 -1032328 -979218 -1450321 202798 1904412 1195873 -127002
7292a27002J129868K422463l51478m072390m320866j305370J592204K414310J327366
$$ -127002 1002866 3425329 3073851 -998539 -5319405 -6624775 -5032571 -2618261 -1290895
7283a290895q17367k288179j054293K213861L778997J552643j883377l010010
$$ -1290895 -2108262 -4396441 -5450734 -3236873 542124 2094767 211390 -2798620
7275b798620j904652p25510J09274J367238K322876J710481M14455M64909J865234
$$ -2798620 -4703272 -5428782 -5319508 -3952270 -1629394 81087 495542 960451 2825685
7266B825685K704068K025420O32819o20827j661284k530271l104555l207591k424201
$$ 2825685 5529753 7555173 8187992 7567165 5905881 3375610 271055 -2936536 -5360737
7257e360737o06052J133138J328234L68015o1886O6423o93308j782692q31898
$$ -5360737 -5966789 -4833651 -3505417 -3137402 -3199288 -3132865 -3826173 -5608865 -6440763
7248f440763J660899J961297p36509k336903q27270j77327k978247m332746N53160
$$ -6440763 -4779864 -2818567 -3555076 -5891979 -6719249 -6896576 -9874823 -14207569 -13654409
7239a3654409O752158N675059j292370m060215R84826N752829K950620l706832
$$ -13654409 -6902251 -1227192 -2519562 -6579777 -5594951 157878 3108498 -598334
7231e98334o031864k530536J798835L118697J580384j287130m023923m964878
$$ -598334 -6630198 -9160734 -7361899 -4243202 -2662818 -3949948 -7973871 -12938749
7223a2938749l160411O90911M943840P486202N944060L09923m658160l622514
$$ -12938749 -16099160 -15408249 -10464409 -2978207 2965853 3275776 -1382384 -5004898
7215e004898J911914M662706J437249k892480l496292k260918k535793k378667
$$ -5004898 -3092984 1569722 3006971 114491 -3381801 -5642719 -8178512 -10557179
7207a0557179J258624N299262M229042o82343k460689J375174N652915N537702
$$ -10557179 -9298555 -3999293 229749 -452594 -2913283 -1538109 4114806 9652508
7199I652508K411845r4176j509256l227483m847494m722402k673578j25021J542288
$$ 9652508 12064353 11970177 10460921 7233438 2385944 -2336458 -5010036 -5135057 -3592769
7190c592769J647542M16797n47532N40107K826997K717505j599737o482720o089591
$$ -3592769 -1945227 -1528430 -2075962 -1535855 1291142 4008647 2408910 -4073810 -10163401
7181a0163401L48269O615852O443502J135144k132855L55623M156492L049649
$$ -10163401 -9815132 -3199280 3244222 4379366 2246511 2602134 6758626 9808275
7173I808275k368648n770544l647019R79770L434541K350715r10927m225028m922223
$$ 9808275 7439627 1669083 -1977936 -998166 2436375 4787090 3876163 -348865 -5271088
7164e271088j580326K888395L520744L80632p92522K513290M798753R06472n075528
$$ -5271088 -6851414 -3963019 -442275 -61643 -854165 1659125 6457878 7364350 2288822
7155B288822n186257O43853M634014K217565k903412n174272l428641L28539L819852
$$ 2288822 -2897435 -2253582 2380432 4597997 1694585 -3479687 -6908328 -6579789 -2759937
7146b759937M656915J364694l984639o852553n208630j345717J621185K702619
$$ -2759937 1896978 3261672 -722967 -7575520 -12784150 -14129867 -12508682 -9806063
7138i806063K434698J935995K585399M193307M009922L28889l875988m317513
$$ -9806063 -7371365 -5435370 -2849971 1343336 5353258 5682147 1806159 -2511354
7130b511354j311450J619420L630447N914040O373353J599270n560706p533900
$$ -2511354 -3822804 -2203384 1427063 7341103 13714456 15313726 9753020 2219120
7122B219120k818725J579525Q73365j326350q23991L49304l67755k78565K697111
$$ 2219120 -599605 979920 1853285 526935 -297056 52248 -315507 -594072 2103039
7113B103039M163695R6127n183035n112121j109258P92734J53768Q24998K031194
$$ 2103039 6266734 6362861 1179826 -3932295 -5041553 -4248819 -4095051 -3270053 -1238859
7104a238859k38210m020210k848979L015923N759089K232040j459493n61285J147991
$$ -1238859 -1477069 -5497279 -8346258 -5330335 428754 2660794 1201301 640016 1788007
7095A788007q53595l899801l621621j876494k892438n228835l954964J143897
$$ 1788007 934412 -2965389 -6587010 -8463504 -11355942 -16584777 -20539741 -19395844
7087a9395844N206798N284702K994288O17972j302010k428132k236097j565858
$$ -19395844 -14189046 -8904344 -5910056 -5292084 -6594094 -9022226 -11258323 -12824181
7079a2824181j761580k011363k13653L068040M179050J104437l259553m129877
$$ -12824181 -14585761 -16597124 -16810777 -13742737 -9563687 -8459250 -11718803 -15848680
7071a5848680k98475M694747O602643M625294J211465j318830k557897k486198
$$ -15848680 -16147155 -11452408 -4849765 -224471 986994 -331836 -2889733 -5375931
7063e375931l35585L395709N451479L114119j572805l863583k656168j527584
$$ -5375931 -5711516 -2315807 3135672 6249791 4676986 813403 -1842765 -3370349
7055c370349k666197l334322m47278M206099O142502L845618k67762l159167l107268
$$ -3370349 -6036546 -9370868 -9818146 -5612047 530455 4376073 4108311 949144 -2158124
7046b158124K73379N251349Q054363O345151K199600o30961j737399l591245o418011
$$ -2158124 -1884745 3366604 11420967 17766118 19965718 19334757 17597358 14006113 7588102
7037G588102o970277l560316M87943O39301k973145n706181m194095p4365K752310
$$ 7588102 617825 -2942491 -2454548 -1815247 -4788392 -10494573 -14688668 -14763033 -12010723
7028a2010723L169385L359965M415416L861230m65316n548771n570528M19897
$$ -12010723 -8841338 -5481373 -1065957 2795273 2329957 -3218814 -8789342 -8369445
7020h369445O382400O468237J747867k456007l715441l903928m697947n009922
$$ -8369445 -1987045 4481192 6229059 3773052 57611 -3846317 -8544264 -13554186
7012a3554186l019205J486957O850051J0080432Q510116K961882j759189k065484
$$ -13554186 -16573391 -15086434 -8236383 1844049 10354165 13316047 11556858 9491374
7004I491374j53481k75544j824430p26312K704496L102574j272607m987787l712961
$$ 9491374 9337893 9062349 7237919 6511607 9216103 12318677 11046070 6058283 2345322
6995B345322p86353j028910k668171j403970J072317O7732k470081J51657P229669
$$ 2345322 1558969 530059 -2138112 -3542082 -2469765 -2402033 -4872114 -4720457 2509212
6986B509212R143119J324699p839102q392971k072577K378850K526604K935813
$$ 2509212 11652331 12977030 5137928 -3255043 -5327620 -2948770 -422166 2513647
6978B513647N018151M841081J348835j042716o4037Q21425p90212j876572m3250
$$ 2513647 7531798 12372879 13721714 12678998 12614961 13436386 12646174 10769602 10726352
6969A0726352J465013o15677l472965k977222p76803p63551j505268R53963M583902
$$ 10726352 12191365 11575688 8102723 5125501 4348698 3585147 2079879 3033842 7617744
6960G617744L368933k173565m325463O1109M500764L154083n18942o90591P33953
$$ 7617744 10986677 8813112 4487649 4548758 9049522 12203605 11684663 10994072 11728025
6951A1728025j980032p617782r037750m443273j80809o33072j821103J355753
$$ 11728025 9747993 2130211 -6907539 -11350812 -11531621 -12164693 -13985796 -12630043
6943a2630043O461805P156415K813219r22142p31771K45659j643575m498372l809407
$$ -12630043 -6168238 988177 3801396 2879254 2147483 2393142 749567 -3748805 -7558212
6934g558212O28076M196089L464476j02332k735541k209313J468254O587048R636041
$$ -7558212 -6930136 -2734047 730429 628097 -2107444 -4316757 -2848503 3738545 13374586
6925A3374586P210830K70802n374246n376599k105455p57822j884971j875851
$$ 13374586 20585416 20856218 15481972 10105373 7999918 7242096 5357125 3481274
6917C481274p0568p4724k755378l260683J541283O748543N524612o31774l365199
$$ 3481274 3410706 3335982 580604 -2680079 -1138796 5609747 11134359 10502585 7137386
6908G137386O52768M713233J477308o468104r727350m461905K910350M538552
$$ 7137386 7790154 12503387 13980695 7512591 -2214759 -6676664 -3766314 772238
6900G72238Q33694j915552j242975p94827k787046l745146p72987K464871J002743
$$ 772238 1605932 -309620 -1552595 -2347422 -5134468 -8879614 -9652601 -7187730 -6184987
6891f184987l039456l296159Q44623L525292K000732L12812J500129K498197K59193
$$ -6184987 -9224443 -12520602 -11675979 -8150687 -6149955 -5837143 -4337014 -1838817 -1579624
6882a579624k510210k155756j73957L68917P52126L466894O050380M071725j206665
$$ -1579624 -4089834 -6245590 -6419547 -6050630 -5298504 -1831610 4218770 8290495 7083830
6873G083830l898094j779224J497828K392622J169302m84606j442244o45690J638751
$$ 7083830 3185736 1406512 2904340 5296962 6466264 5981658 4539414 3893724 5532475
6864E532475K286774j167016n897557o764014l468161k86264R02360K147619L911374
$$ 5532475 7819249 6652233 754676 -6009338 -9477499 -9763763 -8861403 -6713784 -2802410
6855b802410L746384J536279M13118Q28438o07569m209097n134452j505109J194403
$$ -2802410 943974 2480253 2893371 3721809 3114240 -1094857 -6229309 -7734418 -6540015
6846f540015j630948o005231n339947j75188L819808M629083M597180M335379
$$ -6540015 -8170963 -14176194 -19516141 -19691329 -15871521 -11242438 -6645258 -2309879
6838b309879K220160p19784j343473q7268q16761m216215o206081m236791o97845
$$ -2309879 -89719 -809503 -2152976 -2240244 -3057005 -7273220 -13479301 -17716092 -18413937
6829a8413937J642874L415299N571860O315428M244340J854601K443293N031258
$$ -18413937 -16771063 -13355764 -7783904 -1468476 2775864 4630465 7073758 12105016
6821A2105016N493464J962433l509546q002559r791218p857258k584057K468656
$$ 12105016 17598480 19560913 16051367 8048808 -1742410 -9599668 -12183725 -9715069
6813i715069K734944j472870l757589P71987Q209001R829755L255802m314352
$$ -9715069 -6980125 -8452995 -12210584 -11438597 -3229596 6600159 9855961 5541609
6805E541609n440051j288760J761642J394931Q19811K229549L746475L585276
$$ 5541609 101558 -1187202 574440 1969371 2789182 5018731 8765206 12350482
6797A2350482K962806K994301K113352r09314l962124m487856l623699m368300
$$ 12350482 15313288 18307589 20420941 19511627 15549503 11061647 7437948 3069648
6789C069648o504981o534878k979149R36863J342892r92106j444344K236730O266294
$$ 3069648 -3435333 -9970211 -12949360 -12012497 -10669605 -11661711 -13106055 -10869325 -4603031
6780d603031N201992o22796m878462l457289K36945Q97937p64358l02181K135808
$$ -4603031 598961 -23835 -4902297 -8359586 -8122641 -7224704 -7989062 -8291243 -6155435
6771f155435J901019j550247k778002O34322L416038J025389k526420q34781M560833
$$ -6155435 -4254416 -5804663 -8582665 -7948343 -4532305 -3506916 -6033336 -6868117 -2307284
6762b307284O377867K465515j727128j631038P94763J211781j121079l248758
$$ -2307284 4070583 6536098 4808970 3177932 3972695 5184476 4063397 814639
6754H14639k266535J801360N621123N230108M15808m439607n389184l331385j497958
$$ 814639 -1451896 349464 5970587 11200695 11616503 7176896 1787712 -1543673 -3041631
6745c041631o13411N38807J631333J522857J092904J478817P16977l343022p408496
$$ -3041631 -3655042 -3116235 -1484902 37955 1130859 2609676 3326653 -16369 -7424865
6736g424865n226791L356181J0285742Q168388j618081j0957104j2814307o511019
$$ -7424865 -12651656 -9295475 990267 9158655 7540574 -3416530 -16230837 -22741856
6728b2741856K303838O471480M132097L68299J73394J880153J227906o43816O82534
$$ -22741856 -20438018 -13966538 -9834441 -9466142 -9292748 -7412595 -6184689 -6828505 -6145971
6719f145971M128951L928630k70127j926022J624880M666168K899357J86533N22266
$$ -6145971 -2017020 1911610 1641483 -284539 1340341 6006509 8905866 9092399 9614665
6710I614665M40301l845553p735777m832903J904855M182768J027200j156226
$$ 9614665 10054966 6209413 -1526364 -6359267 -4454412 -271644 755556 -400670
6702d00670J11854P84091p29952n17531K853275M749519K078958j499007j476345
$$ -400670 -288816 495275 -234677 -752208 2101067 6850586 8929544 7430537 5954192
6693E954192J183785K919532K575882N16903l128799o124245m192436K621225
$$ 5954192 7137977 10057509 12633391 13150294 10021495 3897250 -295186 2326039
6685B326039P274920L980447l550448o747173l069908K404470M787292L817472
$$ 2326039 9600959 13581406 10030958 3283785 213877 2618347 7405639 11223111
6677A1223111J139645j829749k865005l02454L346887L032955k023595o526507
$$ 11223111 12362756 10533007 7668002 7365548 10712435 13745390 11721795 5195288
6669E195288n892090j810488J020599R31183m45557j587149j828643l03366K796403
$$ 5195288 -696802 -2507290 -1486691 -555508 -1001065 -2588214 -4416857 -4720223 -1923820
6660a923820M752324K964534j253615l923053l144453l63879K554423M746545
$$ -1923820 2828504 5793038 4539423 616370 -2528083 -2891962 -337539 4409006
6652D409006N021814K380162j397022k727599j122969k74249k461577m658296
$$ 4409006 9430820 11810982 10413960 7686361 6563392 6289143 3827566 -830730
6644h30730k924128J420167L417622J356659j329043j128548J440330L487256
$$ -830730 -3754858 -2334691 1082931 2439590 1110547 -18001 1422329 4909585
6636D909585L274032J133353j472500k842183k168190n52104K3390q31743j544293
$$ 4909585 8183617 9316970 7844470 5002287 2834097 2281993 2305383 1473640 -70653
6627g0653j103407n91273j208281j891966n33631K564896M060362J464773k976931
$$ -70653 -1174060 -1765333 -2973614 -4865580 -5399211 -2834315 1226047 2690820 -286111
6618b86111l986042M52377N925869O525000K102713k040366k698571k457623m299766
$$ -286111 -4272153 -3819776 2106093 8631093 10733806 8693440 5994869 3537246 -762520
6609g62520o158296m346926j0961K319601J706831J650597L554819L973489L79469
$$ -762520 -6920816 -11267742 -11278703 -8959102 -7252271 -5601674 -2046855 1926634 2306103
6600B306103l947781l887524N84509M395716L725307L8100k498350k109990r00041
$$ 2306103 -1641678 -5529202 -4944693 -548977 3176330 3214430 716080 -1393910 -2293951
6591b293951j413073k931231k783759j104933j426944m954700p271432m160433
$$ -2293951 -3707024 -6638255 -9422014 -10526947 -11953891 -16908591 -24180023 -28340456
6583b8340456J497008L296167P91931K0880M004592Q159844P273807K473799j589076
$$ -28340456 -26843448 -23547281 -22755350 -22734470 -18729878 -10570034 -3296227 -822428 -2411504
6574b411504k805483j854226M29678K718713K747276K24213j928422j742672j085534
$$ -2411504 -5216987 -7071213 -6641535 -3922822 -1175546 -951333 -2879755 -4622427 -5707961
6565e707961j771471j822210R14182M136919M184495J661384k06902r41304j962708
$$ -5707961 -7479432 -9301642 -8387460 -4250541 -66046 1595338 1388436 447132 -1515576
6556a515576k039938J046389M963777M640974J03248l040112k332987k157355
$$ -1515576 -3555514 -2509125 2454652 7095626 7198874 4158762 1825775 -331580
6548c31580n858532r137804n888781K327685P736149O457519K688964K100894
$$ -331580 -6190112 -15327916 -21216697 -18889012 -11152863 -4695344 -2006380 94514
6540I4514M641940N828138L006963k039649n829603o214322k857021K783032P063434
$$ 94514 4736454 10564592 13571555 11531906 5702303 -512019 -3369040 -586008 6477426
6531F477426O226251Q53505l649983l531852j725898k858881n087041k522611
$$ 6477426 12703677 13557182 9907199 6375347 4649449 1790568 -3296473 -5819084
6523e819084M308069P273056K473469l168289j941390L267952M050052n46774
$$ -5819084 -1511015 5762041 8235510 5067221 3125831 6393783 10443835 9897061
6515I897061l527370j212601K265305K399814o8290k738687n368809p450238o270244
$$ 9897061 6369691 5157090 7422395 9822209 9753919 7015232 1646423 -5803815 -12074059
6506a2074059p86302N160058O602729L215698p28269j363373J158672L525410
$$ -12074059 -12860361 -7700303 -1097574 2118124 1389855 26482 1185154 4710564
6498D710564K906440j74774k758046l236017k822859k540722j071643K346003
$$ 4710564 7617004 7442230 4684184 1448167 -1374692 -3915414 -4987057 -2641054
6490b641054N142227M550338J808214l097o52155j654418k206389o62147J193701
$$ -2641054 2501173 7051511 8859725 8856628 8204473 6550055 4343666 3681519 4875220
6481D875220L24189j811595r82717K558868M193236K648381J571035K242895J072657
$$ 4875220 5199409 3387814 2405097 4963965 9157201 11805582 13376617 15619512 16692169
6472A6692169l247925o102506m012134l10835K54495j487156j642869N12859K735600
$$ 16692169 13444244 7341738 3329604 3018769 3273264 1786108 143239 656098 3391698
6463C391698L664560L125411R79194j446168j321538J606047L635740K323503
$$ 3391698 7056258 10181669 11160863 9714695 8393157 9999204 13634944 15958447
6455A5958447j15325j257062k468244m922182n594125k005557K161011J602349
$$ 15958447 15843122 14586060 12117816 7195634 1601509 -404048 1756963 3359312
6447C359312k416077l741356j34086M537268O369580N184655K411255o20058k085774
$$ 3359312 943235 -2798121 -2932207 1605061 7974641 13159296 15570551 14950493 12864719
6438A2864719j002730N74072k16385k615876l114384p37956J646443J683278L85193
$$ 12864719 11861989 12436061 12219676 9603800 6489416 5751460 7397903 9081181 9466374
6429I466374q4676O32993J144526J51977j956490k965788j235549J428683J464216
$$ 9466374 9381698 10014691 11159217 11311194 9354704 6388916 5153367 6582050 8046266
6420H046266j040486j829087O84617J883943k118232p358130o832044m60673N023285
$$ 8046266 7005780 5176693 5861310 7745253 5627021 -1731109 -8563153 -9023826 -4000541
6411d000541N338943K823511J371847J747039K567644K383904K33346l099544
$$ -4000541 1338402 4161913 5533760 7280799 9848443 12232347 12465693 9366149
6403I366149m647795k829139l97289n13246j398970O50854M122732L687797j150610
$$ 9366149 4718354 1889215 1491926 978680 -420290 230564 4353296 8041093 6890483
6394F890483m457351k336419J868165K942159M97294j972661j950880N6242J597332
$$ 6890483 2433132 96713 1964878 4907037 5404331 3431670 1480790 1537032 3134364
6385C134364P62223j044415K3743M302376O103921J510174m096717k936058K544443
$$ 3134364 3896587 2852172 2875915 7178291 13282212 14792386 10695669 7759611 10304054
6376A0304054K571783m219890p799734k484040L990562K809689k767990m116332
$$ 10304054 12875837 8655947 856213 -1627827 2362735 5172424 2404434 -1711898
6368a711898p65667J273107M45377K48418J277408Q22121o65386o0394J911918
$$ -1711898 -2477565 -1204458 -759081 -510663 766745 1588866 923480 863086 2775004
6359B775004J477602r12306p88921K350472L859348J991315P36487K483272L822305
$$ 2775004 4252606 3340300 2551379 4901851 8761199 10752514 11489001 13972273 17794578
6350A7794578J744948j163426j484122o57420j687432l377935k358580J098794
$$ 17794578 19539526 18376100 16891978 16234558 14547126 11169191 8810611 9909405
6342I909405L469803L124771J481213l52668k777648n618791p513836p472387
$$ 9909405 13379208 16503979 17985192 17632524 14854876 9236085 1722249 -5750138
6334e750138n140962k55252N733265Q507728N044443j044016k451393K253582
$$ -5750138 -10891100 -11146352 -5413087 3094641 8139084 7095068 4643675 6897257
6326F897257O077768L120159l156010n109568j548511J944830J985822R83190
$$ 6897257 12975025 16095184 12939174 7829606 6281095 8225925 10211747 11194937
6318A1194937J372674J815270J044943O80110J496804J121188j423855k879865
$$ 11194937 12567611 14382881 15427824 16107934 17604738 18725926 17302071 14422206
6310A4422206j172088K48462j954768m696746l415999j94062k12887k322420r05469
$$ 14422206 13250118 13498580 11543812 6847066 3431067 3237005 3024118 701698 -203771
6301b03771L710562N140210J915456j13025J479715J426422k781648m895626n30687
$$ -203771 3506791 8647001 10562457 10449432 11929147 13355569 10573921 5678295 5147608
6292E147608L830290N20076o398571p161653j596981J456349j347858l764777
$$ 5147608 8977898 9497974 3099403 -4062250 -5659231 -4202882 -5550740 -9315517
6284i315517j446198J347325j92322l471975k984332J665138O281298P884434
$$ -9315517 -10761715 -9414390 -9606712 -13078687 -16063019 -14397881 -8116583 -232149
6276b32149O716177M194930J400826j222095l853077o242369o774603m245249
$$ -232149 6484028 10678958 12079784 10857689 7004612 762243 -6012360 -10257609
6268a0257609k86745K128503K303075J627963N73595r81140j163076J942995N649412
$$ -10257609 -10544354 -8415851 -6112776 -4484813 -3911218 -4892358 -6055434 -4112439 1536973
6259A536973M654956j170541n586669m486505j135053k13046r49596o3062J961725
$$ 1536973 6191929 5021388 -565281 -5051786 -6186839 -6399885 -7349481 -7412543 -5450818
6250e450818K398269K005740M000915P626336P529748R81550p469691j0570098
$$ -5450818 -3052549 -1046809 2954106 10580442 18110190 19091740 11622049 1051951
6242A051951o158931J057737M897344L723751Q66703k75896j10923q63937k210307
$$ 1051951 -5106980 -4049243 848101 4571852 5438555 5162659 5051736 4187799 1977492
6233A977492j638165R71491K395407Q23679j432437j756327r36142p71223o63307
$$ 1977492 339327 1310818 3706225 4529904 3097467 1341140 404998 -366225 -1029532
6224a029532N06536J525598J271430J691840M186557N036901l1735p402491q010859
$$ -1029532 -522996 1002602 2274032 3965872 8152429 13189330 13157595 5755104 -2255755
6215b255755L58426R020551R473147L546244j337569k675681l406258m706529
$$ -2255755 -1897329 7123222 16596369 20142613 18805044 16129363 12723105 8016576
6207H016576m374855j985378l69534j014116j996160j642652q15990k87317R75332
$$ 8016576 3641721 1656343 1286809 272693 -1723467 -3366119 -4182109 -4469426 -3494094
6198c494094L250475M539445L446121J338862n5598j048567k283789k916252k511228
$$ -3494094 -243619 4295826 7741947 9080809 9025211 7976644 5692855 2776603 265375
6189B65375k563047l769722l813466n28793M383135P434198P464135N078625K95210
$$ 265375 -2297672 -6067394 -9880860 -10409653 -6026518 1407680 8871815 13950440 14245650
6180A4245650n609631q129487m319014J603070K724337r58613l103663j256132
$$ 14245650 8636019 506532 -3812482 -2209412 514925 -443688 -3547351 -4803483
6172d803483J88593j179557j252157K518849N164393K057470k472289j385913
$$ -4803483 -4614890 -5794447 -7046604 -4527755 636638 2694108 221819 -1164094
6164a164094L669189M944232J002870j459985J161030L802640J164846m054915
$$ -1164094 2505095 7449327 8452197 6992212 8153242 11955882 13120728 9065813
6156I065813n382163j413960L533401N601850M628727J977551j722610n823744
$$ 9065813 3683650 2269690 5803091 11404941 16033668 18011219 16288609 10464865
6148A0464865q207044o256508j27920N538718N282382p10757n811753m661744
$$ 10464865 2257821 -3998687 -4126607 1412111 6694493 5983736 171983 -4489761
6140d489761J61428K077743m43249k710001j211285K167300M159509M384985L858710
$$ -4489761 -4328333 -2250590 -2693839 -5403840 -6615125 -4447825 -288316 4096669 7955379
6131G955379K448196L0299k084296k914761l285626l914200l688093j462634J830517
$$ 7955379 10403575 10433874 8349578 5434817 2149191 -1765009 -5453102 -6915736 -5085219
6122e085219M328934N318609N066097L846228K131061M99378j336800l863206
$$ -5085219 -756285 4562324 9628421 13474649 15605710 16105088 14768288 10905082
6114A0905082n587408l826228J025684M302786K291566k840820n552420l486931
$$ 10905082 5317674 1491446 2517130 6819916 9111482 6270662 718242 -2768689
6106b768689M96429K405102J360214m41762q24853q4168k94626k169082l464575
$$ -2768689 -2272260 132842 1493056 1051294 226441 142273 -152353 -2321435 -5786010
6097e786010j814612J414264K262421n27751l588278l232749K56070L841446N483970
$$ -5786010 -7600622 -6186358 -3923937 -4451688 -8039966 -11272715 -11016645 -7175199 -1691229
6088a691229N173859L555833J225712j094221k709233l084559j842747M50930
$$ -1691229 3482630 7038463 8264175 7169954 4460721 1376162 -466585 -15655
6080a5655J819414R08823n65238M03175L524335M822858J728184l633811p269467
$$ -15655 1803759 2712582 2147344 2550519 6074854 10897712 12625896 8992085 1722618
6071A722618p431870m995872j840887J38376M13912R43167L687260O710059N909570
$$ 1722618 -5709252 -10705124 -12546011 -12407635 -11993723 -11050556 -7363296 -653237 5256333
6062E256333J280157k500975l086345l447298n376897n024233P31709P545435
$$ 5256333 6536490 4035515 949170 -2498128 -7875025 -12899258 -12167549 -4622114
6054d622114Q805285M987909K088712K283177K062769p10738l599932m226978
$$ -4622114 4183171 9171080 11259792 13542969 15605738 14895000 11295068 7068090
6046G068090l301757j835563M46141K459089J399414k930890o391774n237025
$$ 7068090 3766333 1930770 2376911 4836000 6235414 3304524 -3087250 -8324275
6038h324275o25356L163791L425839Q21572k018158k682029q76434J360099K196479
$$ -8324275 -8949631 -5785840 -2360001 -1538429 -3556587 -6238616 -7115050 -5754951 -3558472
6029c558472K356211L452186M703726L673064J61902l015064l441334j324992
$$ -3558472 -1202261 2249925 6953651 10626715 10788617 7773553 4332219 3007227
6021C007227J659330L647686K865524q63939m657926n010249k059835P25278J196243
$$ 3007227 4666557 8314243 11179767 10315828 5657902 647653 -1412182 -686904 509339
6012E09339M00636k58196p95978r38312L83886K515933K592641o65505m388267
$$ 509339 909975 651779 -144199 -1082511 -698625 1817308 4409949 3744444 -643823
6003f43823m499753m12843M201395M943265R84125l613474l704500Q50162M563055
$$ -643823 -5143576 -5556419 -1355024 3588241 4572366 958892 -2745608 -1895446 2667609
5994B667609L561023J004590J861347M587107L338997k304112n982514m009971
$$ 2667609 6228632 7233222 9094569 13681676 17020673 14716561 8734047 4724076
5986D724076l97458Q31j657326j561599L83162J199595o06294l914543o415265
$$ 4724076 4326618 4327449 2670123 1108524 1491686 2691281 2084987 -1829556 -8244821
5977h244821n544479p23783M092062L831473k06563r96228L687146O978315L342583
$$ -8244821 -13789300 -14513083 -10421021 -6589548 -6796111 -7792339 -4105193 2873122 6215705
5968F215705k237882j785363L038546L460475k989293r115301q395679k422127
$$ 6215705 3977823 2192460 5231006 8691481 5702188 -3413113 -11808792 -14230919
5960a4230919L129449M922138L054193j27489j128157J443934M240149L049426
$$ -14230919 -11101470 -6179332 -3125139 -3252628 -4380785 -2936851 1303298 4352724
5952D352724q68690k281684K83796K897338K766192J462718L93281j827978n157096
$$ 4352724 3484034 1202350 1486146 4383484 7149676 8612394 9005675 7177697 2020601
5943B020601n974789k462926J558114J775403m32778n85235K224196M819811M745784
$$ 2020601 -3954188 -6417114 -4859000 -3083597 -3516375 -4101610 -1877414 2942397 7688181
5934G688181K305264j248513m454364n087011j901655K744873M394264J422490
$$ 7688181 9993445 8744932 4290568 -796443 -2698098 46775 4441039 5863529
5926E863529k937183m141944j004201L631798O160299N485127L131445Q80587
$$ 5863529 2926346 -1215598 -2219799 1411999 7572298 13057425 16188870 17069457
5918A7069457p42812j730839j958869k146181l689123n908197n385870p41029
$$ 17069457 16326645 14595806 12636937 10490756 6801633 893436 -4492434 -5233463
5910e233463L625873K413570k728967m706304n95312M878421O572190M847769
$$ -5233463 -1607590 805980 -1922987 -6629291 -7224603 -2346182 4226008 9073777
5902I073777K250176r03619m328948n280919k376673J061608J452805J40169J91042
$$ 9073777 11323953 10420334 6091386 810467 -1566206 -504598 948207 1088376 1279418
5893A279418P03433j079531m132654n149303m135895l354950j974854K377762
$$ 1279418 1982851 903320 -3229334 -8378637 -12514532 -15869482 -17844336 -15466574
5885a5466574P175916O544268L37418m360347k940148R62797K218442J597990
$$ -15466574 -8290658 -1746390 -1408972 -5769319 -8709467 -7746670 -5528228 -3930238
5877c930238K439732M006303L058785k36687k562257k561192j911711j827033
$$ -3930238 -1490506 2515797 5574582 5337895 2775638 214446 -1697265 -3524298
5869c524298j738728j363743j383621j857769j937027j254667j54216J167688
$$ -3524298 -5263026 -6626769 -8010390 -9868159 -11805186 -13059853 -13214069 -12046381
5861a2046381K389076K531489J248922P0233O47576K127894K013130l88133k929143
$$ -12046381 -9657305 -7125816 -5876894 -5806661 -5159085 -3031191 -1018061 -1406194 -4335337
5852d335337l317945j671118M8385M55009J45696O98244K359250L306049J913492
$$ -4335337 -7653282 -9324400 -9276015 -8821006 -8675310 -7977066 -5617816 -2311767 -398275
5843c98275q83079k810104l221132k896351j467228K017181N805028O230056K908642
$$ -398275 -1281354 -4091458 -7312590 -10208941 -11676169 -9658988 -3853960 2376096 5284738
5834E284738k72168q79675r23843k028152j912089Q07352K379076o16421m669147
$$ 5284738 5012570 4132895 3209052 1180900 -731189 76163 2455239 1838818 -2830329
5825b830329l917472O67674K764813M54583j676861l14851K558104M249230M566095
$$ -2830329 -6747801 -6080127 -3315314 -2860731 -4537592 -4852443 -2294339 1954891 6520986
5816F520986L338070k5830l162707k224757J588943K325116j846281n661717n337429
$$ 6520986 9859056 9833226 6670519 4445762 6034705 8359821 6513540 851823 -4485606
5807d485606m096152n170045n158560n4513O559853P823269L404238j079090k607945
$$ -4485606 -8581758 -13751803 -18910363 -18964876 -12405023 -4581754 -1177516 -2256606 -4864551
5798d864551k909639l227655k629925j264264l23700J193061N119092R508762
$$ -4864551 -7774190 -11001845 -13631770 -14896034 -15219734 -14026673 -8907581 601181
5790F01181R907752N649689P50029j972800l624952n396154o053934m660777k482201
$$ 601181 10508933 16158622 16908651 14935851 11310899 5914745 -139189 -4799966 -7282167
5781g282167p45612Q44468K286328K501638J393537N28671J017934K482003M121864
$$ -7282167 -8027779 -7183311 -4896983 -2395345 -1001808 -473137 544797 3026800 7148664
5772G148664M823347K840636j853610n548101m508215l51939J959294J165732
$$ 7148664 11972011 14812647 12959037 7410936 2902721 2550782 4510076 5675808
5764E675808M36747J083223P05164j349676k081945n53630l38415l181847m999299
$$ 5675808 6112555 7195778 7900942 6551266 4469321 3915691 3577276 395429 -4603870
5755d603870k216817J979960K490326K14854j73004J688665J632646j732057m731399
$$ -4603870 -6820687 -4840727 -2350401 -2135547 -2308551 -619886 1012760 -719297 -5450696
5746e450696m338870j893546J59144J674679L164903L552803J904717k44474o25506
$$ -5450696 -9789566 -11683112 -11523968 -9849289 -6684386 -3131583 -1226866 -1471340 -2096846
5737b096846M00215L57002j349873j982929P71393N004575O652410M853700K542241
$$ -2096846 -1696631 -1339629 -2689502 -4672431 -3901038 1103537 7755947 12609647 15151888
5728A5151888J285355j050294n498022q264511n495289N48431M348839M470224
$$ 15151888 16437243 15386949 9888927 1624416 -3870873 -3322442 1026397 5496621
5720E496621L347481J373383k781244o564064n328012p29310l5884m619066o529763
$$ 5496621 8844102 10217485 7436241 872177 -4455835 -5185145 -5221029 -9840095 -16369858
5711a6369858o13073O943510P779573L097492l93288j240604k321356k866935
$$ -16369858 -16982931 -10039421 -2259848 837644 444356 -796248 -3117604 -5984539
5703e984539J52714M494469M655274R81103p09399J194735K035240m76809k496081
$$ -5984539 -5831825 -1337356 3317918 4299021 3589622 4784357 6819597 6342788 3846707
5694C846707r73619J673669K352499J618548O75389j259482l840881m012293m77556
$$ 3846707 2873088 4546757 6899256 8517804 9193193 7933711 4092830 80537 -397019
5685c97019L618487N039395M373074L368416J683215j096943l144504k877454
$$ -397019 3221468 8260863 12633937 16002353 17685568 16588625 13444121 10566667
5677A0566667j478874o72601k84766O759q26554k628742k728798J66235L135876
$$ 10566667 9087793 8415192 8130426 8137185 7310631 4681889 1953091 2119326 5255202
5668E255202K925116M66289j438820k764708m965346o640178m755996L9356L242264
$$ 5255202 8180318 8646607 7207787 4443079 -522267 -7162445 -11918441 -11879085 -8636821
5659h636821K459628M63232R62260L744859N806296N631629M162494K265742k32381
$$ -8636821 -6177193 -5713961 -4751701 -1006842 4799454 10431083 14593577 16859319 16626938
5650A6626938k469655j958837J848287M921699K736367l187501o428745m331418
$$ 16626938 14157283 12198446 14046733 18968432 21704799 18517298 12088553 7757135
5642G757135j557428k596925m806891l168964J164723K701656L72588j554441
$$ 7757135 6199707 3602782 -1204109 -4373073 -3208350 -506694 -134106 -1688547
5634a688547r75266l05005p05846l1191J826342J375975k151171m313208k428963
$$ -1688547 -2663813 -2968818 -3674664 -3705855 -1879513 -503538 -2654709 -6967917 -9396880
5625i396880k1776n85235j602375P22967M707429O078033M530849K552657M53063
$$ -9396880 -9418656 -10003891 -11606266 -10883299 -6175870 -97837 4433012 6985669 7438732
5616G438732k313237l248694R6906M582510M728044Q75266j498188n80369m71761
$$ 7438732 5125495 1876801 1973707 6556217 11284261 12159527 10661339 10080970 9609209
5607I609209l386130n223827j947522L622553N210436J371193l019019l216148
$$ 9609209 6223079 999252 -948270 2674283 7884719 9255912 6236893 3020745
5599C020745o7689J815239K02412j962032n87043L837002O542196M472946m28181
$$ 3020745 2953056 4768295 4970707 3008675 2421632 6258634 12800830 17273776 16845595
5590A6845595m522445o292043n611750k345482K066537M396047L630961K583811
$$ 16845595 12323150 6031107 419357 -1926125 140412 4536459 8167420 10751231
5582A0751231K875572J627868l175790p521912o654618k725396j115267j236597
$$ 10751231 13626803 15254671 12078881 4556969 -2097649 -4823045 -5938312 -7174909
5574g174909J759130O859733O988365M40737n290114m514618j367567k092683
$$ -7174909 -5415779 1443954 8432319 8873056 3582942 -931676 -2299243 -4391926
5566d391926m946461l890888J234531M668792L419740L77633j141836j296993
$$ -4391926 -9338387 -13229275 -11994744 -7325952 -3906212 -3528579 -4670415 -5967408
5558e967408j370521j131267L4063J596788K751436L454339L705275K735055j40398
$$ -5967408 -7337929 -8469196 -8435133 -6838345 -4086909 -632570 3072705 5807760 5667362
5549E667362l980636o184743m765803r34999J615765J057766j04894J200363L495585
$$ 5667362 1686726 -4498017 -9263820 -10198819 -8583054 -7525288 -7630182 -6429819 -2934234
5540b934234K454649k464288o574080n915241j392496M019530Q517170J0249423
$$ -2934234 -479585 -2943873 -9517953 -15433194 -16825690 -12806160 -4288990 5960433
5532E960433O982949J49841m108437j863528L043157M378455K245053J586529
$$ 5960433 12943382 13093223 8984786 7121258 10164415 14542870 16787923 18374452
5524A8374452L377150L150014j086372m967864m201067p62015M93408j314120
$$ 18374452 21751602 24901616 23815244 18847380 14646313 13884298 14377706 13063586
5516A3063586k987266k447361p00269R33155K489880L628180K650872j077067
$$ 13063586 10076320 7628959 6928690 7861845 10351725 13979905 16630777 15553710
5508A5553710m922209n158826j454576K341948K638929J22585j872904j892004
$$ 15553710 10631501 5472675 4018099 6360047 8998976 9121561 7248657 5356653
5500E356653j118980j21223K119455N014549N296844J469106k952982l650925
$$ 5356653 4237673 4116450 6235905 11250454 16547298 18016404 15063422 11412497
5492A1412497j411406m02455j553006j814757j58337K61513k298370m413906k378766
$$ 11412497 10001091 9598636 8045630 6230873 6072536 6334049 4035679 -378227 -2756993
5483b756993K037203M312248L679760K828447K113717j203610p122887j0595109
$$ -2756993 -719790 3592458 7272218 10100665 12214382 11010772 3887885 -6707224
5475f707224p570191p01872L811891L612573J710739J398345K412162K562385
$$ -6707224 -14277415 -14979287 -11167396 -7554823 -5844084 -4445739 -2033577 528808
5467E28808J115224n41239p85889L59900J075459m24516l632398n911584n425277
$$ 528808 1644032 1102793 316904 676804 1752263 1327747 -2304651 -8216235 -13641512
5458a3641512k966080r1212L015399O065735O682215L005399k268040l988155
$$ -13641512 -16607592 -16698804 -13683405 -7617670 -935455 2069944 -198096 -4186251
5450d186251j120968K213571L070802L127863M043692L607493r3172m063115m300039
$$ -4186251 -5307219 -3093648 -22846 3105017 7148709 10756202 10663030 6599915 2299876
5441B299876j951766q77238p76526J808448O162123O923223K136828l376986m888359
$$ 2299876 348110 -529128 -1305654 502794 6664917 13588140 15724968 12347982 7459623
5432G459623l641555l131484l262459j768332J073291K791566K470855J196371
$$ 7459623 3818068 686584 -2575875 -4344207 -3270916 -479350 1991505 3187876
5424C187876l26169k082888l369290l270144k096337p81660M43406J452789J462953
$$ 3187876 2861707 778819 -2590471 -5860615 -7956952 -8738612 -8295206 -6842417 -5379464
5415e379464M80545K87769K044571L908971L180218K14748j848216j051538J370573
$$ -5379464 -4898919 -4611150 -2566579 1342392 4522610 4737358 2889142 1837604 3208177
5406C208177K817945J843616r29685l386307l788889k717875k264878k831754
$$ 3208177 6026122 7869738 6940053 3553746 -235143 -2953018 -5217896 -8049650
5398h049650k465116k95862J707918K143591K705135M612354N081723J285398
$$ -8049650 -10514766 -10810628 -9102710 -6959119 -4253984 358370 5440093 6725491
5390F725491l952561n152230k185068k34587j423156j857328J097428L614846
$$ 6725491 2772930 -2379300 -4564368 -4798955 -6222111 -8079439 -6982011 -3367165
5382c367165J058943m577322p044821l987581R38348L444634L082386K247669
$$ -3367165 -2308222 -6885544 -13930365 -17917946 -16979598 -13534964 -10452578 -8204909
5374h204909K838351M324191M285271J206600k875985l942530j126709J627457
$$ -8204909 -5366558 -1042367 3242904 4449504 1573519 -2369011 -3495720 -1868263
5366a868263P60332j997322k469495k27855J403047Q58785J18386N02196K77638
$$ -1868263 -1107931 -3105253 -5574748 -5802603 -4399556 -3540771 -3422385 -2920189 -2642551
5357b642551j908113m017576l352444n42838J471689J379206L24140m57001o79832
$$ -2642551 -4550664 -8568240 -11920684 -12463522 -10991833 -9612627 -9288487 -9745488 -10425320
5348a0425320N3649K225149M864216N694992L589930j34294l344082m966560m771537
$$ -10425320 -10371671 -8146522 -3282306 2412686 6002616 5868322 2524240 -2442320 -7213857
5339g213857k587878J131193M732171O566400O425721M826313J486624l846922
$$ -7213857 -9801735 -8670542 -3938371 2628029 9053750 13880063 15366687 11519765
5331A1519765r076994j0331786o222606l73595K104141M56573j119926Q22329
$$ 11519765 2442771 -7889015 -14111621 -14485216 -12381075 -11924502 -13044428 -12222099
5323a2222099M399359N019190J667418j640821j164091J771897K927815J022048
$$ -12222099 -7822740 -2803550 -1136132 -2776953 -3941044 -2169147 758668 1780716
5315A780716q82506p8977J968473K000707k58616j866297r74327P30539P30868
$$ 1780716 898210 819233 2787706 4788413 4529797 2663500 1689173 2419712 3150580
5306C150580o93012j080794M88803J985856J256158j008425k423950k469832k986587
$$ 3150580 2457568 1376774 1865577 3851433 5107591 4099166 1675216 -794616 -3781203
5297c781203m562906m471166k64193N676272Q026232N107624Q30805q00191l12926
$$ -3781203 -8344109 -12815275 -13079468 -7403196 623036 5730660 6561465 5761274 5448348
5288E448348k92193j110624j768811k674729m184816m004138L9302N453611P389220
$$ 5448348 5156155 4045531 2276720 -398009 -4582825 -8586963 -8547661 -3094050 4295170
5279D295170N216269K586097R25933k105220o520782p772718l488026K061373
$$ 4295170 9511439 12097536 13023469 10918249 4397467 -3375251 -6863277 -4801904
5271d801904L830025K575303J657871R35555j192678k551876O3092M316143M458306
$$ -4801904 -971879 1603424 3261295 4196850 3004172 452296 515388 4831531 9289837
5262I289837k37063m734817o102047o297195o121320k655581M437773R470429
$$ 9289837 9052774 4317957 -1784090 -8081285 -14202605 -16858186 -12420413 -2949984
5254b949984P754991K325118n80737Q5902N79552r49974k661530k996685k480431
$$ -2949984 4805007 7130125 6549388 6635290 7214842 6264868 3603338 606653 -1873778
5245a873778j751170r25472o84216j270451r75188J488879L767712K357973j992971
$$ -1873778 -3624948 -4550420 -5234636 -6505087 -7480275 -5991396 -2223684 134289 -1858682
5236a858682m929700m513089k749363q47713K360343N823943N180506m33127m703577
$$ -1858682 -6788382 -11301471 -14050834 -14898547 -12538204 -6714261 -1533755 -1966882 -6670459
5227f670459j855177M857926P462163M173439L68094n63794j039811k928927l592643
$$ -6670459 -8525636 -3667710 3794453 7967892 8335986 7772192 6732381 3803454 210811
5218B10811j333565K89681k015477n034415l369041K112094N368919L971685J706612
$$ 210811 -1122754 -833073 -2848550 -7882965 -11252006 -9139912 -3770993 200692 1907304
5209A907304J920506K917636J707495j274650l490550l871824k883467q35030
$$ 1907304 3827810 6745446 8452941 7178291 3687741 -184083 -3067550 -3902580
5201c902580J753446L280589K435623j02721k458988l428914k868353j161116
$$ -3902580 -2149134 1131455 3567078 3464357 1005369 -2423545 -5291898 -6453014
5193f453014R42567K695791L864956L994851J626140l667496q533253q151174
$$ -6453014 -5510447 -2814656 1050300 5045151 6671291 3003795 -5529458 -13680632
5185a3680632k404679L109491L907537J666341K93981m0171j528235l568790l271862
$$ -13680632 -16085311 -12975820 -9068283 -7401942 -7107961 -7148132 -8676367 -12245157 -15517019
5176a5517019m74225J677011J466089P03242J382196K924656L737324L504864
$$ -15517019 -15991244 -14314233 -12848144 -12144902 -10762706 -7838050 -4100726 -595862
5168e95862K958447K661348K550477J848703k50612k811726l159624m20088K260404
$$ -595862 2362585 5023933 7574410 9423113 9172501 6360775 3201151 2781063 5041467
5159E041467J643560o45276o02438J414593R80013k716485m422167n96779M468299
$$ 5041467 6685027 6039751 5437313 6851906 7831919 5115434 693267 96488 4564787
5150D564787M233869q86147m272049k177092K016971L123777M30919k867990m354895
$$ 4564787 8798656 7912509 3640460 1463368 3480339 6604116 7035035 4167045 -187850
5141a87850m379911m067513l313737j505619P00355J589944N32762j120061j854282
$$ -187850 -4567761 -8635274 -11949011 -13454630 -12754275 -11164331 -10631569 -11751630 -13605912
5132a3605912j713152j242215J62186L021169N398990M071743j319340o942863
$$ -13605912 -15319064 -16561279 -16399093 -13377924 -7978934 -3907191 -5226531 -12169394
5124a2169394q438785m870897J275305O600380Q703875P103651L453765K05588
$$ -12169394 -20608179 -25479076 -24203771 -17603391 -8899516 -1795865 1657900 1863488
5116A863488j596182k606712l209041k602416n13779J514139J806551Q66520P39286
$$ 1863488 267306 -2339406 -5548447 -8150863 -8664642 -7150503 -5343952 -4477432 -3738146
5107c738146K114531L060189J249375k796615n555352m299927m42362K307360
$$ -3738146 -1623615 1436574 2685949 -110666 -5666018 -9965945 -10408307 -8100947
5099h100947K725746K676767K750871R07711k619025l072880J997927O701794
$$ -8100947 -5375201 -2698434 52437 960148 -1658877 -4731757 -2733830 3967964
5091C967964L482956n362615r433190m182126L372887N198813K325079L43245
$$ 3967964 7450920 2088305 -7344885 -11527011 -8154124 -2955311 -630232 -286987
5083b86987J9792j879690n303431o325423l128348J893910N833160P562960O644300
$$ -286987 -267195 -2146885 -7450316 -13775739 -16904087 -15010177 -9177017 -1614057 5030243
5074E030243L303983l56823j912840j593929j592901k721991l980180m851512
$$ 5030243 8334226 7977403 6064563 4470634 2877733 155742 -3824438 -8675950
5066h675950n342830m091909M28789O335531Q845724N666414p957l112441k152544
$$ -8675950 -14018780 -18110689 -17681900 -11346369 -2500645 3165769 3157812 45371 -2107173
5057b107173j50063q55311m442609o756703l515447L998615Q805038N690785k151445
$$ -2107173 -2257236 -3112547 -7555156 -14311859 -17827306 -13828691 -5023653 667132 -1484313
5048a484313o482462l654959J953094M420224L028539J007085J36036p20414k570427
$$ -1484313 -7966775 -11621734 -9668640 -5248416 -2219877 -1212792 -1076756 -1797170 -4367597
5039d367597m101145k976390J460448O834035Q976746N411464j673952o757822
$$ -4367597 -8468742 -11445132 -9984684 -3150649 5826097 11237561 9563609 2805787
5031B805787o399076k810220p95442j592309j745608J365108N134385N029225
$$ 2805787 -3593289 -6403509 -7198951 -8791260 -10536868 -9171760 -4037375 991850
5023I91850J100641j862183j031370P43790l10793l084010l519594p94592J959382
$$ 991850 2092491 230308 -801062 -57272 -368065 -3452075 -6971669 -7766261 -5806879
5014e806879K588447K001543J134618m93873k172819j501773J625755L610342
$$ -5806879 -3218432 -1216889 -82271 -576144 -2748963 -4250736 -2624981 985361
5006I85361K102166k21421L81856L074799L928709J648903j514013l862379n824413
$$ 985361 3087527 2866106 3247962 6322761 10251470 11900373 10386360 6523981 699568
4997F99568p161859n734114n22625N828228Q997595P005052J571150m005621p471933
$$ 699568 -6462291 -12196405 -12719030 -6890802 2106793 9111845 10682995 6677374 -794559
4988g94559q032914n235218P16707O961064Q597804L885780k380109l930980r54783
$$ -794559 -8827473 -14062691 -13345984 -6384920 2212884 6098664 3718555 -212425 -1167208
4979a167208Q30016r61499k292586k7852K704755J776778j457220l118064l020644
$$ -1167208 -337192 -1298691 -3591277 -3619129 -914374 862404 -594816 -3712880 -6733524
4970f733524l320381l458554j531045Q97890N77972j527403j188087K256077M835376
$$ -6733524 -10053905 -13512459 -15043504 -14145614 -13567642 -15095045 -16283132 -14027055 -9191679
4961i191679M247145K571927J662323L32213k076578l388215k255627p60335o79439
$$ -9191679 -4944534 -2372607 -710284 -378071 -2454649 -5842864 -8098491 -8858826 -9538265
4952i538265q8403L088821O331315N137554l91997n159093n601990l598391k637157
$$ -9538265 -9626668 -6537847 -206532 4931022 4539025 -620068 -6222058 -9820449 -12457606
4943a2457606k615065q11265L131232N976958M999287J176860k550756m369107
$$ -12457606 -15072671 -15883936 -12752704 -6775746 -1776459 -599599 -3150355 -7519462
4935g519462l861629j271698J727199K443914O14115m08741J477940L228390J132526
$$ -7519462 -11381091 -12652789 -10925590 -8481676 -7867561 -8276302 -6798362 -3569972 -2437446
4926b437446k981620m575255l496866k727898j799307J520509M000498J90596
$$ -2437446 -5419066 -9994321 -13491187 -16219085 -18018392 -16497883 -12497385 -12306789
4918a2306789o365924n104892N167548J1906061O482670l085027m713014N18967
$$ -12306789 -18672713 -23777605 -18610057 -6703996 -221326 -3306353 -8019367 -7500400
4910g500400L142199J141733L94480K650365L268993j4450m259244o847740p429214
$$ -7500400 -4358201 -3216468 -2821988 -171623 3097370 3082920 -1176324 -8024064 -15453278
4901a5453278n352021q03926K921405L154852J691658R56760J59790p54172J049711
$$ -15453278 -20805299 -21609225 -18687820 -15532968 -13841310 -12884550 -12724760 -13478932 -12429221
4892a2429221M655202L608768l300016p724060n303599l647893p805894r290856
$$ -12429221 -7774019 -4165251 -7465267 -15189327 -20492926 -24140819 -31946713 -41237569
4884d1237569j598999N523549K356238k754126M95358L679026l062381p876375
$$ -41237569 -42836568 -37313019 -34956781 -37710907 -37215549 -33536523 -36598904 -44475279
4876d4475279M39055K726650j8601677k9577692J9685664J04913732J32789716
$$ -44475279 -44036224 -41309574 -59911251 -89488943 -69803279 35110453 167900169
4869A67900169O1610887l5411040o5799922l2781830n895263j1865973j6779629
$$ 167900169 229511056 194100016 128300094 95518264 89623001 77757028 60977399
4862F0977399j774693P958855l855240j5668583q980684K092140R10440m110463
$$ 60977399 59202706 67161561 63306321 47637738 38657054 40749194 41659634 37549171
4854C7549171j138901K168243l492640r601064o167314n543m46169k354251J448562
$$ 37549171 36410270 38578513 35085873 25484809 19317495 19311952 18865783 16511532 17960094
4845A7960094N006632J162963l985431k531709Q73319o46890k530598J279696
$$ 17960094 22966726 24129689 20144258 17612549 18485868 17838978 15308380 16588076
4837A6588076M936858O37206o947173q986509o923629o273535m428232K387819
$$ 16588076 21524934 22162140 15214967 6228458 -695171 -6968706 -11396938 -9009119
4829i009119P748061M271568k153707j009877N327896O255469P79951k835629
$$ -9009119 -1261058 3010510 856803 -153074 5174822 11430291 12210242 9374613
4821I374613k093408j666227j877379J300495N688381M680342m32213j586555
$$ 9374613 7281205 5614978 3737599 5038094 10726475 15406817 14974604 13388049
4813A3388049J939407J994799l891029p280733k067134N817169O826283N3347
$$ 13388049 15327456 17322255 13431226 6150493 4083359 9900528 16726811 16780158
4805A6780158p100821p745617j429130N970611P257400J254700n200504n124481
$$ 16780158 9679337 1933720 504590 6475201 13732601 14987301 9786797 4662316
4797D662316K92527M381801L818230Q18591j332164p93860K703336O336077N325905
$$ 4662316 4954843 9336644 13154874 13973465 12641301 11847441 14550777 20886854 26212759
4788B6212759o43590n514103n258372l628745m734954n615251k815504l69967
$$ 26212759 25569169 20055066 14796694 11167949 6432995 817744 -1997760 -2367727
4780b367727k578470m266695J288691R021001Q581873J396912j775810Q47964
$$ -2367727 -4946197 -9212892 -7924201 1096800 9678673 11075585 9299775 10147739
4772A0147739L73274n012236n488328K610253Q377554L262811n169249n565199
$$ 10147739 10521013 5508777 20449 2630702 11008256 14271067 9101818 3536619
4764C536619L30959L111094J044167n08683m44663k265705n112135l867668J674526
$$ 3536619 3867578 6978672 8022839 7514156 7069493 4803788 -308347 -4176015 -2501489
4755b501489N342454L511647j86851o34609K423433N321269N014393J509012k637893
$$ -2501489 2840965 6352612 6165761 5531152 7954585 13275854 18290247 19799259 17161366
4746A7161366m658786m042268k284685k19318K460707M490487K815912k962858
$$ 17161366 12502580 8460312 6175627 5956309 8417016 12907503 15723415 12760557
4738A2760557q417920r124460n970001l238412k827025k913908j607300M44519
$$ 12760557 4342637 -4781823 -10751824 -13990236 -16817261 -19731169 -21338469 -20893950
4730b0893950J295895M26854q9804K485862P692568J0914546Q441478K778614
$$ -20893950 -19598055 -19171201 -19261005 -16775143 -9082575 1831971 10273449 13052063
4722A3052063j70860R68576J799653m96695k941196j916161J402897L686240M274949
$$ 13052063 12881203 13849779 15649432 15152737 12211541 10295380 11698277 15384517 19659466
4713A9659466M021892K015709k596937p185137q048365n652562l884360m123348
$$ 19659466 23681358 25697067 23100130 15914993 7866628 2214066 -1670294 -5793642
4705e793642l527456j65346L195886K777373k30084m63257M052478P763615M044621
$$ -5793642 -9321098 -9486444 -6290558 -3513185 -3743269 -4206526 -154048 7609567 11654188
4696A1654188n004061r466571l931693N209647Q297435M686183J187016O55251
$$ 11654188 6650127 -2816444 -6748137 -1538490 6758945 11445128 12632144 13287395
4688A3287395o90142m365918n530744r00791M913790N349658O70441l227589k558738
$$ 13287395 12597253 8231335 2700591 1799800 6713590 12063248 12733689 9506100 6947362
4679F947362J204525M462966N050253L420457J725606R61387p93374n149692r150494
$$ 6947362 8151887 12614853 17665106 21085563 22811169 23772556 22979182 17829490 8678996
4670H678996q152684l008598M08760l39198j617029r46030p02048j953074j181226
$$ 8678996 526312 -2482286 -2073526 -2412724 -4029753 -4975783 -5677831 -7630905 -8812131
4661h812131K725199M579441J320402j703961O55857M107822K113029k551978
$$ -8812131 -6086932 -1507491 -187089 -1891050 -1235193 2872629 4985658 2433680
4653B433680k667291O01379K38182l116728j725613M553893N896820j565631q012569
$$ 2433680 -233611 367768 605950 -2510778 -4236391 317502 6214322 4648691 -3363878
4644c363878m126579N307927R141968N113766l3458j505271l33956J239827J929291
$$ -3363878 -7490457 -2182530 6959438 12073204 12039746 10534475 10200519 11440346 13369637
4635A3369637L47689l026940m195512o39694L604727K834173j754584l871446
$$ 13369637 13717326 10690386 6494874 5855180 9459907 12294080 10539496 6668050
4627F668050j816803l30361k051566l117486J30518M688504M832827m5291m864948
$$ 6668050 4851247 4520886 2469320 -648166 -517648 4170856 9003683 8958392 4093444
4618D093444m935680l25738M985437O651732L478674j243659k662624M03955M115554
$$ 4093444 -842236 -1167974 3817463 10469195 13947869 12704210 10041586 10445541 14561095
4609A4561095M359847J524925p80679n45124Q69351J133370n24831l000873m242136
$$ 14561095 18920942 20445867 19665188 19120064 19989415 21122785 20597954 17597081 13354945
4600A3354945k673756J182883M619335N121696K664407q53457l655952m809944
$$ 13354945 10681189 11864072 16483407 21605103 24269510 23416053 19760101 14950157
4592A4950157m103748k595540k218908l226654l233625q49828J238901m4387k570097
$$ 14950157 10846409 8250869 6031961 2805307 -428318 -1278146 -39245 -83632 -2653729
4583b653729j482035K684707L534230j704640p191956o416976j042724K606403
$$ -2653729 -4135764 -1451057 2083173 378533 -6813423 -13230399 -14273123 -11666720
4575a1666720K657398J958350J418505p03685l293407k400389K000300M754544
$$ -11666720 -9009322 -7050972 -5632467 -6336152 -9629559 -12029948 -10029648 -5275104
4567e275104L222796J352420K965720N167611K696299l761779q098906o622952
$$ -5275104 -2052308 -699888 2265832 7433443 10129742 6367963 -1730943 -8353895
4559h353895j544914L130855N750115O382385M929642J665039j579369k570017
$$ -8353895 -9898809 -6767954 -1017839 5364546 10294188 11959227 10379858 7809841
4551G809841j288182m63720k484476n798776n888729r60282M762451N676082J909659
$$ 7809841 6521659 6057939 3573463 -2225313 -8114042 -9074324 -4311873 1364209 3273868
4542C273868j222772q41136J85432j069402k420351l78069L373582L669554l84316
$$ 3273868 2051096 1209960 1395392 325990 -2094361 -2472430 901152 4570706 4186390
4533D186390l484059j391473K882420K958634k036502n896450l748114Q86645
$$ 4186390 702331 -689142 2193278 5151912 3115410 -2781040 -6529154 -5642509
4525e642509Q34176m151381o513272j988985L645829L051047j674545k712068
$$ -5642509 -4808333 -8959714 -15472986 -17461971 -13816142 -10765095 -12439640 -15151708
4517a5151708J201789L826870K431090J510361L494183L788596o41734m710241
$$ -15151708 -13949919 -10123049 -7691959 -6181598 -2687415 1101181 459447 -4250794
4509d250794l054824J080362J501004o99278n9102K942529K657883j459133l227214
$$ -4250794 -7305618 -6225256 -4724252 -5423530 -5482632 -2540103 117780 -1341353 -4568567
4500d568567M96341N027787M986686J081113k563728l807456k982567j136322
$$ -4568567 -4072226 955561 5942247 7023360 4459632 652176 -2330391 -3466713
4492c466713K88713L20172q292Q14850J743839P20848r69743L6683L185501L938447
$$ -3466713 -3178000 -2857828 -2866120 -2051270 -307431 413417 -556326 -519643 2665858 6604305
4482F604305J055369q88141J260640L964858K571011j407616k951211j285943
$$ 6604305 7659674 6771533 8032173 11997031 14568042 13160426 10209215 8923272
4474H923272m50054k790847n789777n849803k596298J357864L353026K793699
$$ 8923272 8473218 5682371 -107406 -5957209 -8553507 -7195643 -3842617 -1048918
4466a048918J118606l2558n83008j403660k294150k221439j682015k496484m333433
$$ -1048918 69688 37130 -545878 -1949538 -4243688 -6465127 -8147142 -10643626 -14977059
4457a4977059l999027m3530M192563M696812K217669N31759M60101o53516l457817
$$ -14977059 -18976086 -19019616 -14827053 -10130241 -7912572 -7380813 -6920712 -7574228 -11032045
4448a1032045m514239j402263L062667M398725K544031J350011K619305L946697
$$ -11032045 -15546284 -16948547 -13885880 -9487155 -6943124 -5593113 -2973808 972889
4440I72889L200028J970734K406748L008328Q10529l524274o542336p502080q633692
$$ 972889 4172917 6143651 8550399 11558727 12369256 8844982 2302646 -5199434 -13833126
4431a3833126r242580m897652M540803J1042386P777582q27577m576975j334824
$$ -13833126 -23075706 -27973358 -23432555 -12390169 -4612587 -5440164 -10017139 -11351963
4423a1351963J604202L3256r41920L806637J0297025J0752418M327033k648152
$$ -11351963 -9747761 -9714505 -10656425 -6849788 3447237 14199655 18526688 15878536
4415A5878536n162321l681253r23921J154696J205450j011351l276209k750725
$$ 15878536 10716215 7034962 6111041 7265737 8471187 7459836 4183627 1432902
4407A432902J33104J795099K10022k431549k743261m43326J518522O12591k249671
$$ 1432902 1566006 3361105 3571127 1139578 -1603683 -2047009 -528487 84104 -2165567
4398b165567l503831r24685L291128M520905J389159k029926j310532K218732
$$ -2165567 -5669398 -6594083 -3302955 1217950 2607109 577183 -733349 1485383
4390A485383L115393n45898m240521l077001J650534M447659K770661p30252k777403
$$ 1485383 4600776 4054878 -185643 -3262644 -1612110 2835549 5606210 4875958 2098555
4381B098555l102045k633925j046116J769745L932732L949684L347429L963849
$$ 2098555 -1003490 -3637415 -4683531 -2913786 1018946 4968630 8316059 12279908
4373A2279908L954890L84847m833692o366861l447399j240853k311871k309437
$$ 12279908 16234798 16619645 11785953 5419092 1971693 730840 -1581031 -3890468
4365c890468K000432N613895K207780n276322q025298l864869P58428J332841
$$ -3890468 -1890036 3723859 5931639 655317 -7369981 -11234850 -10476422 -9143581
4357i143581P12432K332546M494504M540914L555054L254033K316082m00709k391704
$$ -9143581 -8431149 -6098603 -1604099 2936815 6491869 9745902 12061984 11661275 9269571
4348I269571j297284M52260j052683m941326o602077m132384k28731K089914K602211
$$ 9269571 7972287 8424547 7371864 2430538 -4171539 -8303923 -8532654 -6442740 -3840529
4339c840529K497702K312027J969972J510232J206389J427960K202690K638472
$$ -3840529 -1342827 969200 2939172 4449404 5655793 7083753 9286443 11924915
4331A1924915J449343j522804m862916o652049n371320o92461M914624O512215
$$ 11924915 13374258 11851454 6988538 336489 -5034831 -5727292 -812668 5699547
4323E699547J710963m989796o507396k155236J634229L88515l151381m669201
$$ 5699547 7410510 2420714 -4086682 -6241918 -4607689 -4219174 -7370555 -12039756
4315a2039756m311554l864254k243016J805961N664150O116792M387000L513451
$$ -12039756 -16351310 -20215564 -22458580 -20652619 -14988469 -8871677 -4484677 -971226
4307i71226K852539l4572l735363m508437k649901k059450l469841l268117J81010
$$ -971226 1881313 1846741 -1888622 -6397059 -9046960 -11106410 -14576251 -17844368 -17663358
4298a7663358L864265N092417M689718L536237M09384m081978n459633j089933
$$ -17663358 -13799093 -8706676 -4016958 -480721 -71337 -4153315 -9612948 -10702881
4290a0702881M770210N809410K074038o45891N63318K056743k05622m432645n626121
$$ -10702881 -5932671 -123261 1950777 1304886 1868204 3924947 3719325 -713320 -6339441
4281f339441k386013J975952M334832M654968L779576J435382k106175m752235
$$ -6339441 -8725454 -6749502 -2414670 2240298 6019874 7455256 5349081 596846
4273E96846m929366l566610k051182m1444K750381M697494M647298L985484L469969
$$ 596846 -4332520 -7899130 -9950312 -9991756 -7241375 -2543881 2103417 6088901 9558870
4264I558870P78359m746074p887528l960068K647562L485664j200366k808717
$$ 9558870 10337229 5591155 -2296373 -6256441 -3608879 -123215 -1323581 -4132298
4256d132298J860590N928109M034311l8902j468801j906578l457708k817346J841135
$$ -4132298 -2271708 3656401 7690712 7651810 6183009 4276431 818723 -1998623 -157488
4247a57488M827721J350247l793095l884595j289443j992650l911424p22083N827765
$$ -157488 4670233 6020480 2227385 -1657210 -2946653 -4939303 -8850727 -9572810 -3745045
4238c745045P867306M046145K63503j273300l729643o635444n379415o43324J277631
$$ -3745045 4122261 8168406 8431909 7158609 3428966 -3206478 -8585893 -9229217 -7951586
4229g951586r92513k253216r10890j101067k883535q90562M214538M021259l055960
$$ -7951586 -8944099 -11197315 -12108205 -13209272 -16092807 -16983369 -12768831 -8747572 -11803532
4220a1803532o433405N37005R009079P698894p84073o064571n588693l843198
$$ -11803532 -18236937 -17699932 -8690853 -991959 -1776032 -7840603 -13429296 -17272494
4212a7272494j301169M649858J0486709R229893K136279j693647J488312N167097
$$ -17272494 -18573663 -13923805 -3437096 5792797 7929076 6235429 7723741 12890838
4204A2890838K728916l944431q470632p776741l707314j62500j3368k411996k974570
$$ 12890838 15619754 11675323 3204691 -4572050 -8279364 -8441864 -8455232 -10867228 -13841798
4195a3841798Q85584N531707N223312l1441m447221m083015p92922J688346K103012
$$ -13841798 -12956214 -7424507 -2201195 -2232636 -6679857 -10762872 -11555794 -9867448 -7764436
4186g764436J313082L93232O0395K23676j60465j338605j494818Q10202L722656
$$ -7764436 -6451354 -6058122 -5997727 -5774051 -5934516 -7273121 -8767939 -7957737 -4235081
4177d235081M034415J565704q35727j419926j193289j341849j362817n99049r1006
$$ -4235081 -200666 1365038 529311 -890615 -2083904 -3425753 -4788570 -5387619 -5478625
4168e478625j628320m970918o674086l077802M510536R350839O735842O66412
$$ -5478625 -7106945 -12077863 -18751949 -21829751 -17319215 -7968376 -1232534 -566122
4160e66122j000084K481403L990329m58857o073525p111722m408302j464717J251293
$$ -566122 -1566206 915197 4905526 4446669 -1626856 -8738578 -13146880 -14611597 -13360304
4151a3360304L470916K048210l540320p284681m479702N83045J116560k171866
$$ -13360304 -9889388 -7841178 -11381498 -18666179 -23145881 -22562836 -21446276 -23618142
4143b3618142m569593o079220p717620l455521J2247865L0107571L2088032J4491166
$$ -23618142 -28187735 -34266955 -41984575 -45440096 -33192231 -3084660 29003372 43494538
4135D3494538n927803j2956789q362491l455756k635164k711866j863295j067732
$$ 43494538 37566735 24609946 16247455 12791699 10156535 7444669 5581374 4513642
4127D513642j40406J238603J076524j494320l182693j315378J527637K016944
$$ 4513642 4373236 5611839 6688363 5194043 2011350 695972 2223609 4240553
4119D240553J652993K817014K762084k178730q563410q694443j110098P440380
$$ 4240553 5893546 8710560 11472644 9293914 730504 -7963939 -9074037 -1633657
4111a633657J0672082Q435469L512321k004414n769128n287049j467013R85651
$$ -1633657 9038425 17473894 20986215 18981801 13212673 7925624 6458611 7444262
4103G444262r38602m743083n915639l376379L82921L074831M436722M979410M847458
$$ 7444262 6505660 1762577 -4153062 -7529441 -7146520 -4071689 365033 5344443 10191901
4094A0191901M088914K876259J121533j385054m053816n256737l712964j41471
$$ 10191901 14280815 17157074 18278607 16893553 12839737 7583000 3870036 3728565
4086C728565K946732L294284N77936l592517o542098n713632p01184N211608P191115
$$ 3728565 6675297 9969581 10547517 6955000 412902 -5300730 -6001914 -790306 6400809
4077F400809L875218r23557k765969j411331L81433J053090R17561J83610q13783
$$ 6400809 10276027 9352470 6586501 5175170 5556603 6609693 7527254 7710864 6897081
4068F897081m83754J854438L548572J721349j815691k486560L55141K547599J290873
$$ 6897081 6413327 8267765 11816337 13537686 11721995 9235435 9590576 12138175 13429048
4059A3429048j608934l301906l006171q73381K439304M274770K090386j995792
$$ 13429048 11820114 8518208 5512037 4638656 7077960 11352730 13443116 11447324
4051A1447324l108010j084284r04888l878939m366876J079549O777334N356539
$$ 11447324 8339314 7255030 6350142 2471203 -1895673 -816124 5961210 11317749
4043A1317749j645680o134813m059220J215947M406265K957499k174117o693922
$$ 11317749 9672069 3537256 -521964 693983 5100248 8057747 5883630 -810292
4035h10292n845348m64137K646913J39339k049625K133258P852334N644069l357770
$$ -810292 -6655640 -7119777 -4472864 -4333525 -6383150 -4249892 3602442 9246511 5888741
4026E888741p918050l192407K523078Q24438m971539o141908p72365O068450J0193885
$$ 5888741 -2029309 -5221716 -2698638 -1874200 -6845739 -12987647 -13760012 -7691562 2502323
4017B502323J0639194P095694P38602l976388l543790o66818o87729l398010l386975
$$ 2502323 13141517 20237211 20975813 16999425 13455635 12788817 12101088 8703078 5316103
4008E316103J130519N048472L890424J55306j154792j66872r82930m305085n882812
$$ 5316103 6446622 11495094 15385518 15540824 14386032 14219160 13236230 8931145 3048333
3999C048333l022977J183380K175463j43539k286274k236040q30785Q30175K347407
$$ 3048333 25356 1208736 3384199 3240660 954386 -1281654 -2112439 -1282264 1065143
3990A065143K835292J860092J464920L830445O588696M583619k281798p349014
$$ 1065143 3900435 5760527 7225447 11055892 17644588 22228207 19946409 12597395
3982A2597395o097413k565270k828361n693958n430338j484643J044413K04748
$$ 12597395 6499982 3934712 1106351 -4587607 -10017945 -11502588 -10458175 -10253427
3974a0253427j81973J962278L000410J34847l045913j652971L224837O478221
$$ -10253427 -10435400 -8473122 -5472712 -5337865 -8383778 -10036749 -6811912 -333691
3966c33691O005514L848951J790117k83997k157199k873508k692084k796419k922582
$$ -333691 5671823 9520774 11310891 11026894 8869695 5996187 3304103 507684 -2414898
3957b414898j664533O42825J628955L9061k594355l888958k736968N90641M645717
$$ -2414898 -4079431 -3436606 -1807651 -1768590 -4362945 -8251903 -10988871 -10398230 -5752513
3948e752513O849600N336287J422088j493699k044598j966162k493333k350468
$$ -5752513 1097087 6433374 7855462 6361763 4317165 2351003 -142330 -2492798
3940b492798p76754L06128k90315P414L531090P249520O281987J673357p41592
$$ -2492798 -3269552 -2963424 -3253739 -3246325 284765 7534285 13816272 15489629 14748037
3931A4748037L56100k41276m648781o632528r46826P046469P913523J548383l285852
$$ 14748037 15104137 14862861 10214080 3581552 2634726 9681195 17594718 19143101 15857249
3922A5857249j817038J839026L219766L329125L400838R17317m702901p987661
$$ 15857249 14040211 15879237 19099003 22428128 25828966 26746283 22043382 14055721
3914A4055721m505724J625397K938586r90735l721445j291070L567857O284292
$$ 14055721 9549997 11175394 14113980 13123245 9401800 8110730 11678587 17962879
3906A7962879N333381J967752j678645l784709m346222n281439p331757q111880
$$ 17962879 23296260 25264012 23585367 19800658 15454436 10172997 2841240 -5270640
3898e270640n459497j052900K136295M189562O493872P330720L805827k286283
$$ -5270640 -10730137 -11783037 -9646742 -5457180 1036692 8367412 12173239 9886956
3890I886956n138411k176468K950999N276569L344678j109192n108111n745405
$$ 9886956 4748545 2572077 5523076 10799645 14144323 13035131 7927020 2181615
3882B181615k667480M82283J03094k039709j103846L268476N931142L587744r28343
$$ 2181615 -485865 -3582 99512 -1940197 -3044043 224433 6155575 9743319 8814976
3873H814976l080628j706661J674920N069129O020977K888079k195277m694367
$$ 8814976 5734348 4027687 5702607 10771736 16792713 19680792 17485515 12791148
3865A2791148l397798j602092j514641j363345K92296J502493N60884j011786
$$ 12791148 9393350 7791258 6276617 4913272 5205568 6708061 7268945 6257159
3857F257159j644876k339314l518618k885834N99932L995412M655729L878281
$$ 6257159 4612283 2272969 -1245649 -4131483 -3531551 463861 5119590 8997871
3849H997871L262646J309093k609534m831924k650266M66864J12776j627771J03030
$$ 8997871 12260517 13569610 10960076 6128152 3477886 3944750 4057526 2429755 2532785
3840B532785M112213M615841M63749l516479m200273l056176j063223K999871
$$ 2532785 6644998 11260839 11724588 8208109 4007836 951660 -111563 2888308
3832B888308P821217Q862123M657217p52073l625788m431130m213881j988340
$$ 2888308 10709525 19571648 24228865 23476792 19851004 15419874 11205993 9217653
3824I217653J504577K088113j964806n908815m571281K05059K467957O99085j077569
$$ 9217653 10722230 12810343 10845537 4936722 365441 570500 3038457 3737542 2659973
3815B659973j46751J282452K44016k384243l312852j451750O21737p5304k906687
$$ 2659973 2513222 3795674 4039690 1655447 -1657405 -3109155 -2487418 -2562722 -5469409
3806e469409l826392l65832M425550N050558P41551k934415j099978L859519N179510
$$ -5469409 -9295801 -9661633 -5236083 -185525 556026 -2378389 -3478367 381152 5560662
3797E560662L20805n822566o742237j691392L768669M082665l81594m296736l914377
$$ 5560662 5881467 58901 -6683336 -8374728 -4606059 -523394 -904988 -5201724 -9116101
3788i116101j130561q282r32602r68327N64143O60066j999544l828365j270015
$$ -9116101 -10246662 -10254944 -11187546 -12155873 -11591730 -10931664 -12931208 -16759573 -18029588
3779a8029588L574762N806342M749264M120832N518147O033121L553106N01591
$$ -18029588 -14454826 -8648484 -3899220 221612 5739759 11772880 15325986 15827577
3771A5827577l83833j039378m898003j0031034j0102814l216082M100325M526840
$$ 15827577 15443744 14404366 9506363 -524671 -10627485 -13843567 -9743242 -5216402
3763e216402q58046m638044l231219o57704j238738k780972l35430N645095R212682
$$ -5216402 -6074448 -10712492 -13943711 -14601415 -15840153 -18621125 -18956555 -13311460 -4098778
3754d098778O897547K037590k49418L02126j64793l561703p054939o672343k183254
$$ -4098778 2798769 4836359 4586941 4889067 4724274 1162571 -5892368 -12564711 -14747965
3745a4747965K586022L888702J692565r71528j511411K72557L298696O530077
$$ -14747965 -12161943 -8273241 -6580676 -7552204 -9063615 -8791058 -5492362 1037715
3737A037715Q476104P084597K015454l657024n928735m039135p34989J353096
$$ 1037715 9513819 16598416 18613870 14956846 9028111 4988976 4253987 5607083
3729E607083J789548Q84711j406278m091728m620949j601829K800984M841803
$$ 5607083 7396631 8281342 6875064 2783336 -1837613 -3439442 -638458 4203345
3721D203345L405944J007172M17702J294939Q71984k253905n885986o459236l210168
$$ 4203345 7609289 8616461 9034163 10329102 11201086 8947181 3061195 -3398041 -6608209
3712f608209R20951K753420K040845O05709k94230n01730j7001R08890J530074
$$ -6608209 -5687258 -2933838 -892993 -287284 -581514 -1083244 -1100245 -191355 1338719
3703A338719J857574L067431M993619M753031N60108m277145m716222j004531
$$ 1338719 3196293 6263724 11257343 16010374 16570482 12293337 7577115 6572584
3695F572584J496836q3163k771214l238817k417467k186218j278993J810086M477261
$$ 6572584 8069420 7986257 5215043 1976226 -441241 -2627459 -3906452 -2096366 2380895
3686B380895K888543j822088m152330j189781L909388N908790L024262j859407
$$ 2380895 5269438 3447350 -704980 -1894761 2014627 7923417 10947679 9088272
3678I088272m202987k112235J530256K034151j156541l243674n16659M096292
$$ 9088272 4885285 2773050 4303306 6337457 5180916 1937242 1420583 5516875
3670E516875M956911J711796o65061L69891J473987q09342m453316m927585j750894
$$ 5516875 10473786 12185582 11520521 11890412 13364399 12555057 8101741 3174156 1423262
3661A423262J017653M05671j939375k654335j434037j053989k655980l120969
$$ 1423262 2440915 2846586 907211 -1747124 -3181161 -4235150 -6891130 -10012099
3653a0012099Q06441O691597Q001824K532258l956850m990953j666052j28829
$$ -10012099 -9205658 -2514061 5487763 8020021 4063171 -927782 -2593834 -2722663
3645b722663k486221m658014l071971Q63117L925285M942621L939716P44609l364176
$$ -2722663 -5208884 -9866898 -12938869 -12075752 -8150467 -3207846 731870 1476479 -1887697
3636a887697n111499k734284J403101L419867J957189j386858m005776l762427
$$ -1887697 -6999196 -9733480 -8330379 -4910512 -2953323 -4340181 -8345957 -12108384
3628a2108384n27114K768625K867310Q97628J383511N166575P115667L591581
$$ -12108384 -12635498 -9866873 -6999563 -6101935 -4718424 448151 7563818 11155399
3620A1155399j682400l336790k567706m075517p006452n765865K01549M328661
$$ 11155399 9472999 6136209 3568503 -507014 -7513466 -13279331 -13077782 -8749121
3612h749121K615310n24370N89641M655304O394629M283389P97967k602503n976706
$$ -8749121 -6133811 -6658181 -6068540 -1413236 4981393 9264782 10062749 7460246 1483540
3603A483540p648810n233488q1152L235784K749672J358404K249840M677224N640467
$$ 1483540 -6165270 -11398758 -11479910 -8244126 -5494454 -4136050 -1886210 2791014 8431481
3594H431481L818541M21344k541510l665050k810510j330527r65031j925969k691654
$$ 8431481 12250022 12671366 10129856 6464806 3654296 2323769 1358738 -567231 -3258885
3585c258885j941504R3323K288354L628456L469682J933165J57803r39697j929593
$$ -3258885 -5200389 -5107066 -2818712 809744 4279426 6212591 6370394 5430697 3501104
3576C501104l329782l266075N88451O269453Q034182L534326k392493l925031
$$ 3501104 171322 -3094753 -2506302 3763151 11797333 15331659 12939166 9014135
3568I014135j870886j285297l019546k557300K237822O911436O322693J524699
$$ 9014135 7143249 5857952 2838406 281106 2518928 9430364 15753057 17277756
3560A7277756k250929k498105j199896p08456j057731j541946k266158l065912
$$ 17277756 15026827 12528722 11328826 10620370 9562639 8020693 5754535 2688623
3552B688623k701820n40901J918496K557315J319727J71131K44664J86071j732598
$$ 2688623 -13197 -554098 1364398 3921713 5241440 5412571 5657235 5843306 4110708
3543D110708m410324m387353k43786M626286N274668J070659l420625l994154
$$ 4110708 -299616 -4686969 -4930755 -304469 4970199 6040858 2620233 -1373921
3535a373921j542180J31259j40931J03293K500431M917021M347153J301427o41133
$$ -1373921 -2916101 -2784842 -2925773 -2822480 -322049 4594972 8942125 10243552 9602419
3526I602419N65845K934576L054370J15954l457010m784802l155336k52996J401820
$$ 9602419 10168264 13102840 16157210 16273164 12816154 8031352 4876016 4623020 6024840
3517F024840M01686k316624m150422l479033j611945j171274k514108l108502
$$ 6024840 6426526 4109902 -40520 -3519553 -5131498 -6302772 -8816880 -11925382
3509a1925382r75573K714937N521265O758265O983678N647734J726962l481735
$$ -11925382 -12900955 -10186018 -4664753 2093512 9077190 14724924 16451886 12970151
3501A2970151o671360o261139l887813j514437Q51256L403339M649264L361302
$$ 12970151 6298791 37652 -3850161 -5364598 -4513342 -1110003 3539261 6900563
3493F900563J069205K27812N32720m43912k872113l528592l31207L805059L762027
$$ 6900563 7969768 8197580 8730300 8286388 5414275 1885683 1554476 5359535 9121562
3484I121562j453299o939258p117788j793640L872093N004090J567810k740719
$$ 9121562 7668263 729005 -6388783 -8182423 -4310330 693760 2261570 -479149
3476d79149m814836m362104k692250r35321L41915R90522J364320J937490K561206
$$ -479149 -5293985 -9656089 -12348339 -13283660 -12941745 -11951223 -10586903 -8649413 -6088207
3467f088207K683080K331927K046440J780452R51696k08960n82832Q1565N27940
$$ -6088207 -3405127 -1073200 973240 2753692 3705388 3496428 2913596 2995161 3523101
3458C523101k11604j416711j769464q90200P75488K454676K843625Q95779k184210
$$ 3523101 3311497 1894786 125322 -764878 10610 2465286 5308911 6204690 4020480
3449D020480l247677r23183K251476L000223J418181O5837M31k4397q64827j766786
$$ 4020480 772803 -150380 2101096 5101319 6519500 6585337 6585768 6561371 5696544 3929758
3439C929758j931056j422774l12551J430370K906365K652295M83461k098626l496844
$$ 3929758 1998702 575928 263377 1693747 4600112 7252407 7735868 5637242 2140398
3430B140398l102957j117735J356019K292906M96110k489473l764734k606744
$$ 2140398 -962559 -2080294 -724275 1568631 2064741 -424732 -4189466 -6796210
3422f796210j063266o93859m74927J092105L168707L399585J232136q51596r0398
$$ -6796210 -7859476 -8553335 -9028262 -7936157 -4767450 -1367865 -135729 -987325 -1077723
3413a077723K912698M401308K063610j693650k943662j881721k045026l771388
$$ -1077723 1834975 6236283 8299893 6606243 3662581 1780860 -264166 -4035554
3405d035554k936197J741692M943301K429085j683502j110425K299806J796261
$$ -4035554 -6971751 -5230059 -286758 2142327 458825 -651600 1648206 3444467
3397C444467k353428k785321K331188N379651J272151m465712m542067m07245
$$ 3444467 1091039 -1694282 636906 6016557 7288708 2822996 -1719071 -2126316
3389b126316K017357K002876K798289M404585M267976K831455K193827J165828
$$ -2126316 -108959 1893917 4692206 9096791 13364767 16196222 18390049 19555877
3381A9555877k200860m877696k362021K925726L764739r87615m505040k486662
$$ 19555877 17355017 12477321 10115300 13041026 16805765 15818150 11313110 8826448
3373H826448R00456K78150l215052m999115l774416j522996L56516J648495K004732
$$ 8826448 9726904 10005054 6790002 1790887 -1983529 -3506525 -3150009 -1501514 503218
3364E03218J634128J892123L367993M659297M130825J519825k459402o075572
$$ 503218 2137346 4029469 7397462 12056759 16187584 17707409 15248007 9172435
3356I172435o399512k301778K346839K416726j003058j529253K751133N728104
$$ 9172435 2772923 471145 2817984 5234710 4231652 2702399 5453532 11181636
3348A1181636K329005l889178o371783m670971k992452k737407j880042j037J141701
$$ 11181636 13510641 9621463 3249680 -1421291 -4413743 -7151150 -9031192 -9032229 -7890528
3339g890528J218398J264915Q94236n30883j124323R25631L148907J875017j292727
$$ -7890528 -6672130 -5407215 -4512979 -5043862 -6168185 -5242554 -2093647 -218630 -1511357
3330a511357j312372K055337L409446J47954l636306l774525j748344r30644j077730
$$ -1511357 -2823729 -768392 2641054 2789008 -847298 -4621823 -6370167 -7300811 -8378541
3321h378541j9699K021079L280748L739135M466708M956064L742645Q68972k244654
$$ -8378541 -8398240 -6377161 -3096413 642722 5109430 10065494 13808139 14677111 12432457
3312A2432457m525132n332543m088730j450036M57350O57617Q14515K311641L399483
$$ 12432457 7907325 2574782 -1513948 -2963984 -2506634 -1849017 -1034502 1277139 4676622
3303D676622J648520j886814l731714k837929j679237k211391l131715k178392
$$ 4676622 6325142 4438328 706614 -2131315 -3810552 -6021943 -9153658 -11332050
3295a1332050M60161K382776K051169O12068M14733J966968K949815R73180k951768
$$ -11332050 -10871889 -8489113 -6437944 -5825876 -5411143 -3444175 -494360 478820 -2472948
3286b472948n034998l200647M63459K604167K525569J857376J528672R94005J5377
$$ -2472948 -7507946 -10708593 -10245134 -7640967 -5115398 -3258022 -1729350 -735345 -719968
3277g19968o10520k69348P17670J638374J843730R15740o62635j340363j21804
$$ -719968 -1330488 -1599836 -882166 756208 2599938 3515678 2853043 1512680 1390876
3268A390876J834024K340094Q07797j287009k464043k672369k587774k471899
$$ 1390876 3224900 5564994 6372791 5085782 2621739 -50630 -2638404 -5110303
3260e110303k034718r00247Q13212K051444J482467o90854k195572j103612J547090
$$ -5110303 -7145021 -8045268 -7232056 -5180612 -3698145 -4388999 -6584571 -7688183 -6141093
3251f141093K778848J267222j235589k176015q87327J206186K245594J549999
$$ -6141093 -3362245 -2095023 -3330612 -5506627 -6393954 -5187768 -2942174 -1392175
3243a392175J37649k52979R99750K751931L562863L174400K019888K59906j643203
$$ -1392175 -1254526 -1507505 -507755 2244176 5807039 8981439 11001327 11261233 9618030
3234I618030k346673j123727O86454J275144Q37831P45796Q58464j52634k044456
$$ 9618030 7271357 6147630 6834084 8109228 8947059 9692855 10551319 10398685 8354229
3225H354229l026387k738373k609074k643143p79558K997184M666934J039365
$$ 8354229 5327842 2589469 -19605 -2662748 -3442306 -445122 4221812 5261177
3217E261177m951714o884430k534620L594323N835586L435972J47008q12709J05843
$$ 5261177 309463 -6574967 -9109587 -5515264 320322 3756294 3903302 3090593 3196436
3208C196436M11693r34584k478621k508314j364393p87778j424475k080595j570450
$$ 3196436 3608129 2673545 194924 -2313390 -3677783 -4465561 -5890036 -7970631 -9541081
3199i541081k51718Q05626J399011K184030L407245M308731L918078K269194O26051
$$ -9541081 -9792799 -8987173 -7588162 -5404132 -1996887 2311844 6229922 8499116 9125167
3190I125167K02927O64568N05779q31097k053483j799203m26701P38135R66650
$$ 9125167 9328094 9992662 10498441 9667344 7613861 5814658 5387957 6126092 7092742
3181G092742Q8627j778240l244730k078870J495361L686047J894902j135599j290562
$$ 7092742 7181369 5403129 2158399 79529 1574890 5260937 7155839 6020240 4729678
3172D729678M12813k44012l170739l878522j270849L91055r31668j400624J656244
$$ 4729678 5142491 4898479 1727740 -2150782 -3421631 -3030576 -3962244 -5362868 -3706624
3163c706624M458873K819260j016741k423410j568295j364780j481358m0482J290927
$$ -3706624 752249 3571509 2554768 131358 -1436937 -2801717 -4283075 -4323557 -3032630
3154c032630n9500j761836K47108M037375L838178l94093k399807O12276M128109
$$ -3032630 -3092130 -4853966 -4606858 -569483 3268695 2874602 474795 1087071 5215180
3145E215180L880413J269241q61517k342664l150558j914944M11768L07430k178269
$$ 5215180 9095593 10364834 9503317 7160653 4010095 2095151 2506919 2814349 636080
3136F36080k119570K211163N193098K064579l427589m761198k248743j187327
$$ 636080 -1483490 727673 5920771 7985350 4557761 -203437 -2452180 -3639507
3128c639507k989476m018453k067660J149710L529314M422708L449250J105135
$$ -3639507 -6628983 -10647436 -12715096 -11565386 -8036072 -3613364 -164114 941021
3120I41021j09317J443339L407745K444502p40022k705840k264546o03763J882754
$$ 941021 831704 2275043 5682788 8127290 7387268 4681428 2416882 1813119 3695873
3111C695873M667290M653365j77258n593847n190316L96266L944020J898403j570207
$$ 3695873 8363163 13016528 12839270 7245423 2055107 2451373 6395393 8293796 6723589
3102F723589k102020r20066n80191k48120J295647K147535N89709j246008o21814
$$ 6723589 4621569 3701503 3121312 2873192 4168839 6316374 6906083 5660075 5038261
3093E038261J356534J730853K7566k137980l661657l689584j203000K523819L681412
$$ 5038261 6394795 8125648 8153214 6015234 2353577 -1336007 -2539007 -15188 3666224
3084C666224J037664j478037n94417R47946q34939l804455k648729K272622N027659
$$ 3666224 4703888 3225851 2631434 3579380 2744441 -1060014 -3708743 -1436121 3591538
3075C591538K971924l04797j800522l121850n442358n629390j122397M853260
$$ 3591538 6563462 6258665 4458143 1336293 -4106065 -9735455 -10857852 -6004592
3067f004592O940096M426503R29139j065152j899853k031415j154304m9913l83026
$$ -6004592 935504 5362007 6291146 5225994 3326141 1294726 140422 90509 -292517
3058b92517k088675l132991k427477j104348k89340N78508K194313L580950L187303
$$ -292517 -2381192 -5514183 -7941660 -9046008 -9335348 -8756840 -6562527 -2981577 205726
3049B05726J120690q54105j335708n51685L15294N28114M06860O63541J209921
$$ 205726 1326416 472311 -863397 -1415082 -1099788 -571674 -164814 498727 1708648
3040A708648J054994j05904p32111Q41969L515384L988757J113904k000510j963509
$$ 1708648 2763642 2657738 1925627 2767596 6282980 10271737 11385641 9385131 7421622
3031G421622R2984K05658k383733l976275k054116P63140N44070k185286l319153
$$ 7421622 7514606 7720264 5336531 1360256 -693860 69280 613350 -1571936 -4891089
3022d891089r69185K440076L944499L396828K301451J333639L07963o18544j019330
$$ -4891089 -5860274 -3420198 524301 3921129 6222580 7556219 7864182 7245638 6226308
3013F226308r64484q87333r66673j026804p43064Q8960R90266P52396j104310
$$ 6226308 5261824 4374491 3407818 2381014 1637950 1726910 2717176 3469572 2365262
3004B365262l004262k736159l07217J959948K359290J286812m66155k819798m792076
$$ 2365262 -639000 -3375159 -3682376 -1722428 636862 1923674 1457519 -1362279 -6154355
2995f154355l936821N18270N214315N692610J648440k646277l194059j23562L305066
$$ -6154355 -10091176 -9572906 -4358591 1334019 2982459 336182 -2857877 -2981439 323627
2986C23627M127410J821937j762091l983820l470833j052737J373516K641928
$$ 323627 4451037 6272974 4510883 527063 -2943770 -3996507 -2622991 18937
2978A8937K722696J896317K95583j813579l769258m571143l355230m23976K336147
$$ 18937 2741633 4637950 4933533 3119954 -649304 -5220447 -8575677 -8999653 -6663506
2969f663506L201933K844592L240122M078295K639775j474290m178673k169487
$$ -6663506 -3461573 -616981 2623141 6701436 9341211 7866921 3688248 1518761
2961A518761J666117J802389j873826l769221p86542L294031L438396K3790k795536
$$ 1518761 3184878 4987267 3113441 -655780 -1442322 1851709 5290105 5313895 2518359
2952B518359l061823k192657j353205P8993K217824L440714K616045J094742J091735
$$ 2518359 -543464 -2736121 -4089326 -4010333 -1792509 1648205 4264250 5358992 6450727
2943F450727K550775K910132M40066l054244m117620k184690n24510j639037l459250
$$ 6450727 9001502 11911634 12351700 9297456 5179836 2995146 2470636 831599 -2627651
2934b627651k345321J240406L190535J868256L00571J060967K246768R18721j976041
$$ -2627651 -4972972 -3732566 -542031 1326225 1626796 2687763 4934531 5853252 3877211
2925C877211l172211k046920q34081n88569j131J739274L528405M178641L594020
$$ 3877211 705000 -1341920 -2176001 -2764570 -2765701 -1026427 2501978 6680619 10274639
2916A0274639J909248n14450k115049j421241L14194J28025k390095m305589l710794
$$ 10274639 12183887 11669437 9554388 8133147 8447341 8575366 6185271 1879682 -1831112
2907a831112k209577j572250p28774J505360L165928J894667o57043r30174P97835
$$ -1831112 -4040689 -5612939 -6341713 -4836353 -1670425 224242 -432801 -1362975 -565140
2898e65140Q40745j554275k631296l63313J871657P28706j331825J87534M222277
$$ -565140 275605 -1278670 -3909966 -4273279 -2401622 -1672916 -3004741 -2817207 1405070
2889A405070N078758P78616m053713m825527k579178q05072L8095J588301L297916
$$ 1405070 6483828 7262444 3208731 -1616796 -4195974 -5001046 -4962951 -3374650 -76734
2880g6734K902579N57457r70356n59702j95572j334326k519081k094557j057287
$$ -76734 2825845 3383302 2412946 1853244 1657672 323346 -2195735 -4290292 -5347579
2871e347579j152087j647527l80308K592465M614103L873935J551458J2487L1569
$$ -5347579 -6499666 -8147193 -8527501 -5935036 -1320933 2553002 4104460 4116947 4148516
2862D148516M23544k41434k037649l470963k758369L01614L761186N242560M126829
$$ 4148516 4572060 4330626 2292977 -1177986 -3936355 -3634741 126445 5369005 9495834
2853I495834J643433q05499k575234l318830k853305j820448j434324j935411
$$ 9495834 11139267 10333768 7758534 4439704 1586399 -234049 -1668373 -3603784
2845c603784k064153q03283R85214J617972R76510P07852J774705K778788J616242
$$ -3603784 -5667937 -6471220 -5486006 -3868034 -2891524 -2183672 -408967 2369821 3986063
2836C986063j519257l856232l179792m58388J511998J594972J147897J347381
$$ 3986063 2466806 -1389426 -4569218 -5027606 -3515608 -1920636 -772739 574642
2828E74642J343396N3234j567169j728766o14069r0011p11217r44012J40067J206450
$$ 574642 1918038 1971272 404103 -1324663 -1938732 -2028743 -2739960 -3683972 -3543905 -2337455
2818b337455P46336n48003q71936K1899O12576j89097j669808k175854q40426
$$ -2337455 -1591119 -2139122 -3011058 -2989159 -2376583 -2565680 -4235488 -6411342 -7251768
2809g251768J430087K565969J486724k81479k01513J711632K398648j85763l968784
$$ -7251768 -5821681 -3255712 -1768988 -2050467 -2251980 -540348 1858300 1672537 -2296247
2800b296247n287817l437740q34105O11309J186800J752935K490821L357571L992772
$$ -2296247 -7584064 -11021804 -11855909 -11244600 -10057800 -8304865 -5814044 -2456473 1536299
2791A536299L159811J91895k938214l178971m74574J893945J725268M35434J94412
$$ 1536299 4696110 4888005 1949791 -1229180 -1703754 190191 1915459 2350893 2545305
2782B545305Q04117R57677O71766O44277O37835J88978l32077q04080j994227
$$ 2545305 3349422 4307099 4978865 5623142 6260977 6449955 6117878 5313798 3319571
2773C319571l593668l431988o93002J839755J286282j031880j645518j34026R33266
$$ 3319571 -274097 -3706085 -4399087 -2559332 -1273050 -2304930 -3950448 -4084474 -3151208
2764c151208N82832N50741J812385L199219L860150M192322L855430J712333j627734
$$ -3151208 -2568376 -2017635 -205250 2993969 6854119 11046441 14901871 16614204 14986470
2755A4986470l924188m534060m747706m495062k142103J463178K530125j82348
$$ 14986470 11062282 6528222 1780516 -2714546 -4856649 -3393471 -863346 -1045694
2747a045694k879235k185181P4734M77461m85530r6523J502326J832186N12713
$$ -1045694 -3924929 -6110110 -6035376 -5557915 -6043445 -6139968 -4637642 -2805456 -2292743
2738b292743n22871o68957j114645j858366j377999N01615K058404K309467J950104
$$ -2292743 -2815614 -3484571 -4599216 -6457582 -7835581 -7333966 -5275562 -2966095 -1015991
2729a015991J428314K01967j698185l104316l082763j712451L01174J745765J478097
$$ -1015991 412323 614290 -1083895 -4188211 -7270974 -8983425 -8682251 -6936486 -5458389
2720e458389K21216N02907K963560M293063J476102l233761m786932j972258J774939
$$ -5458389 -5237173 -4734266 -1770706 2522357 3998459 764698 -4022234 -5994492 -4219553
2711d219553L646896L905471L210916J433980l00508m1499J608459J837418J20490
$$ -4219553 -572657 3332814 6543730 7977710 7677202 7635703 9244162 11081580 11202070
2702A1202070j073494q84570j481760l493277m049381j589889J001784P49555
$$ 11202070 10128576 9244006 7762246 4268969 219588 -1370301 -368517 381038
2694C81038r95328j250236J91101J807776L256824M346330L474053J66899k814547
$$ 381038 -614290 -1864526 -1673425 134351 3391175 7737505 11211558 11378457 8563910
2685H563910k897731j415256j083219j722288j517688o15329j68069M40205J941222
$$ 8563910 5666179 4250923 3167704 1445416 -72272 -687601 -855670 -415465 1525757
2676A525757K417561N132k981686k698551L24564K010889R12286o02754j118704
$$ 1525757 3943318 3948450 966764 -1731787 -1407223 603666 1515952 913198 -205506
2667b05506j797064k782777k113857O75710L257503L871941L061081J399474j337681
$$ -205506 -2002570 -4785347 -6899204 -6223494 -2965991 905950 3967031 5366505 4028824
2658D028824l972777m170434k012125l83958p69113j557204j429055j194383j117251
$$ 4028824 56047 -4114387 -6126512 -6510470 -7279583 -8836787 -10265842 -11460225 -12577476
2649a2577476J45074K323035K663888L57604j364604m3887J992635J344215j095652
$$ -12577476 -12432402 -10109367 -7445479 -7087875 -8452479 -8496366 -6503731 -5159516 -6255168
2640f255168j668007O87249L502259M285470K697875Q9806j428507n78934J076083
$$ -6255168 -7923175 -7235926 -3733667 551803 3249678 3339484 1910977 1332043 2408126
2631B408126M05305k629843l957595j091916K748151L158821R30420K11382J796586
$$ 2408126 2813431 183588 -3774007 -4865923 -2117772 1041049 1971469 2182851 3979437
2622C979437K378686J38735k735876l635825k646055j346204p29070q82763j111955
$$ 3979437 6358123 6496858 3760982 125157 -2520898 -3867102 -4596172 -5478935 -6590890
2613f590890l27400J303390J814418K94252r78025K17936J995368J045548j494967
$$ -6590890 -6918290 -5614900 -3800482 -3506230 -4484255 -4266319 -2270951 -1225403 -2720370
2604b720370j197998K444422M601328K325646j136853j695826l25679l36996j592323
$$ -2720370 -3918368 -1473946 3127382 5453028 4316175 2620349 2294670 1957674 365351
2595C65351j357971O24545J756559Q30732n73006j027280q56799m62771M25859
$$ 365351 -992620 -368075 1388484 2219216 1646210 618930 -237869 -700640 -274781
2586b74781J097999k05585l336186n011178k499472K299845M542368K332784r58525
$$ -274781 823218 617633 -2718553 -7729731 -10229203 -7929358 -3386990 -1054206 -2012731
2577b012731j296905O56058R28407j527108k905730r4526M422960N844207L659832
$$ -2012731 -3309636 -2653578 -1725171 -3252279 -6158009 -6252535 -1829575 4014632 7674464
2568G674464J572713J308882M95231k298750m280797k716911L72418J090517n12919
$$ 7674464 9247177 10556059 11051290 8752540 4471743 1754832 2127250 3217767 2704848
2559B704848j054942N39247J671321O22243q58774o65676O33614J472965J890528
$$ 2704848 1649906 2189153 3860474 4482717 3623943 2958267 3591881 5064846 6955374
2550F955374K506705K408831L36376k632426l711757j892171P66809J743426P97462
$$ 6955374 9462079 11870910 12207286 9574860 5863103 3970932 4737741 6481167 7278629
2541G278629l97881m43246O45540J885937K172918R32977j352344l185846l136206
$$ 7278629 6880748 6437502 7083042 8968979 11141897 12074874 10722530 7536684 4400478
2532D400478j241217P89397J052612p67363l160341m323377l760053k292194q65784
$$ 4400478 3159261 3948658 5001270 4233907 1073566 -3249811 -7009864 -9302058 -10167842
2523a0167842J32707N36692K60038j43192L52055J749087K525646J823735J340093
$$ -10167842 -10035135 -9498443 -9238405 -9381597 -9029542 -7280455 -4754809 -2931074 -1590981
2514a590981L007980N083726L478589j969998n722535l655355O64830Q69380k588688
$$ -1590981 1416999 6500725 9979314 8009316 2286781 -1368574 -703744 165636 -2423052
2505b423052l030656J855151N880607L652502j069321j168748L052543M958922
$$ -2423052 -5453708 -3598557 2282050 5934552 4865231 3696483 6749026 11707948
2497A1707948K118450o96294J10584J584532K4003k647211k512716n40987q92261
$$ 11707948 13826398 13130104 13240688 14825220 14849223 12202012 9689296 9148309 8256048
2488H256048l587539l884391K42606M178186K661275k797358n641867k753864
$$ 8256048 4668509 784118 1026724 5204910 7866185 5068827 -573040 -3326904
2480c326904J790259K365827j073452l696246k588979J9509Q51133J45358K35554
$$ -3326904 -1536645 829182 -244270 -3940516 -6529495 -6509986 -5658853 -5513495 -5277941
2471e277941J487109K248947J875289J166791K97734j063001j855038p20644J004264
$$ -5277941 -3790832 -1541885 333404 1500195 1797929 734928 -1120110 -1840754 -836490
2462h36490N59657j570796j756128R96751L058247J792170m72883o53889K96254
$$ -836490 -276833 -1847629 -3603757 -2607006 451241 2243411 1770528 1116639 1412893
2453A412893P8321m92148L41740J096188m85136k562970j666633J043839J148187
$$ 1412893 1491214 999066 1340806 2436994 1951858 -611112 -2277745 -1233906 -85719
2444h5719j663394k928750p52102J521821J507420J457416L166596L955718J435577
$$ -85719 -1749113 -4677863 -5429965 -3908144 -2400724 -943308 2223288 6179006 7614583
2435G614583j473065o63416K491627L082816m8744l167660l356934j639282j40235
$$ 7614583 6141518 5478102 7969729 11052545 11003801 7836141 4479207 2839925 2699690
2426B699690O91515J213884J295051Q70240L35619j66271p60739j065656n93258
$$ 2699690 3391205 4605089 5900140 6770380 7105999 6939728 6178989 5113333 4520075
2417D520075R6066j21132j261716k166222k075202j261370k57811M65403K70550
$$ 4520075 4616141 4495009 3233293 1067071 -1008131 -2269501 -2527312 -2061909 -1791359
2408a791359r79501k070269j448163P39702K527022K222420M1751k233609k712209
$$ -1791359 -2770860 -4841129 -6289292 -5549590 -3022568 -800148 -758397 -2992006 -5704215
2399e704215q90817J677520K655193J396907n09462j601443k164670k631239k048293
$$ -5704215 -6595032 -4917512 -2262319 -865412 -1374874 -2976317 -5140987 -7772226 -9820519
2390i820519J05322K000313J696978L84552P80907K770468L435243J510096r58680
$$ -9820519 -9715197 -7714884 -6017906 -5633354 -4852447 -2081979 1353264 2863360 1904680
2381A904680j935630j762679j344726m84565O69993P30746p35624j868529j078870
$$ 1904680 -30950 -1793629 -3138355 -3622920 -2952927 -2222181 -2957805 -4826334 -5905204
2372e905204M88953Q36027K52563N82565K012504K638642J337647n07780p82766
$$ -5905204 -5416251 -4580224 -4327661 -3745096 -1732592 906050 2243697 1735917 953151
2363I53151O23065J537636J3184l193737n205687m263712j510534J071954L133647
$$ 953151 1576216 3113852 3127036 -66701 -5272388 -9536100 -11046634 -9974680 -6841033
2354f841033M793554M487392R37842l247772l591949j6869K562929J380386k77816
$$ -6841033 -2047479 2439913 3377755 129983 -3461966 -3478835 -915906 464480 186664
2345A86664J098440L193796J753963k074462l390017j500765q54606l377176m970026
$$ 186664 1285104 4478900 6232863 4158401 768384 -732381 -1586987 -4964163 -9934189
2336i934189j969490K840235M057521J174041j341853n74210J565972J961779
$$ -9934189 -11903679 -9063444 -5005923 -3831882 -5173735 -5747945 -4181973 -2220194
2328b220194N40878m56939L3294Q83109R33228O36844R18611J398792R78419r8120
$$ -2220194 -1679316 -2136255 -2102961 -1219852 -286624 350220 1268831 2667623 3646042 3547922
2318C547922k03732J230867K505756J769053n75642k602883l285705l068405k596119
$$ 3547922 3344190 4575057 7080813 8849866 8274224 5671341 2385636 -682769 -3278888
2309c278888k119678j872933j859730j361327L18352K608058L949169L272408
$$ -3278888 -5398566 -7271499 -9131229 -10492556 -10174204 -7566146 -3616977 -344569
2301c44569P30609k516445m576756l695560n4795L723791M983761L637003J593277
$$ -344569 386040 -2130405 -6707161 -10402721 -10457516 -6733725 -1749964 1887039 3480316
2292C480316M02416N31953J878633L296748K530606j221738n134756n419503k085568
$$ 3480316 3882732 4414685 6293318 9590066 12120672 10898934 5764178 344675 -1740893
$$ [...]
##END NTUPLES=NMR SPECTRUM
##END=
