##TITLE=31Pdec_DE-102_2
DMSO-d6, 64 sc
 13.8.2025
##JCAMPDX= 6.0         $$ Bruker NMR JCAMP-DX V2.0
##DATA TYPE= NMR SPECTRUM
##DATA CLASS= NTUPLES
##ORIGIN= UXNMR, Bruker Analytische Messtechnik GmbH
##OWNER= root
$$ XWIN-NMR		Version 3.5
$$ Wed Aug 13 14:30:15 2025 Russian Standard Time (UT+4h)  she@DPX200
##.OBSERVE FREQUENCY= 81.013821
##.OBSERVE NUCLEUS= ^31P
##.ACQUISITION MODE= SIMULTANEOUS
##.ACQUISITION SCHEME= undefined
##.AVERAGES= 64
##.DIGITISER RES= 17
##SPECTROMETER/DATA SYSTEM= spect
##.PULSE SEQUENCE= zgpg30
##.SOLVENT NAME= DMSO
##.SHIFT REFERENCE= (INTERNAL, DMSO, 0, 198.062)
##AUDIT TRAIL= $$ (NUMBER, WHEN, WHO, WHERE, WHAT)
$$ ##TITLE= Audit trail, XWIN-NMR		Version 3.5
$$ ##JCAMPDX= 5.01
$$ ##ORIGIN= Bruker BioSpin GmbH
$$ ##OWNER= she
$$ F:/spectra/data/she/nmr/P31/2/pdata/1/auditp.txt
$$ ##AUDIT TRAIL=  $$ (NUMBER, WHEN, WHO, WHERE, WHAT)
(   1,<2025-08-13 14:28:42.43 +0400>,<she>,<DPX200>,
      <created by zg, POWCHK disabled, PULCHK disabled
       configuration hash MD5:
       00 E9 B6 7A A2 85 ED C7 34 08 36 98 17 FE 4E 26
       data hash MD5: 32K
       E6 E6 00 BF 11 C2 66 1E 87 67 56 C5 41 AC F5 D4>)
(   2,<2025-08-13 14:28:45.01 +0400>,<she>,<DPX200>,
      <Start of raw data processing
       efp BC_mod = 2 LB = 1.5 FT_mod = 6 PKNL = 1 PHC0 = 1810.887 PHC1 = -5.500614 SI = 64K 
       data hash MD5: 64K
       ED 7B 2F 13 16 C6 A1 2E 8F 20 F7 31 1C A9 33 3E>)
(   3,<2025-08-13 14:29:02.62 +0400>,<she>,<DPX200>,
      <pk PHC0 = -90.93733 PHC1 = 130.8 
       data hash MD5: 64K
       B5 D9 0D 62 8F 95 E5 FA 72 5F 58 CF 82 2A A6 6B>)
(   4,<2025-08-13 14:29:16.12 +0400>,<she>,<DPX200>,
      <abs ABSG = 5 
       data hash MD5: 64K
       7C 67 07 3F F8 C7 CB 58 89 B7 C3 85 68 4E 72 3C>)
(   5,<2025-08-13 14:29:45.85 +0400>,<she>,<DPX200>,
      <pk PHC0 = 52.16808 PHC1 = -118.7999 
       data hash MD5: 64K
       93 AB 04 87 71 66 0D DD 0A 3E F5 C3 0F FC 8D C3>)
$$ ##END=
$$ 
$$ hash MD5
$$ AF B0 36 A5 1F BD 31 EC 66 49 5E 60 AB 2D 6A 84
##$RELAX= 
##$RELAX= 
##$RELAX= 
##$RELAX= 
##$RELAX= 
##$RELAX= 
##$RELAX= 
##$RELAX= 
$$ Bruker specific parameters
$$ --------------------------
##$DU= <F:/spectra>
##$EXPNO= 2
##$NAME= <P31>
##$PROCNO= 1
##$TYPE= <nmr>
##$USER= <she>
##$AMP= (0..31)
100 100 100 100 100 100 100 100 100 100 100 100 100 100 100 100 100 100 
100 100 100 100 100 100 100 100 100 100 100 100 100 100 
##$AQSEQ= 0
##$AQ_mod= 1
##$AUNM= <au_zg>
##$AUTOPOS= <>
##$BF1= 81.014009
##$BF2= 200.13
##$BF3= 200.13
##$BF4= 200.13
##$BF5= 200.13
##$BF6= 200.13
##$BF7= 200.13
##$BF8= 200.13
##$BYTORDA= 1
##$CFDGTYP= 0
##$CFRGTYP= 5
##$CHEMSTR= <none>
##$CNST= (0..31)
1 1 145 1 1 1 1 1 1 1 1 1 1 1 1 1 1 1 1 1 1 1 1 1 1 1 1 1 1 1 1 1 
##$CPDPRG= <waltz16>
##$CPDPRG1= <>
##$CPDPRG2= <waltz16>
##$CPDPRG3= <>
##$CPDPRG4= <mlev>
##$CPDPRG5= <mlev>
##$CPDPRG6= <mlev>
##$CPDPRG7= <mlev>
##$CPDPRG8= <mlev>
##$CPDPRGB= <>
##$CPDPRGT= <>
##$D= (0..31)
$$ [...]
##$SUBNAM3= <"">
##$SUBNAM4= <"">
##$SUBNAM5= <"">
##$SUBNAM6= <"">
##$SUBNAM7= <"">
##$SUBNAM8= <"">
##$SUBNAM9= <"">
##$SW= 400.765351723535
##$SWIBOX= (0..15)
0 1 3 0 0 0 0 0 0 0 0 0 0 0 0 0 
##$SW_h= 32467.5324675325
##$TD= 32768
##$TD0= 1
##$TE= 0
##$TE2= 300
##$TE3= 300
##$TEG= 300
##$TL= (0..7)
0 120 53 12 22 120 120 120 
##$TP= (0..7)
150 150 150 150 150 150 150 150 
##$TP07= 0
##$TPNAME0= <>
##$TPNAME1= <>
##$TPNAME2= <>
##$TPNAME3= <>
##$TPNAME4= <>
##$TPNAME5= <>
##$TPNAME6= <>
##$TPNAME7= <>
##$TPOAL= (0..7)
0.5 0.5 0.5 0.5 0.5 0.5 0.5 0.5 
##$TPOFFS= (0..7)
0 0 0 0 0 0 0 0 
##$TUNHIN= 0
##$TUNHOUT= 0
##$TUNXOUT= 0
##$USERA1= <user>
##$USERA2= <user>
##$USERA3= <user>
##$USERA4= <user>
##$USERA5= <user>
##$V9= 5
##$VALIST= <valist>
##$VCLIST= <CCCCCCCCCCCCCCC>
##$VD= 0
##$VDLIST= <DDDDDDDDDDDDDDD>
##$VPLIST= <PPPPPPPPPPPPPPP>
##$VTLIST= <TTTTTTTTTTTTTTT>
##$WBST= 1024
##$WBSW= 4
##$XGAIN= (0..3)
0 0 0 0 
##$XL= 0
##$YL= 0
##$YMAX_a= 5648
##$YMIN_a= -3548
##$ZGOPTNS= <>
##$ZL1= 120
##$ZL2= 120
##$ZL3= 120
##$ZL4= 120
##$ABSF1= 198.0616
##$ABSF2= -202.7028
##$ABSG= 5
##$ABSL= 3
##$ALPHA= 0
##$AQORDER= 0
##$ASSFAC= 0
##$ASSFACI= 0
##$ASSFACX= 0
##$ASSWID= 0
##$AUNMP= <proc_1d>
##$AZFE= 0.1
##$AZFW= 0.5
##$BCFW= 0
##$BC_mod= 2
##$BYTORDP= 0
##$COROFFS= 0
##$CY= -3
##$DATMOD= 1
##$DC= 0
##$DFILT= <>
##$DTYPP= 0
##$F1P= 0
##$F2P= 0
##$FCOR= 1
##$FTSIZE= 65536
##$FT_mod= 6
##$GAMMA= 0
##$GB= 0
##$INTBC= 1
##$INTSCL= 9.790993e-09
##$ISEN= 30
##$LB= 1.5
##$LEV0= 0
##$LPBIN= 0
##$MAXI= 10000
##$MC2= 0
##$MEAN= 0
##$ME_mod= 0
##$MI= 50
##$NCOEF= 0
##$NC_proc= -9
##$NLEV= 6
##$NOISF1= 182.463
##$NOISF2= 159.3651
##$NSP= 0
##$NTH_PI= 0
##$NZP= 0
##$OFFSET= 198.0616
##$PC= 4
##$PHC0= 1772.118
##$PHC1= 6.499504
##$PH_mod= 1
##$PKNL= yes
##$PPARMOD= 0
##$PSCAL= 0
##$PSIGN= 0
##$REVERSE= no
##$SF= 81.0140089999434
##$SI= 65536
##$SIGF1= 159.3651
##$SIGF2= -187.1042
##$SINO= 113.3802
##$SIOLD= 16384
##$SREGLST= <1H.CDCl3>
##$SSB= 0
##$STSI= 65536
##$STSR= 0
##$SW_p= 32467.5324675325
##$SYMM= 0
##$S_DEV= 0
##$TDeff= 32768
##$TDoff= 0
##$TI= <>
##$TILT= no
##$TM1= 0
##$TM2= 0
##$TOPLEV= 0
##$USERP1= <user>
##$USERP2= <user>
##$USERP3= <user>
##$USERP4= <user>
##$USERP5= <user>
##$WDW= 1
##$XDIM= 65536
##$YMAX_p= 524624685
##$YMIN_p= -166230466
$$ End of Bruker specific parameters
$$ ---------------------------------
##NTUPLES= NMR SPECTRUM
##VAR_NAME=  FREQUENCY,     SPECTRUM/REAL,   SPECTRUM/IMAG
##SYMBOL=    X,             R,               I
##VAR_TYPE=  INDEPENDENT,   DEPENDENT,       DEPENDENT
##VAR_FORM=  AFFN,          ASDF,            ASDF
##VAR_DIM=   65536,         65536,           65536
##UNITS=     HZ,            ARBITRARY UNITS, ARBITRARY UNITS
##FACTOR=    0.49542278885378, 1,            1
##FIRST=     16045.7642231865, 0,            0
##LAST=      -16421.768244346, 0,            0
##MIN=       -16421.768244346, -166230466,   0
##MAX=       16045.7642231865, 524624685,    0
$$ Real data points
##PAGE= N=1
##DATA TABLE= (X++(R..R)), XYDATA
$$ [...]
7390G751069N767408J534052k824974j406563L539629M852101J011002k574472
$$ 7751069 13518477 15052529 12227555 10820992 14360621 19212722 20223724 17649252
7382A7649252k358733j163776k619941n309264m846712K61017O719538R583807
$$ 17649252 15290519 14126743 11506802 6197538 1350826 1611843 8331381 17915188
7374A7915188O459492o26741o841146q402241n372238j001467J248360K75962
$$ 17915188 24374680 23747939 16906793 8504552 3132314 2130847 3379207 3655169
7366C655169k025815k543990l02991K053041J431170j457559l163068k620534
$$ 3655169 1629354 -914636 -1217627 835414 2266584 809025 -2354043 -4974577
7358d974577k145732k755434k245509K54447J622932k23347j874063P55923N193733
$$ -4974577 -7120309 -9875743 -12121252 -11866805 -10243873 -10467220 -12341283 -11585360 -6391627
7349f391627M735751k440227j0427535j1988793m961054O922316J6118209J5161332
$$ -6391627 -1655876 -4096103 -14523638 -26512431 -31473485 -24551169 -8432960 6728372
7341F728372L382785r586755j1766376k164645P770685Q181649K068653j077621
$$ 6728372 10111157 524402 -11241974 -13406619 -5635934 2545715 4614368 3536747
7333C536747Q68709J289751l426298p441239m038662L709497O396518J450750
$$ 3536747 4405456 5695207 2268909 -5172330 -9210992 -5501495 895023 2345773
7325B345773l056933k3473O260641O329741o28799n844668l766715J208600L099134
$$ 2345773 -711160 -734633 5526008 11855749 11226950 5382282 1615567 2824167 5923301
7316E923301K724631L193404K669611j896580p525669q727708o043166m059273
$$ 5923301 8647932 11841336 14510947 12614367 5088698 -3639010 -9682176 -13741449
7308a3741449k635755J899650P366895O686970K961l189103J974891P823368O076995
$$ -13741449 -16377204 -14477554 -7110659 -423689 -420728 -3609831 -1634940 6188428 12265423
7299A2265423N85207L15576M595865M578322k382193q712183p970157l022371
$$ 12265423 12850630 13166206 17762071 22340393 19958200 11246017 3275860 253489
7291B53489k92206j058589j827562l10546K052288K379335m93481m575045o144135
$$ 253489 -38717 -1097306 -2924868 -3235414 -1183126 1196209 702728 -3872317 -10016452
7282a0016452l539845P59978L100007K957946K505927K738738K567432J445369
$$ -10016452 -13556297 -12796319 -9696312 -6738366 -4232439 -1493701 1073731 2519100
7274B519100K31306o98148j743712k341462j429855J83676O94712P94509K876568
$$ 2519100 2750406 2052258 308546 -2032916 -3462771 -3279095 -2584383 -1789874 1086694
7265A086694N796075M477047k528387q459654n599543M321391J1326298Q956037
$$ 1086694 6882769 11359816 8831429 371775 -5227768 -906377 10419921 19375958
7257A9375958J088215m049626l282787L32024L190572M563531M930818M143020
$$ 19375958 20464173 16414547 13131760 13463784 16654356 21217887 26148705 30291725
7249C0291725K245171Q9113k091303n155005q741413j0012862o858896j591165
$$ 30291725 32536896 32626009 30534706 25379701 16638288 6625426 -233470 -1824635
7241a824635J016914n30049k896791k548894K73587L045369M205003L641250K067403
$$ -1824635 -807721 -1337770 -4234561 -6783455 -6509868 -3464499 740504 4381754 6449157
7232F449157J504333M051042P874292O970356j284050j0075374r790843q11317
$$ 6449157 7953490 12004532 19878824 26849180 25565130 15489756 5698913 4887596
7224D887596N862114K842407m025136m475839J728620N265332P44862o726885
$$ 4887596 10749710 13592117 9566981 5091142 6819762 12085094 12829956 6103071
7216F103071r611728p005927k838069O53805L594143N244814M478055K562344
$$ 6103071 -3508657 -10514584 -13352653 -12698848 -9104705 -3859891 618164 3180508
7208C180508J973878K880612L591985L525318K590554r17280p280819j1103782
$$ 3180508 5154386 8034998 11626983 15152301 17742855 16825575 9544756 -1559026
7200a559026o171457M424473R547839M402317k625835k310633K127412J340098
$$ -1559026 -7730483 -3306010 6241829 10644146 8018311 5707678 7835090 9175188
7192I175188m705695o973584k205123J988978p48457o288788p244307l472410
$$ 9175188 4469493 -2504091 -4709214 -2720236 -3468693 -9757481 -17001788 -20474198
7184b0474198j21237Q73700J950903M522915O866305O731748L332744k161475
$$ -20474198 -20595435 -19721735 -17770832 -13247917 -6381612 350136 3682880 1521405
7176A521405o126745m511033K107351P469835O476343J380166j609393p0909L430125
$$ 1521405 -4605340 -9116373 -7009022 460813 6937156 8317322 6707929 6637020 10067145
7167A0067145O095711O932137M979706k28416n992345p727066m192027O94676
$$ 10067145 16162856 23094993 28074699 27846283 21853938 14126872 9934845 10629521
7159A0629521K250307j35101l053331k980511O4248K374715O77199l514341n439126
$$ 10629521 12879828 12744727 9691396 6710885 6775133 9149848 9827047 6312706 873580
7150H73580l467865j099996j123976j355930P38814K590350L33438m210814n729261
$$ 873580 -2594285 -3694281 -4818257 -6174187 -5435373 -2845023 -2511585 -6722399 -12451660
7141a2451660l491045j687955j942185j265202J618424L614205L006921K752281
$$ -12451660 -15942705 -17630660 -19572845 -20838047 -19219623 -15605418 -12598497 -9846216
7133i846216M996098O551346L592354k109465n398512m306704j172305J426770
$$ -9846216 -4850118 1701228 5293582 3184117 -2214395 -6521099 -7693404 -6266634
7125f266634K878660L444723L408922L055761K078722l03577l611849n662856
$$ -6266634 -3387974 56749 3465671 6521432 8600154 8296577 4684728 -978128
7117i78128m995488k543922O928J980119K937845K217374O11568M19445K079766
$$ -978128 -5973616 -8517538 -8510610 -6530491 -3592646 -1375272 -763704 -344259 1735507
7108A735507K758266K97435l344731m873218m031051k559959m95180L177425P050510
$$ 1735507 4493773 4791208 1446477 -3426741 -7457792 -10017751 -10512931 -7335506 -284996
7099b84996Q005526N582060K740130J625806Q86014j876142o487209r820961q431248
$$ -284996 7720530 13302590 16042720 17668526 18554540 16678398 10191189 370228 -8061020
7090h061020j953161N235614O970967J904961l845668l385047K114371M638394
$$ -8061020 -10014181 -4778567 2192400 4097361 251693 -3133354 -1018983 3619411
7082C619411q1825o845040p774723j915730M837453P573121O755054N261097M278249
$$ 3619411 3537586 -3307454 -11082177 -12997907 -8160454 -587333 6167721 11428818 15707067
7073A5707067L158344J390476n87552j789516j436303j15002q6647k817195n937182
$$ 15707067 18865411 20255887 19668335 17878819 16442516 16327514 16240867 13423672 7486490
7064G486490n061357j13325K691848j641434q867606r455038j105747P256749
$$ 7486490 2425133 2311808 5003656 3362222 -5505384 -14960422 -16066169 -8809420
7056h809420O613477o64567m573974p56476M817230M639532r96312n234400k882879
$$ -8809420 -2195943 -2860510 -7434484 -8190960 -3373730 1265802 269490 -4964910 -7847789
7047g847789M377046J0011673Q924572K162716m637374p581994p682444o744559
$$ -7847789 -3470743 6540930 15465502 17628218 12990844 5408850 -2273594 -9018153
7039i018153l315074L575456R127472P100912q03259n917893m122346l90586K88812
$$ -9018153 -12333227 -8757771 369701 7470613 6667354 749461 -3372885 -3763471 -3474659
7030c474659P6407K335192M409211K171786k404906m445673l827163l356640k083112
$$ -3474659 -3398252 -1063060 3346151 5517937 3113031 -1332642 -5159805 -8516445 -10599557
7021a0599557K380384O645654M729331j608868l761536R84346N184398K518804
$$ -10599557 -8219173 -1573519 3155812 1546944 -2214592 -1230246 3954152 6472956
7013F472956l495181n898276l574334K08678L548793N426000L574429k165424
$$ 6472956 2977775 -2920501 -6494835 -6286157 -2737364 2688636 6263065 4097641
7005D097641p358602q081704n520268j852417M038041J1636373J4351840P498519
$$ 4097641 -3260961 -11342665 -16862933 -18715350 -14677309 -3040936 11310904 18809423
6997A8809423k342899m485751O88386K821066j914170n400979j791014K486086
$$ 18809423 16466524 11980773 12669159 15490225 13576055 8175076 6384062 8870148
6989H870148o64561p526018q029239r51800M593357K009097n250739r642870p762034
$$ 8870148 8205587 679569 -7349670 -8301470 -3708113 -1699016 -6949755 -16592625 -24354659
6980b4354659j383896N497341Q862863O808202J456443k558068k438018O55968
$$ -24354659 -25738555 -20241214 -11378351 -4570149 -3113706 -5671774 -8109792 -7453824
6972g453824L571566M085507K376320R27892K369972O197172Q623544O959184
$$ -7453824 -3882258 203249 2579569 3507461 5877433 12074605 20698149 27657333
6964B7657333K668107j296136l897655m678997k094932L135491N758884K022416
$$ 27657333 30325440 29029304 25131649 20452652 18357720 21493211 27252095 29274511
6956B9274511l910513n158470k312280j818660m735399m992590l11118L286853
$$ 29274511 25363998 20205528 17893248 16074588 11339189 6346599 6035481 9322334
6948I322334J392030j781753j263471K80486j874089n826721o715403m907103
$$ 9322334 10714364 8932611 7669140 7949626 6075537 248816 -6466587 -11373690
6940a1373690l499804j095797N223846J1904818J1835588M589681l244982p417321
$$ -11373690 -14873494 -15969291 -10745445 1159373 12994961 17584642 14339660 6922339
6932F922339q808591p574672k469093L266218L418378j505451l311931K145604
$$ 6922339 -1886252 -9460924 -11930017 -8663799 -5245421 -6750872 -10062803 -7917199
6924g917199Q736071R047892L871036j072026k795715j672063J057333K786802
$$ -7917199 818872 9866764 13737800 12665774 9870059 8197996 9255329 12042131
6916A2042131P97239k946295k999290O63004J046877m306361p005516J35804J0375602
$$ 12042131 12839370 9893075 6893785 7556789 8603666 4297305 -2708211 -2572407 7803195
6907G803195J1107629J421217p438908p934861l747115q97866L10850J853735
$$ 7803195 18910824 20332041 12893133 4958272 1211157 313291 624141 2477876
6899B477876K973781K248102M75979j455680m399000q173521r645984o146448
$$ 2477876 5451657 7699759 8175738 6720058 2321058 -5852463 -15498447 -21644895
6891b1644895N38649N286127M403244p27532m179053r39700O734447J0475320
$$ -21644895 -21106246 -15820119 -11416875 -12144407 -16323460 -17263160 -10528713 -53393
6883e3393N771388j672685l294402R65182L867983J988833p37512q07475k3237
$$ -53393 5717995 4045310 750908 1716090 5584073 7572906 6835394 6027919 6004682
6874F004682p35150j860053k243006l057685l917367j267595N597987J0818278
$$ 6004682 5269532 3409479 1166473 -1891212 -5808579 -7076174 -1478187 9340091
6866I340091Q627374J177611m277542m101303o01504K552481L420873J405467
$$ 9340091 17967465 19145076 14867534 10766231 10164727 12717208 16138081 17543548
6858A7543548k481430n138294m114424q85214Q62336J7364j034306j08115K293927
$$ 17543548 15062118 9923824 5809400 4924186 5786522 5803886 4769580 4661465 6955392
6849F955392M322353M723280L107688p3862l134840l856967j524681J978135L601392
$$ 6955392 11277745 16001025 19108713 19034851 15900011 12043044 10518363 12496498 16097890
6840A6097890J869823j730219m183942l796044j328393J492649L422821L358689
$$ 16097890 17967713 16237494 12053552 8257508 6929115 8421764 11844585 15203274
6832A5203274N12819l582030n124254k472951R63381J062300j245712k031337
$$ 15203274 15716093 12134063 7009809 4536858 5500239 6562539 5316827 3285490
6824C285490p82621j09763K73624L443514Q222563Q395076J729673n560473p121314
$$ 3285490 2502869 2393106 2666730 6110244 14332807 22727883 24457556 18897083 11775769
6815A1775769m646772l413096l743973k400092L01255P43219j624784l443215
$$ 11775769 7128997 3715901 -28072 -2428164 -2126909 -1383690 -3008474 -6451689
6807f451689k890012j592482q75078L7945J454536J987005P38269j277762k149012
$$ -6451689 -9341701 -10934183 -11809261 -11771316 -10316780 -8329775 -7591506 -8869268 -11018280
6798a1018280l82118L623516O165892K989809m019021o394559J36977P652878
$$ -11018280 -11400398 -7776882 -1610990 1378819 -2640202 -9034761 -8897784 -1244906
6790a244906N372808m712034r563483l139343N583106N984637m3780k932793N63524
$$ -1244906 4127902 -584132 -10147615 -13286958 -7703852 -1719215 -1762995 -4695788 -4132264
6781d132264M823364M624307J027971j820939j573659J047751L233391K393238
$$ -4132264 691100 5315407 6343378 4522439 2948780 3996531 7229922 9623160
6773I623160p74428k481354q67758R16483q02420m396327n041642j778419J113641
$$ 9623160 8848732 6367378 5499620 6416103 5613683 1217356 -3824286 -5602705 -4489064
6764d489064j58174m701641q569286q136470k259936O101247J0912333R101435
$$ -4489064 -4647238 -9348879 -17918165 -26054635 -28314571 -22213324 -11300991 -2199556
6756b199556N239491O066764J0289016R262748k80384r918961j0093233k454768
$$ -2199556 3039935 9106699 19395715 28658463 28378079 18459118 8365885 5911117
6748E911117L768542M451888L013073J895183o80268m464007m932467o01951L010947
$$ 5911117 9679659 14131547 17144620 19039803 18359535 13895528 8963061 8361110 11372057
6739A1372057R87352l783305n741412n340137o686430q744281n859430K525617
$$ 11372057 12359409 8576104 2834692 -2505445 -9191875 -17936156 -23795586 -21269969
6731b1269969Q959419P244350J46523n107628n678892m076076k657163j230313
$$ -21269969 -12310550 -5066200 -4919677 -10027305 -15706197 -19782273 -22439436 -23669749
6723b3669749M20215J309508J573016L380091P494528J0330663P354240j11977
$$ -23669749 -23249534 -21940026 -20367010 -16986919 -9492391 838272 8192512 8080535
6715H080535m493988r89693N079598M382975l232409p362536j249630Q166538
$$ 8080535 3586547 2596854 7676452 12059427 8827018 1464482 214852 8381390
6707H381390R326402J099511p574206j0462741r072845n841259m46569N575836
$$ 8381390 17707792 18807303 11233097 770356 -8302489 -14143748 -14590317 -9014481
6699i014481P867041N843881M240803N042159L824334k134329p900375p898817
$$ -9014481 -1147440 4696441 8937244 13979403 17803737 15669408 7769033 -129784
6691a29784m071074j800973j745878j116247M26869J719931L870994P382677Q243542
$$ -129784 -4200858 -6001831 -7747709 -8863956 -8437087 -6717156 -2846162 4536515 12780057
6682A2780057K986943m386225o681020l325182q3653j53342j372862j458756l53966
$$ 12780057 15767000 11380775 4699755 1374573 1290920 1137578 -235284 -1694040 -2048006
6673b048006J945811M535240L730028k165131p662899o322680r16299K65252l485219
$$ -2048006 -102195 4433045 8163073 5997942 -1664957 -7987637 -8903936 -8638684 -12123903
6664a2123903m758250j148057R60440j531145k379849K840916Q014542N771599
$$ -12123903 -16882153 -18030210 -17069770 -18600915 -20980764 -18139848 -10125306 -4353707
6656d353707q10699l131754N39896M411917M189917R88053j954104k136971P41610
$$ -4353707 -5164406 -8296160 -7756264 -3344347 845570 1833623 -120481 -2257452 -1515842
6647a515842L213564Q94481m585789o033124j270481K541750O6972l015602O93664
$$ -1515842 1697722 2592203 -1993586 -8026710 -9297191 -6755441 -6688469 -9704071 -9010407
6638i010407P111276O284794j518904n558719o53660N801352N257912r07183n244102
$$ -9010407 -1899131 4385663 2866759 -2691960 -3345620 2455732 7713644 6806461 1562359
6629A562359m063498J1128K270735M35069l231132l853342J67423M366336M131044
$$ 1562359 -2501139 -2490011 -219276 215793 -3015339 -6868681 -6701258 -2334922 1796122
6620A796122J267569K65889K94856k741638p243659o667930l92902L577726j37894
$$ 1796122 3063691 3329580 3624436 882798 -6360861 -13028791 -13421693 -9843967 -9981861
6611i981861o384325o780094n12722O123230P860154M788121P84012l9674K848726
$$ -9981861 -16366186 -23146280 -23659002 -17535772 -9675618 -4887497 -4103485 -4143159 -1294433
6602a294433N149351K690720k469022m694227l152549k058004k307026r3508M158409
$$ -1294433 3854918 6545638 4076616 -617611 -3770160 -5828164 -8135190 -8228698 -4070289
6593d070289L748827k906869o840805j383785O318388N406221k123974n218721
$$ -4070289 -321462 -3228331 -10069136 -11452921 -5134533 271688 -1852286 -7071007
6585g071007j392952O87426l429253o979353l805031J906674L155402P28944R370
$$ -7071007 -8463959 -7776533 -11205786 -18185139 -21990170 -20083496 -16928094 -16199150 -16189780
6576a6189780J646642J955322L78403M52662L502658O152774N240088K122631
$$ -16189780 -14543138 -12587816 -12209413 -11756751 -8254093 -2101319 3138769 5261400
6568E261400N80603J920912L395827J319954m465058r563776r323637m097803
$$ 5261400 5842003 7762915 11158742 12478696 8013638 -1550138 -10873775 -14971578
6560a4971578J263410L448724M003733N314560N711551J697698n719871j0420486
$$ -14971578 -13708168 -10259444 -6255711 -941151 4770400 6468098 748227 -9672259
6552i672259q008751r44887M724629O018636M374778J801607r96129k454167Q7505
$$ -9672259 -17681010 -18625897 -13901268 -7882632 -3507854 -1706247 -2702376 -5156543 -5069038
6543e069038N963411R219901N007831l109599o654715l330392J92778j513748
$$ -5069038 894373 10114274 15122105 12012506 5357791 2027399 2220177 706429
6535G06429m538687j920843N436279R730073O852608N56759l999309n576890m568594
$$ 706429 -3832258 -5753101 -316822 9413251 16265859 16822618 12823309 7246419 2677825
6526B677825o32208M482662N785304P39942o030680p493439k715666K489077L007533
$$ 2677825 2045617 6528279 12313583 13053525 7022845 -470594 -3186260 -697183 2310350
6517B310350k60185k734862j614352J666131L244047Q15419l550890n104742j886525
$$ 2310350 2050165 -684697 -2299049 -632918 2611129 3426548 -124342 -5229084 -7115609
6508g115609K418765K842484l00076j715825J580863N917951N722443R23056l105107
$$ -7115609 -4696844 -1854360 -2154436 -3870261 -2289398 3628553 9350996 10274052 7168945
6499G168945k747677m51957m57412k419600k140890J796532N278445L918671j063301
$$ 7168945 4421268 3969311 3511899 1092299 -1048591 747941 6026386 9945057 8881756
6490H881756m373568l095794M04228J793730n07222l919609m231179k0616N029058
$$ 8881756 4508188 1412394 1816622 3610352 3103130 -816479 -5047658 -5068274 -39216
6481c9216N731786K039666n06992J229533L006669q341m808416m913659j149953
$$ -39216 5692570 7732236 7225244 8454777 11461446 11453105 6644689 1731030 581077
6472E81077l56171l334850k931890L190938O821898J782815n524231n879656j452347
$$ 581077 224906 -3109944 -6041834 -2850896 3971002 5753817 229586 -5650070 -7102417
6463g102417q08755l758142k047584N782594J1041651Q264489K566912J90134
$$ -7102417 -7911172 -11669314 -13716898 -7934304 3107347 11371836 13938748 14128882
6455A4128882j99941k093532l716493j714201K328554M358402L635494J786292
$$ 14128882 13928941 11835409 8118916 6404715 8733269 13091671 16727165 18513457
6447A8513457p38877l212256k872765R87001L956596J950990k713612n029198
$$ 18513457 17774580 14562324 11689559 12676560 16633156 18584146 15870534 10841336
6439A0841336m625796m599822n105670l464534L65533L403524M163850L199764
$$ 10841336 6215540 1615718 -3489952 -6954486 -6588953 -3185429 978421 4178185
6431D178185K22634m397269o366190j768235N376279O417887L14422l999021k69226
$$ 4178185 4400819 3550 -6362640 -8130875 -2754596 3663291 3977713 -21308 -290534
6422b90534O255729P051285K182782j764258k016903j359660j288147j50067J677112
$$ -290534 5965195 13016480 15199262 13435004 11418101 10058441 8770294 8620227 10297339
6413A0297339J050610j695341j422948L613536P121222L298076l450441l859209
$$ 10297339 11347949 9652608 8229660 11843196 18964418 22262494 18812053 14952844
6405A4952844K435334N981796J669469m015409m234879l074087p766820j4557622
$$ 14952844 17388178 23369974 25039443 21024034 16789155 13715068 5948248 -8609374
6397h609374j2812989k115296N901340N063196L120451P309797J1505000O703033
$$ -8609374 -21422363 -23537659 -17636319 -12573123 -9452672 -2142875 9362125 16065158
6389A6065158k961451n663647L99503N678369M413988P83498o46118r91265j545119
$$ 16065158 13103707 7440060 7839563 13517932 17931920 18715418 18069300 17078035 15532916
6380A5532916p71997L25946k432929q286059r953703m236949K388959L415065
$$ 15532916 14760919 15086865 12653936 4367877 -5585826 -9822775 -7433816 -4018751
6372d018751J560239K994974P201929Q497072M480775k063076p268109q348342
$$ -4018751 -2458512 536462 7738391 16235463 20716238 18653162 11385053 3036711
6364C036711m521798P53944J749091j952618l675864Q44694O604597O608425J670312
$$ 3036711 -1485087 -731143 1017948 -934670 -4610534 -3765840 2838757 9447182 11117494
6355A1117494k523170m131721m686776l355735J186179N296047L914451j363216
$$ 11117494 8594324 4462603 -224173 -3579908 -2393729 2902318 6816769 5453553
6347E453553m082425k088162Q88969J908257J385539L6306j001802J585025Q565719
$$ 5453553 1371128 -717034 171935 2080192 3465731 3502037 2500235 4085260 12650979
6338A2650979J3206199Q384467k250599q205916o820065n125094o558384o031895
$$ 12650979 25857178 34241645 31991046 23785130 16965065 11839971 5281587 -750308
6330g50308j138313J889732j179118m611835k133265K749274L389315J348117
$$ -750308 -1888621 1111 -1178007 -5789842 -7923107 -5173833 -1784518 -436401
6322d36401K740848O856384O930847J019772n204779o608770l773607L75477M126168
$$ -436401 2304447 9160831 16091678 17111450 11906671 5297901 1524294 1899771 6025939
6313F025939O087308M570705m23583o257163r317208p273464j024085M729827
$$ 6025939 12113247 16683952 16260369 10003206 685998 -6587466 -7611551 -2881724
6305b881724N023968K15055m279507n105503m489468m674872l187554K412311
$$ -2881724 2142244 2357299 -1922208 -7027711 -11517179 -16192051 -19379605 -16967294
6297a6967294Q546068R366345M562508r90536l747268l500501p03913L437921
$$ -16967294 -8421226 945119 5507627 4517091 769823 -2730678 -3434591 3330
6289C330N280899J954898l868967o314785l196359K573120P294400Q587354M854716
$$ 3330 5284229 7239127 3370160 -2944625 -6140984 -3567864 3726536 12313890 17168606
6280A7168606k600233p904958o189867n09287J856701k43867r22260K766126O235562
$$ 17168606 14568373 6663415 473548 -35739 1820962 1577095 654835 3420961 9656523
6271I656523M972004J033667j462017k747599n077964p136679n318515N14447
$$ 9656523 14628527 15662194 14200177 11452578 6374614 -762065 -6080580 -5566133
6263e566133N906004O301962J089596o063856r755444o926944K96315O518938
$$ -5566133 339871 6641833 7731429 1667573 -8087871 -15014815 -14718500 -8199562
6255h199562Q219335N950280J796026k959919p059597q520982o064854m18097
$$ -8199562 19773 5970053 7766079 4806160 -2253437 -10774419 -16839273 -17257370
6247a7257370N813043Q613570M591677m448776j0309486o271419L874334R375957
$$ -17257370 -11444327 -2830757 1760920 -2687856 -12997342 -19268761 -15394427 -6018470
6239f018470N644177j307866m619699m588764m041299j971439K994919P358205
$$ -6018470 -374293 -1682159 -6301858 -10890622 -14931921 -16903360 -13908441 -6550236
6231f550236P048773M174937L649452N065899L866918m71759l463601k962474
$$ -6550236 498537 4673474 8322926 13388825 17255743 16783984 13320383 10357909
6223A0357909j928449k673516l089723n78081L703213O427369N625717J565862
$$ 10357909 8429460 5755944 2666221 2088140 5791353 12218722 17844439 19410301
6215A9410301l708278p054833o591390l760066j162287J033820L748827N108009
$$ 19410301 15702023 8647190 2055800 -1704266 -2866553 -1832733 1916094 7024103
6207G024103K273900k821396m577853j762595N95761o27323j911567J71856K731707
$$ 7024103 9298003 6476607 1898754 136159 731920 104597 -1806970 -1635114 1096593
6198A096593J975689L46850J867197L690682J24186o355501o925627m44785L154305
$$ 1096593 3072282 3419132 5286329 8977011 9101197 2745696 -4179931 -4624716 -1470411
6189a470411k489223r789879p983360J218512O843727M768547J884599L923292
$$ -1470411 -3959634 -13749513 -21732873 -20514361 -13670634 -8902087 -7017488 -3094196
6181c094196P248588N862693N50735l368186l670340k221855n43151J520598L493787
$$ -3094196 4154392 10017085 10567820 7199634 3529294 1307439 764288 2284886 5778673
6172E778673L843982J961775j105910l560695l737019j523435L05409j404712
$$ 5778673 9622655 11584430 10478520 6917825 3180806 1657371 1962780 558068
6164E58068m954013m304084K468943Q564976O532790j461392o456770m383693
$$ 558068 -4395945 -8700029 -6231086 2333890 8866680 7405288 948518 -3435175
6156c435175M24758K806428K151591k27979l430063n210309l070547J013523J759645
$$ -3435175 -3010417 -203989 1947602 1719623 -1710440 -6920749 -9991296 -8977773 -7218128
6147g218128j601948l748011j804866J78131j221375k500298M30718M390331L580702
$$ -7218128 -8820076 -12568087 -14372953 -14194822 -15416197 -17916495 -17485777 -13095446 -9514744
6138i514744j169249l999128k560895Q67532M679695Q206467Q421489L030020
$$ -9514744 -10683993 -14683121 -17244016 -16376484 -11696789 -3490322 4931167 7961187
6130G961187l980291o362092m573419l926463m327821j66222Q260230J1972810
$$ 7961187 3980896 -2381196 -6954615 -10881078 -15208899 -15375121 -7114891 4857919
6122D857919N826686l512181p077429n100802l424495l357790j554627K899766
$$ 4857919 10684605 7172424 94995 -5005807 -8430302 -11788092 -13342719 -10442953
6114a0442953P148934Q772588O993201J653129m905923p294982l053466K729102
$$ -10442953 -3294019 5478569 12471770 14124899 9218976 1923994 -1129472 1599630
6106A599630L412038l65062k725182j663793l97481m92283J76147K143584K852903
$$ 1599630 5011668 4646606 1921424 257631 -139850 -632133 -455986 1687598 4540501
6097D540501J837176K239764N163066P005901M788604L23611l199138n167009
$$ 4540501 6377677 8617441 13780507 20786408 25575012 25898623 22699485 17532476
6089A7532476n681543l432627J320447M552961K902900j496634l766958k415595
$$ 17532476 11850933 8418306 9738753 14291714 17194614 15697980 11931022 9515427
6081I515427J41116J734741K000818P62839j917813m344203m628954l524992l332585
$$ 9515427 9656543 11391284 13392102 14154941 12237128 7892925 3263971 -261021 -3593606
6072c593606l970352k748699J401414N813841P150845M794560L52084m371814
$$ -3593606 -7563958 -10312657 -8911243 -3097402 4053443 8848003 9200087 4828273
6064D828273p650499p704007m167000R31614N074964P567563Q531697O536388
$$ 4828273 -2822226 -10526233 -14693233 -13761619 -8686655 -1119092 7412605 13948993
6056A3948993L2882q280519j1657956o540429K142788O327362M752948L299357
$$ 13948993 13981875 5701356 -5956600 -12497029 -10354241 -4026879 726069 4025426
6048D025426M834025M221048k852669j0669628r639189J5499P919310P663248
$$ 4025426 8859451 13080499 10227830 -441798 -10080987 -10065488 -2146178 5517070
6040E517070M142843L877413M901564K085888k543050k737730P43326K82029o227556
$$ 5517070 9659913 13537326 18438890 20524778 17981728 15243998 15987324 16269353 10041797
6031A0041797j0859571p033130O81145L407379N72519o91459K855398O148055
$$ 10041797 -817774 -7850904 -7169759 -3762380 -3189861 -3881320 -1025922 5122133
6023E122133M107782r88190l298225j174791K123939L484836K577820N64236r74303
$$ 5122133 9229915 8241725 4943500 3768709 5892648 9377484 11955304 12519540 11545237
6014A1545237n21298J255124O15996m765025j0850089j0849038m339725J800661
$$ 11545237 11023939 12279063 12895059 8130034 -2720055 -13569093 -17908818 -16108157
6006a6108157L241608L807179P720480J1349833Q670970J511858l008664l689713
$$ -16108157 -12866549 -9059370 -1338890 10010943 18681913 20193771 17185107 13495394
5998A3495394n779732r986782r681225k149381N126690M564146j039075l829889
$$ 13495394 7715662 -2271120 -11952345 -14101726 -8975036 -4410890 -5449965 -9279854
5990i279854k040231L07790J190640J622327J361778k28164q46131J407121L268647
$$ -9279854 -11320085 -11012295 -9821655 -8199328 -6837550 -7065714 -7911845 -6504724 -3236077
5981c236077J046317j912746K31666N134988M646360j875916n768917k858122
$$ -3236077 -2189760 -4102506 -3870840 1264148 5910508 4034592 -1734325 -4592447
5973d592447P3665k808608o171726k067990P007195J1319243P146423p0568m308609
$$ -4592447 -4518782 -7327390 -13499116 -15567106 -8559911 2759332 9905755 9835187 5526578
5964E526578m653312k900090o21453Q70871J148326J502770K823201L450535J590067
$$ 5526578 873266 -2026824 -2648277 -1777406 -629080 873690 3696891 7147426 8737493
5955H737493j392641k850803k813424l200277m187225m192979k548866K73494
$$ 8737493 7344852 4494049 1680625 -1519652 -5706877 -9899856 -12448722 -12175228
5947a2175228L748696O213277M804152l00898l787422j494140K953548K624680
$$ -12175228 -8426532 -2213255 2590897 2289999 -1497423 -2991563 -38015 2586665
5939B586665k685726o316057m598042j217030l93442r50471J24022K227128K707801
$$ 2586665 -99061 -6415118 -11013160 -12230190 -12623632 -13574103 -13450081 -11222953 -8515152
5930h515152J571231J428738L552274O018240N668985J334680m429905p099379
$$ -8515152 -6943921 -5515183 -1962909 4055331 9724316 11058996 6629091 -470288
5922d70288m807437o83024R48761k66123j537764j725453j981628k153169n15231
$$ -470288 -5277725 -5960749 -5011988 -5278111 -6815875 -8541328 -10522956 -12676125 -13191356
5913a3191356K363332L271853J088015j445771k041512j808246k210513k006762
$$ -13191356 -10828024 -7556171 -6468156 -7913927 -9955439 -11763685 -13974198 -15980960
5905a5980960O42240N054701Q746112R707430P155832K077392k407000l713856
$$ -15980960 -15338720 -10284019 -1537907 8169523 15325355 17402747 14995747 11281891
5897A1281891l255358m228818n840948m133175M40654J750388k814475p125857
$$ 11281891 8026533 3797715 -2043233 -6176408 -5735754 -3985366 -6799841 -13925698
5889a3925698m723287J916790N891877O111030O622579P989260O589072K257246
$$ -13925698 -18648985 -16732195 -10840318 -4729288 1893291 9882551 16471623 18728869
5881A8728869l78217M08552N55025k579746n540122m723594k536695l240350n679303
$$ 18728869 18350652 18759204 19314229 16734483 11194361 6470767 3934072 693722 -4985581
5872d985581m965348n7528M763401N861074M033101J897868O22917J76101K29782
$$ -4985581 -9950929 -10008457 -5245056 616018 4649119 6546987 7169904 7346005 7575787
5863G575787l38036k539756m618395k862740K771147O253820K131500o631856
$$ 7575787 7237751 4697995 79600 -2783140 -11993 6241827 8373327 1741471
5855A741471j1388609q334886k322476O27915L31299j10052K58684Q25012K264848
$$ 1741471 -9647138 -17982024 -20304500 -19676585 -19345286 -19455338 -19196654 -18371642 -16106794
5846a6106794M737652N605477L304625J428031L937901P876522O725516N07138
$$ -16106794 -11369142 -5763665 -2459040 -1031009 2906892 10783414 17508930 18016068
5838A8016068l817862k701560l66745j175342m004340o808089j0359487j3570436
$$ 18016068 14198206 11496646 11129901 9954559 5950219 -857870 -11217357 -24787793
5830b4787793j1146405j228305R360436J3085349J0880942P741204L579384l991488
$$ -24787793 -35934198 -37162503 -27802067 -14716718 -3835776 3905428 7484812 3493324
5822C493324j0799207r089531N49177Q171052P132974J454132j506209r6635K526331
$$ 3493324 -7305883 -16395414 -15846237 -7675185 -542211 911921 -594288 -690923 1835408
5813A835408L691581K653237R7619j491240J26649L039783K725483j038250k984824
$$ 1835408 5526989 8180226 8277845 6786605 6913254 9953037 12678520 11640270 8655446
5804H655446n22903J353524k450047q006874o457513L361525J1734767R484228
$$ 8655446 8132543 9486067 7036020 -970854 -7428367 -4066842 7667925 17152153
5796A7152153p40229p598337m363876L977492P798805M461933n4122l67245J596939
$$ 17152153 16411924 8813587 4449711 8427203 16226008 20687941 20633819 20266574 21863513
5787B1863513R75974k374820m344364l122761j353345j808257m042686n797346
$$ 21863513 22839487 20464667 16120303 12997542 11644197 9835940 5793254 -4092
5779d092n567864l635958j970596k221513k472731J548847R375114J3264151P669019
$$ -4092 -5571956 -9207914 -11178510 -13400023 -15872754 -14323907 -4948793 8315358 15984377
5770A5984377j476758l605797J717566M718762L86834n138048n621690l524458
$$ 15984377 14507619 10901822 12619388 17338150 17724984 12586936 6965246 3440788
5762C440788k996293j861373K668133O312114L631825k361414m431979k380852
$$ 3440788 444495 -1416878 1251255 7563369 11195194 8833780 4401801 2020949
5754B020949k190246n276675o514508l193017J204939L348392L993024M117635
$$ 2020949 -169297 -5445972 -11960480 -15153497 -13948558 -10600166 -6607142 -2489507
5746b489507K826873Q91378J122875L288768L717394J929803K116768N234833
$$ -2489507 337366 1228744 2351619 5640387 9357781 11287584 13404352 18639185
5738A8639185N590177j92683o102508m784678J141033L000456o77482k731415
$$ 18639185 24229362 24036679 17934171 13149493 14290526 17290982 16613500 13882085
5730A3882085M58283L314811P40086l229079k074285K057441R73122o567603j1414724
$$ 13882085 14340368 17655179 18395265 15166186 13091901 15149342 16122464 9554861 -1859863
5721a859863o236538L735269O989273Q59835n051022j839150O812975R768884
$$ -1859863 -8096401 -4361132 2628141 3487976 -1563046 -3402196 3410779 13179663
5713A3179663L461426l717301l382538J643394K633117j697469m006434p05312
$$ 13179663 16641089 12923788 9541250 11184644 13817761 12120292 8113858 7408546
5705G408546J928133k052364q026822p476362j217329K277543O44425N01802M763035
$$ 7408546 9336679 7284315 -742507 -8218869 -9436198 -7158655 -6514230 -6012428 -1249393
5696a249393O423219K35535p192363o629963q0923L450996K524272L525873P391019
$$ -1249393 5173826 5409361 -1783002 -8412965 -8493888 -5042892 -2518620 1007253 8398272
5687H398272O786813j076819q287025p483934j782730J939134L221608M971381
$$ 8398272 15185085 14108266 5821241 -1662693 -3445423 -1506289 1715319 6686700
5679F686700N405606R47413n499790p010390k851168O15826j23506j126256J698958
$$ 6686700 12092306 13039719 7539929 529539 -2321629 -1705803 -1829309 -2955565 -1256607
5670a256607N866907O187709K212757j498321j237527J975871L826747R01081
$$ -1256607 4610300 10798009 13010766 11512445 10274918 12250789 16077536 16978617
5662A6978617n813662j0962497r420132j710221O026440Q293503N678112L066220
$$ 16978617 11164955 202458 -9217674 -10927895 -4901455 3392048 9070160 12136380
5654A2136380L164974L610725J125232l165836m878111k654302l70232j475580
$$ 12136380 15301354 18912079 20037311 16871475 11993364 9339062 8968830 7493250
5646G493250l841276l389927r22322q67282l786352n239140l109681r19359j423862
$$ 7493250 3651974 262047 -660275 -1527557 -5313909 -10553049 -13662730 -14582089 -16005951
5637a6005951j688765J620002N752426N418268P23413k918328j854145K390327
$$ -16005951 -17694716 -16074714 -10322288 -4904020 -4180607 -7098935 -8953080 -6562753
5629f562753N911102N605995O93887n832385q340523m223705K508289N976526
$$ -6562753 -651651 4954344 5648231 -184154 -8524677 -12748382 -10240093 -4263567
5621d263567N207648L152198J082723j751358m315990m476536l032957k512424
$$ -4263567 944081 4096279 5179002 3427644 -888346 -5364882 -8397839 -10910263
5613a0910263k143926J205339O722272R138328N880311O74037j609369m27407
$$ -10910263 -13054189 -11848850 -5126578 4011750 9892061 10566098 8956729 8529322
5605H529322J474722J717425j67272k439360k174865Q64048K220483j615042o644877
$$ 8529322 10004044 11721469 11554197 9114837 6939972 7804020 10024503 8409461 1764584
5596A764584n889220k44504J946870k321884n654785j652089N218542O645081
$$ 1764584 -4124636 -4369140 -2422270 -4744154 -10398939 -12051028 -6832486 -187405
5588a87405K339988j504093k295774k923231n089255o782892o115413k966111
$$ -187405 2152583 648490 -1647284 -4570515 -9659770 -16442662 -22558075 -25524186
5580b5524186K743500R944393J4111141J0979510K977962k591894k684104j542410
$$ -25524186 -22780686 -12836293 1274848 12254358 15232320 12640426 9956322 8413912
5572H413912l336267o179711o017807k851320L82125K772130N372869P174677
$$ 8413912 5077645 -1102066 -7119873 -9971193 -9589068 -6816938 -1444069 5730608
5564E730608N209386n04569n291373n078698j484487O08300n16338k051639j507639
$$ 5730608 10939994 10435425 5144052 65354 -1419133 -810833 -1327171 -3378810 -4886449
5555d886449J35872J050007J396793J642714O90606j576221k262753L89913K742425
$$ -4886449 -4750577 -3700570 -2303777 -661063 29543 -1546678 -3809431 -3419518 -677093
5546f77093K85369m595001m860118Q50912N922193N535471L062906L431803N089317
$$ -677093 -391724 -4986725 -9846843 -8995931 -3073738 2461733 5524639 8956442 14045759
5537A4045759L320126j674941n041547m113138r24679J261578Q49573j734640
$$ 14045759 17365885 15690944 10649397 6536259 5611580 6873158 7722731 5988091
5529E988091m057496l296759k3410J500851q21172l190633j237449L121537M048931
$$ 5988091 1930595 -1366164 -1389574 111277 -709895 -3900528 -5137977 -2016440 2032491
5520B032491j98485n149561n427327J39931P374616R032914J151944j0529040
$$ 2032491 1834006 -3315555 -8742882 -8602951 -1228335 7804579 8956523 -1572517
5512a572517j4545002p596342M89972P29390k100030J300604P966335O967230
$$ -1572517 -16117519 -23713861 -23223889 -22494499 -24594529 -23293925 -15327590 -8360360
5504h360360j655289n773653o36365L975721Q13072l427226j572842O72366m071155
$$ -8360360 -10015649 -15789302 -16425667 -12449946 -11636874 -15064100 -16636942 -15964576 -20035731
5495b0035731r166757l189995R780251J3486728K975284q128656o945365K497325
$$ -20035731 -29202488 -32392483 -22612232 -9125504 -6150220 -14278876 -21224241 -18726916
5487a8726916P614793M182570j417184k722290k21780J189615j321000m839652
$$ -18726916 -11112123 -6929553 -8346737 -11069027 -11290807 -10101192 -11422192 -16261844
5479a6261844l575325L518535R731188Q379933J898040j596311L12087K474285
$$ -16261844 -19837169 -16318634 -6587446 1792487 3690527 2094216 2406303 4880588
5471D880588J790267J542099L879643M816385R54767m060393m684826j267555
$$ 4880588 6670855 8212954 12092597 16908982 17863749 13803356 9118530 7850975
5463G850975J872361K909334K507884K81179l786209o353969l972961J703411
$$ 7850975 9723336 12632670 15140554 15421733 11635524 5281555 1308594 3012005
5455C012005N773323O018192L784405Q05360j336958p16274K030098K529997j307980
$$ 3012005 8785328 14803520 18587925 19393285 18056327 17340053 19370151 21900148 20592168
5446B0592168m717423k681769J647575J742345j349433j111342K170760R51759
$$ 20592168 15874745 13192976 14840551 16582896 15233463 14122121 16292881 17244640
5438A7244640n891600q750603j471943Q430213J0367037N070883P76808k85779
$$ 17244640 11353040 2602437 1130494 9560707 19927744 24998627 25775435 25489656
5430B5489656k836393p914698r877063n154498K209491N976033M770705J854929
$$ 25489656 22653263 14738565 4861502 -292996 1916495 7892528 12663233 14518162
5422A4518162L75291M56582J06766j462796j764283J823129O580019N923625j364340
$$ 14518162 14893453 15350035 15456801 13994005 12229722 14052851 20632870 26556495 25192155
5413B5192155p450607n102164K276164N474665J980268k438906l569145l540744
$$ 25192155 17741548 12639384 14915548 20390213 22370481 19931575 16362430 12821686
5405A2821686m933646o053824m519397j371906R09845J638284J286174P1990j215111
$$ 12821686 7888040 1834216 -2685181 -4057087 -3147242 -1508958 -222784 -150794 -1365905
5396a365905r96615J067186L170802L250132Q80815k436589l815335r79762M521055
$$ -1365905 -2362520 -1295334 1875468 5125600 6006415 3569826 -245509 -1225271 3295784
5387C295784P566798N106374j57196l987151n912089p165429o606567l369149
$$ 3295784 10862582 15968956 15811760 11824609 5912520 -1252909 -7859476 -11228625
5379a1228625o24641j086098j490441J924499N211221K101069m376560n215359
$$ -11228625 -11853266 -12939364 -14429805 -12505306 -7294085 -5193016 -9569576 -14784935
5371a4784935K34169L667995K171338J694124L945773K356482m077148n643157
$$ -14784935 -14550766 -10882771 -8711433 -7017309 -3071536 -715054 -4792202 -10435359
5363a0435359J823174P503531K448318m931866k708404M178268K331845o985417
$$ -10435359 -8612185 -1108654 1339664 -3592202 -6300606 -2122338 209507 -6775910
5355f775910r357553k10596R000122Q996720L677956m8182j665045k266494n18909
$$ -6775910 -16133463 -16344059 -7343937 1652783 5330739 5282557 3617512 1351018 832109
5346H32109K098718O33353m595354o570879k750423N32114q55390j852726K030439
$$ 832109 2930827 3564180 -1031174 -7602053 -10352476 -9820362 -10675752 -12528478 -10498039
5337a0498039N968753M078991j24630K86139L974046M170166L07711j532924J118920
$$ -10498039 -4529286 -450295 -574925 -288786 3685260 7855426 8163137 6630213 7749133
5328G749133L801218K582807j055659l995348n510264n888068m257338L43415
$$ 7749133 11550351 14133158 13077499 9082151 3571887 -2316181 -6573519 -6230104
5320f230104O965572J2452312J2978984P230516j112062o142062o408748o287853
$$ -6230104 735468 13187780 26166764 33397280 32285218 26143156 19734408 13446555
5312A3446555q760864j0194904n939545J626832N543729L563106L7620j431637
$$ 13446555 4685691 -5509213 -11448758 -9821926 -4278197 -715091 -677471 -2109108
5304b109108k338831m875065p193551n625345L99170P522801J1397908R662394
$$ -2109108 -4447939 -9323004 -16516555 -22141900 -21742730 -14219929 -2822021 6840373
5296F840373L665064j832879k449789R75502K794662o79661o121071o932637j358597
$$ 6840373 10505437 8672558 6222769 7198271 9992933 9313272 3192201 -3740436 -5099033
5287e099033N441790P571326M459566j9267k373853j865797K20656J484691j80800
$$ -5099033 342757 7914083 12373649 12354382 9980529 8114732 8335388 9820079 9639279
5278I639279l553758l609670K501225R677678R569700J562769o008477p270494
$$ 9639279 6085521 2475851 4977076 14654754 24224454 25787223 19778746 12508252
5270A2508252n659881n994130n939519j608293L211758J809231l738546m417847
$$ 12508252 6848371 854241 -5085278 -6693571 -3481813 -1672582 -5411128 -9828975
5262i828975K172392Q333269P588317J923984m118929q984786j0956742p107637
$$ -9828975 -7656583 676686 8265003 10188987 6070058 -2914728 -13871470 -20979107
5254b0979107L74367L574287n54886n126717l986970r54846j769603k972589K253257
$$ -20979107 -20604740 -17030453 -17585339 -22712056 -26699026 -27653872 -29423475 -32396064 -30142807
5245c0142807J1093072J3767208P841123P10209k292949l475638m971160l822300
$$ -30142807 -19049735 -5282527 2558596 3268805 975856 -2499782 -7470942 -11293242
5237a1293242J496975O291490N952289K503382O53144Q41084K89251j621299l003319
$$ -11293242 -9796267 -3504777 2447512 4950894 5604038 6445122 6734373 5113074 2109755
5228B109755l063847k819507k941784l169642l256065k960057j917914n64704
$$ 2109755 -954092 -3773599 -6715383 -9885025 -13141090 -16101147 -18019061 -18583765
5220a8583765P9273M17336K221781N296851O295972K880570k553945n517071m628905
$$ -18583765 -18504492 -18087156 -15865375 -10568524 -4272552 -1391982 -3945927 -9462998 -14091903
5211a4091903k083230L4487J546877K871234M110187N253842N594307L577174
$$ -14091903 -16175133 -16140646 -14593769 -11722535 -7612348 -2358506 3235801 6812975
5203F812975p54133l957620k605863J633731L303164L2919m735580o620118m804439
$$ 6812975 6058842 2101222 -504641 1129090 4432254 4465173 -270407 -6890525 -11694964
5194a1694964o65523M332007P285359M533851k550634n992492n28757Q032071
$$ -11694964 -12360487 -8028480 -743121 3790730 1240096 -4752396 -5281153 2750918
5186B750918R736480M063251n76029m70888j137556o002422r370093o021215p07232
$$ 2750918 12487398 16550649 15974620 15503732 14366176 8363754 -1006339 -7027554 -7734786
5177g734786r18807n110129n773346j038192M293023P058719P660399N290968
$$ -7734786 -8653593 -13763722 -19537068 -20575260 -16282237 -9223518 -1563119 3727849
5169C727849j010022p174609p711026m562132m580181p613125n747606L300826
$$ 3727849 2717827 -4456782 -12167808 -16729940 -21310121 -28923246 -34670852 -31370026
5161c1370026J0674893Q657617J366414k209190l42683J981537J778377N83594
$$ -31370026 -20695133 -12037516 -10671102 -12880292 -13222975 -11241438 -9463061 -8879467
5153h879467M57653J788049L725148M335326K296947k07971M34788L137449K658931
$$ -8879467 -8421814 -6633765 -2908617 1426709 3723656 3515685 3950473 7087922 9746853
5144I746853j810449m064866j05591N303325N427180L70745n074637q060449p962016
$$ 9746853 7936404 3871538 3765947 9069272 14496452 14867197 9792560 1732111 -6229905
5135f229905m421529M93275K510529J730249L841167J0026195J1926339L567337
$$ -6229905 -10651434 -10158159 -7647630 -5917381 -2076214 7949981 19876320 23443657
5127B3443657p414046r142339k008585L390281J901272k195597n039341o931690
$$ 23443657 16029611 6887272 4878687 8268968 10170240 7974643 2935302 -3996388
5119c996388o444671q08293O349817O864307K42720m152023l53217O125813P273763
$$ -3996388 -10441059 -11249352 -4899535 1964772 2207492 -1944531 -2297748 3828065 11101828
5110A1101828L184990p06747j775213j036632L54682J440050R69193o35669j359388
$$ 11101828 14286818 13580071 11804858 10768226 11122908 12562958 13532151 12896482 11537094
5101A1537094j305873k964099o111605o507790k173867K782842L655589J339786
$$ 11537094 10231221 7267122 1155517 -5352273 -7526140 -4743298 -1087709 252077
5093B52077j34128K33735O2640k060944m750392n753811m017958m53049K425886
$$ 252077 117949 351684 414324 -1646620 -6397012 -12150823 -16168781 -16621830 -14195944
5084a4195944K630466J156172J099996L682107O306917N292641o450n897125p120358
$$ -14195944 -11565478 -10409306 -9309310 -5627203 679714 5972355 5965905 68780 -7051578
5075g051578k060581M517826O099516K507277p98J657318K539481j567548n601297
$$ -7051578 -9112159 -4594333 1505183 4012460 4011662 5668980 8208461 6640913 1039616
5066A039616k346368N086118O444884n20529o657012m933433K18116P03163l799339
$$ 1039616 -1306752 3779366 10224250 9703721 3046709 -1886724 -1668608 -965445 -4764784
5057d764784o682707l468670L681017R057245R040295N471279L461583M666562
$$ -4764784 -11447491 -14916161 -11235144 -2177899 6862396 12333675 15795258 20461820
5049B0461820M509740j056860q356154j0217905n851428j033196P33256J323586
$$ 20461820 24971560 23914700 15558546 5340641 -510787 -1543983 -810727 512859
5041E12859K314505K262775N80353j118998k373896l853468l939655n56054L750759
$$ 512859 2827364 5090139 5670492 4551494 2177598 -1675870 -5615525 -6171579 -2420820
5032b420820M349817K048894J804217L935850L682291J67931j612662O78934L245325
$$ -2420820 1928997 3977891 5782108 9717958 13400249 13568180 11955518 12634452 15879777
5023A5879777L000930J261082r01405m162203o517497m607785p44473r16081m632648
$$ 15879777 18880707 20141789 19240384 15078181 8560684 3952899 3208426 2292345 -2340303
5014b340303n283656j826825l33017k002300p30216M138785M655969j084648l516070
$$ -2340303 -7623959 -9450784 -9783801 -11786101 -12516317 -8377532 -3721563 -4806211 -8322281
5005h322281K143544O403827J405366n082954k677072M434059N710410J615275
$$ -8322281 -6178737 225090 1630456 -3452498 -6129570 -1695511 4014899 5630174
4997E630174l43188m64244m047288q261272n570908K149698N640719L001261P14816
$$ 5630174 5286986 4822742 775454 -7485818 -13056726 -10907028 -5266309 -2265048 -1550232
4988a550232J128716M99307j040296Q17484M422836K957862l228266n683494j436364
$$ -1550232 -421516 77791 -962505 -145021 4277815 7235677 4007411 -1676083 -3112447
4979c112447K476273R83199j884908j644269o97884k247677l728980j529684K620194
$$ -3112447 -636174 347025 -1537883 -3182152 -3880036 -6127713 -9856693 -11386377 -8766183
4970h766183M560879L537282J599266l8762j262182j810387j730715j607321j573115
$$ -8766183 -4205304 -668022 931244 892482 -369700 -2180087 -3910802 -5518123 -7091238
4961g091238j398772j136273j36459K981270P015602P146269Q89811o795039q674072
$$ -7091238 -8490010 -9626283 -9762742 -6781472 234130 7380399 8270210 1475171 -7198901
4952g198901m331951J35681O31729j040733j468008K05779K839688N048423N718183
$$ -7198901 -11530852 -11395171 -10763442 -11804175 -13272183 -13066404 -10226716 -5178293 539890
4943E39890M351920J186831l035515o358081n708570p01542L738704L011761j2461
$$ 539890 4891810 6078641 3043126 -3314955 -9023525 -9725067 -5986363 -2974602 -2987063
4934b987063N51985L217814J397371m204358n614463j410787O97087k052521k901583
$$ -2987063 -2435078 782736 2180107 -2024251 -7638714 -9049501 -8352414 -10404935 -13306518
4925a3306518P43665K064792j063707n78126N810704P714871L55644n253399j487950
$$ -13306518 -12562853 -10498061 -11561768 -12139894 -6329190 1385681 1741325 -3512074 -5000024
4916e000024J998274l214104p700905j914322M900681J760000k767721L175460
$$ -5000024 -3001750 -6215854 -13916759 -15831081 -10930400 -9170400 -11938121 -8762661
4908h762661J0932212O499329k954629k274668L257196q98262q945956m876596
$$ -8762661 2169551 8668880 5714251 3439583 6696779 5798517 -3147439 -8024035
4900h024035N887800N009847m711953m857032L649381L199862o100943p815784
$$ -8024035 -2136235 2873612 -1838341 -6695373 -3045992 153870 -5947073 -13762857
4892a3762857k559845n456740j2156543m515171J0609370Q354410p651222r147355
$$ -13762857 -16322702 -21779442 -33935985 -38451156 -27841786 -19487376 -27138598 -36285953
4884c6285953M231495M292733r183036n237418J5657090J5998863o340522p567404
$$ -36285953 -32054458 -27761725 -36944761 -42182179 -26525089 -10526226 -16866748 -24434152
4876b4434152J6866716J5285931j2050052K2171601J45814076K27692557J33278008
$$ -24434152 -7567436 7718495 -4331557 17840044 163654120 391346677 524624685
4869E24624685o9198120j79361904j23808086k4234682o06692k8214685l0555078
$$ 524624685 455426565 276064661 152256575 128021893 127415201 99200516 68645438
4862F8645438p648066k520613j2512439q126517L448842k456750j5047063q472919
$$ 68645438 60997372 58476759 45964320 37837803 41286645 38829895 23782832 15309913
4854A5309913P931929P525859m808855n434195K756262n91974j1604980r113749
$$ 15309913 23241842 30767701 25958846 20524651 23280913 22688939 11083959 1970210
4846A970210N239733J0119597K185174k107783J554475J746916k851750j749928
$$ 1970210 7209943 17329540 19514714 17406931 18961406 20708322 17856572 16106644
4838A6106644M341588L720273l733812o634099l637707l838778p001174l876275
$$ 16106644 20448232 24168505 20434693 13800594 10162887 6324109 -677065 -4553340
4830d553340M502301P082113J890647k659823m111554o471028o736389J071190
$$ -4553340 -51039 7031074 8921721 6261898 2150344 -4320684 -11057073 -9985883
4822i985883J0163362P623058l831629q484442j870838N036590O061437O553036
$$ -9985883 177479 7800537 3968908 -4515534 -6386372 -1349782 4711655 11264691
4814A1264691Q474234O065165n64206l030396Q73785M121950L922130M480749
$$ 11264691 19738925 25804090 25239884 22209488 23083273 27205223 31127353 35608102
4806C5608102M895789r94388j0366978j1774494l119000M537880M447623J825718
$$ 35608102 40503891 39509503 29142525 17368031 14249031 18786911 23234534 25060252
4798B5060252P30741k439122p701960p631338p69909L513540j34307m635228l009095
$$ 25060252 25790993 23351871 15649911 8018573 7248664 10762204 10627897 5992669 2983574
4789B983574J332374K881139K565820K084445o36737m536283l395090L443971
$$ 2983574 4315948 7197087 9762907 11847352 11210615 6674332 3279242 6723213
4781F723213P395143L370767k688797m490706m277304n069465l568567K018585
$$ 6723213 14118356 17489123 14800326 10309620 6032316 962851 -2605716 -587131
4773e87131N699294K912811j454750j527769L05256k36583r59981J086178K357525
$$ -587131 5112163 8024974 6570224 5042455 5347711 5111128 4151147 5237325 7594850
4764G594850m49941k477645J744170P725345O778127j136824q262179r917103
$$ 7594850 7144909 4667264 6411434 14136779 20914906 19778082 11515903 1598800
4756A598800p390995k602833L216988P194194O873755L333794j387386o915537
$$ 1598800 -5792195 -8395028 -5178040 2016154 8889909 12223703 10836317 3920780
4748C920780j1160449r134211j76518Q145771Q965804M897080K420461J979918
$$ 3920780 -7239669 -16373880 -16550398 -8404627 561177 5458257 7878718 9858636
4740I858636R4342k567076k297199R41671L990259N359985M641606M90356n544244
$$ 9858636 9952978 7385902 5088703 6030374 10020633 15380618 20022224 20512580 14968336
4731A4968336p403925k772445J645646n5447k995585J61637N807084M962394j067728
$$ 14968336 7564411 4791966 6437612 6382165 3386580 3548217 9355301 14317695 13249967
4722A3249967k708111J320642K168192l047322n949721j715391K465670J18650
$$ 13249967 10541856 11862498 14030690 10983368 5033647 3318256 5783926 5902576
4714E902576l202228L02988O847947O536183j249782o966289m367251K433864
$$ 5902576 2700348 3003336 9851283 16387466 15137684 8171395 3804144 6238008
4706F238008N878163L501290j658383n304272m909769p90651M260712O955211
$$ 6238008 12116171 15617461 13959078 8654806 3745037 2954386 7215098 14170309
4698A4170309N625556P42269n539027r987556r968857n719308m06143K597586
$$ 14170309 19795865 20538134 14999107 5011551 -4957306 -10676614 -11082757 -8485171
4690h485171K115377o28036k842640j686415L033562P581509P631990L147905
$$ -8485171 -6369794 -6997830 -9840470 -11526885 -8493323 -911814 6720176 9868081
4682I868081j688278l278369j579701J186119K474327N99168l288030m932175
$$ 9868081 8179803 4901434 3321733 4507852 6982179 7581347 4293317 -638858
4674f38858j880638K004222J144895k877313k550043M113514R250827N694839
$$ -638858 -2519496 -515274 629621 -2247692 -4797735 -684221 8566606 14261445
4666A4261445l101545q363296p601571n544204n489172n217823j505858N231114
$$ 14261445 11159900 2796604 -4804967 -10349171 -15838343 -21056166 -22562024 -17330910
4658a7330910J1246499J2178855O268265k827303p896765n695269j023812j93572
$$ -17330910 -6084411 6094444 12362709 9535406 1638641 -4056628 -5080440 -5274012
4650e274012k558120k912777m55059N71196j059483j227470K137881N059101L860187
$$ -5274012 -7832132 -10744909 -11199968 -10628772 -11688255 -12915725 -10777844 -5718743 -1858556
4641a858556Q82320K44445J445175J082790j478304l785037m016853k143945J050775
$$ -1858556 -976236 -731791 713384 1796174 317870 -3467167 -7484020 -9627965 -8577190
4632h577190L693392L524618J264784Q10700L311564M096658n66483o588668p196071
$$ -8577190 -4883798 -1359180 -94396 716304 4027868 8124526 7558043 969375 -6226696
4623f226696k933961l40350j358151r10128L836452Q321868P575887L194973n6580
$$ -6226696 -9160657 -9501007 -10859158 -11769286 -7932834 389034 7964921 11159894 11103314
4614A1103314n81085L97070J855517K251318p91822o320129q697767m587314J444345
$$ 11103314 10522229 10919299 12774816 15026134 14234312 7914183 -783584 -5370898 -3926553
4605c926553K883667M59116K3018K751855L573058l33627n115480o006575l109397
$$ -3926553 -1042886 -583770 -560752 2191103 5764161 5430534 315054 -5691521 -8800918
4596h800918N01084K725438K473352p39708m630389m477742J290770P737643Q647466
$$ -8800918 -8299834 -5574396 -3101044 -3840752 -8471141 -12948883 -11658113 -3920470 4726996
4587D726996L951981q23889j711797N882J156062P86759k18147j513382l268232
$$ 4726996 8678977 7855088 6143291 6149173 7305235 8091994 7873847 6360465 3092233
4578C092233m465681l227114N47510M073262M378359J701025r34192j391770l81466
$$ 3092233 -1373448 -4600562 -4053052 20210 4398569 6099594 5165402 3773632 3392166
4569C392166L74197K82614n60523k319240m495849n227575l205136K90646K707166
$$ 3392166 3766363 4048977 3488454 1169214 -3326635 -8554210 -11759346 -11468700 -8761534
4560h761534L098291K438171J673656Q61238j61509j461277k986748m011420l430629
$$ -8761534 -5663243 -3225072 -1551416 -690178 -851687 -2312964 -5299712 -9311132 -12741761
4551a2741761j491776L0507M47196J224856L004749L770499K214053N29543P20930
$$ -12741761 -14233537 -14203030 -13755834 -12530978 -9526229 -5755730 -3541677 -3012134 -2291204
4542b291204M89629k926524o652781n351005P2140K865701L91046k206491m16745
$$ -2291204 -1801575 -4728099 -11380880 -16731885 -16659745 -13794044 -13402998 -15609489 -16026234
4533a6026234L069935L648304K034804J823813L041284K783762M68924j645079
$$ -16026234 -12956299 -9307995 -7273191 -5449378 -2408094 375668 844592 -800487
4525h00487k132504j315940L75270J954304J142952k520392m959803j870991M472968
$$ -800487 -2932991 -4248931 -3873661 -1919357 -776405 -3296797 -8256600 -10127591 -5654623
4516e654623O668119J311983o534012r481520o017166q68769J129212m28926k432987
$$ -5654623 1013496 2325479 -4208533 -13690053 -19707219 -20575988 -19446776 -19875702 -22308689
4507b2308689j892309J731632O722385J0473143J0643584O376378k36690m576617
$$ -22308689 -24200998 -22469366 -15746981 -5273838 5369746 11746124 11509434 6932817
4499F932817l449681J062135L538951J527724k083645l723831l579719l536397
$$ 6932817 3483136 4545271 8084222 9611946 7528301 3804470 224751 -3311646
4491c311646l084570m77498K999183L410088l83715m111933k717823L183034P159570
$$ -3311646 -6396216 -6873714 -3874531 -464443 -848158 -4960091 -7677914 -4494880 2664690
4482B664690M055123l507181p468755l873097K051794K659035k076572n318581
$$ 2664690 6719813 3212632 -4256123 -8129220 -6077426 -3418391 -5494963 -10813544
4474a0813544l570156o80140l2580J499773P355668J3214781J1404392K111663
$$ -10813544 -14383700 -15063840 -15096420 -13596647 -6240979 6973802 18378194 20489857
4466B0489857n674429n245824J55181K294642k362413r467986j1645997n789057
$$ 20489857 14815428 9569604 9724785 12019427 9657014 189028 -11456969 -17246026
4458a7246026L477119Q073626N412639J362708J870529M069501O03532q239952
$$ -17246026 -13768907 -5695281 -282642 1080066 2950595 7020096 7623628 -616324
4450f16324j3158828q246709J163203O533300O911797O629393O121115K010748
$$ -616324 -13775152 -22021861 -20858658 -14325358 -7413561 -784168 5336947 7347695
4442G347695m679544p503050l617034J627931K210551o17014j799193o93096p26087
$$ 7347695 2668151 -4834899 -8451933 -6824002 -4613451 -5230465 -7029658 -7722754 -8448841
4433h448841k250238j424484K856900N944836M010140m0041p77091J926014L167989
$$ -8448841 -10699079 -12123563 -9266663 -3321827 688313 648272 -128819 1797195 4965184
4424D965184J36854m590754o743968m505445R39037O322494P822889M355503n06798
$$ 4965184 5102038 511284 -6232684 -10738129 -9799092 -3476598 4346291 8701794 8194996
4415H194996k292698j090459n96760k232238l634497k911689p05334J994068M028497
$$ 8194996 5902298 4811839 4215079 1982841 -1651656 -4563345 -5268679 -3274611 753886
4406G53886K324226m603928j0881089p770104L710097J1705489R080395L000016
$$ 753886 3078112 -1525816 -12406905 -20177009 -16466912 -4761423 4318972 7318988
4398G318988L131693P092436O085331K2540l264157j700001j190977l774608l767429
$$ 7318988 10450681 17543117 23628448 23650988 20386831 18686830 17495853 13721245 9953816
4389I953816J372144N154375J769453m896278p212452m115186l92416J094840
$$ 9953816 11325960 16480335 18249788 13353510 6141058 2025872 1633456 2728296
4381B728296J616947K562738L025286J270649k874730o681354o098532q59031
$$ 2728296 4345243 6907981 9933267 11203916 8329186 1647832 -4450700 -5309731
4373e309731L145949O39475m680654m273101K362926N920283Q54763o329256o809225
$$ -5309731 -2163782 -1524307 -6204961 -10478062 -8115136 -2194853 -1340090 -7669346 -14478571
4364a4478571j338925L268021M484571M268671K648908j663206o177831o755056
$$ -14478571 -15817496 -12549475 -8064904 -3796233 -1147325 -2810531 -8988362 -15743418
4356a5743418l872061j138993J175679N208279R115446Q213769K752294j579416
$$ -15743418 -19615479 -20754472 -19578793 -14370514 -5255068 2958701 5710995 4131579
4348D131579j821824q53983j290329j830221j278112r15725r00753O79456L024993
$$ 4131579 2309755 1455772 165443 -1664778 -2942890 -3858615 -4759368 -4079912 -1054919
4339a054919K082427k415866m541778o68192M113025K801802l555219p646738
$$ -1054919 1027508 -1388358 -5930136 -6598328 -2485303 316499 -3238720 -10885458
4331a0885458n552748j05686M020735M552918J916537j163333j100780K588873
$$ -10885458 -16438206 -16543892 -12523157 -7970239 -6053702 -7217035 -8317815 -5728942
4323e728942N778441M813240J564143M97773K486720M835492N623600M399893
$$ -5728942 49499 4862739 6426882 6924655 9411375 14246867 19870467 24270360
4315B4270360O65842l963890m278696K273577R323488Q029012o16359o801725
$$ 24270360 24936202 20972312 16693616 18967193 28290681 36319693 35703334 28901609
4307B8901609n717031k854973l600962n377974m189706k084432k572484l833489
$$ 28901609 23184578 20329605 16728643 11350669 7160963 5076531 2504047 -1329442
4299a329442k288818R98034K847711L338931L614187K081654j819440l943185
$$ -1329442 -3618260 -2620226 227485 3566416 7180603 9262257 7442817 3499632
4291C499632j495534J125566p24084l118466J81646N979524N702225o53102m791023
$$ 3499632 2004098 3129664 2405580 -712886 -531240 5448284 11150509 10497407 5706384
4282E706384l685510k244865k111070N72042M276080J555299o225296o424195
$$ 5706384 2020874 -223991 -2335061 -1763019 2513061 4068360 -2156936 -8581131
4274h581131N303665J4884242R342724l663882q045866l075788p82382m387186
$$ -8581131 -3277466 11606776 20949500 17285618 9239752 6163964 5381582 994396
4266I94396m834760J626342O818888M582009l75807j905199j172168j208598q09586
$$ 994396 -3840364 -2214022 4604866 9186875 8811068 6905869 5733701 4525103 3715517
4257C715517Q57562L22913l827123o075777j426404O131179Q412130L916209j284037
$$ 3715517 4573079 4895992 1068869 -5006908 -6433312 -302133 8109997 12026206 10742169
4248A0742169k225744J9482J932797K223502J802917J222064k39957k932319n090632
$$ 10742169 8516425 8535907 10468704 12692206 14495123 15717187 15477230 12544911 7454279
4239G454279m176142o57377J286121j208579n329702n865982j940769K331060
$$ 7454279 3278137 2620760 3906881 2698302 -2631400 -8497382 -10438151 -8107091
4231h107091L296927J041661k231472m158130l018353N20925L007687K279449
$$ -8107091 -4810164 -3768503 -5999975 -10158105 -13176458 -12655533 -9647846 -7368397
4223g368397P77246J632691L268651K322630L19402J669852N505215N802768M62230
$$ -7368397 -6591151 -4958460 -1689809 632821 952223 2622075 8127290 13930058 14392288
4214A4392288n781041q928879j0089873j0066658o008100K373608Q376296N565926
$$ 14392288 8611247 -317632 -10407505 -20474163 -26482263 -24108655 -15732359 -10166433
4206a0166433l193035q781890o753012j444982N26900j975738m161586j564150
$$ -10166433 -13359468 -22141358 -28894370 -30339352 -29812452 -31788190 -35949776 -37513926
4198c7513926M283100P623252O056745L655209M487296O142726L721890j976943
$$ -37513926 -33230826 -25607574 -19550829 -15895620 -11408324 -5265598 -1543708 -3520651
4190c520651n268826l502641N64019L414296L334777j93532m801587m980318Q19039
$$ -3520651 -8789477 -12292118 -11728099 -8313803 -4979026 -5172558 -9974145 -14954463 -14135424
4181a4135424N401679K025419m525423m733621L80179J572944k227516k314443
$$ -14135424 -8733745 -6708326 -11233749 -15967370 -15587191 -14014247 -16241763 -18556206
4173a8556206L847190P848260M733344o308j985640m378745p758099n761748K546202
$$ -18556206 -14709016 -6860756 -2127412 -2133720 -4119360 -8498105 -16256204 -22017952 -19471750
4164a9471750P588978L795893j798632k649215k804357n976516o654922j562264
$$ -19471750 -11882772 -8086879 -9885511 -12534726 -15339083 -21315599 -27970521 -29532785
4156b9532785J703729k444089p445612p213416o500249q585443p112132j659037
$$ -29532785 -27829056 -30273145 -37718757 -44932173 -51432422 -60017865 -67129997 -68789034
4148f8789034m240877j6072485j8370964n540414l155789k3384116k6676787K7600790
$$ -68789034 -73029911 -89102396 -107473360 -113013774 -116169563 -139553679 -166230466 -138629676
4140a38629676J05078843J23995510O3006879r534649k9524275j2138059o320594
$$ -138629676 -33550833 90444677 153451556 143916907 114392632 102254573 95933979
4133I5933979j7938833j9226838o214469q15806p585476q949529q28130R97446
$$ 95933979 77995146 58768308 52553839 51738033 44152557 35203028 34374898 35372344
4125C5372344q178022j3495274p349135l74047p5721L82558N477782P796379K776540
$$ 35372344 27194322 13699048 6349913 5975866 5900145 6282703 11760485 19556864 22333404
4116B2333404k170763p21659K571387J900760j137439l630580o071972o912248
$$ 22333404 20162641 19440982 22012369 23913129 22775690 19145110 13073138 6160890
4108F160890k486980L957341L704151l080109n433386J264909P591810N715157
$$ 6160890 3673910 7631251 11335402 8255293 2821907 4086816 11678626 17393783
4100A7393783J583933L241935O807202M269030k094989l998434j113901j46017
$$ 17393783 18977716 22219651 29026853 33295883 31200894 27202460 26088559 25942542
4092B5942542k489339k866450J38135J218445k375355n907856m488332m07727
$$ 25942542 23453203 20586753 20724888 21943333 19567978 13660122 9171790 8764063
4084H764063L27535l756623p828656o706090r46867L627084K590919j616330k556586
$$ 8764063 9091598 5334975 -2493681 -9199771 -10146638 -6519554 -3928635 -5544965 -8101551
4075h101551J739350N756128L617879l026641p128243n131072l56462K703252
$$ -8101551 -6362201 -606073 3011806 -14835 -7143078 -12274150 -12630612 -9927360
4067i927360L894446N094142N119823J054589n551913q217257l535132L613159
$$ -9927360 -6032914 -938772 4181051 5235640 -316273 -8533530 -12068662 -8455503
4059h455503O272953M337808K807441L031312J735219j407868k091361Q34335
$$ -8455503 -2182550 2155258 4962699 7994011 9729230 8321362 6230001 7064336
4051G064336K361234n90814l942947l393094j039401k02061R93819M844997P599774
$$ 7064336 9425570 8834756 4891809 1498715 459314 257253 1251072 6096069 13695843
4042A3695843M709443j107294m175869n007384p521437r975842p202307k75053
$$ 13695843 18405286 17297992 13122123 8114739 593302 -9382540 -16584847 -16859900
4034a6859900M591164N763105O177353M676105k562642j1456764j1750262k206724
$$ -16859900 -12268736 -6505631 -328278 4347827 1785185 -9671579 -21421841 -23628565
4026b3628565N877261M518393o93721j217795K133826L870025L536417L611989
$$ -23628565 -17751304 -13232911 -13926632 -15144427 -13010601 -9140576 -5604159 -1992170
4018a992170L225426P93688j549722k197794m075053q245577q540094p7660J0794061
$$ -1992170 1233256 2026944 477222 -1720572 -5795625 -14041202 -22581296 -22658956 -11864895
4009a1864895J3304047O609402n72057k986403l311181m100016l631825j375220
$$ -11864895 1439152 8048554 7476497 4490094 1178913 -2921103 -6552928 -7928148
4001g928148o19159l030848n693851n760745l719511l40786N080202J1146014
$$ -7928148 -8547307 -11578155 -17272006 -23032751 -26752262 -27093048 -22012846 -10866832
3993a0866832J3163556Q659903J417541k764866k574052j337280k099088m346713
$$ -10866832 2296724 10956627 12374168 9609302 7035250 5697970 3598882 -747831
3985g47831m959792j668959L799092O560642M256547Q76437J708006N025924L595402
$$ -747831 -5707623 -7376582 -3577490 2983152 7239699 8116136 9824142 14850066 18445468
3976A8445468m276756j0487270p641133L09438L318444j048858n287540l281333
$$ 18445468 14168712 3681442 -3959691 -3650253 -331809 -1380667 -6668207 -9949540
3968i949540K079079M677811L507018J522376l09440l168978o195614o660538
$$ -9949540 -7870461 -3192650 314368 1836744 1527304 -1641674 -7837288 -14497826
3960a4497826m195620j239815Q25729K592149L567157K120910o35105r83216J623960
$$ -14497826 -18693446 -19933261 -19107532 -16515383 -12948226 -10827316 -11462421 -12445637 -10821677
3951a0821677K835284j7710l267044k145334K430354O021754O852410N741804
$$ -10821677 -7986393 -8004103 -11271147 -13416481 -10986127 -4964373 1888037 7629841
3943G629841K547452k311393m773342j348642M395720N326439O80667l179193
$$ 7629841 10177293 7865900 3092558 1743916 6139636 11466075 12146742 8967549
3935H967549k374852J53270J248152K189201L888116L047408k637834r286452
$$ 8967549 6592697 6745967 7994119 10183320 14071436 17118844 14481010 5194558
3927E194558j1030517o923462m74778N148411Q358534Q113671N108673K325900
$$ 5194558 -5835959 -12759421 -13234199 -8085788 272746 8386417 13495090 15820990
3919A5820990J528801P87655k016540n131329n264853k534535j81710r1273r21794
$$ 15820990 17349791 18137446 16120906 10989577 5724724 3190189 3008479 2917206 1995412
3910A995412l15729K492168N722371O030906J677985m782044q561728p599218
$$ 1995412 1679683 4171851 9894222 15925128 17603113 12821069 4259341 -3339877
3902c339877l595710J248156N295918N952384J928426k608335j809033K614252
$$ -3339877 -6935587 -5687431 -391513 5560871 7489297 4880962 3071929 5686181
3894E686181K363828m647419r611458n532022K199643M420066J659601J060175
$$ 5686181 8050009 3402590 -6208868 -11740890 -9541247 -5121181 -3461580 -2401405
3886b401405L898619M918003K146305q79266k076772k699886k528124k6551K793769
$$ -2401405 1497214 6415217 8561522 7682256 5605484 2905598 377474 350923 3144692
3877C144692K380232N19590K300115O799651P183684J617370l124226j719986
$$ 3144692 5524924 6044514 8344629 15144280 22327964 23945334 20821108 19101122
3869A9101122K190079J919671l628109j0156319j2806324q824795L30937P919868
$$ 19101122 21291201 23210872 19582763 9426444 -3379880 -12204675 -11873738 -3953870
3861c953870P586717J620493j511873Q67419K582388k21930k356058J328226O819949
$$ -3953870 3632847 5253340 3741467 4608886 7191274 6969344 4613286 5941512 12761461
3852A2761461P103013K325587k540732n744209p647185n677023J538968P646018
$$ 12761461 19864474 22190061 19649329 13905120 6257935 580912 2119880 9765898
3844I765898M983359l222198n799554M30635O214944L874347k362571m598572
$$ 9765898 14749257 11527059 5727505 6158140 12373084 16247431 13884860 9286288
3836I286288k987659k742409m057037k626282J536971L166663L19924k292786
$$ 9286288 6298629 3556220 -500817 -3127099 -1590128 1576535 1896459 -396327
3828c96327p40891K452243L384382L266360M998995O101543J554087o377885q019550
$$ -396327 -1137218 1315025 4699407 7965767 12964762 19066305 20620392 14242507 6222957
3819F222957Q51275J1274886J1389840J433821p302133p320337k680246j205593
$$ 6222957 7074232 18349118 29738958 31172779 23870646 16550309 13870063 12664470
3811A2664470m543430q507118r155623n403055J471673P762432Q944168M381887
$$ 12664470 8121040 -386078 -9541701 -14944756 -13473083 -5710651 3233517 7615404
3803G615404j090415k820573j779102j557204k055549m52504K364800J504043
$$ 7615404 6524989 3704416 1925314 368110 -1687439 -2139943 224857 1728900
3795A728900m212454q490555n010366L547796P977560L966783k653651l710154
$$ 1728900 -2483554 -10974109 -15984475 -12436679 -4459119 -492336 -3145987 -6856141
3787f856141J183693N469274N043093K462295J352850J313288R33071J742717
$$ -6856141 -5672448 -203174 4839919 7302214 8655064 9968352 10901423 12644140
3779A2644140M762441O017210J230939o091374p430686q30750N921643N457226
$$ 12644140 17406581 23423791 24654730 18563356 11132670 10301920 16223563 21680789
3771B1680789q55207o925457r302762p610276k486439K962571L771909m61060
$$ 21680789 20825582 13900125 4597363 -3012913 -5499352 -2536781 1235128 774068
3763G74068l374060n62605L313363J707218l079280l475142J155381L929809J823586
$$ 774068 -2599992 -3162597 150766 1857984 -1221296 -4696438 -3541057 388752 2212338
3754B212338n70079k17282o39342m252620o662709l708394J061818J779474n77995
$$ 2212338 1642259 1424977 785635 -3466985 -10129694 -13838088 -12776270 -10996796 -11574791
3745a1574791n00755K910036N292101M506631K759749J135208k006720n585719
$$ -11574791 -12075546 -9165510 -3873409 633222 3392971 4528179 2521459 -3064260
3737c064260m386408L390500J1097595J0588658K268934n813652p860311n312858
$$ -3064260 -7450668 -4060168 7037427 17626085 19895019 14081367 6221056 908198
3729I08198k276277l79466M73610O1403q92523j41334K545083L549565N22847
$$ 908198 -1368079 -1747545 -1273935 -1212532 -2105055 -2246389 298694 3848259 4371106
3720D371106k687472q13633M108259M474369j545313o394571l897042J715583
$$ 4371106 1683634 870001 4978260 9452629 7907316 1512745 -2384297 -668714
3712f68714K454551j770448m419482k939898j016395n44177J278465N009445N964669
$$ -668714 1785837 15389 -4404093 -7343991 -8360386 -8904563 -7626098 -2616653 3348016
3703C348016J935438j734741Q3102L745566K252106l487111n880145k521721M84910
$$ 3348016 5283454 3548713 3631815 7377381 9629487 6142376 262231 -2259490 -1774580
3694a774580j236386l518718j056671L498574L457464j612321n355310l712208
$$ -1774580 -3010966 -6529684 -7586355 -4087781 -630317 -2242638 -7597948 -11310156
3686a1310156O99219L750005M585826L905023J867619k4995J102572M661680N274166
$$ -11310156 -10610937 -6860932 -2275106 1629917 3497536 3472541 4575113 9236793 14510959
3677A4510959Q6617n757406n844810k175286j844124n177645m778348K161500
$$ 14510959 14597576 8840170 2995360 820074 -1024050 -6201695 -10980043 -8818543
3669h818543Q243557O638643J079727q20050O19304n68003m613352n231712l26075
$$ -8818543 -574986 6063657 7143384 6323334 6942638 6374635 1761283 -3470429 -3796504
3660c796504M143391L183461m89919j868247q08482L3855N14300J869763K829989
$$ -3796504 346887 3530348 3040429 1172182 363700 397555 911855 2781618 5611607
3651E611607J252212j592339k158939L84667L259083L840757J928380j253473
$$ 5611607 6863819 5271480 3112541 3497208 6756291 10597048 12525428 11271955
3643A1271955l986954m421618k154533R30777L102881M930924O874553O523534
$$ 11271955 7285001 2863383 708850 1639627 4742508 9673432 16547985 23071519
3635B3071519J849927l851511m836288j011972J438917j136513m941990n000160
$$ 23071519 24921446 21069935 16233647 15221675 16660592 15524079 10582089 5581929
3627E581929k151997k35081M07284K157847M875653N978523M857064K986532J41689
$$ 5581929 3429932 3194851 3602135 5759982 10635635 16614158 21471222 24457754 24599443
3618B4599443n088677j0744160j1933099p298654j472451O86002n66121j745425
$$ 24599443 19510766 8766606 -3166493 -10465147 -11937598 -11251596 -11817717 -13563142
3610a3563142m78567L558280Q894602J1608105P851185l49535n245307k779761
$$ -13563142 -14041709 -10483429 -1588827 10019278 17870463 17520928 12275621 9495860
3602I495860J425739L6095m986509n612040p17465J699128k990520q234570n455145
$$ 9495860 10921599 10957694 5971185 359145 -358320 1340808 -1649712 -9884282 -15339427
3593a5339427L532141Q867073N520431j437535m469643k075309J819399L818610
$$ -15339427 -11807286 -2940213 2580218 1142683 -3326960 -5402269 -3582870 235740
3585B35740L832897L168293K381546J428871L78967r89180l345177o230437o949974
$$ 235740 4068637 7236930 9618476 11047347 11426314 10437134 7091957 861520 -6088454
3576f088454l146840L136868O264665L321873k163826m646244l133716j136393
$$ -6088454 -9235294 -6098426 166239 3488112 1324286 -3321958 -6455674 -7592067
3568g592067j414380l388827m820790l450619J952813R129762J2059620P059910
$$ -7592067 -9006447 -12395274 -17216064 -20666683 -18713870 -9584108 2475512 9535422
3560I535422j392335n243062l091750q82184k000872k855744o33181Q49147k251677
$$ 9535422 8143087 2900025 -191725 -1073909 -3074781 -5930525 -6563706 -5714559 -7966236
3551g966236o136164m389315J934928N431328K776233j538826k521566j000273
$$ -7966236 -14102400 -18491715 -16556787 -11125459 -8349226 -9888052 -12409618 -13409891
3543a3409891o96127k080802j763159K734955R140097J2047288Q652687K173581
$$ -13409891 -14106018 -16186820 -17949979 -15215024 -6074927 5972361 14625048 16798629
3535A6798629j887603k268193k070488k589514j252886K742343N277807L143097
$$ 16798629 14911026 12642833 10572345 7982831 6729945 9472288 14750095 17893192
3527A7893192o50169j568092o98684k384148o561102q547600n938462j300750
$$ 17893192 17243023 15674931 14976247 12592099 6030997 -2516603 -8455065 -9755815
3519i755815K055808L310873K943197J455619k85870j549113k460241k952552
$$ -9755815 -7700007 -4389134 -1445937 9682 -276188 -1825301 -4285542 -7238094
3511g238094k318668j055212p31113n86716J954175N212188L069730n010515r824829
$$ -7238094 -9556762 -10611974 -11343087 -11929803 -9975628 -4763440 -1693710 -6704225 -16529054
3502a6529054m810861L070772L493023j066293l06472N785359O802846k4884m983099
$$ -16529054 -21339915 -18269143 -14776120 -15842413 -16148885 -10363526 -3560680 -3585564 -8568663
3493h568663k093239K223456J614044m76594J74466L66023k124977j540001N583030
$$ -8568663 -10661902 -8438446 -6824402 -7300996 -7126530 -6760507 -8885484 -10425485 -4842455
3484d842455J1375477P547922j585626o874672q612291j1955069j3619086o182184
$$ -4842455 6533022 14080944 12495318 5620646 -2991645 -14946714 -28565800 -34747984
3476c4747984O838735J3151087R160165L961950M567281P437612P045465L697528
$$ -34747984 -27909249 -14758162 -5597997 -1636047 2931234 10368846 17414311 21111839
3468B1111839j87985l928448n998478m451838j942437l426819p220457n963586
$$ 21111839 20923854 16995406 10996928 6545090 4602653 1175834 -6044623 -12008209
3460a2008209J386834O718833N043545J406136J376425K639838J363201m16124
$$ -12008209 -10621375 -3902542 1141003 2547139 3923564 6563402 7926603 7510479
3452G510479J16892O32942p63713m26372L240404L560774m131204j1522939p468541
$$ 7510479 7627371 8260313 7496600 7070228 10310632 13871406 9740202 -1782737 -9251278
3443i251278M204001Q833549K131672m749147l250859J135419M28011k743991
$$ -9251278 -5047277 3786272 5917944 1168797 -2082062 -946643 -518632 -3262623
3435c262623j224694M074135N950040J937422l532984o234878n467353j431360
$$ -3262623 -4487317 -413182 5536858 7474280 3941296 -2293582 -7760935 -9192295
3427i192295N133438J0747434J1266119O809253J486318j713534k909117k968303
$$ -9192295 -4058857 6688577 17954696 24763949 26250267 24536733 21627616 18659313
3419A8659313k547361k850278l811381k387212L105474P860156N447969j974502
$$ 18659313 16111952 13261674 9450293 7063081 10168555 18028711 23476680 21502178
3411B1502178m979248l39128L870949O69583n193748n457603j614730j287398
$$ 21502178 16522930 16183802 20054751 20724334 15530586 10072983 8458253 7170855
3403G170855m575458m089298J471272L857415j484861p203542m374066N006044
$$ 7170855 2595397 -1493901 -22629 3834786 2349925 -4853617 -9227683 -4221639
3395d221639J1701313J1209601O263522M22745m776780p681303p056273m731967
$$ -4221639 7479674 18689275 24952797 25375542 20598762 12917459 5861186 1129219
3387A129219l617665l248015j016667K433553L129297k79665m106434m602451
$$ 1129219 -2488446 -5736461 -6753128 -4319575 -1190278 -1469943 -5576377 -10178828
3379a0178828k655329j734908k834898l385276r13303L441945N874175M522434
$$ -10178828 -12834157 -14569065 -17403963 -20789239 -21702542 -18260597 -12386422 -7863988
3371g863988K081988K276525M447923M410060Q62652k540323k855940j950118
$$ -7863988 -5782000 -3505475 942448 5352508 6215160 3674837 818897 -1131221
3363a131221k563632l647858k759965k84459K059540M238614N980984M873646
$$ -1131221 -3694853 -7342711 -10102676 -10387135 -8327595 -4088981 1892003 6765649
3355F765649O10271j924931R36091M813887L070068k536920m208630m21297J995851
$$ 6765649 7375920 5450989 6387080 11200967 14271035 11734115 7525485 7104188 9100039
3346I100039q08701l964697k296725K018662L923820K459838m05090l523786n593348
$$ 9100039 8291338 4326641 2029916 4048578 7972398 10432236 10027146 6503360 910012
3337I10012m451047r24259K91608k805217n539987k909401L147146O618815M910645
$$ 910012 -3541035 -4465294 -4173686 -6978903 -12518890 -15428291 -12281145 -5662330 -751685
3328g51685n5438n435460q412905o280128K30766N774545O402421M570241M384329
$$ -751685 -807123 -6242583 -14655488 -20935616 -20704850 -14930305 -8527884 -3957643 426686
3319D26686M785038K545361m89527L48045M045756M522160L19587l017794k221185
$$ 426686 5211724 7757085 7267558 7615603 11661359 16183519 16503106 13485312 11264127
3310A1264127j494969m711560p900777n092762J655751M384683N73424l490158
$$ 11264127 9769158 5057598 -2843179 -7935941 -6280190 -1895507 -1322083 -4812241
3302d812241j958510K651552L636600o57236n193556m872654j290M816518N237828
$$ -4812241 -6770751 -4119199 -482599 -1139835 -6333391 -11206045 -11207335 -6390817 -1152989
3293a152989N99211n438492p604092m067510J285950L365556J997698P86368O27940
$$ -1152989 -553778 -5992270 -13596362 -17663872 -16377922 -13012366 -11014668 -10228300 -9600360
3284i600360j048406l915438l316416J991735O184695M867238K016751K571317
$$ -9600360 -10648766 -14564204 -17880620 -15888885 -9704190 -4836952 -2820201 -248884
3276b48884L152392j656645p567651n450522L276901P272444K626866j641860
$$ -248884 2903508 1246863 -6320788 -11771310 -8494409 -1221965 1404901 -236959
3268b36959Q07429L563574l81586n901700m227025K467718M790931N98335l515355
$$ -236959 570470 4134044 3752458 -2149242 -6376267 -3908549 882382 1480717 -2034638
3259b034638l228719p51303J165892K343613K384497P15361o20677P62113K999825
$$ -2034638 -5263357 -6014660 -4848768 -2505155 -120658 594703 -25974 736139 3735964
3250C735964K363888n83359j894053l18936K120846M341665O141714N516748J440899
$$ 3735964 6099852 5516493 3622440 3303504 5424350 9766015 15907729 21424477 22865376
3241B2865376k119908q51744K507154J806436k489473m166233j961320j384302
$$ 22865376 20745468 19893724 22400878 24207314 21717841 17551608 15590288 14205986
3233A4205986m493887n924382k286279J533483r7914n124863p519514n420320
$$ 14205986 9712099 3787717 1501438 3034921 2937007 -2187856 -9707370 -15127690
3225a5127690j355145K397730M729281M536976K187109K76797K72283L59450j102197
$$ -15127690 -16482835 -14085105 -9355824 -4818848 -2631739 -2354942 -2082659 -1723209 -2825406
3216b825406k348754j087887J394938J893246j09759k002610j796902n19408o60241
$$ -2825406 -5174160 -6262047 -4867109 -2973863 -3083622 -5086232 -6883134 -7402542 -8062783
3207h062783k820276m220618j500505M471164Q495119P413348M175619K769148
$$ -8062783 -10883059 -15103677 -16604182 -12133018 -3637899 3775449 7951068 10720216
3199A0720216K001864j069856l989302j621365M688737P607597M340437N9933
$$ 10720216 12722080 11652224 7662922 6041557 10730294 18337891 22678328 22738261
3191B2738261r21339q36390k440842l422521j001345K479883K844889j77810l750876
$$ 22738261 21816922 20980532 18539690 15117169 14115824 16595707 19440596 19262786 15511910
3182A5511910n617731m686140j215414J616312J21802m053494m845805n09062
$$ 15511910 9894179 5208039 3992625 5608937 5730739 1677245 -3168560 -3677622
3174c677622L536665L005304M22634n02597k94147K64370L194644P468073O488504
$$ -3677622 -140957 2864347 3286981 2784384 2490237 2754607 5949251 13417324 19905828
3165A9905828k058591r484676o911570J685968N524158K453029p76232j286675
$$ 19905828 17847237 8362561 1450991 3136959 8661117 11114146 10337914 9051239
3157I051239l004499o808012p471289k771075K284775L466685L070187M227369
$$ 9051239 6046740 -761272 -8232561 -11003636 -8718861 -5252176 -2181989 2045380
3149B045380N020172K395452j937180l612945j519667J389191K022665J76358
$$ 2045380 7065552 9461004 7523824 3910879 2391212 3780403 5803068 5979426
3141E979426j486244K6124M320632O891540M182812j209760l271110l73004K856940
$$ 5979426 4493182 4519306 8839938 15731478 19914290 18704530 15433420 15060416 17917356
3132A7917356K060241j444879l083204p82643L087216M624229K551221l84585
$$ 17917356 19977597 18532718 15449514 14666871 17754087 22378316 24929537 24544952
3124B4544952o33249J564043K500293K70504k982699n068998o429190o927414
$$ 24544952 23911703 25475746 27976039 28246543 25263844 20194846 13765656 6838242
3116F838242m278006J012942L519048L69320l128410j031953L652330L857563
$$ 6838242 2560236 3573178 7092226 7461546 4333136 3301183 6953513 10811076
3108A0811076K19839k22131L775650N166723m63594q585487j2344625r897451
$$ 10811076 11030915 10808784 14584434 19751157 19287563 10702076 -1642549 -11540000
3100a1540000l690277K403332M301672J297622j134028K287040P682454O548097
$$ -11540000 -15230277 -12826945 -8525273 -7227651 -8361679 -6074639 1607815 8155912
3092H155912m61113l118110K601571P524186K957170o533440j0378401n983881
$$ 8155912 7694799 4576689 7178260 14702446 17659616 11126176 747775 -5236106
3084e236106J102595O209178Q183592O723542L291730J925870L815537M019324
$$ -5236106 -4133511 2075667 10259259 16982801 20274531 22200401 26015938 30035262
3076C0035262j290782p733287q735388n457490l932390m670101k812895K014597
$$ 30035262 28744480 21011193 12275805 6818315 2885925 -1784176 -4597071 -2582474
3068b582474L891875K09412l436397r05897O370201J1790751J1028392M826883
$$ -2582474 1309401 1518813 -1917584 -2823481 3546720 15337471 26365863 31192746
3060C1192746l013713q189363q387581n456967l954171n770483p209301l552356
$$ 31192746 28179033 19989670 11602089 6145122 2190951 -3579532 -10788833 -14341189
3052a4341189L715785P024738J942766n633213n399455L986951J2190067J0447130
$$ -14341189 -10625404 -3600666 -1657900 -7291113 -12690568 -8703617 3486450 13933580
3044A3933580K661533j856647k289044m746297r095945p931502j92263M821706
$$ 13933580 16595113 14738466 12449422 7703125 -1392820 -9324322 -9516585 -4694879
3036d694879J705601k269429N75254N511821L609960l539961p193580n298128
$$ -4694879 -2989278 -5258707 -4683453 828368 4438328 898367 -6295213 -11593341
3028a1593341k678773K279O519724J4455872J4837572M957055o584206j0695475
$$ -11593341 -14272114 -14269835 -7750111 6705761 21543333 26500388 19916182 9220707
3020I220707p374749k146004J068108R57268j991399m697938m014063j455825
$$ 9220707 1845958 -300046 768062 1725330 -266069 -4964007 -8978070 -10433895
3012a0433895j158533k801220k125524J153704K845109K761643N566387J0536956
$$ -10433895 -11592428 -14393648 -16519172 -15365468 -12520359 -9758716 -4192329 6344627
3004F344627R552368M41462o393056k434441N063621L460007n863957r727416
$$ 6344627 15896995 16338457 9945401 7510960 12574581 16034588 10170631 443215
2996D43215l153502M212942L538951j159020j001752M632462Q659700O355890
$$ 443215 -2710287 1502655 5041606 3882586 2880834 7513296 16172996 22528886
2988B2528886J36381m221363l242781J411392M437571K386461k237985m444240
$$ 22528886 22665267 18443904 15201123 16612515 21050086 23436547 21198562 16754322
2980A6754322l579902k942425l056437r68278K603189K103815l312005n558328
$$ 16754322 13174420 10231995 7175558 6207280 8810469 10914284 7602279 2043951
2972B043951J129199R849759R517794M36004o848740o543435k767966q4596J795476
$$ 2043951 3173150 13022909 22540703 22976707 16127967 9584532 6816566 6731970 8527446
2963H527446K346004j291182o758422o384799N51078M141555j226488o722508
$$ 8527446 10873450 9582268 2823846 -3560953 -3009875 1131680 -94808 -6817316
2955f817316k310748P259577J0098350N065104K22147k469815p445838j2099607
$$ -6817316 -9128064 -1868487 8229863 13294967 13517114 11047299 3601461 -8498146
2947h498146p621711M659714J1340775N876033k441738l935871j667098k113594
$$ -8498146 -16119857 -11460143 -119368 5756665 3314927 -620944 -2288042 -4401636
2939d401636l306794j232892N63220k346995n656622l207998J940824L091730
$$ -4401636 -7708430 -8941322 -8378102 -10725097 -16381719 -19589717 -17648893 -14557163
2931a4557163J827000M157243Q435169P792315K521084m61515L05712o53610m855112
$$ -14557163 -12730163 -8572920 -137751 7654564 10175648 9714133 10019845 9366235 4511123
2922D511123o976554m318998o96833J109949L204860O447995P206958L252141
$$ 4511123 -2465431 -6784429 -7481262 -6371313 -3166453 3281542 10488500 13740641
2914A3740641k201153m874265m004652j250376J334348J677587m93109k396739
$$ 13740641 11539488 6665223 2660571 1410195 2744543 4422130 3929021 1532282
2906A532282j926228j097411k147543l039296j690272r87597l147689l188836
$$ 1532282 -393946 -1491357 -3638900 -6678196 -8368468 -9356065 -12503754 -15692590
2898a5692590L438019J0308268P697689j273630m016285K249801P048109M083884
$$ -15692590 -12254571 -1946303 5751386 4477756 461471 2711272 9759381 13843265
2890A3843265n05224q97169m08271k221993k341588J622722M107782Q84393l443607
$$ 13843265 13338041 12440872 12032601 9810608 7469020 9091742 13199524 14083917 10640310
2881A0640310l497319r68377J247241M543390Q347563P023168l46095n628993
$$ 10640310 7142991 6174614 7421855 11965245 20312808 27335976 26989881 21360888
2873B1360888m073412k143111n249205p276589k002395M174296K503825k711814
$$ 21360888 17287476 15144365 9895160 2618571 616176 4790472 7294297 4582483
2865D582483j668630L839487M093528j756587n607632m644701l242479k258601
$$ 4582483 2913853 6753340 10846868 9090281 3482649 -1162052 -4404531 -6663132
2857f663132J375600N005934K153092n206327p122407J2385Q927124J2425642
$$ -6663132 -5287532 -281598 1871494 -3334833 -10457240 -10444855 -1517731 10907911
2849A0907911J0390185N324711o28863l792740k168158m34638l827627q444251
$$ 10907911 21298096 26622807 25993944 22201204 20033046 19598408 15770781 7326530
2841G326530o868607j518842j049015m519679k454304N283099P089826q86867
$$ 7326530 457923 -1060919 -2109934 -6629613 -9083917 -3800818 3289008 2402141
2833B402141o843623j680313P060687Q258743L946246L019981N879596N707772
$$ 2402141 -4441482 -6121795 938892 9197635 13143881 16163862 22043458 27751230
2825B7751230N15971n075174p467763o688018l647405j26815Q18124j448358l589004
$$ 27751230 28267201 23192027 15724264 9036246 5388841 5262026 6080150 4631792 1042788
2816A042788l214567j719234p0363L021362O046885M043473l164404q311806o824443
$$ 1042788 -2171779 -3891013 -3961376 -940014 5106871 9150344 5985940 -2325866 -9150309
2807i150309l430267l574177m577882j585163L415305N567260N442696O096221
$$ -9150309 -12580576 -16154753 -20732635 -22317798 -18902493 -13335233 -7892537 -1796316
2799a796316N734673R20926n498089o881653j947668M253478P174184N885184
$$ -1796316 3938357 4859283 -638806 -7520459 -9468127 -5214649 1959535 7844719
2791G844719J304165m111098o690186n320206k762443p31266K327464N874659
$$ 7844719 9148884 5037786 -1652400 -6972606 -9735049 -10466315 -8138851 -2264192
2783b264192N605550J321309k33296L867935O224031P99707n934971m934136O82631
$$ -2264192 3341358 4662667 4429371 8297306 14521337 15321044 9386073 4451937 5134568
2774E134568J912336l47607J348718N274987K464578o267703r641117m123074
$$ 5134568 7046904 6699297 8048015 13323002 15787580 9519877 -121240 -4244314
2766d244314Q91494k04325o06379M850538R038217M140477n433433j0403296r573842
$$ -4244314 -3352820 -3557145 -4163524 687014 9725231 13865708 8432275 -1971021 -11544863
2757a1544863p032750k788414M675111J1037487J0519044N204599K032916K103027
$$ -11544863 -18577613 -21366027 -16690916 -5653429 4865615 10070214 12103130 14206157
2749A4206157L89256m660431q302575o924861k681804M51718J083113p845j228970
$$ 14206157 14595413 9934982 1632407 -5292454 -7974258 -7522540 -6439427 -6447272 -7676242
2740g676242m55271L130231O977259P431400M283017P39871j183058k712677n203805
$$ -7676242 -8131513 -5001282 1975977 9407377 13690394 14430265 13247207 10534530 5330725
2731E330725p237597o190743j777544L064899M996772L735342K024907J707907
$$ 5330725 -1906872 -8097615 -9875159 -6810260 -1813488 1921854 3946761 5654668
2723E654668J221130j129347k930929n80247L690349K752247n272623j2385791
$$ 5654668 6875798 5746451 2815522 2235275 5925624 8677871 3405248 -8980543
2715h980543j0159317o15242O880101P492272M697926L073362K574045J027389
$$ -8980543 -19139860 -19755102 -12875001 -5382729 -684803 2388559 4962604 5989993
2707E989993j731567m060818m391819j807151K966511O396982M751818q28072
$$ 5989993 4258426 197608 -4194211 -6001362 -3034851 3362131 8113949 7285877
2699G285877m590232l304819l85811l27787j840527p04166K322552K226354j115140
$$ 7285877 2695645 -609174 -994985 -1322772 -3163299 -3867465 -1544913 681441 -433699
2690d33699q32207O463051J3430201J1067380J719174m149160k894680j231874
$$ -433699 -1265906 5197145 18627346 29694726 31413900 27264740 24370060 23138186
2682B3138186l726858n575825k278649J257490j475949p055318p010771j403320
$$ 23138186 19411328 13835503 11556854 12814344 11338395 4283077 -2727694 -4131014
2674d131014J403801k037551n708817l955031J441697N899649P316043M781039
$$ -4131014 -2727213 -4764764 -10473581 -14428612 -12986915 -7087266 228777 5009816
2666E009816j598720p232800n795752J585705O088482L318230j019733j486553
$$ 5009816 3411096 -3821704 -9617456 -8031751 -1943269 1374961 355228 -1131325
2658a131325j239440l797311m001173L637656J2811108J2417047L362581k510470
$$ -1131325 -2370765 -6168076 -10169249 -6531593 6279515 18696562 22059143 19548673
2650A9548673k51705K244983j440770o070938m158880K089997M918458K329021
$$ 19548673 19296968 21541951 20101181 14030243 9871363 11961360 16879818 19208839
2642A9208839j155451k287258k004829j882617k188267k901490l479943k477229
$$ 19208839 18053388 15766130 13761301 11878684 9690417 6788927 3308984 831755
2634H31755M2009J248465m30948j846007P06597N223213O141792K287477j700813
$$ 831755 873764 2122229 1691281 -154726 551871 5775084 11916876 14204353 12503540
2625A2503540k269411q73795K98187K085626N016411N799121J372548n179303
$$ 12503540 10234129 9360334 9658521 11744147 16760558 22559679 23932227 18752924
2617A8752924p081793k385808L403353M252266N94058k185330o29916L261579
$$ 18752924 11671131 9285323 12688676 16940942 17535000 15349670 14719754 17981333
2609A7981333M948303K443587j839086l982297k911572j259106j744502l878294
$$ 17981333 22929636 25373223 23534137 19551840 16640268 15381162 13636660 9758366
2601I758366n289413n014612l520471o12036L629099O207089L466693k938857
$$ 9758366 4468953 -545659 -4066130 -4678166 -1049067 5158022 8624715 5685858
2593E685858o260817l099116J865445K594003j50478j398437M2722J352394J786482
$$ 5685858 -574959 -3674075 -1808630 785373 634895 -763542 -720820 631574 2418056
2584B418056L124144M265698J520972m333587o972568l170495K226995L326711
$$ 2418056 5542200 9807898 11328870 6995283 22715 -3147780 -920785 2405926
2576B405926J095338J26913P16977p61976m847919p121489l919821L081630Q722221
$$ 2405926 3501264 3628177 4345154 3583178 -1264741 -8386230 -12306051 -9224421 -502200
2567e02200R112994M540516r54164l115996j611476N4732n71309j846843j285189
$$ -502200 8610794 13151310 12197146 9081150 7469674 7524406 6953097 5106254 3821065
2558C821065L97393J111310J423803L142191M726232K394914l373135o406797
$$ 3821065 4218458 5329768 6753571 9895762 14621994 17016908 13643773 7236976
2550G236976k429388M422362O054651P50842m402496k770420K850106L867439
$$ 7236976 4807588 9229950 15284601 16035443 11632947 8862527 11712633 15580072
2542A5580072k141202p496241m597255L697743Q204743N709405J457389k05662
$$ 15580072 13438870 5942629 1345374 5043117 13247860 18957265 20414654 20208992
2534B0208992j140191l492108m764277k782549o08564j557148l172619j600620
$$ 20208992 19068801 15576693 10812416 8029867 7421303 5864155 2691536 1090916
2526A090916J207257Q15641j439636m04773L632914M860981J609768j064617l36239
$$ 1090916 2298173 3113814 1674178 1269405 4902319 9763300 11373068 10308451 9972212
2517I972212j74981l418239n450348j111190O246524Q449652L138708m453352
$$ 9972212 9797231 6378992 928644 -182546 6063978 14513630 17652338 13198986
2509A3198986r113790j0098780q350649m245535O13561L074639J869418p90780
$$ 13198986 4085196 -6013584 -14364233 -18609768 -17996207 -14921568 -13052150 -13842930
2501a3842930k275320k110233n36138K703488O030035N207220j336438p615507
$$ -13842930 -16118250 -18228483 -18764621 -16061133 -10031098 -4823878 -6160316 -13775823
2493a3775823n364072M791929J2060785Q373018j161829n257743j429111K228142
$$ -13775823 -19139895 -14347966 -2287181 6085837 4924008 -333735 -1762846 465296
2485D65296M509l662659k315364K397408L882933N99097k738262k807370j552858
$$ 465296 469805 -3192854 -5508218 -3110810 772123 1371220 -1367042 -4174412 -5727270
2476e727270k067052m295216n728060m170059L85313N067776O101179L241386
$$ -5727270 -7794322 -12089538 -17817598 -21987657 -21602344 -16534568 -10433389 -7192003
2468g192003P92179J910521L889520K388495j591465l307755j642389k0940l45154
$$ -7192003 -6399824 -4489303 -599783 1788712 197247 -3110508 -4752897 -4773837 -5118991
2459e118991q98448m87333J50696J444011M367835O090074K105571n565107q484083
$$ -5118991 -6017439 -6504772 -6354076 -4910065 -542230 5547844 7653415 2088308 -6395775
2450f395775l265090K811198K034829k895083l856503N65789M339082L579518
$$ -6395775 -9660865 -6849667 -4814838 -7709921 -11566424 -11000635 -6661553 -3082035
2442c082035O78636j032138j374879j053553M84645L135474M836965L945276J434609
$$ -3082035 -2403399 -3435537 -4810416 -5863969 -5379324 -2243850 2593115 6538391 7973000
2433G973000l92602m72884L71923P22752M4700j019817j733578k134166k267666
$$ 7973000 7580398 7107514 7479437 8202189 8246889 7227072 5493494 3359328 1091662
2424A091662j501373m8368o8481k773041n303336l846904O08633L724368M783544
$$ 1091662 -409711 -458079 -526560 -3299601 -8602937 -12449841 -11841208 -8116840 -3333296
2415c333296O834225R072486N822822l670176j0865288q582843j050948K635921
$$ -3333296 3500929 12573415 18396237 14726061 3860773 -4722070 -5773018 -3137097
2407c137097J008537m36622P54705J942565J748294J480415Q26312j543840l454714
$$ -3137097 -2128560 -2565182 -1810477 132088 1880382 3360797 4187109 2643269 -811445
2398h11445j426490K825930M143382K024843Q40533K145684L385599M105774N861732
$$ -811445 -2237935 587995 4731377 6756220 7596753 9742437 13128036 17233810 23095542
2389B3095542N540793k241325j3825553j7030477p560907L639166N402106R03602
$$ 23095542 28636335 26395010 12569457 -4461020 -12021927 -8382761 -2980655 -2077053
2381b077053k14948K600429K593259j335884l475459j509306J071484K427254
$$ -2077053 -2292001 308428 2901687 1565803 -1909656 -3418962 -2347478 79776
2373G9776M107458M914262R59775o307218r114428l410718N358754R375017P026196
$$ 79776 4187234 9101496 10061271 3754053 -5360375 -8771093 -3412339 5962678 12988874
2364A2988874J891942k649911m829343l873929j117159M70527P7012K85752K823546
$$ 12988874 14880816 12230905 7401562 3527633 2410474 2881001 2958013 3243765 6067311
$$ [...]
##END NTUPLES=NMR SPECTRUM
##END=
