##TITLE=31Pdec_DE-102K_EA_TFA
CDCl3, 64 sc
 22.8.2025
##JCAMPDX= 6.0         $$ Bruker NMR JCAMP-DX V2.0
##DATA TYPE= NMR SPECTRUM
##DATA CLASS= NTUPLES
##ORIGIN= UXNMR, Bruker Analytische Messtechnik GmbH
##OWNER= root
$$ XWIN-NMR		Version 3.5
$$ Fri Aug 22 15:33:47 2025 Russian Standard Time (UT+4h)  she@DPX200
##.OBSERVE FREQUENCY= 81.013821
##.OBSERVE NUCLEUS= ^31P
##.ACQUISITION MODE= SIMULTANEOUS
##.ACQUISITION SCHEME= undefined
##.AVERAGES= 64
##.DIGITISER RES= 17
##SPECTROMETER/DATA SYSTEM= spect
##.PULSE SEQUENCE= zgpg30
##.SOLVENT NAME= DMSO
##.SHIFT REFERENCE= (INTERNAL, DMSO, 0, 198.062)
##AUDIT TRAIL= $$ (NUMBER, WHEN, WHO, WHERE, WHAT)
$$ ##TITLE= Audit trail, XWIN-NMR		Version 3.5
$$ ##JCAMPDX= 5.01
$$ ##ORIGIN= Bruker BioSpin GmbH
$$ ##OWNER= she
$$ F:/spectra/data/she/nmr/P31/2/pdata/1/auditp.txt
$$ ##AUDIT TRAIL=  $$ (NUMBER, WHEN, WHO, WHERE, WHAT)
(   1,<2025-08-22 15:32:13.85 +0400>,<she>,<DPX200>,
      <created by zg, POWCHK disabled, PULCHK disabled
       configuration hash MD5:
       00 E9 B6 7A A2 85 ED C7 34 08 36 98 17 FE 4E 26
       data hash MD5: 32K
       6F 97 72 4F 72 70 A2 BE AB DB AF BF F7 C9 F0 E1>)
(   2,<2025-08-22 15:32:16.14 +0400>,<she>,<DPX200>,
      <Start of raw data processing
       efp BC_mod = 2 LB = 1.5 FT_mod = 6 PKNL = 1 PHC0 = 1601.461 PHC1 = -437.5005 SI = 64K 
       data hash MD5: 64K
       DA EF E3 1B 0C FA 14 AC 74 95 E2 45 F6 DF 00 DB>)
$$ ##END=
$$ 
$$ hash MD5
$$ 6F 55 BF 8B C6 21 CB 7E 91 4B 27 8F BE 3E D0 55
##$RELAX= 
##$RELAX= 
##$RELAX= 
##$RELAX= 
##$RELAX= 
##$RELAX= 
##$RELAX= 
##$RELAX= 
$$ Bruker specific parameters
$$ --------------------------
##$DU= <F:/spectra>
##$EXPNO= 2
##$NAME= <P31>
##$PROCNO= 1
##$TYPE= <nmr>
##$USER= <she>
##$AMP= (0..31)
100 100 100 100 100 100 100 100 100 100 100 100 100 100 100 100 100 100 
100 100 100 100 100 100 100 100 100 100 100 100 100 100 
##$AQSEQ= 0
##$AQ_mod= 1
##$AUNM= <au_zg>
##$AUTOPOS= <>
##$BF1= 81.014009
##$BF2= 200.13
##$BF3= 200.13
##$BF4= 200.13
##$BF5= 200.13
##$BF6= 200.13
##$BF7= 200.13
##$BF8= 200.13
##$BYTORDA= 1
##$CFDGTYP= 0
##$CFRGTYP= 5
##$CHEMSTR= <none>
##$CNST= (0..31)
1 1 145 1 1 1 1 1 1 1 1 1 1 1 1 1 1 1 1 1 1 1 1 1 1 1 1 1 1 1 1 1 
##$CPDPRG= <waltz16>
##$CPDPRG1= <>
##$CPDPRG2= <waltz16>
##$CPDPRG3= <>
##$CPDPRG4= <mlev>
##$CPDPRG5= <mlev>
##$CPDPRG6= <mlev>
##$CPDPRG7= <mlev>
##$CPDPRG8= <mlev>
##$CPDPRGB= <>
##$CPDPRGT= <>
##$D= (0..31)
0 1 0 0 0 0 0 0 0 0.06 0 0.03 2e-05 3e-06 0 0 0.0002 0 0 0 0 0 0 0 0 0 
0 0 0 0 0 0 
##$DATE= 1755862333
##$DBL= (0..7)
120 120 120 11 120 120 24 19 
##$DBP= (0..7)
150 150 150 150 150 150 150 150 
##$DBP07= 0
##$DBPNAM0= <>
##$DBPNAM1= <>
##$DBPNAM2= <>
##$DBPNAM3= <>
##$DBPNAM4= <>
##$DBPNAM5= <>
##$DBPNAM6= <>
##$DBPNAM7= <>
##$DBPOAL= (0..7)
0.5 0.5 0.5 0.5 0.5 0.5 0.5 0.5 
##$DBPOFFS= (0..7)
0 0 0 0 0 0 0 0 
##$DE= 6
##$DECBNUC= <off>
##$DECIM= 4
##$DECNUC= <off>
##$DECSTAT= 4
##$DIGMOD= 1
##$DIGTYP= 9
##$DL= (0..7)
0 0 52 120 120 21 21 25 
##$DP= (0..7)
$$ [...]
##$SUBNAM3= <"">
##$SUBNAM4= <"">
##$SUBNAM5= <"">
##$SUBNAM6= <"">
##$SUBNAM7= <"">
##$SUBNAM8= <"">
##$SUBNAM9= <"">
##$SW= 400.765351723535
##$SWIBOX= (0..15)
0 1 3 0 0 0 0 0 0 0 0 0 0 0 0 0 
##$SW_h= 32467.5324675325
##$TD= 32768
##$TD0= 1
##$TE= 0
##$TE2= 300
##$TE3= 300
##$TEG= 300
##$TL= (0..7)
0 120 53 12 22 120 120 120 
##$TP= (0..7)
150 150 150 150 150 150 150 150 
##$TP07= 0
##$TPNAME0= <>
##$TPNAME1= <>
##$TPNAME2= <>
##$TPNAME3= <>
##$TPNAME4= <>
##$TPNAME5= <>
##$TPNAME6= <>
##$TPNAME7= <>
##$TPOAL= (0..7)
0.5 0.5 0.5 0.5 0.5 0.5 0.5 0.5 
##$TPOFFS= (0..7)
0 0 0 0 0 0 0 0 
##$TUNHIN= 0
##$TUNHOUT= 0
##$TUNXOUT= 0
##$USERA1= <user>
##$USERA2= <user>
##$USERA3= <user>
##$USERA4= <user>
##$USERA5= <user>
##$V9= 5
##$VALIST= <valist>
##$VCLIST= <CCCCCCCCCCCCCCC>
##$VD= 0
##$VDLIST= <DDDDDDDDDDDDDDD>
##$VPLIST= <PPPPPPPPPPPPPPP>
##$VTLIST= <TTTTTTTTTTTTTTT>
##$WBST= 1024
##$WBSW= 4
##$XGAIN= (0..3)
0 0 0 0 
##$XL= 0
##$YL= 0
##$YMAX_a= 3042
##$YMIN_a= -18567
##$ZGOPTNS= <>
##$ZL1= 120
##$ZL2= 120
##$ZL3= 120
##$ZL4= 120
##$ABSF1= 0
##$ABSF2= 0
##$ABSG= 0
##$ABSL= 0
##$ALPHA= 0
##$AQORDER= 0
##$ASSFAC= 0
##$ASSFACI= 0
##$ASSFACX= 0
##$ASSWID= 0
##$AUNMP= <proc_1d>
##$AZFE= 0.1
##$AZFW= 0.5
##$BCFW= 0
##$BC_mod= 2
##$BYTORDP= 0
##$COROFFS= 0
##$CY= -3
##$DATMOD= 1
##$DC= 0
##$DFILT= <>
##$DTYPP= 0
##$F1P= 0
##$F2P= 0
##$FCOR= 1
##$FTSIZE= 65536
##$FT_mod= 6
##$GAMMA= 0
##$GB= 0
##$INTBC= 1
##$INTSCL= 9.790993e-09
##$ISEN= 30
##$LB= 1.5
##$LEV0= 0
##$LPBIN= 0
##$MAXI= 10000
##$MC2= 0
##$MEAN= 0
##$ME_mod= 0
##$MI= 50
##$NCOEF= 0
##$NC_proc= -8
##$NLEV= 6
##$NOISF1= 182.463
##$NOISF2= 159.3651
##$NSP= 0
##$NTH_PI= 0
##$NZP= 0
##$OFFSET= 198.0616
##$PC= 4
##$PHC0= 1601.461
##$PHC1= -437.5005
##$PH_mod= 1
##$PKNL= yes
##$PPARMOD= 0
##$PSCAL= 0
##$PSIGN= 0
##$REVERSE= no
##$SF= 81.0140089999434
##$SI= 65536
##$SIGF1= 159.3651
##$SIGF2= -187.1042
##$SINO= 113.3802
##$SIOLD= 16384
##$SREGLST= <1H.CDCl3>
##$SSB= 0
##$STSI= 65536
##$STSR= 0
##$SW_p= 32467.5324675325
##$SYMM= 0
##$S_DEV= 0
##$TDeff= 32768
##$TDoff= 0
##$TI= <>
##$TILT= no
##$TM1= 0
##$TM2= 0
##$TOPLEV= 0
##$USERP1= <user>
##$USERP2= <user>
##$USERP3= <user>
##$USERP4= <user>
##$USERP5= <user>
##$WDW= 1
##$XDIM= 65536
##$YMAX_p= 35816691
##$YMIN_p= -271571101
$$ End of Bruker specific parameters
$$ ---------------------------------
##NTUPLES= NMR SPECTRUM
##VAR_NAME=  FREQUENCY,     SPECTRUM/REAL,   SPECTRUM/IMAG
##SYMBOL=    X,             R,               I
##VAR_TYPE=  INDEPENDENT,   DEPENDENT,       DEPENDENT
##VAR_FORM=  AFFN,          ASDF,            ASDF
##VAR_DIM=   65536,         65536,           65536
##UNITS=     HZ,            ARBITRARY UNITS, ARBITRARY UNITS
##FACTOR=    0.49542278885378, 1,            1
##FIRST=     16045.7642231865, 0,            0
##LAST=      -16421.768244346, 0,            0
##MIN=       -16421.768244346, -271571101,   0
##MAX=       16045.7642231865, 35816691,     0
$$ Real data points
##PAGE= N=1
##DATA TABLE= (X++(R..R)), XYDATA
$$ [...]
9687 689326 -298939 -1894434 -2423579 -1529692 851318 5229855 10912148 14639349 13138104
9678 13138104 7300749 1994289 989341 3512297 6499115 8468071 9606222 9385939
9670 9385939 6516623 1409888 -3054349 -4061166 -1552422 1981271 4055474 4433048
9662 4433048 4992766 7254190 10146586 10996550 8849526 5563338 3046713 1070551 -892542
9653 -892542 -1556576 -62545 939656 -2127622 -8107807 -11451693 -9153728 -4224777 -783421
9644 -783421 1163263 3610654 5950910 5932493 3764866 1745562 365346 -1834339 -4460031
9635 -4460031 -4661394 -1286608 3044713 5340332 5621384 5638124 6162114 7099753 8586798
9626 8586798 10091754 9722285 6528320 2714722 1379265 2333049 2372887 -57682 -2700042
9617 -2700042 -2916248 -1327826 -282339 -23774 1166845 3257303 3599754 946649 -1783447
9608 -1783447 -923985 2827116 5214379 4169230 2159205 2119141 3505968 3986652 3165436
9599 3165436 2542496 2951060 4200518 6517752 10091105 13477323 14675651 13893514 13211385
9590 13211385 13219086 12071906 8618486 4590916 2506803 2672442 3419676 3469253 3066534
9581 3066534 3219296 4377174 5608267 5214780 2882220 814440 1383230 3804443 4793565
9572 4793565 2658069 -990068 -3858025 -5388167 -6050881 -6245951 -6709340 -8074021 -9192314
9563 -9192314 -8022812 -5152990 -3881873 -5218338 -5526355 -1641963 3990003 6465393
9555 6465393 5091905 3411761 3436772 3551139 2266592 723902 545418 1664868 3262976
9546 3262976 5010253 6636344 7791225 8779719 10008845 10583989 9084248 5814294 2521961
9537 2521961 -176544 -3102906 -6097930 -7543662 -6855500 -5344980 -3973713 -2424198
9529 -2424198 -1146412 -1848813 -4571581 -6505113 -5544060 -3258348 -2429647 -3148250 -3457659
9520 -3457659 -2742709 -2247938 -2811171 -4072286 -5609308 -7035934 -7097773 -4451651 307420
9511 307420 4653795 6568443 6222777 5185821 4733251 5000063 5144752 4287854 2705396
9502 2705396 1878382 2852580 4838066 6049040 5726200 4745292 4386474 5041706 6054325
9493 6054325 6430363 5751158 4529236 3454041 2348930 491478 -1933727 -3565175 -3529026
9484 -3529026 -2713068 -2813266 -4493316 -6769674 -7778223 -6141821 -2373520 1022887 1884959
9475 1884959 992642 1154823 3492344 6117062 6957783 6199458 5149941 4514408 4898225
9466 4898225 7054231 9981865 10603448 7463783 3335128 1899792 3129741 4428466
9458 4428466 5077671 6405364 8208572 8532425 7250707 6590166 7334312 7535125 6115306
9449 6115306 4841700 5095666 5299951 3696728 1626634 1610843 3528250 5043326 4947961
9440 4947961 3896820 2427492 433762 -1493562 -2085514 -1029270 696743 2184102
9432 2184102 3139103 3154399 1800502 -230803 -1109056 506755 4228476 8279054 10601622
9423 10601622 10044471 7386694 5079381 5077512 6888422 8380540 8222739 6712037 4693675
9414 4693675 2981794 2600882 3957435 5571244 5340705 3683473 3729823 7318052 12264665
9405 12264665 14990732 14556602 12364937 9058347 4235979 -1020408 -4046032 -3855500
9397 -3855500 -2537887 -2401025 -3429411 -4694777 -6482949 -9216158 -11570919 -11848308 -10580304
9388 -10580304 -9651208 -9143775 -7343190 -4097048 -1846813 -2307195 -3881318 -3712316 -1180800
9379 -1180800 1844958 3415775 3077442 1706952 800102 1491133 3475874 5242364 5832767
9370 5832767 5777162 5882502 6032117 5835676 5424947 4681923 2740142 -457898 -2952071
9361 -2952071 -2700767 -410779 984978 -313537 -3150267 -4863733 -3751512 -405080
9353 -405080 2531733 2332165 -1085602 -4693197 -5478028 -3585647 -1497614 -845755 -1259143
9344 -1259143 -1632232 -1039580 1001804 3529548 3954630 809423 -3646991 -5633382 -4531335
9335 -4531335 -3170889 -3393985 -3872089 -2984758 -1347499 -171799 838394 2397027 4061470
9326 4061470 5357640 7177939 10364664 13773306 15319271 14447493 12341958 10203835
9318 10203835 8513602 7639682 7989059 9416721 11064927 11914837 11499596 10355869 9607707
9309 9607707 9591598 9263436 7739399 5769663 4424351 3121470 866183 -1267019 -1475227
9300 -1475227 -647500 -1236239 -2651999 -1703114 1463549 2361402 -670817 -2832321 -85076
9291 -85076 3912159 3086848 -1594071 -3764688 -1428674 1007311 625712 13332 1747855
9282 1747855 3924602 3804323 2048135 477699 -1245784 -3636194 -4526910 -1566567 3750677
9273 3750677 7462242 7851104 6494871 5297197 4759094 4918021 5863458 7007471 7295661
9264 7295661 6482636 5279144 4200425 3147114 2149620 1700103 2164690 3402660 5072155
9255 5072155 6864032 8235426 8195586 5828925 1453308 -2798804 -4265955 -2108403 2027462
9246 2027462 5884691 8252232 8492403 6200994 2710010 1174735 2861208 4657295
9238 4657295 3113208 -92268 -328795 2814922 4974708 4309823 4469401 7976887 11200384
9229 11200384 9759223 5585460 3967610 5608726 6484816 4695282 2567309 1665294
9221 1665294 253290 -2845183 -5527091 -5646668 -4398950 -4275573 -5334185 -5579161 -4150678
9212 -4150678 -2417030 -2102904 -3263200 -4091827 -2666617 655626 2896370 1540882 -2286670
9203 -2286670 -5090060 -5197141 -3841064 -2035968 1089637 5659067 8939851 8022615 3711226
9194 3711226 -58300 -399052 2070656 4487668 4319921 1051901 -3522853 -6664953 -7064557
9185 -7064557 -5829200 -4821181 -4647604 -4948316 -5877507 -8005205 -10892181 -12947108 -13039482
9176 -13039482 -11609545 -9965972 -8980316 -8658504 -8606585 -8625254 -8812462 -9015477 -8352906
9167 -8352906 -5905516 -2176374 789059 1417448 376747 -363492 63508 836269 1193431
9158 1193431 1701351 3220159 5239677 6096137 4932220 2946434 2301584 3824746 6121736
9149 6121736 7169488 6477163 5211226 4421249 4020324 3766654 4276097 6134587 8434544
9140 8434544 9260857 7811867 5415992 4265423 5528313 8641231 11822286 13127485
9132 13127485 11653517 8204172 4613636 2232549 1231620 1260708 2143284 3605910 4835629
9123 4835629 4878935 3443082 1161163 -703580 -829157 1176303 3877815 4720546 2442143
9114 2442143 -1468926 -4387500 -5285203 -5045516 -4491838 -3444659 -1791064 -14312 1891530
9105 1891530 4668754 8062085 10089257 9349445 7149857 5851451 5773343 5442810 4526134
9096 4526134 4482623 6000508 7589445 7495130 5715220 3412630 1496140 486542 658957
9087 658957 1486302 1852377 1510658 1440909 2265326 3469813 4675112 6071941 6763994
9078 6763994 4678513 -225780 -4414588 -4625227 -1970677 86189 583861 1074960 1837456
9069 1837456 1742964 1906432 5525280 12712319 18693443 19135678 14952773 10036541 6516923
9060 6516923 4390057 3684346 4189419 4291446 2748519 893189 754206 1727143 1523244
9051 1523244 -170774 -1610587 -2289097 -3461839 -5072681 -5004021 -2441586 402701 1390674
9042 1390674 1430074 2701663 5235178 6946419 6382674 4089819 1685131 517619 794621
9033 794621 1371053 1036236 491570 1947725 5913087 9634891 10136042 7914948 6057490
9024 6057490 6259628 7365357 7522264 6123557 3665091 1235315 206341 912625 1551971
9015 1551971 31400 -2957113 -4653500 -4438322 -4893182 -7316496 -8593945 -5169339 1131636
9006 1131636 4273998 1106920 -5065047 -8550617 -7085991 -2945753 101539 -26728
8998 -26728 -2425781 -4100723 -2835542 329364 2267859 1642228 347627 585687 2046774
8989 2046774 3121983 3564030 4345397 5713855 7075246 8371553 9918186 10941007 9799781
8980 9799781 6005844 1027926 -3102186 -5260832 -5474185 -4622349 -3810431 -3180182 -1581180
8971 -1581180 1662442 5103086 6546850 5744887 4259427 2920474 1222993 -654826
8963 -654826 -1220541 274995 2728652 4785200 6102667 6577483 6122246 5909986 7711896
8954 7711896 10698294 10990874 6385358 -73501 -3522980 -3190663 -2456640 -3686579 -5614735
8945 -5614735 -5937378 -4164697 -1307097 1400297 2666885 1560798 -1205255 -3293144
8937 -3293144 -2909741 -507538 2130223 4021799 5746043 8243548 11111158 12343401
8929 12343401 10314411 6117509 3044529 3186129 5380612 7145274 7540085 7176399 6653325
8920 6653325 6431164 7149028 8353536 7965172 5085399 2399001 3207274 6555971 8132457
8911 8132457 5969195 2312818 -490441 -2707676 -4755030 -5247033 -3533893 -1759056
8903 -1759056 -2098290 -3635395 -4023603 -2782850 -1013002 748548 2350928 2987605 2434158
8894 2434158 2220611 3438985 4461886 3237898 974824 763621 2835058 4048492 2517899
8885 2517899 167584 -349744 695190 912370 -865280 -3202076 -3584201 -843074 3524064
8876 3524064 6390636 5967603 3685190 2458148 3333648 4775427 5055406 4217020 3552304
8867 3552304 4054982 5610230 7183508 7859189 7954516 8468007 9038209 7758196 4113227
8858 4113227 630932 -252109 266765 -622333 -2639739 -2726656 56532 3076259 4202492
8849 4202492 4393248 5008048 5182363 3608733 961162 -1169321 -2239343 -2288709 -1181687
8840 -1181687 182342 -430415 -3834694 -7624982 -8875971 -7574962 -5734978 -4202678
8832 -4202678 -2217097 541229 3119784 4183074 2899706 -70644 -1821300 627611
8824 627611 6009935 8945919 6624129 3085450 3713021 7410671 8408342 4799295 494937
8815 494937 -1473888 -2596647 -4299854 -4438248 -1394203 1816161 1306256 -1857385 -3262100
8806 -3262100 -1525515 351681 -203611 -2142506 -2906386 -1560362 865959 2701518 2829584
8797 2829584 1671411 1121325 2390109 3980121 3263154 289660 -1625175 -8478 3319393
8788 3319393 4238951 1284869 -2682347 -3855861 -1465891 2179528 4786595 5966814
8780 5966814 6161552 5324398 3742839 2997114 4272084 6066072 5576818 2642762 311937
8771 311937 714023 2319743 2579929 1434829 360285 -453057 -1439556 -1178307 2339459
8762 2339459 7783870 10691105 8769582 4965985 3761627 5795321 7770350 6958062
8754 6958062 4195583 2338493 2786289 4145772 4255040 3077638 2822809 4913251 7905532
8745 7905532 9555952 10051286 11286321 13227829 13374918 10534581 7041866 5908267 7284757
8736 7284757 9144726 10167005 10336560 9671187 8135565 6429695 5496651 5577035 6712341
8727 6712341 9289410 12653397 14152952 11728621 7188360 4679911 5567345 6823257
8719 6823257 5189453 1100021 -2606604 -4338283 -4632172 -4360144 -3720829 -2878680 -2335953
8710 -2335953 -2324128 -2474055 -2451560 -2637499 -3755804 -5618679 -6515385 -4608406 -294492
8701 -294492 3563982 4508542 3002065 1230153 156814 -816694 -1773796 -1755017 -501471
8692 -501471 898836 1461246 991883 -736619 -3600224 -5583389 -3931291 1125161 5893250
8683 5893250 7727141 7894743 8475889 8947292 8312616 8314352 11002649 14419936 14582842
8674 14582842 11398351 8742524 8300041 7267083 3543552 -376137 -1041540 1056922
8666 1056922 2909447 3506077 4113691 4995491 4655523 2501586 264219 83996 2090607
8657 2090607 4317034 4838073 4068516 4602361 7811576 10953038 9695195 4077889 -414676
8648 -414676 714607 5520670 8689227 8235689 6344769 4814154 3136165 1005469 -565063
8639 -565063 -1347131 -2327303 -3048570 -1182046 3701853 8196695 8897247 6543929 4282603
8630 4282603 3179483 1995535 714031 1355629 4628902 8023283 8658880 6788588 4996490
8621 4996490 4579808 4359104 3193814 2131110 2996706 5635439 7957494 8706374 8815511
8612 8815511 9468483 10037568 9076479 6643597 4362197 3467167 3938574 5337135 7207688
8603 7207688 8625169 8612309 7270543 5438932 3130772 -392111 -4741797 -8110801 -9437507
8594 -9437507 -9340353 -8109923 -4654756 844945 4775217 3275336 -2556276 -7027302 -6081726
8585 -6081726 -1382989 2639211 4019805 3952817 3573842 2568062 1218724 1564425 4913412
8576 4913412 9271538 11124417 9670385 7612244 7432018 8618715 9503652 10120388 11459086
8567 11459086 12988898 13133405 11798733 10178983 8070958 3888046 -1981105 -6310160
8559 -6310160 -6990441 -5881717 -5901753 -6836108 -6185429 -3126615 690279 3789193 5987188
8550 5987188 6880685 5563341 2683912 1058754 2931098 7323429 11007694 11821780 10563805
8541 10563805 9775199 10867859 12526005 12298625 9822076 7494801 7237522 7684607 6112003
8532 6112003 2504950 -298859 -629986 -156906 -1197216 -3398292 -4383502 -2889012 -31665
8523 -31665 2281552 3272503 3500660 3610127 3166848 1022823 -2947452 -6896761 -8462095
8514 -8462095 -7013256 -3843496 -478237 2265976 3840545 3939020 3138776 2470706 2137572
8505 2137572 1714776 1619059 2818708 4706577 5065937 3148070 1169819 1360110 2911933
8496 2911933 3640963 3572717 4617878 7051204 8666215 7896289 5889073 4667203 4738668
8487 4738668 5512061 6717769 7990890 7962323 5579966 2224058 791656 2132053 3832447
8478 3832447 3620530 2828967 4660860 9248158 12517054 10925909 5867020 1871896 1323836
8469 1323836 2767962 4190698 5831089 8864131 12789268 15573717 15934866 14441251
8461 14441251 12489808 10923850 9615649 7860468 5151005 1929780 -396919 -449737
8453 -449737 2009604 5880194 9425764 11161372 10436220 7621785 3999799 1437114 1623637
8444 1623637 4765873 8890353 11374636 11699199 11754632 12718082 12956063 10597491 7100118
8435 7100118 5845717 7360807 8455640 6712145 3567682 1886680 2412225 3931658
8427 3931658 5296638 5852191 5362009 5049946 7258632 12191905 16178171 15377540 10630496
8418 10630496 6549614 6056354 7786270 8918647 8594843 7883971 7760897 8063770 7981196
8409 7981196 7106058 6015110 5549756 5437862 4399089 2031750 -361267 -1463164 -1395149
8400 -1395149 -758514 395925 1581770 1454836 -47738 -664074 1174165 3760098 4822295
8391 4822295 5244903 7042716 8840502 7241933 2548857 -846397 -574962 772178 130038
8382 130038 -1857187 -2913000 -2607073 -1661866 41771 2678637 5320969 7214154 8614380
8373 8614380 9093134 7172308 3346742 1178719 3053452 6662172 8069866 6542758
8365 6542758 3760443 51353 -5151833 -10025597 -11176288 -8019716 -3560951 -425291
8357 -425291 1487786 3028343 3922360 3814723 3420166 3649530 4628354 6020160 7393533
8348 7393533 8175370 8153780 7824091 7355116 5994840 3890238 3425893 6486088 10963033
8339 10963033 12609967 10341567 7097858 5283599 4272732 3201278 3222676 5295565
8331 5295565 7977514 9241981 8843675 7413565 4960456 1896564 -118789 -181614 398332
8322 398332 310150 348877 1395989 2000360 576615 -1240424 -494541 2389873 3958192
8313 3958192 2887061 1684191 2431781 3724667 3391729 1951284 1319522 1625243 1493723
8304 1493723 703444 509348 1474567 2612193 2827323 1976570 341941 -1783676 -3624003
8295 -3624003 -4048364 -2820201 -1127757 -315928 -526398 -1072712 -1616364 -2129757 -1952108
8286 -1952108 -46825 3319426 5986423 5890649 3413589 1013930 650696 2327407 5055354
8277 5055354 8069303 10617006 11674535 10950452 9582330 8695324 7607844 4780031 570638
8268 570638 -2405107 -2326819 -458029 599816 160474 -305992 128217 381133 -914506
8259 -914506 -3269835 -4863055 -4773187 -3739735 -2745475 -1892942 -1227507 -1735844 -4119430
8250 -4119430 -6565934 -5353052 1058293 9205117 13429863 11700283 7494165 5590570
8242 5590570 7240155 10203127 12192687 12660342 11743790 9319972 5550679 1263414 -2582279
8233 -2582279 -5028106 -4862198 -1706593 2286526 3546919 1035112 -2192441 -2678888 -651571
8224 -651571 1266342 2340621 4211496 7211768 8887224 7273793 3742591 1150164
8216 1150164 439258 517150 524372 576544 672702 394136 -226142 -587907 -407883 -6948
8206 -6948 216714 -83241 -1388191 -3733724 -5937690 -6273890 -4158239 -643495 2745405
8197 2745405 5014850 5609351 4325519 1866172 -80638 383 2168502 5057333 7119486
8188 7119486 7780706 7441040 6465750 4524589 1406744 -1712179 -2858639 -1591635 218220
8179 218220 794414 753854 1737815 3443215 3815067 2175108 312445 -149249 109749
8170 109749 -374868 -1396522 -1472311 -65943 1830020 3079294 3282386 2309029 17504
8161 17504 -3081828 -5436153 -5369925 -2559218 1547112 4983863 7000652 8263656 9199635
8152 9199635 8816629 6036835 1841474 -1218526 -1909777 -1503758 -1552833 -1782461 -1259130
8143 -1259130 -517845 -807631 -1634950 -959205 1761203 4323625 4550248 3173672 2622127
8134 2622127 3494167 3836381 2169481 -187501 -787419 767544 2581152 3145002 2886660
8125 2886660 2709899 2326058 1062848 -476668 -879676 125647 1305299 1616324 1353770
8116 1353770 1381672 2017375 3031311 4153429 5211415 6165678 7241138 8682599 10251967
8107 10251967 11278229 11224724 9971638 7836444 5762950 4955177 5414541 5272525 2862901
8098 2862901 -675518 -2353956 -1131773 733386 678935 -1244676 -3253819 -4298115 -4506663
8089 -4506663 -4121935 -3190426 -1828631 -42475 2121134 3769548 3584795 1813914 636913
8080 636913 1469433 3051386 3495769 3040009 3077848 3431130 2601014 249460 -2455579
8071 -2455579 -4583500 -5639783 -4518126 -693532 3473295 4254962 1220272 -1849505
8063 -1849505 -1801050 200104 1226167 848329 768401 1548236 2147819 2273108 2923589 4377219
8053 4377219 5457990 5394996 5001773 5221682 5543766 4803707 2937110 1000585 -283641
8044 -283641 -1155384 -1991356 -2624315 -2802308 -2772988 -2862751 -2718789 -1616272 345779 1835312
8034 1835312 1416270 -1059415 -4308822 -6635964 -7041145 -5827643 -4556413 -5099291 -8080645
8025 -8080645 -12062803 -14544571 -13960509 -10732111 -6505754 -2607510 654617 3359242
8017 3359242 5189794 5883265 6314737 8047434 11177202 13608646 13557915 11847873 10137331
8008 10137331 7793074 3051840 -2904468 -6178286 -5394890 -3664433 -3592034 -3347421 -498202
7999 -498202 2745181 1960154 -2971190 -7589452 -8860847 -8025187 -7333924 -7322574 -8020128
7990 -8020128 -9823833 -12046870 -13006166 -12471327 -11819778 -11202696 -9134905 -5562029 -2423483
7981 -2423483 -201040 2879769 6752401 8097180 5383629 2176449 2403806 4953077
7973 4953077 6321177 6327198 7249546 8903041 8896167 7126949 5888370 5607163 4510539
7964 4510539 2873576 3394864 6045269 6435808 1672691 -4973781 -7885415 -5767975 -2090223
7955 -2090223 -119930 108523 426596 2172986 5289681 8503046 10249566 10071926 8989160
7946 8989160 8146545 7579704 6688943 5259775 3473673 1558144 41804 -219110 1086742
7937 1086742 3267543 5537545 7819842 10022969 11079568 9659149 5855080 1560295
7929 1560295 -1030779 -1125514 379582 1985546 2735714 2348652 759888 -1723783 -3869018
7920 -3869018 -4164179 -2539038 -560048 649144 1559866 2536715 2616727 1667692 2192540
7911 2192540 6255675 11390902 12798369 9765436 6646432 6612106 7710593 6830467 4535864
7902 4535864 3356129 3527743 3493300 3251207 4093253 5611178 5860951 4536201 3582506
7893 3582506 4390319 6314209 8138647 9175599 8761826 6554284 3714511 2172621 2362550
7884 2362550 3093190 3589398 3814181 2884192 -245355 -3939615 -4605219 -1739787 457538
7875 457538 -1146328 -3615423 -2062628 2667930 4626865 1312444 -2452942 -1040253
7867 -1040253 4675838 9292559 10160778 9295495 8713087 7528987 4688279 1688734 544040
7858 544040 750236 501045 -41128 1000679 3987710 6999110 8488668 8641025 7622729
7849 7622729 4754310 618087 -2057263 -1508301 438411 854182 -216255 -365827 1217628
7840 1217628 2959011 3971777 5289240 7360264 8635836 7872791 6139040 5263354 5634035
7831 5634035 6668463 8089690 9349707 8946706 5945999 1551907 -2156808 -4481170
7823 -4481170 -5948621 -6698564 -6478638 -5725521 -5149173 -4488291 -2986281 -859088 966934
7814 966934 2312397 3652264 4798999 4979406 4071701 2629440 1077572 107500 1070854
7805 1070854 4128473 6686765 6037598 3171401 1221078 319006 -2398984 -6938759 -8742346
7796 -8742346 -5166902 -109380 1288756 -7870 1108152 6104668 11218509 13128256
7788 13128256 12165086 9676183 6148441 3009885 2761585 5460542 7612505 6371210
7780 6371210 2868145 -115347 -1736629 -2652944 -2913225 -2362999 -1836162 -2032810 -2219942
7771 -2219942 -1630050 -949837 -717598 414012 3608426 7016546 7511173 4870072 1865144
7762 1865144 275237 -753314 -1969513 -2048435 411370 4485454 7830491 9139359 8784967
7753 8784967 7780186 6976025 6779444 6906264 6667447 5909457 5287399 5249746 5234654 4341335
7743 4341335 2355790 -452137 -4058725 -8152214 -10840438 -9327714 -3192779 3600240
7735 3600240 5860857 2915122 -447015 113162 3283612 4737544 3429004 2150530
7727 2150530 2385373 2399197 1202298 636857 1679786 2072598 286799 -1050336 1055749
7718 1055749 5027209 7048095 6427846 4917840 2530608 -1415476 -4286761 -2450668
7710 -2450668 2334860 4001858 561383 -3443742 -4202812 -3288503 -2798527 -926448 3875563
7701 3875563 8238976 7804451 3350502 -918651 -3131244 -3959565 -2987401 781678 5675850
7692 5675850 8653464 9612075 10956920 13073792 13637405 11627338 8926780 7419879 7086287
7683 7086287 7352268 7930010 8044974 7173309 6718653 8518440 11499275 12444593 10490967
7674 10490967 8124760 6982927 5457809 1775756 -2934470 -6225038 -7128742 -5937370
7666 -5937370 -2886069 1300701 4685159 5363091 2909055 -1802615 -7009341 -10009670
7658 -10009670 -8583778 -3491693 1836765 4882645 5881563 5711632 4271877 2163508
7650 2163508 1570715 3389100 5282508 4909119 3644433 4497647 7275280 8670596 7010407
7641 7010407 4284371 2999453 3210984 3527878 3401234 3349856 3893789 5070912 6400142
7632 6400142 6959462 6252219 5287154 5866615 8254466 10356416 9942334 7107316 3756922
7623 3756922 1150894 -914828 -2477488 -2274621 775438 5502766 9096385 9950389 9000208
7614 9000208 7982453 7465197 7293220 7864809 9621398 11830894 13285571 13978907 14779973
7605 14779973 15655549 15696842 14881656 14216106 13935835 13180846 11756727 10463246 9204651
7596 9204651 6817843 3762829 2871064 5652901 9388549 9955729 6714399 2749275 891156
7587 891156 1325880 2794416 4293065 5359115 6019525 6791997 7907887 8506880 7394012
7578 7394012 4645720 1964958 1578389 4921511 11536105 18615856 22570263 22046724 18841998
7569 18841998 15282970 11900060 8527643 5951170 4645140 3297623 946730 -414388
7561 -414388 1858798 6561305 9428600 8737613 7236060 7572837 8502684 7257454 3615349
7552 3615349 -350672 -3198607 -4812413 -4969625 -3144880 234095 3528043 5086942
7544 5086942 4306694 1852002 -695465 -1872886 -1555796 -825422 -429069 -52680 622732
7535 622732 1163939 1389928 2221446 4437782 7014241 7770485 5750709 2376750 155117
7526 155117 449274 2350686 3577815 2756866 889071 128965 1069005 1928050 705926
7517 705926 -2544732 -5985188 -7846935 -7502839 -5335987 -2329873 457866 2634611 4610519
7508 4610519 6622909 7816440 6832599 3522060 -116310 -1125833 1721383 6280188
7500 6280188 8716908 7343783 4180938 2097869 1361173 345435 -1129421 -1309154 507501
7491 507501 2552542 2970521 2022697 974272 184920 -566877 -998922 -798396 -399042
7482 -399042 -244515 43433 873393 1782998 2205596 2453050 3107722 4076987 4929918 5444494
7472 5444494 5312816 4338035 3442055 4039784 5635184 5847166 4110101 3287510 5480923
7463 5480923 8104493 7156540 3292736 1099889 2399656 3882128 2444639 -257903
7455 -257903 -595882 1772533 3687038 2598580 -902194 -4251843 -5219102 -3168677 798767
7446 798767 4465553 5619284 3289436 -1253531 -4600718 -3622267 1104602 5315720 5967248
7437 5967248 5008315 6119633 8727165 8557245 4298346 167114 441966 4359475 8261322
7428 8261322 10182917 10047706 7699899 3739360 808753 1013280 2853105 3354018 2464433
7419 2464433 2590781 4397595 6115721 6879670 7657432 8551903 8240498 6864356 6547261
7410 6547261 7875838 8585180 7176055 5206931 4249275 3235414 1189757 92871 1825046
7401 1825046 4050514 2915215 -926228 -2811545 -709216 2320305 3183248 2827406 3522109
7392 3522109 4902685 5098295 3900211 2433014 996862 -500889 -1004512 472957 2766729
7383 2766729 3978550 4522785 6368119 9392060 11047916 10033259 7801510 5645862
7375 5645862 2782539 -1239682 -4433546 -4750341 -3143001 -2181612 -2559807 -2946330 -2551074
7366 -2551074 -1747913 -597355 1057270 2084956 894681 -1776709 -2908828 -853798
7358 -853798 2717825 5464909 7361161 9623958 11811199 11792509 8528534 3753556 695233
7349 695233 1450332 5244002 8814371 9014753 5721356 1960534 786253 2435223 4868965
7340 4868965 6325479 6494507 5688304 3965645 1267433 -2053673 -4919801 -5755612 -3666514
7331 -3666514 189934 3138494 3671997 3045965 3326850 4489238 4797008 3813594 3374520
7322 3374520 5052571 7968018 10012443 10340980 9580180 8162584 5851262 3053327 1360436
7313 1360436 1911719 3687204 4268295 2292276 -1356199 -4627732 -5829864 -4200632 -300320
7304 -300320 3494364 4131233 917526 -3179960 -4604536 -3013258 -492597 2188980 5915108
7295 5915108 9800117 10720052 7780287 4485898 4122402 5163792 4174725 1593120 983725
7286 983725 3155097 4866439 3946651 2270784 2333255 3770979 5132292 6731849 9410992
7277 9410992 11972197 12236425 10008025 7126215 4995373 3658184 3016993 3425269 4898427
7268 4898427 6691741 7803809 7555489 6167152 5192100 6408512 9351538 10915041 8786131
7259 8786131 4619131 2211750 2834086 4043603 3239922 750830 -1247178 -1624559 -1148937
7250 -1148937 -1037434 -1487844 -1568340 -205116 2695051 6015218 8354584 9100284 8588902
7241 8588902 7603430 6900763 6717803 6377270 4941674 2721192 1430047 2113159 3601397
7232 3601397 3999307 3095064 2059702 1233444 -147111 -1926219 -2380103 -330163 3184043
7223 3184043 6175091 7946683 9264314 10711008 11710716 11348764 9822358 8687423 9314797
7214 9314797 11180655 12371786 12009511 11199330 10931892 10256143 7889018 4599291 2052042
7205 2052042 -4130 -2878687 -5454617 -4764097 -1125969 447770 -3530222 -9565143
7197 -9565143 -11146338 -7201759 -3205230 -3624933 -6448381 -6699623 -3101280 1078015 2899380
7188 2899380 3167516 4558216 7778452 10611047 10465632 7220498 3436770 2042692 3884314
7179 3884314 7252599 9472588 8987070 6279552 3147271 1224357 1118189 2556354 4742037
7170 4742037 6436367 6462455 4861060 3160683 2698006 2964902 2622375 1978061 3050324
7161 3050324 6697551 10898457 12784993 11647908 9103810 6929791 5723602 5372022
7153 5372022 5782437 6855333 8102790 8489168 6862971 3061355 -1367473 -4234257 -4730215
7144 -4730215 -3725689 -2053460 232584 2397800 2402493 -854945 -5601699 -8996632 -10275566
7135 -10275566 -10610303 -10368736 -8413561 -4315474 335703 3417380 4098821 2939734 1208807
7126 1208807 365618 1168071 2888099 4188442 4850983 5631477 6473613 6440479 5803941
7117 5803941 6366874 8613605 10205011 9059069 6769414 6761596 9503959 11938521 11995007
7108 11995007 11276410 11961056 12966423 11408848 7050705 2880765 1082928 631860 -148151
7099 -148151 -564346 1065193 4097611 5842038 5066975 3331631 2447294 2274501 1733433
7090 1733433 565939 -839203 -2220654 -3069979 -2507297 -580644 1160206 1341959 137754
7081 137754 -1848687 -4659270 -7547199 -7992803 -4447079 764863 3785030 4151463 4791209
7072 4791209 7026647 8519830 7188875 4522805 3210554 3370548 3180027 2016571 921736
7063 921736 629729 1051412 2417407 5090542 8039452 9102053 7541490 5388151 5267441
7054 5267441 7147289 8135460 5927456 1913820 -142498 1356814 3887466 4218369 2454095
7045 2454095 918542 4509 -2119043 -5544601 -7387098 -5890486 -3356311 -2970166 -4485536
7036 -4485536 -5321808 -4611702 -3595226 -2779800 -1501878 -281874 -890816 -3296405 -4796511
7027 -4796511 -3544087 -1373598 -1481903 -4042947 -5703884 -3528456 1572569 5824569
7019 5824569 6605570 4898267 3566393 3787749 4155010 3262705 1736548 809887 182596
7010 182596 -987437 -1590500 770952 6209718 11448949 13327475 12224917 10806433 10176824
7001 10176824 8786494 5117492 144689 -3510302 -4221116 -2455224 401837 3329800
6993 3329800 5496668 5760743 3504340 -70524 -2474750 -2204975 2488 2333030 3600040
6984 3600040 3557062 2479440 1197909 912920 2068649 3633021 4119779 3118657 1391728
6975 1391728 -119409 -830325 -502296 594465 1685329 2130043 1852625 944350 -555146
6966 -555146 -2131710 -2876650 -2746053 -2968318 -4390747 -6135615 -6808196 -6360846 -5737288
6957 -5737288 -5296807 -4759786 -4247640 -4154789 -4233213 -3851729 -2943272 -1869277 -843447 -385862
6947 -385862 -1545522 -4330511 -6587675 -6054601 -3139280 -90382 2150334 4384856 6687203
6938 6687203 7732152 7061760 6095078 6082712 6587331 6809282 7032154 7733227 8270735 7529832
6928 7529832 5434475 3177748 2162802 2796162 3929259 3708660 1630736 -568152 -850098
6919 -850098 775721 2772889 4208215 5042063 5127984 4773149 5671866 9023399 12917633
6910 12917633 13936934 11468777 8156972 5976727 4422147 2920998 2165333 2103358 1334989
6901 1334989 -200553 -440211 1435329 3218602 2923364 1648382 1436406 2294249 3215353
6892 3215353 4342110 6194601 8295007 10174454 12054668 13063117 10926870 5386103
6884 5386103 -96253 -2081244 -723374 2160135 6009273 10128520 12160107 11153454
6876 11153454 9757645 9882902 8680130 3144707 -3420726 -4779085 -543483 3764414
6868 3764414 5130047 5978955 8112045 9339565 8124928 6880384 8053493 10513692
6860 10513692 12150505 12877779 12926342 11322704 8403883 6904375 8040301 9139770 7645648
6851 7645648 4906776 3309914 2125645 -595725 -3837270 -4645489 -2303539 1334863
6843 1334863 4833946 7951101 10104599 10420548 9002894 6569701 3575362 1018859
6835 1018859 715600 2991006 5497648 6170785 5798387 5722416 5063175 2944348 1437050
6826 1437050 2704370 4659270 3538520 48575 -1418883 279597 1394107 -458963
6818 -458963 -2653969 -2096332 131634 1128754 499438 -274245 -853365 -1932544 -3344476
6809 -3344476 -4306372 -4598132 -3974192 -1616047 2241385 5341028 5786680 4496749 3826806
6800 3826806 4735801 6651321 8799668 9961164 8336623 3954121 177109 218175 2675808
6791 2675808 3175706 272731 -3029078 -3894353 -2973619 -2260049 -2259902 -2664453 -3559691 -4250979
6781 -4250979 -2842170 969594 4244323 4207269 2115652 1277739 2121703 2112128 315134
6772 315134 -1126999 -817043 -481899 -1932126 -3932999 -4257367 -3342103 -3505648 -5186889
6763 -5186889 -6184515 -4667135 -1283002 1882037 3171298 2161546 -162841 -1975526
6755 -1975526 -2394082 -2481178 -3228873 -3078805 409026 6218071 9647299 7659924 2638627
6746 2638627 -660551 -347533 2037821 4556634 5972965 4749508 28552 -5908494
6738 -5908494 -8678643 -6482711 -2078931 957128 2225046 3292679 4153176 3346262 1128554
6729 1128554 -31269 1212871 3148047 3479184 2310926 1310999 1030069 845307 1014079
6720 1014079 2678303 5509997 7245445 6550115 4978587 4833653 6005602 6314967 4514414
6711 4514414 1664624 -326180 -517240 618622 1749449 1813272 1180585 1270814 2453735
6702 2453735 3227379 2457799 1306600 1342501 1781252 791126 -1167867 -1967066 -1506410
6693 -1506410 -1740338 -2685042 -1788470 1497431 3850705 2891725 993201 1599671 4080615
6684 4080615 5329372 4691110 3940482 3592688 2767681 2062823 2961085 4430245 3598801
6675 3598801 310527 -2217674 -2127940 -1316229 -1951279 -3404670 -4191205 -4528886 -5142867
6666 -5142867 -5455323 -4772892 -3701493 -2766085 -1179848 1364403 3247387 3157878 2393460
6657 2393460 2850395 3866149 3382424 1512057 498072 1297590 2488966 2848511 3039048
6648 3039048 4147069 6100766 8239077 10261552 11920973 12647542 12106781 10625384 8800850
6639 8800850 7160084 6145818 5739989 5214526 4130886 3440686 4409384 6374730 7007024
6630 7007024 5361082 3356100 3295947 5004908 6631354 7462800 8364351 9631792 9975711
6621 9975711 8081170 4161572 -423550 -4155235 -5569976 -3701917 646268 4823245
6613 4823245 6683967 6591193 6048640 5129854 3074527 1003293 1329734 3636287 3883507
6604 3883507 -127552 -4588493 -4069295 912526 4206495 2130440 -2139291 -3567334
6596 -3567334 -1712678 23723 -442344 -2134289 -3433202 -3701724 -2683075 -395681 2032936
6587 2032936 2884621 1601219 -810913 -2969776 -3748093 -2192802 1544315 5034459 4958485
6578 4958485 550231 -5153421 -8150320 -7071359 -3696687 -665565 712232 769456 294805
6569 294805 -643963 -2471827 -4719526 -5577749 -3545113 849684 5691460 9592959 12022150
6560 12022150 12292939 9909738 6122580 3505508 3170302 3576754 2998369 2034087 2325523
6551 2325523 3479272 3022638 -221299 -3913052 -4244819 22804 6061315 9501957 8235533
6542 8235533 3823504 -290416 -1472934 836002 5355637 9646684 11127569 8631338
6534 8631338 3415396 -1717949 -4513606 -4526423 -2800959 -817843 577873 1837717 4098185
6525 4098185 7425566 10169327 10767336 9488509 7280005 3746542 -1783376 -7466754
6517 -7466754 -9643710 -7078417 -2600671 412136 1442746 1751078 1947276 2360084 4065586
6508 4065586 7226519 9461710 8289563 4704215 2055019 1642749 1793051 1376903 1671090
6499 1671090 3796453 6409171 7374667 6421033 4817487 3401364 2279731 1918535 3101221
6490 3101221 5544333 7296342 6141200 1894870 -2800055 -4663455 -3184216 -1086227
6482 -1086227 -735141 -1205098 -284610 1761137 2719100 2173295 1946717 2574253 2269797
6473 2269797 464674 -349368 1952471 5983232 8923201 9843700 9163036 6906288 3924137
6464 3924137 2982838 5581846 8749699 8074652 3449833 -966675 -2130862 -652138 1775403
6455 1775403 4393247 6498841 7447501 8295227 10975538 15075069 17687603 17142480 14645009
6446 14645009 11722589 8627376 5942058 4825211 4473500 2314648 -1643360 -3588470
6438 -3588470 -1108289 3154861 5500358 6115955 7003640 7418851 5202985 1147168 -1872390
6429 -1872390 -3239919 -4280415 -4244175 -940832 4206283 6018737 2200673 -3055824 -4171366
6420 -4171366 -652565 3491538 5112676 4703892 4719298 6719671 9930880 11876949 10705216
6411 10705216 7024232 2988998 43097 -1405318 -920903 1268691 2812133 999367
6403 999367 -3475837 -6731984 -6379386 -3870186 -1476904 621441 2953768 4774662 5284411
6394 5284411 5112639 4876851 3807684 1457040 -795162 -1709371 -2096846 -2812390 -2454961
6385 -2454961 466369 4318217 6098497 5734241 5781829 7036092 7343404 5286172 2454319
6376 2454319 977650 778454 546367 2050 -177285 110114 103810 -756727 -2025214 -2470678
6366 -2470678 -1201523 1138314 2741468 2828620 2779139 3963100 5199064 4200081 1285116
6357 1285116 -616746 -186816 301883 -1478318 -4228146 -4805600 -2663129 -486016 -741371
6348 -741371 -3375787 -6911302 -9980025 -11170333 -8964016 -3218479 3816151 9013685
6340 9013685 10845770 9942505 7800079 5789973 4928276 5280419 5539493 4474750 3037194
6331 3037194 3532604 6069418 7581333 5824087 2794046 1948779 3018549 2441646 -1077519
6322 -1077519 -4462082 -4661721 -2482407 -388735 1250181 3410433 5415629 5371277 3218249
6313 3218249 1201072 1210962 3206439 6196278 9209718 11118051 10963579 9085878 7140410
6304 7140410 6607331 7664259 9395339 10500547 9984259 7922239 5632992 4597343 5099469
6295 5099469 5982211 5479214 2513340 -1882584 -4449856 -2517933 2488004 5958523 5491085
6286 5491085 3652739 3914578 5671970 5680935 3262511 1246227 1937175 4622609 7301405
6277 7301405 8741541 8408666 6308085 3655602 2329804 3014048 4722499 6118447 6184151
6268 6184151 3962096 -565385 -5171213 -6753718 -4694887 -1619645 -262228 -598847
6260 -598847 -550953 1315745 4251567 6098614 5598081 3983780 3467028 3954670 3065700
6251 3065700 439949 -320574 3618395 9553149 12323000 10846707 8117941 5748287
6243 5748287 2776730 -247617 -677779 1546148 2645297 222371 -3476869 -5138284
6235 -5138284 -4177716 -1442982 2635738 6646181 7992773 6346352 4668688 4756849 4587491
6226 4587491 2361586 183902 759669 2936123 3710210 2679799 1455950 481617 -521277
6217 -521277 -649630 511876 835208 -1594879 -4944289 -5823602 -3755885 -656373 2473250
6208 2473250 5060004 4897772 616075 -4707050 -6348390 -3878288 -745760 1235799
6200 1235799 2888320 3744842 1919635 -1553117 -2712840 -254261 2637790 3246915 2535035
6191 2535035 2100243 1520858 423975 -102937 -72999 -1545475 -4963889 -7327303 -6212592
6182 -6212592 -3150563 -806409 804995 2851365 4580935 4464897 3017782 1974266
6174 1974266 1681896 1382553 1015727 795647 94696 -1313571 -1998588 -894277 393729
6165 393729 -590482 -3749398 -6819875 -8431397 -8733053 -7685691 -5131465 -2343938 -1118954
6156 -1118954 -1093644 -148035 2108264 3524354 3051151 3013037 5865065 10060867 11518810
6147 11518810 8884033 4987595 2541419 732373 -2181769 -4738368 -3749795 454019
6139 454019 3579784 3169013 1797675 2491129 3675327 1818005 -2684578 -5917437 -5999538
6130 -5999538 -4690740 -3693136 -2922370 -2689302 -3934057 -5461166 -4464153 -1063674 1009087
6121 1009087 -220940 -2189708 -2157431 -1013787 -464421 253676 1930134 2707747 1373263
6112 1373263 723576 3566963 7314134 7097464 3231999 853416 2165188 3621341 1862059
6103 1862059 -1511844 -3002647 -2169001 -1262203 -1528702 -1815318 -355869 2964728 5971623
6094 5971623 6068207 3389503 1254393 2204848 4726562 5879959 5899403 7092932 8872412
6085 8872412 7924978 4046724 1776586 4165938 8180757 9101022 7076222 6012467 7386118
6076 7386118 8738095 8143467 6950858 7146795 8351420 8971674 8980514 9776927 11547017
6067 11547017 12255049 9918106 5210627 971588 -678202 181099 2623154 6198279
6059 6198279 9945406 11474021 9049200 4283033 823063 171692 572461 387459 549851
6050 549851 2625071 6165880 9458677 11608611 12303142 10640775 6254246 1145883 -1680944
6041 -1680944 -1641445 -967326 -1401008 -2224040 -2263563 -2074494 -2657617 -3259732 -2376241 -350543
6031 -350543 1156765 2270609 5040924 9570765 12404279 10836195 7131753 5691687
6023 5691687 6916065 7212870 5252951 4524171 7904281 12622085 13407001 9090122 3457349
6014 3457349 478602 1058588 3733595 6037141 5516387 1948722 -1321777 -536014 3733316
6005 3733316 7142275 7143314 5607646 5277430 6166998 6817374 6849703 6343018 4353005 335764
5995 335764 -3778463 -5030114 -2748818 1117582 4725714 7723764 9805574 9657544 6521585
5986 6521585 2126738 -197530 1259674 4745110 6971677 6743222 5900362 6529587 8375935
5977 8375935 9865124 10554841 10944956 10503892 8026426 4147369 1510560 1739581 3823218
5968 3823218 6107043 8090902 9364589 8826509 6710687 5814486 8402676 12549959 13725407
5959 13725407 9983396 3863989 -958738 -3282620 -4193153 -4694742 -4550968 -3084213 -516789
5950 -516789 1650977 1853825 206563 -1528131 -2204475 -2809499 -4758594 -7225231 -7577783
5941 -7577783 -4600918 -128068 2923845 3323287 2051392 974575 1495954 3689709 5927402
5932 5927402 5814121 2453799 -2206479 -5079214 -5242577 -4861913 -6264448 -8706446 -9199156
5923 -9199156 -6571815 -3293402 -2303988 -3126069 -2825433 -483784 1392513 606946 -1484567
5914 -1484567 -2072284 -1058926 -981430 -2922698 -4641606 -3658318 -657138 1665867 2350477
5905 2350477 3001847 4879259 6995163 8039656 8672716 10109187 11224679 9455684 4832767
5896 4832767 685250 -872263 -1966640 -5416378 -9795365 -10864946 -7371233 -2642052
5888 -2642052 -301521 -949235 -3456842 -6778079 -9346080 -9208786 -6564536 -4327111 -4357713
5879 -4357713 -4724909 -2675171 1073300 3318830 2766399 1042092 -244870 -1033605 -1330246
5870 -1330246 -573551 727953 604024 -1871573 -4805835 -5527586 -3984654 -3024463 -5105014
5861 -5105014 -9294730 -12078518 -11264709 -8550827 -7381371 -8433530 -8662850 -5511371 -599290
5852 -599290 2365047 2494542 2460991 4340097 6906434 8097367 8449831 10059056 12572553
5843 12572553 12515464 7783074 1431832 -1093630 1541564 5001136 5125584 3113152 2656169
5834 2656169 3630746 2240934 -2639896 -7068299 -7386359 -4916220 -3266735 -3477535 -4294418
5825 -4294418 -5162756 -6026892 -5649696 -3281956 -1165213 -2279646 -5949806 -8591204 -8670663
5816 -8670663 -7944963 -7573839 -6145615 -2603544 1418171 3566132 3338937 1733122 -47399
5807 -47399 -792100 55495 1154911 459261 -1549101 -1789200 1078102 4152734 3782704
5798 3782704 124868 -3490429 -4704054 -3946801 -2835865 -2433715 -2903379 -3599005 -3403533
5789 -3403533 -1723051 799498 2831670 3373079 2211300 -16605 -2108305 -3309642
5781 -3309642 -4019024 -4727599 -4670088 -2901920 -391267 915829 1219500 2818615 6400596
5772 6400596 9777244 11302575 11993296 12664793 11569787 7413615 2764147 1446570 3588127
5763 3588127 6033378 6924989 7027453 6901168 5763344 3472820 1054633 -1301160 -4395690
5754 -4395690 -7459224 -7793188 -4287032 456438 2914368 2329684 455998 -1118446 -1949480
5745 -1949480 -1913201 -1024598 59785 520690 463432 768639 1756431 2629546 2557032 1973696
5735 1973696 2268055 3899706 5165453 3681208 -605553 -4765241 -6042940 -4923431
5727 -4923431 -3892744 -3818059 -3400508 -2231464 -2159343 -4404388 -6948864 -6739099 -3890214
5718 -3890214 -1759207 -2566347 -4503288 -4079129 -434419 3758676 5378969 3841991 967766
5709 967766 -1138511 -1525330 -443080 1057314 1637935 578628 -1575495 -3608041 -4764786
5700 -4764786 -4789877 -3196682 259441 4061453 5172788 1930568 -3723195 -7747617 -7610115
5691 -7610115 -4042497 192991 2530404 2028253 -371715 -2735371 -3700554 -3374222 -2766627
5682 -2766627 -2640077 -2941389 -2947131 -1974315 -451580 9364 -1365418 -2698651 -1372257
5673 -1372257 2044350 3919236 2497706 364406 272440 884458 -513371 -2777416 -2122073
5664 -2122073 1808116 4796776 3763461 527948 -1447181 -1558859 -1664643 -3096743 -5782650
5655 -5782650 -8949358 -11151807 -10742538 -7796188 -4690359 -3489974 -3595135 -3213845 -2265078
5646 -2265078 -2282364 -3908124 -5976710 -7061270 -6816731 -5718070 -4382052 -3391354 -3152650
5637 -3152650 -3480995 -3429161 -1900068 1116582 3900091 4393205 2755607 1573335 2554851
5628 2554851 4133971 3952022 2573600 2282274 2945882 2336656 587375 527878 2481071
5619 2481071 2662225 -888597 -4236355 -2698591 2525603 6524001 7530656 7687542 8298207
5610 8298207 8601246 8837742 10342552 12258739 12006360 9728858 8600340 9630289 9789975
5601 9789975 6980722 3483529 2159230 2127237 1108781 -140210 874936 3680940 4628933
5592 4628933 1531659 -3684755 -7293574 -7239544 -4161527 -308096 2121573 2300577 840697
5583 840697 -1419123 -4206576 -7207430 -9490305 -10153023 -9034169 -6498738 -3301676 -876964
5574 -876964 -528631 -1687290 -2097672 -480831 2042335 3765140 4230044 3468883 1174208
5565 1174208 -1928161 -3463186 -2108932 160633 519346 -834625 -1271585 399783 2749044
5556 2749044 4053870 3690414 1349850 -2813401 -6778879 -7429834 -3742114 1910044 6215402
5547 6215402 7800810 7470669 6693010 6214181 5439214 3188840 -275337 -2603550 -1986598
5538 -1986598 202599 1117421 345998 34611 1244784 2563511 2707961 2098768 1031152
5529 1031152 -1334876 -4790804 -6896264 -5700443 -2288191 834185 2603711 3267526
5521 3267526 2794276 1229708 -259439 -441970 342236 874637 746772 159950 -1106120
5512 -1106120 -3006823 -4161927 -3164091 -741929 880301 769185 114991 156351 505394
5503 505394 123036 -654388 183767 4124933 9554986 12326970 10191684 6082059 4887729
5494 4887729 6951707 7560143 3895253 -614340 -1244076 1242746 2017029 -1092649 -5681281
5485 -5681281 -8764187 -9284805 -6891933 -1708637 4070758 7261510 7294033 6564223 6756573
5476 6756573 7193537 7222527 7467519 7832886 6975280 4964408 3871839 4284393 3872708
5467 3872708 1360175 -516981 1495538 6512970 10941066 13235695 14585065 15717147
5459 15717147 15781506 14339221 12255427 10348612 8665495 7066692 5181213 2069485
5451 2069485 -2504986 -6625189 -7717308 -5724091 -3379345 -2952494 -3881645 -4105965 -2843505
5442 -2843505 -1426131 -1676986 -3710157 -5384304 -4313524 -540823 3457634 5619544
5434 5619544 6053406 5503415 3697391 598703 -2072495 -2576263 -1686149 -1488912 -2169869
5425 -2169869 -2212988 -1610229 -2301586 -4781020 -6553790 -5196986 -1254952 3169581 7106421
5416 7106421 10307760 11379798 8663184 3042019 -1939080 -3540509 -2502319 -1638834
5408 -1638834 -2479625 -4131122 -5075567 -4942898 -4135659 -2676862 -446093 1862546 3249301
5399 3249301 3915748 4988393 6370328 6294117 3977349 1520959 1743850 4830704 8553964
5390 8553964 11280223 13099951 14134012 13533844 10763695 6705801 2867242 192103
5382 192103 -1083385 -1208107 -856559 -606192 -280561 540210 1390093 1275626 346865 135714
5372 135714 1583795 3634804 4395328 3129496 611472 -1924779 -3582903 -4000416 -3526557
5363 -3526557 -3223069 -4139881 -6249287 -8204322 -8507457 -7135556 -5689187 -5439224 -5566594
5354 -5566594 -4320980 -1847391 -435199 -1458236 -3541532 -4689030 -4761072 -4557795 -3978392
5345 -3978392 -2929918 -2707037 -4120897 -5289779 -4062866 -1971274 -2452796 -5070705 -5115040
5336 -5115040 -95334 6613703 10356520 10546866 9208876 6840784 2948603 -827546
5328 -827546 -1632120 664667 3079116 3303561 1814550 -2901 -1704481 -2964137 -2625381
5319 -2625381 -28112 3271651 4311366 1679245 -2554303 -4393174 -1978106 2089285
5311 2089285 3431297 1053519 -1387909 -61361 4585964 8917613 10501507 9847950
5303 9847950 8428574 6815136 4994382 3191513 1771005 809175 -21004 -1253614 -2931751
5294 -2931751 -3886033 -2555196 824911 3776297 4329272 3380548 3057441 3531269 3144702
5285 3144702 1314628 -574694 -1330171 -1327793 -1311753 -1288804 -1199593 -1349806 -1394396 -59674
5275 -59674 3116003 6597390 8479848 8801088 9184500 10376587 11157907 9982253 7060725
5266 7060725 4258631 2951268 2389828 628415 -2924729 -6507781 -8062126 -7761222 -7480134
5257 -7480134 -7822314 -6965624 -3186631 2363011 6554082 7697241 6965299 6285441 5932373
5248 5932373 4905631 2905655 832663 -467934 -873063 -272911 1710411 4761006 7500470
5239 7500470 8816833 8947953 8619538 7909437 6861478 6372525 7122711 8145037 7928700
5230 7928700 6655071 5838305 5980559 6287129 6592643 7502769 8299530 6964175 3273549
5221 3273549 -102595 -958267 -415603 -985416 -3150444 -5471394 -6958357 -7637589 -7576249
5212 -7576249 -7011285 -6939091 -8107247 -9754684 -10524846 -10216991 -9595435 -8961917 -7876380
5203 -7876380 -5768102 -2167600 2647643 6470427 6246323 1924145 -2179894 -1950800 1512510
5194 1512510 3579611 2065367 -794656 -2015928 -1133600 444877 1389399 1225423 439067
5185 439067 -15683 -168014 -1324893 -3620131 -4384661 -1172209 4278947 7707510 7785536
5176 7785536 7263857 8444877 10205932 10351782 8688055 6714646 5842038 6444120 7147874
5167 7147874 5111027 -802305 -7068425 -8460043 -4503655 -112078 1057480 578270
5159 578270 1009084 1191511 -1231498 -5068087 -6850429 -5646256 -3522229 -1932513 -558101
5150 -558101 472233 -51126 -2260901 -4252204 -3931320 -955454 3065332 5527997 4713891
5141 4713891 1852117 398053 1761697 2845693 49330 -5033036 -6867060 -3250947
5133 -3250947 1610831 2719618 598961 -277055 2008045 4699561 4861527 3438189 3363161
5124 3363161 5108014 6348331 5943857 5941247 8341743 11491479 11857912 8886542 5773986
5115 5773986 5028927 5394109 4253575 1364493 -1383009 -2793349 -3228076 -3220098 -2894001
5106 -2894001 -2693845 -3265847 -4287386 -4369581 -2563328 522154 3346046 4887636 5353500
5097 5353500 5593940 5922271 5723425 4479989 2818804 1816872 1500762 1120448 922866
5088 922866 2182172 4831307 6458449 4879905 870009 -2860082 -4716435 -4941154 -3856225
5079 -3856225 -1227632 2296425 4793073 5356870 5927493 9151571 14269752 16835538 13800286
5070 13800286 7732451 3934712 3822585 3894687 1769949 -105926 1123747 3659868 3942675
5061 3942675 2591211 3139048 5806834 7255135 6561389 6441804 7427562 5950595 713577
5052 713577 -3577092 -2384299 2224316 5110174 5200253 5008671 5281289 4632978 3329662
5043 3329662 3165869 4066212 4506333 4787552 6132514 6956373 4300556 -621986 -2576128
5034 -2576128 654887 5087812 6295307 5109330 5045314 6548260 7010523 5404244 3827268
5025 3827268 4216771 5702821 6117536 4902299 3379515 2546052 1846231 661618 35338
5016 35338 1531665 4584932 6583252 6020424 4147965 2944999 2974200 3941888 5549585
5007 5549585 6634655 5366033 1971417 -361326 829400 4124002 6598030 7737702
4999 7737702 8731644 9381166 8475615 6324016 4319243 2746488 1437441 1563329 3945241
4990 3945241 6454657 6273957 4277751 3912885 5882422 7282898 6239160 4039079 1992090
4981 1992090 -584486 -3974396 -6340498 -5982193 -3579294 -1096923 200664 204208 -61812
4972 -61812 1258094 4951992 9166669 11351995 11282698 10123582 7434470 2271597 -2993901
4963 -2993901 -3691597 1322995 7823798 11332221 11538271 10576145 9485087 8001501 6165570
4954 6165570 4745341 4826126 7057851 10202966 11207727 8704170 5558675 5347755 7229042
4945 7229042 7612197 6216620 6391202 9294671 11969975 12091288 10772112 9447379 7486111
4936 7486111 4299990 808004 -2322644 -5149662 -6675121 -5739737 -4010923 -4513528 -6813950
4927 -6813950 -7482773 -5639009 -3778778 -2773566 -902277 1488681 1716509 332781 1365314
4918 1365314 5269980 7308685 5149035 2454369 2436395 3552708 4373836 6755457 10779985
4909 10779985 12388685 9952255 7814036 9445894 12309865 13064866 12249053 10327255
4901 10327255 5501583 -557957 -1732298 3130191 6899673 5249082 3374152 5979914
4893 5979914 8894735 7514034 5116577 4986690 2999310 -3142143 -6349566 -1843069
4885 -1843069 2839629 566411 -2551632 417913 2906490 -1999088 -5797992 -358534
4877 -358534 2896906 -7555495 -18186250 -16492593 -31813655 -105371571 -214144503 -271571101
4869 -271571101 -227488291 -131137181 -65785059 -51431057 -48259769 -31896699 -18175725
4862 -18175725 -19540717 -21534883 -11939425 -1092029 -341666 -3536858 -2188808 -605921
4854 -605921 -4082830 -6766776 -2581775 3234967 3384645 -116175 -2126009 -3401187 -5814037
4845 -5814037 -6257470 -2568663 950423 150063 -2736469 -4495702 -6227249 -8491304 -7942769
4836 -7942769 -3995223 -2229663 -5645589 -8874561 -6930015 -3522745 -4136662 -6361790
4828 -6361790 -4329873 1424559 5556061 6170017 5056034 2438055 -2176537 -5876173
4820 -5876173 -4943673 -415937 3633281 5887354 7597116 8467127 7317632 5510596 5490340
4811 5490340 6933399 7855676 8148482 8709067 8834280 7921320 7850920 10081883 12297835
4802 12297835 11630242 9225742 7776127 6676213 3969510 1088759 788055 1855465
4794 1855465 969400 -1224666 -1167969 1014455 1397655 -1090768 -3222483 -3455915 -4186853
4785 -4186853 -6511984 -7578830 -5414448 -2308757 -805795 219855 2689877 5434322
4777 5434322 6290406 6042415 7129562 9512612 10554669 8648257 4926649 1492466 -526048
4768 -526048 -1158542 -1011688 -733147 -487977 102271 1275364 2538322 2979617 2199242
4759 2199242 993156 877046 2254409 3205739 1503180 -1826256 -2962214 -535032 1863973
4750 1863973 767136 -1583863 -255387 4803541 8326848 7039550 3242656 -66019
4742 -66019 -3474594 -7954145 -10717339 -8145762 -1492890 3792707 4292326 1710699 -213772
4733 -213772 242392 2079183 3201137 2349861 570697 753911 4425002 9069494 10292816
4724 10292816 6975694 2618893 844931 1252871 1102550 -297824 -1061786 -187579 735625
4715 735625 -5859 -1695674 -2181738 -401584 3060548 6957513 9733653 9803415 7114876
4706 7114876 4080303 3378239 4934876 6527638 7117783 7671290 8591670 8644971 7296296
4697 7296296 5989619 5692213 4936870 2101154 -1656484 -3682736 -3266621 -1994348 -1210591
4688 -1210591 -861660 -621162 -611876 -981164 -1823549 -3301827 -4934553 -5324863 -3686410
4679 -3686410 -988184 1582089 4385583 8010249 11140665 11909368 10918579 10588931 11512625
4670 11512625 11800851 10430123 8894872 8646982 8917912 8243458 6455581 3905647 289990
4661 289990 -4139354 -7385209 -7662282 -6132699 -5948794 -8352926 -10981418 -10572583 -6616196
4652 -6616196 -1721102 1206015 1339531 -510576 -3568207 -7162155 -9689047 -9443584 -7111859
4643 -7111859 -5711836 -6825341 -8404134 -7900691 -5951781 -4543028 -2859526 1559497
4635 1559497 7688408 10840013 8897573 5544958 5193241 7142542 7436818 4933599 2513519
4626 2513519 2568556 3856949 3524009 771330 -2334838 -3262463 -1849667 -607917 -1797544
4617 -1797544 -4404855 -5212468 -3164691 -1063630 -1825383 -4460020 -5488013 -3511347 -471859
4608 -471859 1331166 1596749 1242217 997103 1392961 2822646 4763473 5817572 5287893
4599 5287893 4019220 2974609 1772494 -249246 -2034420 -1497741 1388267 3631432
4591 3631432 2515742 -941817 -3248094 -2786408 -1273795 -798955 -1343651 -2071420 -3166054
4582 -3166054 -4731424 -5261235 -3330314 -92527 1990254 2459547 2737708 2990489 1665679
4573 1665679 -1511292 -4666291 -6815228 -9333840 -12892074 -15046396 -13078713 -8052009
4565 -8052009 -3887589 -2843370 -3650211 -4020674 -3459303 -3080663 -3384718 -2876420 686068
4556 686068 7361448 13877649 16472752 14751352 11587628 9484741 8707726 8893759 10065727
4547 10065727 11176836 9916318 5530224 321245 -2947147 -3710747 -2727521 -592760
4539 -592760 1387382 1003927 -2028820 -4775507 -4802865 -3497161 -3242762 -3155945 -855773
4530 -855773 2874641 4973189 5086180 5762955 7500377 7556521 4789684 2070203 2003543
4521 2003543 3159429 2804974 1123234 216994 532138 941199 1537965 3652061 6895270
4512 6895270 8321270 5548113 -169013 -4763856 -5056718 -1415634 2948548 4949295
4504 4949295 3919047 1502123 -58805 440503 2393162 3799237 3052628 685296 -1342666
4495 -1342666 -2314735 -3512091 -5678191 -7267262 -6596583 -4515942 -3204286 -3150193 -3077211
4486 -3077211 -2185450 -686101 1291942 3495675 4786129 4421048 3529447 3436071 3298188
4477 3298188 1619377 -737425 -1766351 -1898677 -3202580 -5258113 -5338447 -3026653 -1078947
4468 -1078947 -915012 -845899 57124 87984 -1314843 -1605316 533943 2171941 512778
4459 512778 -2431012 -2990821 -1562937 -1507513 -3704621 -5836915 -6396339 -6058051 -5348908
4450 -5348908 -4054301 -3026969 -3715725 -5401013 -5382541 -2736857 96520 489726 -1031127
4441 -1031127 -1716506 -162638 1981277 1963529 -721010 -3518295 -3877942 -2376879 -1362323
4432 -1362323 -1154870 -124492 1434041 880422 -2031914 -3417072 -662577 3356082 4455562
4423 4455562 2965520 1851398 1289529 -576783 -2906848 -2957920 -1306137 -1708563 -5195356
4414 -5195356 -8331628 -8326212 -6268961 -4139133 -2013425 207046 1285627 676511 -230955
4405 -230955 -329981 -89239 516262 2854077 6872674 9842073 9674551 7527877 5381612
4396 5381612 3108102 133712 -1779536 -239472 3854350 6471869 4884637 709299
4388 709299 -1788993 -69990 3877286 5257639 1699661 -3654063 -5631398 -3116973
4380 -3116973 486955 2679719 4640438 7587025 9541333 8123060 4541781 2227147
4372 2227147 2601339 4339504 5867290 6520337 5927716 4273782 2914117 3162131 4698041
4363 4698041 6369952 7989473 9915855 11302773 10335124 6384489 1040897 -3078126
4355 -3078126 -4208769 -2589217 -108991 1719769 3459670 6379138 9565577 10429386
4347 10429386 8625042 7072994 7725422 8671410 7496709 5348106 4805343 5198252 3371361
4338 3371361 -1361469 -6138506 -8584818 -9182420 -9090246 -8116062 -5934598 -3470326 -1845975
4329 -1845975 -1052764 -425545 521973 2209707 4841206 7533779 8503745 6754186 3028265
4320 3028265 -1150651 -4644615 -6678666 -6588544 -4316468 -879897 2110918 3560396 3771226
4311 3771226 4342685 6642026 9942333 11719696 10543340 8083668 7207990 8399219 9228554
4302 9228554 7449715 3599955 138108 -1354055 -1535798 -1918527 -2549336 -1844022 791850
4293 791850 3137017 2607461 269057 78021 3328336 6202491 4636828 -219845 -3813918
4284 -3813918 -4294735 -4044480 -5328598 -7106222 -7022377 -4840226 -2741188 -2827217 -4890369
4275 -4890369 -6532157 -5642340 -2847506 -749538 -486452 -416198 1007255 2776683 3282065
4266 3282065 3087960 3605074 4282005 3710992 2632450 2867484 3602199 1955959 -2305495
4257 -2305495 -5656194 -5467779 -3206587 -1641140 -1118663 -291280 1236424 2828352 4182948
4248 4182948 5131743 4980670 3531358 2009824 1589435 1655064 976607 60108 611695
4239 611695 2657044 3871733 2442338 -594306 -2790146 -3243639 -2958272 -2693740 -1948660
4230 -1948660 -329148 1485850 2887332 4196359 5369588 5157810 3069675 945755
4222 945755 555484 718861 -596261 -2212014 -1127049 2311943 4478498 4174628 4135874
4213 4135874 5652410 6119330 4126971 2631048 3893002 5196635 3499211 973954
4205 973954 1460948 4042879 4834688 3194431 1545484 598503 -709773 -1807689 -1441651
4196 -1441651 -909469 -2099163 -3509341 -2471960 36897 1224809 1510800 2902567 4100687
4187 4100687 2716973 827844 2214448 5245731 5133648 2565457 2957530 7091808 9790343
4178 9790343 8574816 6402743 4797867 1737075 -2044210 -2187694 1534658 3628024
4170 3628024 1448222 -1299744 -1671251 -1136547 -286949 2539428 5343389 3351206 -1888509
4161 -1888509 -2984065 1284893 3947957 2479260 2574789 5777553 5505541 351646 -1735774
4152 -1735774 1308975 564713 -6272675 -8542404 -3775289 -6235788 -20040441 -25311409
4144 -25311409 -13356916 -14197344 -55235248 -105738429 -104216289 -41828325 21711100 35816691
4136 35816691 15747410 3904786 8486833 9307304 1316893 -1333524 5010449 8803551
4128 8803551 5995105 4647764 6932257 5372960 -1762992 -7092321 -7530548 -7481131 -7533329
4119 -7533329 -2758194 6052448 11136491 9945006 8337108 9682621 10420017 8516187
4111 8516187 7212947 7920844 7609888 5584118 5234333 7023040 7182663 5386629 6261449
4102 6261449 10960951 14473957 13947979 12805595 13762815 14418468 12922470 11677337 11938360
4093 11938360 10673724 6508749 3271580 3696475 4677366 2864227 292126 154715 1195903
4084 1195903 773470 -144517 484680 1425545 795308 275160 2152443 4406958 3407874
4075 3407874 69177 -1090946 1688588 5800627 8542118 9531559 9114780 7693695 6903995
4066 6903995 8471612 11052621 10550040 4902564 -2707809 -6628822 -4415944 801408
4058 801408 3632265 1893839 -1607673 -2927445 -1708342 -919281 -2490539 -4977220 -5693528
4049 -5693528 -3653747 -186653 1984364 323839 -5012629 -9981967 -9942917 -4930056 -65431
4040 -65431 102556 -3616871 -6534972 -5070296 310185 5929759 8069183 6156437 3107301
4031 3107301 1957819 2699276 3425255 3499692 3680395 3990320 3867951 3861332 4594931 4592998
4021 4592998 2149393 -947405 -1075200 1579947 2761725 402256 -2530619 -2836464 -1165131
4012 -1165131 631126 2895256 6350085 9487015 10467078 9795469 8880654 7695696 5934046
4003 5934046 4674395 4657118 4408439 2254525 -954209 -2930504 -2649713 -587203 2269695
3994 2269695 4270121 3686903 1029001 -930247 -929582 -1036741 -2990401 -5002570 -4517068
3985 -4517068 -2114480 -19133 1511959 3380810 4705502 4000774 2576669 3532981 7335711
3976 7335711 11006376 11949851 10479941 8320297 6412144 4580843 2203746 -839542
3968 -839542 -3209347 -2854602 329408 3666676 4767604 4280416 4244164 5133904 6295544
3959 6295544 7835172 9777193 10432267 8149467 4225208 1876170 2588131 5161731 7670298
3950 7670298 8574367 6862557 3269767 608951 753545 2123149 2357157 2266600 4179457
3941 4179457 7277443 8205629 6303602 4614698 4988218 5562477 4462481 3053015 3580623
3932 3580623 5670852 7170279 7183014 6587034 6274378 6107603 5293900 3297546 753145
3923 753145 -698082 -285346 706310 970143 1676139 4741524 8868580 10096449 7025575
3914 7025575 2977923 1743320 3356262 5516519 7059314 7996561 7787324 6104450 4578886
3905 4578886 5288616 7366020 7136996 2448890 -4343824 -8631094 -8257197 -5290879 -3370122
3896 -3370122 -4045304 -5976466 -7113907 -6882517 -6261111 -6484748 -7921964 -9597784 -9628878
3887 -9628878 -6955863 -2980689 -534814 -726713 -1803702 -1610754 129447 2605043 5200486
3878 5200486 6789690 5667042 2094128 -722615 -451850 1055376 860058 -184586 986080
3869 986080 4207045 6251303 6354020 7354021 10415171 12595684 11424420 8491981 6337410
3860 6337410 4717338 2470221 623892 830623 2406232 3500402 3862096 4136346 3817527
3851 3817527 2406292 1417391 2525971 4469334 4515119 2671946 1781047 3321672 5591380
3842 5591380 6545474 6254025 5684692 4859157 3455732 2151098 2129948 3550945 5150089
3833 5150089 5383226 3965550 2396711 2550706 4378191 5698026 5018194 3765689 4451863
3824 4451863 7164517 9476336 9729414 8749385 8020333 7797976 7746087 8017919 8612991
3815 8612991 8647165 7452009 5823173 5131477 5633627 6657707 8021644 10009100 12013456
3806 12013456 12509125 10772736 7713572 4630494 2034576 105132 -731177 -446873 206261
3797 206261 833759 2141964 4601304 7255834 9130545 10901010 13391500 15165447 14028958
3788 14028958 10833210 9087738 10129388 11230312 9649394 6155943 3024856 871066
3780 871066 -579615 -755086 328812 746243 -608667 -1633164 -237452 1674687 999098
3771 999098 -921490 407663 5794379 10854588 11993576 10272846 8406307 7418157 7541725
3762 7541725 9007069 10248413 8569059 4626922 3107188 6292292 9766257 7871161
3754 7871161 1520332 -3053601 -2456067 391886 966316 -1541523 -4401041 -4895647 -2605333
3745 -2605333 1012341 4423194 7182955 9350403 10464002 10161257 9328801 8949537 8054899
3736 8054899 5079827 1313915 72530 1647586 2373449 364394 -1205461 818036
3728 818036 4268272 4944889 2868792 1239869 715707 -886193 -3739917 -5181482 -4160776
3719 -4160776 -2875905 -3135854 -4129414 -4616944 -4498845 -3319207 -12457 4616527 7640453
3710 7640453 7698004 6891378 7579128 9107114 9239034 7288771 4273695 1195980 -1230199
3701 -1230199 -1931972 -16323 4236214 9565341 14486368 17565587 17823055 15445813 11577404
3692 11577404 7316658 3704705 2347727 4294871 7908686 9670974 8087313 5342302
3684 5342302 4030924 3746312 2457792 135986 -1031042 121533 1943586 1888936 -654175
3675 -654175 -3843382 -5206384 -3723453 -381061 3043441 5574231 7348556 8662852
3667 8662852 9271209 8740250 7154060 5374912 4706501 5942094 8355732 10131925 10461951
3658 10461951 10643022 12105257 13976312 14204723 12896342 12519410 14219136 15835530 14831498
3649 14831498 11729539 8995478 7453340 5750685 3196751 1245022 1488741 3369136
3641 3369136 4764967 4289990 2301727 59932 -1304378 -1156399 338713 1950164 2172147
3632 2172147 860434 -472046 -645301 -465842 -1357345 -2864363 -3084786 -1611830 -319811
3623 -319811 -630701 -1583418 -1579222 -672721 42419 147972 -266094 -1409157 -3051405 -3916220
3613 -3916220 -3208490 -1855585 -861785 447131 2848100 5100541 5657736 5679431 7791112
3604 7791112 12108466 15915008 17261596 16591099 14835249 12422249 10411522 9966759 10018610
3595 10018610 7905706 3237718 -1131517 -2884446 -2710471 -2018794 -698879 1328677
3587 1328677 2673438 2568362 2556199 4049271 5749193 5565117 3774838 2135237 969021
3578 969021 -533726 -1800195 -1036093 2096743 5721483 7739001 7334477 4813038 1349863
3569 1349863 -1259580 -1902647 -1174813 -215894 979772 2940229 4999116 5766367 5154815
3560 5154815 4481279 4496132 4616529 4288146 3934147 4216682 5181445 6299055 6677089 5382641
3550 5382641 2534251 71089 312886 3341235 6576727 7393191 5677807 3539447 2919870
3541 2919870 3753170 4174951 2321680 -1897415 -6563949 -9122267 -8026124 -3603707 1897006
3532 1897006 5234745 4333761 254853 -3477963 -3995913 -1244014 2800311 5927693 6472187
3523 6472187 3869390 -404949 -3510990 -4163321 -4149695 -5734084 -8354050 -9442124 -8013017
3514 -8013017 -5730047 -4522254 -4733905 -5687198 -6438793 -5623354 -2194119 2775876 6162299
3505 6162299 5665116 2022703 -2225792 -5380083 -7238762 -7981136 -7628145 -6391824 -4539832
3496 -4539832 -1975273 1097070 3140735 2255281 -1201449 -4077764 -3638194 -650389 1950232
3487 1950232 2885789 3311787 3975534 3912595 2801879 2418356 4067072 6277335 7104116
3478 7104116 7268792 8440619 9495250 7729348 3558943 548217 149913 -169301 -2179517
3469 -2179517 -3545617 -1582708 2197435 4209634 3879724 3710193 5168749 7235651 8635033
3460 8635033 8981310 7731193 4391981 313111 -1626582 -31750 3331237 5379849
3452 5379849 4536004 1649555 -1013164 -1602202 -279344 964240 666888 -224959 321308
3443 321308 2571470 4718525 5482198 5706015 6696265 7882788 7287211 4262225 655542
3434 655542 -1536288 -2929948 -5516923 -8536774 -7957342 -1918611 5093806 6540186 1747331
3425 1747331 -3585778 -4897846 -3446309 -2677420 -3407405 -4498938 -5512890 -6402673 -6651496
3416 -6651496 -6662362 -7931477 -10050607 -9973126 -6333483 -1814076 1261495 4653502 10126689
3407 10126689 14547536 13593740 8530595 4568921 3613717 3421826 3195468 4694767 7445049
3398 7445049 7984286 5262537 2502878 2130477 2684152 2376526 2000451 2326481 2000184
3389 2000184 313514 -784154 258256 1945321 2290769 1820763 1925051 2192884 1481086
3380 1481086 9103 -1394893 -2588362 -3198538 -2232873 -131622 747938 -528928 -1490424
3371 -1490424 481962 4560365 8010422 9674568 9904929 8637653 5969822 3620343
3363 3620343 3416446 4765351 5542816 5166489 5125118 6567806 8629851 9214147 6913683
3354 6913683 2548486 -970333 -1124413 1680628 5043783 7743111 10154065 11634022
3346 11634022 10267495 6188821 2586215 1836587 2671682 2646506 1476788 500554 749776
3337 749776 2832243 6544644 9327068 7785423 2543946 -1189918 -124212 2807480
3329 2807480 3191651 1304169 264710 628874 760086 677828 1326683 1219386 -2000005
3320 -2000005 -7146919 -10304818 -9635442 -6216636 -1141391 4396904 7126010 4525999
3312 4525999 -302053 -1238475 2617449 5674844 3967757 149385 -1584209 -1494969 -2294811
3303 -2294811 -4135824 -4961267 -4281620 -3751892 -4609605 -6428846 -8023070 -8453719 -7600938
3294 -7600938 -6266904 -5074475 -3388234 -623829 1744923 1672088 131001 597927 4116283
3285 4116283 7361514 6970631 3740067 1024396 612247 1587182 1942152 244059 -3035879
3276 -3035879 -5203837 -3977210 -907394 -735 -2278337 -4464782 -4325795 -4103789 -6241892
3267 -6241892 -8539905 -7028720 -1988534 2474251 4079051 4258741 4595511 4554687 3357692
3258 3357692 1623297 297684 -257401 449635 2906422 6048283 7438143 5974308 3340253
3249 3340253 1914032 2086184 2426050 1781840 278611 -1494568 -3405943 -5515278 -7131104
3240 -7131104 -6714198 -3348367 1655406 5343262 5768244 3621665 956110 -905154 -1542785
3231 -1542785 -509253 2299938 5485168 6781593 5434729 3198044 2484565 4024217
3223 4024217 6691937 9024712 10195600 9824884 7893611 5305572 3805491 4385681 5890827
3214 5890827 6140217 4624010 3149324 3406420 4925127 6166899 6562141 6325841 5246379
3205 5246379 3279098 1740440 2072585 3593145 4243565 3539601 2921912 3074245 2998780
3196 2998780 2269758 2057571 2954060 3785802 3890297 4704849 7308756 9767682 8983511
3187 8983511 4609537 -480239 -3251457 -2824203 -273561 2549667 4202660 4622828 4755835
3178 4755835 4793728 3614367 705270 -2376011 -3609890 -2854324 -1508554 -580958 -223889
3169 -223889 -477639 -1195691 -1640113 -1147541 241353 2443335 5623660 8984751 10665189
3160 10665189 10240050 9922886 11426810 12922128 11475498 7566626 4413251 3215002
3152 3215002 2042415 -317053 -2352418 -2549313 -1573337 -536255 735198 2329207 3049995
3143 3049995 2099399 400546 -1131933 -3007750 -5258433 -5800708 -2910395 1730318 4787870
3134 4787870 5585994 6465120 8937873 11522613 11733937 8724902 3842415 4917 279062
3125 279062 4892117 9313429 7797301 144430 -7100528 -7917576 -3548267 113190 213038
3116 213038 -1045712 -1350344 -1473651 -2527666 -3178303 -1713869 1068343 3209241 4463360
3107 4463360 5698081 6511236 5825590 4272682 3569046 3686291 3031602 1565996 1199764
3098 1199764 2410852 2949751 1199263 -1260434 -2028964 -1049253 453611 2657452 6406213
3089 6406213 10562385 12481120 11175952 8301763 6013900 5428783 7038856 10598715
3081 10598715 14050523 14419541 10959867 6270627 3178348 1444253 -1129233 -4958179
3073 -4958179 -7744176 -7527868 -5227017 -3147652 -1802839 360922 4058658 7414429
3065 7414429 7995135 5798671 3089932 1566916 840945 -186013 -1502644 -2027003 -865733
3056 -865733 1810358 4748468 6359178 5925793 4133476 2111231 303972 -1202011 -1967066
3047 -1967066 -1910372 -2070181 -3117453 -3638959 -1909472 868014 1610955 12901 -626958
3038 -626958 1622060 4204127 3846403 1259104 -254461 726980 3036731 5404011 7152428
3029 7152428 7330834 5684680 4030664 4369880 5956392 6379376 5192313 4186397 4254568
3020 4254568 4420527 4175827 4392800 5288202 5565804 4483954 3113158 2598455 2503503
3011 2503503 1843077 837853 792393 2613285 5694320 7966607 7441987 4403683 1495212
3002 1495212 725919 1217477 1158937 834923 1649256 3003367 2874560 1423032 1228166
2993 1228166 3352136 5747651 6620674 7047705 8697875 10697314 10596089 7649848 3782426
2984 3782426 1613677 2184905 4222241 5328615 4314255 2292349 1093820 1385581 3244577
2975 3244577 7201218 12679639 16508905 15848603 12260513 9932026 9913868 9341669 6614134
2966 6614134 3623590 1862175 200384 -1636032 -1144282 2685409 6346258 6306371 4095464
2957 4095464 3559715 5023315 5730608 4644551 3129156 1692800 -343361 -2180624 -1898827
2948 -1898827 272349 1913574 2065088 2333270 3742406 4793253 3621432 510077 -2478654
2939 -2478654 -3317765 -1351144 2014508 4090153 3615357 2314509 2384313 3188106 2465038
2930 2465038 254482 -991212 -345227 188921 -932246 -2211598 -1220159 2188338 5905872
2921 5905872 7773697 7000807 4405814 1901364 859054 608318 -470863 -2226766 -2504310
2912 -2504310 -77844 3618643 6431733 7889350 8742484 9142125 8354323 5797730 1721916
2903 1721916 -2636589 -5220055 -4358792 -583523 3288057 4590627 3213103 1378983
2895 1378983 1390612 3695914 6725713 8483631 8563210 8430268 9394126 10879654 11450553
2886 11450553 10842889 9755265 8189719 5652771 2796414 1000317 108825 -1581026
2878 -1581026 -4557480 -7045113 -7406572 -5945616 -3531586 -189070 3785655 6925527
2870 6925527 8268667 8641574 8891040 8279338 6397467 5248292 6937207 9990451 10670612
2861 10670612 8039265 5227227 5118394 7101519 9123445 10745229 12394816 13203542
2853 13203542 11869117 9054353 6887099 6181731 5883469 5229861 4567000 3704312 1582654
2844 1582654 -1323013 -2122911 1196742 6744346 10786921 11985582 11667306 10696027 8629378
2835 8629378 5917760 4238078 3907943 3284581 1671866 544735 686485 562859 -600779
2826 -600779 -450879 3130912 7925170 9624556 7331823 3996805 1966050 1070772 983944
2817 983944 2295407 4504408 5601320 4830913 3957023 4751327 6750703 8237074 8013617
2808 8013617 5782946 2404144 153702 853576 3219959 4052576 2645779 1780239 3474616
2799 3474616 6228655 7848204 8487461 8895041 7966133 4797834 1645912 1812514 5175811
2790 5175811 8425673 9503147 9447533 9857586 10832465 11906859 13123336 14415452 15259835
2781 15259835 15589275 16024908 16671377 16492459 14328947 10053820 4724752 233572 -1440690
2772 -1440690 266576 3576791 5869523 6339175 6306783 6746498 6717885 5047380 2654778
2763 2654778 1863810 3441611 5526253 6081055 5506654 5669149 6795500 7105928 6040088
2754 6040088 5941629 8851303 12883706 14092144 11469286 7691858 4933567 2636184 87861
2745 87861 -1565931 -1396947 -501288 103684 1479154 4638660 8112638 9933031 10660070
2736 10660070 11897193 12849054 11197892 7012836 3109015 1493692 1835758 3520333
2728 3520333 6658830 10447785 12811257 12708338 11150495 9166103 6470925 3150677
2720 3150677 1032240 1819792 4601080 6496697 5660399 2991975 966378 1060816 2341253
2711 2341253 2730262 1647619 600693 731406 979679 -157145 -2139425 -3349069 -3767233
2702 -3767233 -4765729 -6707132 -8732668 -10534133 -12184606 -12605250 -10798528 -8523901 -8751633
2693 -8751633 -10942342 -10966897 -6839759 -1539618 1464698 2589826 3881307 5056129 4713398
2684 4713398 3676040 4045025 5901390 7632559 8773473 9935471 10463575 8786975 5011674
2675 5011674 917582 -2568671 -5791820 -8346040 -8870051 -7141832 -4443664 -1566608
2667 -1566608 1723982 5029999 7074856 7511016 7161054 6182275 4083666 2026070 2610383
2658 2610383 6151385 9392117 9619084 8185182 7956900 8905414 8780047 7184440 6111613
2649 6111613 6458792 6709026 5844981 5291640 6505543 8202373 7844648 5226473 2783468
2640 2783468 2267257 2629497 1859005 -179384 -1834476 -2078501 -1526911 -938809 -30205
2631 -30205 1376424 2027405 526688 -2327149 -4023025 -3370235 -1524498 540313 3689559
2622 3689559 8215964 11399719 10199238 6031453 3933701 6139951 9157602 8940914
2614 8940914 6617667 6283898 8543859 9804944 7995492 5470164 4984606 5755739 5640652
2605 5640652 4971638 5487619 6786642 6744339 4950463 3023759 1635075 -32141 -1535619
2596 -1535619 -825892 2126606 3870526 1580970 -2998662 -5639284 -4532968 -1368801
2588 -1368801 1527124 3221264 3861327 4130517 4945016 6446401 7543429 7493939 7263575
2579 7263575 7880308 8111521 5687690 677173 -4223665 -6908828 -7668888 -7592951 -6970659
2570 -6970659 -5804401 -4290219 -2142003 1102876 4489379 5886540 4612940 2392299
2562 2392299 915171 30638 -681025 -376242 1416722 3175943 3397128 3149905 4512202
2553 4512202 7194125 8962065 9056364 8854084 9054930 8539476 6643087 4499432 3126036
2544 3126036 1897242 167355 -982208 -143725 2079859 3599253 3398436 2447640 2166916
2535 2166916 2841416 3578092 3231413 1325279 -1558979 -4222065 -5702193 -5620284 -4047223
2526 -4047223 -1713963 -103535 -157499 -687352 631970 4118099 7261007 7986739 7446093
2517 7446093 8128622 10205892 11568437 11026918 9562897 8338277 7252549 6013274 5185471
2508 5185471 5292091 5723067 5361731 4025358 2970151 3994830 7532741 11114055 10734907
2499 10734907 5301498 -883331 -2155957 1958209 6387623 6987234 4785228 2846746
2491 2846746 1906568 1425036 2562679 6657127 11701561 13758685 11999175 9459655 8321482
2482 8321482 7259075 4670925 2077370 2258594 5344541 8732524 10337910 10276954 9435967
2473 9435967 7848735 5109629 1741384 -608003 -591533 1353043 3305196 3742683 2679040
2464 2679040 831947 -1376775 -3328741 -3855298 -2798169 -2181929 -4066192 -7556340 -9758151
2455 -9758151 -9478472 -7918618 -5817086 -2579261 1122587 2692442 1068813 -1401721
2447 -1401721 -2202888 -1683594 -1087792 164735 2764267 5062756 5378296 5313206 7399050
2438 7399050 10316575 10161297 6411862 3054194 3202280 5900604 9126976 12602518 16044635
2429 16044635 17629513 16381348 13932181 11935178 9766037 6851698 5190491 6818572
2421 6818572 10090103 11231716 8943692 5173678 2039759 374515 739001 3181285
2413 3181285 5915783 6650906 5578244 4931880 5275316 4527285 1437947 -2112042 -3476696
2404 -3476696 -2226926 448280 3764979 7215194 9529195 9540760 7786146 6007180 5226313
2395 5226313 5194493 5452713 5963632 6675305 7186458 7082373 6410556 5834602 6221504 7653121
2385 7653121 8902464 8586751 6902135 5310887 4294510 2579875 -770018 -4597556
2377 -4597556 -6937046 -7210049 -6144153 -4351099 -2256048 -817935 -843944 -1781542 -2463036
2368 -2463036 -2886857 -3963380 -5605144 -6559595 -6360672 -6015835 -6283997 -6573692 -6164555
2359 -6164555 -5266424 -4033056 -1697595 2143817 6186224 8550173 8749983 7513540 5318093
2350 5318093 2486626 263484 -18737 950499 887404 -903152 -2371969 -1870507 -999600
2341 -999600 -2490789 -6028373 -8381765 -7791816 -6146189 -6054841 -7572984 -9013748 -9449333
2332 -9449333 -8803287 -6775570 -3786660 -2137163 -3662890 -6310932 -5652507 -444274 5584422
2323 5584422 8364514 7714930 5867042 4166013 3016404 3009013 3844753 3738403 2137315
2314 2137315 1441404 3547614 6403545 7072129 6574284 7746777 9467254 7912815 3518748
2305 3518748 1348438 3259353 4901324 2873847 -28799 -71725 1359184 1271077 955909
2296 955909 3226474 6397259 6605134 4575990 4365654 5976914 5008131 102721 -4699114
2287 -4699114 -6301282 -6306920 -6741827 -6703452 -5562969 -5210527 -6226922 -5531558 -1126344
2278 -1126344 3867888 5330732 3800059 2621428 2650810 2427846 1945574 2489954 3659534
2269 3659534 3870404 3114451 2263805 629733 -2450774 -4354459 -1261646 6366952 13690398
2260 13690398 17200976 17584508 16737245 15330958 14145477 14508738 15862555 15467065 12120353
2251 12120353 8102195 6076681 6050008 6619143 7059539 6663303 4172497 -118254 -3345037
2242 -3345037 -3216984 -960163 700352 1278316 2258790 4047295 5260385 4599254 1802472
2233 1802472 -2622343 -6904613 -7952373 -3965556 2850802 7948672 9079305 8011526
2225 8011526 7673758 9014333 10830371 11385710 9928343 7619362 6943849 9054174 11799933
2216 11799933 11813743 8647382 5293406 4275779 4907359 5202911 4894462 5139111 6213459
2207 6213459 7074367 6975170 6310152 5728709 5192529 4204706 2717479 1654251 2272318
2198 2272318 4541270 6367957 5472406 2358038 303751 1589544 4615225 5848852
2190 5848852 4017064 1113265 -446049 -337780 91854 -344709 -1602871 -2448771 -1465326
2181 -1465326 1329789 4026383 4898706 4719124 5657109 7852538 8836160 6999079 3882968
2172 3882968 1819236 873418 -129489 -781356 422897 3219773 5443451 5927066 5658719
2163 5658719 5759762 6153296 6736300 8016716 9729072 10474373 9784895 9055996 9270850
2154 9270850 9287662 7862611 6059443 5827072 7073930 8057555 8150202 8329550 9119285
2145 9119285 9804326 9769216 9165949 8255298 7456505 7854028 9952147 11926819 11109580
2136 11109580 7749712 5392240 6446366 8875796 8670517 4718275 -69099 -2056846
2128 -2056846 -337595 2905508 4765459 4270972 2840962 2134599 2064712 1697774 1405266
2119 1405266 2459280 4519691 5374669 3783442 1034866 -985557 -1714778 -1134404 1120090
2110 1120090 4557491 7285427 8248976 8756710 10141980 11143581 9597864 5806454 2042092
2101 2042092 -707333 -3212049 -5484767 -6244494 -5257957 -4051964 -3565147 -2871577 -1054854
2092 -1054854 1207828 2815931 3643677 3942407 3743173 3836171 5857047 9869506 12954503
2083 12954503 12153065 8529269 6490231 8647479 12631625 13727313 9961341 3900640
2075 3900640 -199728 -334867 2062634 4064657 3816779 1553476 -974742 -1708276 308388
2066 308388 3852792 6160498 5497954 3043259 1487013 1974327 3429843 4732364 5988542
2057 5988542 7119675 6802056 4218329 959605 -408513 627713 2379045 3739607
2049 3739607 5496405 8287596 10636032 10246473 6775360 2344594 -517363 -730479 1261676
2040 1261676 4230377 6676639 7390600 6214701 4194305 2662023 2125795 2044457 1559565
2031 1559565 506370 -124333 976621 3609338 5410791 4119089 577112 -1907207
2023 -1907207 -1771095 -1114417 -2032674 -2668657 503005 7045468 12168840 12489085 9567332
2014 9567332 6726173 4954685 3678482 3205064 3861928 4280829 3233527 2096240 2748936
2005 2748936 3943520 2993768 700479 868149 4255324 6667591 4716990 276664 -3084709
1996 -3084709 -5253535 -8035385 -10584758 -10294812 -7604029 -6157563 -7672763 -9714092
1988 -9714092 -9559197 -7652867 -5840925 -4422518 -2800659 -1414026 -973814 -853146 -281125
1979 -281125 -398192 -2856358 -6515542 -7848985 -5288950 -1343581 569331 -51856 -1180053
1970 -1180053 -1092502 637697 3924067 8082168 11357168 12347558 11996849 12589641 14467757
1961 14467757 15253406 12921673 8342731 4055015 1650355 1120131 1654548 2138868 1782934
1952 1782934 1149813 1655518 3309343 4283168 3841047 4064994 6719424 9726359 9440246
1943 9440246 5917244 3065386 3337957 5059228 5815258 5773927 6062050 6112533 4855641
1934 4855641 3177488 2895720 3877236 4158630 2803080 1061846 656250 2145634 5001791
1925 5001791 8135914 10228860 10547686 9654873 8584440 7342887 5137257 2179986 186661
1916 186661 457610 2080088 2760977 1343272 -951063 -1895693 -721222 975953 948936
1907 948936 -1098286 -2946776 -2180929 1025031 3722743 2977235 -1067685 -4978134 -5227653
1898 -5227653 -1813951 1686720 1995183 -502059 -2875037 -3369063 -2644129 -1657221 -219146
1889 -219146 1717329 2924338 2260750 326426 -1205122 -1282226 124508 2386299 4160781
1880 4160781 4007516 2257354 1509670 3966402 8743546 12980817 15110810 15800692 16148083
1871 16148083 16407087 16367567 15719052 14119425 11994157 10855468 11316121 11109475 7168447
1862 7168447 107638 -5392166 -5787900 -2720494 -500578 -840197 -1960907 -2297313 -2735321
1853 -2735321 -4408247 -5953013 -4683816 -234135 4421855 6089153 4521245 1744371
1845 1744371 -786442 -2870230 -3910188 -2805001 -240098 822078 -1504812 -5384384
1837 -5384384 -7597899 -7587671 -7315799 -7799397 -8042906 -7370877 -6577766 -6164354 -5261223 -3166515
1827 -3166515 -595205 1341824 2232979 1926710 357431 -1543159 -2171166 -1327770 -647110
1818 -647110 -1054150 -1205607 378930 2994735 5012842 6309450 7803695 9516258 10880021
1809 10880021 12251429 14125163 15263298 13768389 10118701 7126504 6451731 6962568
1801 6962568 7105734 7033646 7408400 7790916 7601934 7400976 7709041 7615484 6269834 4951351
1791 4951351 5563816 7290638 7018818 3712707 415158 626300 3976099 6923209 6985476
1782 6985476 4908521 3125478 3437688 5993053 9190710 10516410 8651232 4926387
1774 4926387 1737157 -291512 -2136948 -3524136 -2452032 1531381 5620110 6951061
1766 6951061 6011176 4988866 4054086 1737361 -1628700 -3557613 -2770313 -689241 911747
1757 911747 1734676 1832176 737213 -1178280 -2146831 -1031954 1359329 3876137 6351183
1748 6351183 8232262 7802421 4740672 2112565 3410491 8053605 11825924 11570050 7708078
1739 7708078 2448210 -2374934 -5404051 -5733744 -3809076 -1348032 233260 646371 21977
1730 21977 -1419019 -2752124 -2638781 -746168 1960017 4501793 6432656 7060334 5651015
1721 5651015 2985751 1331996 1989734 3874617 5191005 5343500 4493471 2694611 666175
1712 666175 79169 1501101 3105276 3133987 2678723 3917643 6279239 6953745 5265794
1703 5265794 3842657 4609499 6101904 6232877 5582060 5760579 5964317 3845346 -500326
1694 -500326 -3858551 -3749291 -1215768 995872 1753501 2118592 3433847 5765514 7976282
1685 7976282 8826711 8177494 7289302 7606680 9126554 10367529 10004816 8021600 5220368
1676 5220368 2350313 32298 -1114671 -810275 625307 2421267 3456190 2584618 -115100
1667 -115100 -2531315 -2440511 -667598 -678954 -3962225 -7362816 -6769690 -2431384 1487445
1658 1487445 2211627 991553 246957 276157 -161265 -1529958 -3162216 -4473067 -5385731
1649 -5385731 -5805464 -5407043 -3860406 -988720 2959088 6920927 9318771 9172461 6896730
1640 6896730 4043112 2420520 3055119 5312424 7184250 7141444 5593446 3925554 2608687
1631 2608687 1342995 535840 933050 1822247 1493910 -99653 -1022292 -367424 377165
1622 377165 51286 -101630 1287475 3147020 3820062 4146291 6186801 9565114 11608503
1613 11608503 11025166 9160503 7406653 5452909 2567746 -1136321 -5114993 -8422741
1605 -8422741 -9154476 -5941804 -598192 2941758 3436950 3981788 7233520 10971734 10828603
1596 10828603 6325322 1545421 4880 1221138 2720107 3290897 3222570 2841938 2236303
1587 2236303 1830496 2107931 2766053 2702306 1003095 -1948144 -4172716 -3395141 482474
1578 482474 4432735 5103536 2786243 1218108 2890245 6121564 7888106 7912517 7996775
1569 7996775 8498612 8150532 7076716 7059342 8136037 7671509 4283805 452796 -696832
1560 -696832 523965 1584922 1586763 1587826 2212553 3408808 5690642 8884082 10282985
1551 10282985 7252648 1687409 -1420692 -487657 781661 -935268 -4241161 -5977685
1543 -5977685 -5421951 -3276476 682340 5943995 9396207 8517367 5216152 3367637 3479950
1534 3479950 2978842 1079596 -159040 289210 846362 324185 -438717 -902799 -2096130
1525 -2096130 -4191893 -5110557 -3222998 242713 3083283 4940831 6513354 7109099 5118247
1516 5118247 813477 -2943223 -3369217 -553437 2722435 3739915 2243932 67025
1508 67025 -1319283 -2094725 -2741231 -2640777 -1129897 939954 2171709 2549688 2753192
1499 2753192 2060009 -929720 -5361460 -8053582 -7106785 -4023234 -1546269 -785498 -1117664
1490 -1117664 -1525306 -1183761 182603 1759911 2303170 1800522 1613301 2685708 4568742
1481 4568742 6357945 7535503 7848743 7500027 7315103 7461586 6536227 3745648 1322406
1472 1322406 2128023 5119063 6414458 5166611 4685525 6655828 8249940 7204901 6006172
1463 6006172 7741576 10797354 11626984 10722673 11508017 14218893 15076322 11769987 6467212
1454 6467212 2762651 2053319 3328798 4538493 3979089 2051169 1474284 4062611 7811035
1445 7811035 9164742 7566948 5453280 4299574 3407145 2473969 2475325 3500436 4201986
1436 4201986 3999434 3656275 3286068 2131709 776003 952477 2285391 1886706 -1316274
1427 -1316274 -4148626 -3006929 1488876 5520862 6563705 5073070 2604580 221098
1419 221098 -1349952 -1602771 -925201 -703264 -2042094 -4211600 -4800272 -2231798 1840853
1410 1840853 3899270 2859208 1411599 1892756 2740264 1347080 -1114300 -950340 2509810
1401 2509810 5933388 6711504 5567509 3978592 2129639 401390 -6302 753677 839105
1392 839105 -309342 -1120980 -1050840 -1762663 -3736852 -4601130 -2778044 -173516 879657
1383 879657 870799 1075096 835117 -429864 -833691 1229360 3751311 3701587 1510380 -158782
1373 -158782 -813545 -2033526 -3984863 -5419216 -6530909 -8512064 -10607592 -10790747 -9151340
1364 -9151340 -7467100 -5581822 -1614942 3979921 8000384 8900240 8539188 8673706 8718893
1355 8718893 8146576 8177019 9422700 10154896 8530083 4745992 -47169 -4812657 -7576882
1346 -7576882 -6025095 -989175 3032026 3080974 1516366 2200519 4738408 5500034 3305277
1337 3305277 856137 558727 1741093 2605798 2635288 2057830 719624 -1137664 -2059567
1328 -2059567 -841556 1439831 2065535 -277737 -3716310 -5000283 -2839603 1161675
1320 1161675 4735140 7049956 8166329 7676526 5317829 2384612 924630 1476534 2841010
1311 2841010 4016594 4970290 5532589 5221765 4509227 4655788 5799460 6694825 6707067
1302 6707067 6297948 5106705 1842466 -2788804 -5318381 -3479906 762320 3944241
1294 3944241 5221705 5774112 5776108 4589092 2908179 2009475 1481469 303808 -396613
1285 -396613 1370858 4557126 5656282 3759365 1926578 2356613 3159980 1868701 -365760
1276 -365760 -787737 269963 -329639 -3894535 -8087992 -10134270 -9859078 -8667734 -6955505
1267 -6955505 -3985246 50990 3251068 3978569 3023419 2734939 3934718 4924236 4275074
1258 4275074 3254601 3823528 5146827 4545644 1917696 513177 2343860 5276889 6343212
1249 6343212 5826614 5878502 6791180 7385828 8008780 10030698 12639790 13230316 11374285
1240 11374285 9478842 8666175 7004567 3458103 806374 2009619 5499410 7064015
1232 7064015 5546069 3775113 4026394 5314671 5713877 5017645 4107131 3454605 3350479
1223 3350479 4239890 5761358 6588155 6249775 6061875 7164901 8628372 8766641 7528092
1214 7528092 6158674 5076476 3683958 2110850 1516546 2339582 3552070 4159972 4359838
1205 4359838 4551722 4150554 2408774 40685 -1040366 55758 1758935 1447412 -1545346
1196 -1545346 -4767336 -5090657 -2240861 880289 1570537 35437 -1843030 -3248733 -4563580
1187 -4563580 -5474131 -4805589 -2410221 313801 2248671 3594947 4534420 4250754 2383430
1178 2383430 502863 735521 3131678 5481160 5864948 4635543 3571635 3562306 3710228
1169 3710228 2849803 1453654 1245196 2829426 4670524 4999264 3770028 1845195 -546552
1160 -546552 -2925466 -3254375 -53916 4464029 6183756 4435062 2755123 3456033 4545921
1151 4545921 3817000 2919617 4430002 7080258 7437850 5208130 3442987 3908336 5412808
1142 5412808 6683465 7836724 8610789 7980156 6308324 5504224 6259723 7245842 7626639
1133 7626639 8088040 8698439 8237831 6707598 6065054 7052927 7542937 5660658 2489694
1124 2489694 -103933 -2278666 -4672564 -5878463 -4145198 -526713 2255643 3509989
1116 3509989 4784731 6734976 8051272 7615607 5927065 4217063 3486604 4242654 5831341
1107 5831341 6362660 4763668 2564886 2144981 3638462 5267042 6249061 7277194 8233327
1098 8233327 7747558 5570823 3502872 3226915 4581062 6364016 7502084 7255492 5798020
1089 5798020 4669548 4907258 4781258 1758084 -2898389 -4329430 -271984 5378347 7087420
1080 7087420 3891372 -843801 -4093048 -5210499 -4539983 -2661249 -764974 196548 620128
1071 620128 1197572 1481240 1036331 954553 2039146 2355186 -583067 -5309360 -7084998
1062 -7084998 -3833861 1157547 3610025 3127049 2365587 3362701 6403545 10842087 14911144
1053 14911144 15795639 12164830 6316019 2000101 339463 -455029 -1686849 -2696539
1045 -2696539 -3104707 -4220792 -6799870 -8890856 -7787324 -3655305 358880 1712387
1037 1712387 986337 596962 1987576 4529564 6396259 5928712 2793781 -1359704 -3680409
1028 -3680409 -2454894 1143149 4143846 4724599 3663824 2935363 3584221 5292792 7369683
1019 7369683 9425683 11181199 12210527 12199994 11395419 10572365 10283839 10097930 9023120
1010 9023120 6978041 5230011 4687273 4407988 3029786 1251910 1160338 3025879 4831557
1001 4831557 5610197 6902450 9391510 10407786 7420788 2504325 109666 961265 1539144
992 1539144 -111963 -1495442 154285 3763332 6482531 7633773 8293058 8498585 7360890
983 7360890 5219463 3532109 2853520 2491629 1827478 590303 -1688154 -4997805 -7965737
974 -7965737 -9004036 -8026937 -5953407 -3326810 -855459 -186708 -1892996 -3407336 -1665628
965 -1665628 2352816 4590861 3682846 2599675 3563957 4645022 3452437 1328082 918304
956 918304 1548361 345959 -3015412 -5883134 -6540795 -5550858 -3235947 1028343 6276924
947 6276924 9547081 9372753 7596161 6451232 5845897 4922551 4220532 4289080 3826013
938 3826013 1580782 -1008625 -1610294 -794298 -1394527 -4153530 -6599687 -6707724 -5222983
929 -5222983 -3467371 -1206280 1771255 3867039 3488284 1525253 125439 -263936 -845274
920 -845274 -2037294 -3009267 -3487826 -4173367 -5092156 -5083613 -3349138 -277578 3498376 7469872
910 7469872 10340502 10384830 7610459 4264677 2154409 594673 -1754935 -4003590 -3656378
901 -3656378 52615 4762413 7100776 5480955 950714 -3846477 -6469794 -6205622 -4218670
892 -4218670 -2180562 -948390 -559070 -696538 -622601 549202 2604267 3822948 2808730
883 2808730 273156 -1974128 -3265735 -4092450 -4430527 -3721932 -2412617 -1727038 -1624136
874 -1624136 -751113 977012 1638672 362758 -478288 2056720 7448693 12146274 13646039
865 13646039 12448248 10028087 6755837 2635550 -1194707 -2970739 -2010779 794864
857 794864 3961826 6320011 7267025 6969948 6440697 6684474 7396054 7105578 5192360
848 5192360 3188875 3143076 5009317 6905121 7907348 8934162 10316750 10473610 8562078
839 8562078 6820297 7891505 10685365 11605775 9696924 7712716 7696630 8548503 9095390
830 9095390 10437956 13082208 14397644 11931760 7527867 4974190 4683074 3984752 1955391
821 1955391 244227 -900472 -3417006 -7093390 -8137282 -4289348 1378562 4252735
813 4252735 3660911 2065992 720820 -801042 -1991066 -1702127 -702356 -783019 -1232847
804 -1232847 635780 4800706 7525589 6416202 3620517 2018387 854525 -1987796
796 -1987796 -5303015 -5778620 -3256622 -1213113 -1617158 -2530523 -1835524 -325506 698036
787 698036 2260440 5509483 8463109 8096950 5034450 3175009 4497124 6851538 7515094
778 7515094 6499482 5179039 3703620 1472883 -1112772 -3041719 -4095598 -4547226 -4114388
769 -4114388 -2469739 -274324 1444034 2469550 2928115 2302319 212218 -2339755 -3935223
760 -3935223 -4628021 -5460683 -6453444 -6741885 -6520636 -6840181 -7194432 -5461754 -1168930
751 -1168930 3088111 4837530 4805261 5228947 6447775 7162025 7189635 7603728 8270098 7602893
741 7602893 5384006 3816520 4590794 6335833 6386799 4152050 1309349 -681044 -1671636
732 -1671636 -1708412 -554076 1282014 2470717 2532018 2438893 2758594 2392975 464243 -1503567
722 -1503567 -1137823 1315165 3035028 2486797 1319575 1462119 2078662 1097770 -1356109
713 -1356109 -3102450 -3081951 -2355921 -1737394 -406415 2193872 4596320 4835812 2960823
704 2960823 737095 -693401 -1547847 -1989608 -1497224 -115919 963529 1087556 1517442
695 1517442 3756437 6908560 8354408 7263231 5711029 5531472 5849147 5288693 4993794
686 4993794 6922837 10009250 11107841 9855795 9368814 11193210 12848020 12196377 11114039
677 11114039 11988469 13160430 11499046 7813554 5657760 5600222 4917290 2948244 2437196
668 2437196 4621771 6930529 7128319 6311963 5992662 5479825 4345052 4374694 6359307
659 6359307 7636361 5893229 3124477 2436089 2853028 1183704 -2147141 -3270615 -686166
650 -686166 2876836 4834936 5627370 6376388 6659642 5961440 5153647 5230733 6060975 7099026
640 7099026 7849752 7296377 4705276 1448453 108992 1212631 2730349 3293359 3717617
631 3717617 4649398 5165070 4960014 5562417 7608016 8921844 7441911 4600518 3625419
622 3625419 5405300 7960000 9301690 9063552 7806667 6273817 5058942 4040928 2791170
613 2791170 2217830 4313870 8949335 12596463 12308721 9642209 8224897 8516044 7851430
604 7851430 5173380 2582880 1902620 2536457 3458870 4795458 6457803 7471834 7750490
595 7750490 8423675 9248993 7905788 3487238 -1259512 -3144698 -2443624 -1547224 -1101324
586 -1101324 18227 1676713 2147263 962192 -63164 803603 3324331 6070129 7643053
577 7643053 6860743 3379908 -1083820 -3462965 -2342785 397952 1722791 698560 -1027085
568 -1027085 -1539713 -629928 613467 1667001 3433554 6747136 10209082 10696540 6842277
559 6842277 1117316 -2743028 -3661804 -3131673 -2092138 -288669 1399246 946788 -1386614
550 -1386614 -2156344 898928 5482768 7751213 7092185 5634841 4421279 2912782 1539538
541 1539538 1597395 2467443 1787644 -966472 -3589443 -4694336 -5714264 -8032068 -10274182
532 -10274182 -10328159 -8633867 -7592515 -8434649 -10068372 -10493688 -8457116 -4489735 -1035401
523 -1035401 -421533 -1866066 -1913961 1015836 4122476 3898178 819061 -1772698 -2356938
514 -2356938 -2335993 -3027426 -4094625 -4951810 -5433486 -4817531 -2273483 1294076 3705820
505 3705820 4226648 4101388 4143404 3829587 3267668 3728557 5047940 4539098 210939 -6186251
495 -6186251 -10820434 -11560140 -8972873 -4707961 -359306 2844404 4720967 6236678 7957944
486 7957944 8826832 7352582 3579842 -885477 -4322190 -5763623 -5177775 -3607087 -2525198
477 -2525198 -2321122 -2006875 -923652 235310 799200 1349100 2545392 3846178 4655292
468 4655292 5693154 7684537 9507458 9355558 7252226 4818343 2988584 1622672 1019744
459 1019744 1901599 3743527 4771482 4008623 2150771 338819 -711354 -454126 1071033
450 1071033 2409527 1827655 -315757 -1698062 -933611 1002083 2665401 3958567 5274716
441 5274716 6143952 5791837 4236030 2009007 -490437 -2696030 -3734875 -3426757 -2826375
432 -2826375 -2922904 -3134103 -1824797 1709766 6124146 8925927 8666140 6535419 5456853
423 5456853 7002435 9571396 10392695 8813073 6460406 4706434 3660291 3453635 4423095
414 4423095 5596328 5021457 2479772 169486 -235730 423714 696060 625382 680449 331183
404 331183 -643136 -903447 559798 2538603 3523859 4347212 6709312 9907227 11406221
395 11406221 10320941 8088322 5762526 2806355 -1126527 -4986100 -7315239 -7234289 -4595376
386 -4595376 -553143 2422435 2873415 2379909 3356446 5312100 5816423 4950507 5533528
377 5533528 8149686 9268780 6177786 1170014 -1470241 -723597 1237453 2740695 3638526
368 3638526 3695260 2624409 1442961 1605103 2834349 3550824 3275292 2938304 2986531 2877562
358 2877562 2400729 1889545 1126088 -407671 -2168106 -2976740 -2815950 -2603103 -2191567
349 -2191567 -488984 2116307 3420737 2249105 -78638 -1961073 -3470930 -4957315
341 -4957315 -5357603 -3631002 -916121 451354 -262405 -1563592 -1551991 607575 4532827
332 4532827 8790189 11424303 11323158 9127758 6395716 4271195 3318688 3700722 4592779
323 4592779 4273243 2049579 -450198 -1157412 -271771 224406 -656486 -2132060 -3424509
314 -3424509 -4581667 -5327708 -4789274 -3038708 -1610089 -1668554 -2552835 -2781377 -1793665
305 -1793665 -250605 688720 103877 -1863616 -3703104 -3961676 -3118839 -2908646 -3654642
296 -3654642 -3842992 -2832033 -2142270 -2888854 -3562689 -2049690 1220587 3849384 4423739
287 4423739 3264736 929736 -2160091 -4882642 -6001803 -5665943 -4918621 -3830787 -1645779
278 -1645779 1246836 3152673 3207526 2271004 1401558 799504 548825 964977 1723230 1923990
268 1923990 1477590 1219378 1387172 1435740 1621594 2882603 4460193 3766682 45109
259 45109 -3599152 -3642664 -396623 2939509 4392890 4471111 4152209 3769076 3631083 3908429
249 3908429 3979438 3429377 3412589 5332209 8393886 10302949 10308037 9631719 8912784 7528754
239 7528754 5903856 5987515 8195659 9957617 8957080 6252866 4472302 4244632 4332425
230 4332425 4222108 4352027 4277250 2900873 667804 -452107 358272 1763464 2513013
221 2513013 3025894 3815326 3893297 2330733 515226 963756 3841511 6222382 5455753
212 5455753 2262093 -343462 -561230 765644 1977636 2626436 3152878 3379070 2374528
203 2374528 -134812 -2888419 -3932738 -2220628 1480253 4908992 5727331 3303814 -674079
194 -674079 -3724335 -4764017 -4438353 -3559828 -2215539 -599879 427781 360981 -213785
185 -213785 -727718 -1692522 -3575536 -5284351 -5225129 -3668240 -2578788 -2917336 -3493273
176 -3493273 -2952399 -1626823 -670728 -409620 -481038 -843158 -1600701 -2224428 -1850662 -246378
166 -246378 2015405 4041810 4956936 4440669 3510559 3923515 5867180 7102562 5791969
157 5791969 3532626 3664176 6554888 8654641 7081925 3454162 1754185 3435448 6196571
148 6196571 7181149 5960251 4251264 3728896 4486972 5181281 4495409 2629590 1172059
139 1172059 1306662 2549992 3585188 3790371 3395862 2704533 1942696 1457063 1220636
130 1220636 531302 -881893 -1883740 -1261299 212830 452774 -1102045 -2725001 -2841323
121 -2841323 -1863110 -982566 -437614 117945 597817 906139 1549206 2724289 3460779 2833647
111 2833647 1591752 1451662 3021736 5380200 7396841 8466814 8251231 6872257 5289350
102 5289350 4379298 3671637 2132605 232046 -92533 2052347 5155456 7004548 6846248
93 6846248 5353185 3434724 1862505 1313761 1862152 2788061 3512146 4267472 5274509
84 5274509 5885689 5455376 4662450 4931690 6579987 8406670 9205369 8907032 8053050 6890520
74 6890520 5407164 3792261 2437351 1669720 1626887 2078551 2263393 1388810 -384770
65 -384770 -1870050 -2171106 -1678864 -1193619 -472931 1336471 3768166 4720494 2853063
56 2853063 -422560 -2381963 -2132325 -1279440 -1497175 -2574755 -3234271 -2832926 -1561984
47 -1561984 207275 1870938 2473277 1658061 441510 98257 507693 601759 279709 628082
37 628082 2013753 3183251 2906435 1626694 726807 840963 1749968 3434681 6102499
28 6102499 9089915 10675837 9584653 6408173 3088617 1006582 -53323 -915226 -1529784
19 -1529784 -1219563 -270606 -139545 -1461383 -2817438 -2566105 -1195542 -416812 -306573
$$ [...]
##END NTUPLES=NMR SPECTRUM
##END=
