##TITLE=31Pdec_DE-102_ch_5_TFA
CDCl3, 64 sc
 27.8.2025
##JCAMPDX= 6.0         $$ Bruker NMR JCAMP-DX V2.0
##DATA TYPE= NMR SPECTRUM
##DATA CLASS= NTUPLES
##ORIGIN= UXNMR, Bruker Analytische Messtechnik GmbH
##OWNER= root
$$ XWIN-NMR		Version 3.5
$$ Wed Aug 27 14:11:56 2025 Russian Standard Time (UT+4h)  she@DPX200
##.OBSERVE FREQUENCY= 81.013821
##.OBSERVE NUCLEUS= ^31P
##.ACQUISITION MODE= SIMULTANEOUS
##.ACQUISITION SCHEME= undefined
##.AVERAGES= 64
##.DIGITISER RES= 17
##SPECTROMETER/DATA SYSTEM= spect
##.PULSE SEQUENCE= zgpg30
##.SOLVENT NAME= CDCl3
##.SHIFT REFERENCE= (INTERNAL, CDCl3, 0, 198.062)
##AUDIT TRAIL= $$ (NUMBER, WHEN, WHO, WHERE, WHAT)
$$ ##TITLE= Audit trail, XWIN-NMR		Version 3.5
$$ ##JCAMPDX= 5.01
$$ ##ORIGIN= Bruker BioSpin GmbH
$$ ##OWNER= she
$$ F:/spectra/data/she/nmr/P31/2/pdata/1/auditp.txt
$$ ##AUDIT TRAIL=  $$ (NUMBER, WHEN, WHO, WHERE, WHAT)
(   1,<2025-08-27 14:10:33.04 +0400>,<she>,<DPX200>,
      <created by zg, POWCHK disabled, PULCHK disabled
       configuration hash MD5:
       00 E9 B6 7A A2 85 ED C7 34 08 36 98 17 FE 4E 26
       data hash MD5: 32K
       BD 2F 32 7B 48 3F D8 DE D6 AC 09 8B F1 D7 1F FF>)
(   2,<2025-08-27 14:10:35.31 +0400>,<she>,<DPX200>,
      <Start of raw data processing
       efp BC_mod = 2 LB = 1.5 FT_mod = 6 PKNL = 1 PHC0 = 1601.585 PHC1 = -446.9 SI = 64K 
       data hash MD5: 64K
       64 92 91 72 A8 D1 41 0D 65 C6 38 5D FB 8A B0 D2>)
$$ ##END=
$$ 
$$ hash MD5
$$ B4 A7 25 25 82 50 82 8B 7E 48 5C 2F 87 46 44 7B
##$RELAX= 
##$RELAX= 
##$RELAX= 
##$RELAX= 
##$RELAX= 
##$RELAX= 
##$RELAX= 
##$RELAX= 
$$ Bruker specific parameters
$$ --------------------------
##$DU= <F:/spectra>
##$EXPNO= 2
##$NAME= <P31>
##$PROCNO= 1
##$TYPE= <nmr>
##$USER= <she>
##$AMP= (0..31)
100 100 100 100 100 100 100 100 100 100 100 100 100 100 100 100 100 100 
100 100 100 100 100 100 100 100 100 100 100 100 100 100 
##$AQSEQ= 0
##$AQ_mod= 1
##$AUNM= <au_zg>
##$AUTOPOS= <>
##$BF1= 81.014009
##$BF2= 200.13
##$BF3= 200.13
##$BF4= 200.13
##$BF5= 200.13
##$BF6= 200.13
##$BF7= 200.13
##$BF8= 200.13
##$BYTORDA= 1
##$CFDGTYP= 0
##$CFRGTYP= 5
##$CHEMSTR= <none>
##$CNST= (0..31)
1 1 145 1 1 1 1 1 1 1 1 1 1 1 1 1 1 1 1 1 1 1 1 1 1 1 1 1 1 1 1 1 
##$CPDPRG= <waltz16>
##$CPDPRG1= <>
##$CPDPRG2= <waltz16>
##$CPDPRG3= <>
##$CPDPRG4= <mlev>
##$CPDPRG5= <mlev>
##$CPDPRG6= <mlev>
##$CPDPRG7= <mlev>
##$CPDPRG8= <mlev>
##$CPDPRGB= <>
##$CPDPRGT= <>
##$D= (0..31)
0 1 0 0 0 0 0 0 0 0.06 0 0.03 2e-05 3e-06 0 0 0.0002 0 0 0 0 0 0 0 0 0 
0 0 0 0 0 0 
##$DATE= 1756289432
##$DBL= (0..7)
120 120 120 11 120 120 24 19 
##$DBP= (0..7)
150 150 150 150 150 150 150 150 
##$DBP07= 0
##$DBPNAM0= <>
##$DBPNAM1= <>
##$DBPNAM2= <>
##$DBPNAM3= <>
##$DBPNAM4= <>
##$DBPNAM5= <>
##$DBPNAM6= <>
##$DBPNAM7= <>
##$DBPOAL= (0..7)
0.5 0.5 0.5 0.5 0.5 0.5 0.5 0.5 
##$DBPOFFS= (0..7)
0 0 0 0 0 0 0 0 
##$DE= 6
##$DECBNUC= <off>
##$DECIM= 4
##$DECNUC= <off>
##$DECSTAT= 4
##$DIGMOD= 1
##$DIGTYP= 9
##$DL= (0..7)
0 0 52 120 120 21 21 25 
##$DP= (0..7)
$$ [...]
##$SUBNAM2= <"">
##$SUBNAM3= <"">
##$SUBNAM4= <"">
##$SUBNAM5= <"">
##$SUBNAM6= <"">
##$SUBNAM7= <"">
##$SUBNAM8= <"">
##$SUBNAM9= <"">
##$SW= 400.765351723535
##$SWIBOX= (0..15)
0 1 3 0 0 0 0 0 0 0 0 0 0 0 0 0 
##$SW_h= 32467.5324675325
##$TD= 32768
##$TD0= 1
##$TE= 0
##$TE2= 300
##$TE3= 300
##$TEG= 300
##$TL= (0..7)
0 120 53 12 22 120 120 120 
##$TP= (0..7)
150 150 150 150 150 150 150 150 
##$TP07= 0
##$TPNAME0= <>
##$TPNAME1= <>
##$TPNAME2= <>
##$TPNAME3= <>
##$TPNAME4= <>
##$TPNAME5= <>
##$TPNAME6= <>
##$TPNAME7= <>
##$TPOAL= (0..7)
0.5 0.5 0.5 0.5 0.5 0.5 0.5 0.5 
##$TPOFFS= (0..7)
0 0 0 0 0 0 0 0 
##$TUNHIN= 0
##$TUNHOUT= 0
##$TUNXOUT= 0
##$USERA1= <user>
##$USERA2= <user>
##$USERA3= <user>
##$USERA4= <user>
##$USERA5= <user>
##$V9= 5
##$VALIST= <valist>
##$VCLIST= <CCCCCCCCCCCCCCC>
##$VD= 0
##$VDLIST= <DDDDDDDDDDDDDDD>
##$VPLIST= <PPPPPPPPPPPPPPP>
##$VTLIST= <TTTTTTTTTTTTTTT>
##$WBST= 1024
##$WBSW= 4
##$XGAIN= (0..3)
0 0 0 0 
##$XL= 0
##$YL= 0
##$YMAX_a= 17451
##$YMIN_a= -6963
##$ZGOPTNS= <>
##$ZL1= 120
##$ZL2= 120
##$ZL3= 120
##$ZL4= 120
##$ABSF1= 0
##$ABSF2= 0
##$ABSG= 0
##$ABSL= 0
##$ALPHA= 0
##$AQORDER= 0
##$ASSFAC= 0
##$ASSFACI= 0
##$ASSFACX= 0
##$ASSWID= 0
##$AUNMP= <proc_1d>
##$AZFE= 0.1
##$AZFW= 0.5
##$BCFW= 0
##$BC_mod= 2
##$BYTORDP= 0
##$COROFFS= 0
##$CY= -3
##$DATMOD= 1
##$DC= 0
##$DFILT= <>
##$DTYPP= 0
##$F1P= 0
##$F2P= 0
##$FCOR= 1
##$FTSIZE= 65536
##$FT_mod= 6
##$GAMMA= 0
##$GB= 0
##$INTBC= 1
##$INTSCL= 9.790993e-09
##$ISEN= 30
##$LB= 1.5
##$LEV0= 0
##$LPBIN= 0
##$MAXI= 10000
##$MC2= 0
##$MEAN= 0
##$ME_mod= 0
##$MI= 50
##$NCOEF= 0
##$NC_proc= -8
##$NLEV= 6
##$NOISF1= 182.463
##$NOISF2= 159.3651
##$NSP= 0
##$NTH_PI= 0
##$NZP= 0
##$OFFSET= 198.0616
##$PC= 4
##$PHC0= 1601.585
##$PHC1= -446.9
##$PH_mod= 1
##$PKNL= yes
##$PPARMOD= 0
##$PSCAL= 0
##$PSIGN= 0
##$REVERSE= no
##$SF= 81.0140089999434
##$SI= 65536
##$SIGF1= 159.3651
##$SIGF2= -187.1042
##$SINO= 113.3802
##$SIOLD= 16384
##$SREGLST= <1H.CDCl3>
##$SSB= 0
##$STSI= 65536
##$STSR= 0
##$SW_p= 32467.5324675325
##$SYMM= 0
##$S_DEV= 0
##$TDeff= 32768
##$TDoff= 0
##$TI= <>
##$TILT= no
##$TM1= 0
##$TM2= 0
##$TOPLEV= 0
##$USERP1= <user>
##$USERP2= <user>
##$USERP3= <user>
##$USERP4= <user>
##$USERP5= <user>
##$WDW= 1
##$XDIM= 65536
##$YMAX_p= 45805702
##$YMIN_p= -272717962
$$ End of Bruker specific parameters
$$ ---------------------------------
##NTUPLES= NMR SPECTRUM
##VAR_NAME=  FREQUENCY,     SPECTRUM/REAL,   SPECTRUM/IMAG
##SYMBOL=    X,             R,               I
##VAR_TYPE=  INDEPENDENT,   DEPENDENT,       DEPENDENT
##VAR_FORM=  AFFN,          ASDF,            ASDF
##VAR_DIM=   65536,         65536,           65536
##UNITS=     HZ,            ARBITRARY UNITS, ARBITRARY UNITS
##FACTOR=    0.49542278885378, 1,            1
##FIRST=     16045.7642231865, 0,            0
##LAST=      -16421.768244346, 0,            0
##MIN=       -16421.768244346, -272717962,   0
##MAX=       16045.7642231865, 45805702,     0
$$ Real data points
##PAGE= N=1
##DATA TABLE= (X++(R..R)), XYDATA
$$ [...]
##PAGE= N=2
##DATA TABLE= (X++(I..I)), XYDATA
7527D261635p88210P22169J157757Q51074Q09914P10588k67352j450027j504169
$$ 4261635 3473425 4195594 5353351 6204425 7014339 7724927 7457575 6007548 4503379
7518D503379p18409l03002R8632J605475L010747J620780k246623m721654l547409
$$ 4503379 3784970 3481968 3580600 5186075 8196822 9817602 7570979 2849325 -698084
7509f98084r32264K74174M32841J064984J481276J81040k006283k804489j603506
$$ -698084 -1630348 -1356174 -923333 141651 1622927 1803967 -202316 -3006805 -4610311
7500d610311L01514J670783J921993R90193J60378J544426M933775O792756M495672
$$ -4610311 -4308797 -2638014 -716021 274172 434550 1978976 6912751 13705507 18201179
7491A8201179K0934k842081l320252l029235k195212J9100K301571K024787o19259
$$ 18201179 18222113 15380032 12059780 9030545 6835333 6854433 9156004 11180791 10561532
7482A0561532k498218j940464n08939J0634k27352n22428q20752r24003n28706
$$ 10561532 8063314 6122850 5613911 5624545 5397193 4874765 4054013 3130010 2601304
7473B601304l44145j144163j728946k55030K339333K986180R47998j183132j526826
$$ 2601304 2257159 1112996 -615950 -870980 1468353 4454533 5402531 4219399 2692573
7464B692573j036237p84512k50857M65761p9901j466012o35500L262614O087764
$$ 2692573 1656336 871824 620967 1086728 1006827 -459185 -1094685 2167929 8255693
7455H255693L797180j717013n009832l871491p09723J733220K838838K722546
$$ 8255693 12052873 10335860 5326028 1454537 744814 2478034 5316872 8039418
7447H039418J420751k15323j027750j210016j725565k227122j492990J23063P36764
$$ 8039418 9460169 9244846 8217096 7007080 5281515 3054393 1561403 1684466 2421230
7438B421230k92834j473624j470921o38496J89518Q76972J366439J239752N50351
$$ 2421230 2128396 654772 -816149 -1454645 -1265127 -388155 978284 2218036 2768387
7429B768387O214j70068n23748j169833j514227j559969k069962k745625j826812
$$ 2768387 2774601 2604533 2080785 910952 -603275 -2163244 -4233206 -6978831 -8805643
7420h805643J165625L562361K352962j571925l951689k273543J274935K815177
$$ -8805643 -7640018 -4077657 -1724695 -3296620 -7248309 -9521852 -8246917 -5431740
7412e431740J450507m16601p17870N5660M47471L10336N12433J185743J384396
$$ -5431740 -3981233 -4397834 -5115704 -5060044 -4612573 -4302237 -3789804 -2604061 -1219665
7403a219665L69980j388311k420650j308087J837176M629108M234932Q10505k021952
$$ -1219665 -849685 -2237996 -4658646 -5966733 -4129557 499551 4734483 5544988 3523036
7394C523036j436862R88177J735494L25774p27298l34551k9239n13641l72029
$$ 3523036 2086174 3074351 4809845 5135619 4408321 4073770 4044531 3530890 3158861
7385C158861P05928O82869j107478k049046l52201J709139J448045J02463K05284
$$ 3158861 3864789 4547658 3440180 1391134 1038933 2748072 4196117 4298580 4503864
7376D503864Q82056k09148j894022j049249J563887J840934j073518l411621k903271
$$ 4503864 5385920 5176772 3282750 2233501 3797388 5638322 4564804 1153183 -1750088
7367a750088j705346j661066j157357Q33520J754230j30062j763781K64947L862251
$$ -1750088 -3455434 -5116500 -6273857 -5440337 -3686107 -3816169 -5579950 -5315003 -1452752
7358a452752M324550J456039o60134k43341K92017p33672j556129l92997J655431
$$ -1452752 2871798 4327837 3667703 3424362 3716379 2982707 1426578 1033581 2689012
7349B689012K699150K652155K250494J408454k9414j406656k295244l061565l475742
$$ 2689012 5388162 8040317 10290811 11699265 11669851 10263195 7967951 4906386 1430644
7340A430644k334617L60738K380773J928638J55210n96511j70942m05777j892299
$$ 1430644 -903973 -543235 1837538 3766176 3921386 3324875 3153933 2748156 855857
7331H55857k759097j215118J810836L465724K245789j64025q63952N91719J605774
$$ 855857 -1903240 -3118358 -1307522 2158202 4403991 4239966 3376014 3967733 5573507
7322E573507K84674j628565j394421K26885P2605j945892k161755P56106K841310
$$ 5573507 5858181 4229616 2835195 3062080 3134685 1188793 -972962 -216856 2624454
7313B624454P91419k360783j708288J575616J951926j414719k999375K98178L958690
$$ 2624454 3415873 1055090 -653198 922418 2874344 1459625 -1539750 -1241572 2717118
7304B717118K591892k038163l896324j263523J929667K401680R76355m39066j589292
$$ 2717118 5309010 3270847 -625477 -1889000 40667 2442347 3418702 2979636 1390344
7295A390344k396527j701747O72003K520656J859081k01827r34332K97066J493829
$$ 1390344 -1006183 -2707930 -2035927 484729 2343810 2141983 1207651 1504717 2998546
7286B998546J054826k25835p09008l40776n12031j799946k854806j958655P99581
$$ 2998546 4053372 3827537 3118529 2777753 2265722 465776 -2389030 -4347685 -3548104
7277c548104L455349M086786K362937m97374k554026k163625O43544L510348L625410
$$ -3548104 -92755 3994031 6356968 5859594 3305568 1141943 1785487 5295835 8921245
7268H921245Q80710j803191j956509k67944J055923J337624J330972J068746k00772
$$ 8921245 9801955 7998764 6042255 5774311 6830234 8167858 9498830 10567576 10366804
7259A0366804k182967l444126l250332k061280k53551K048653L803581L474637
$$ 10366804 8183837 4739711 1489379 -571901 -825452 1223201 5026782 8501419
7251H501419J105131j448672k737336k822278k052609n49865O92639K55327j305773
$$ 8501419 9606550 8157878 5420542 2598264 545655 -4210 688429 943756 -362017
7242c62017j500282N09493K337798J834185J42341n20783j91130J14301J211262
$$ -362017 -1862299 -1352806 984992 2819177 2961518 2440735 2249605 2363906 3575168
7233C575168M096503O483530M677062q56565n098650m622434j398649P26939P88048
$$ 3575168 7671671 14155201 18832263 17975698 12877048 8254614 6855965 7582904 8370952
7224H370952K23359j67988n10037l84987O46772J608293J046278q06134k245270
$$ 8370952 8594311 8426323 7916286 7531299 8178071 9786364 10832642 10026508 7781238
7215G781238k252388j182096L50442J845115K354179J106952j029256k023279
$$ 7781238 5528850 4346754 4697196 6542311 8896490 10003442 8974186 6950907
7207F950907j107606K51634K69431j126138k631136l141318k442964r73576M89810
$$ 6950907 5843301 6094935 6364366 5238228 2607092 -534226 -2977190 -3950766 -3460956
7198c460956J261454J282231R75133N06161k39101q84283o89962J61180M00111
$$ -3460956 -2199502 -917271 57862 564023 324922 -559361 -1249323 -1088143 -688032
7189f88032m83818j127845l0428K246822L700018L232646J318149j137678l226155
$$ -688032 -1171850 -2299695 -2330123 -83301 3616717 6849363 8167512 7029834 3803679
7180C803679l707841j969426N35896J392447J84663j073871r18431k56218m42519
$$ 3803679 95838 -1873588 -1337692 54755 239418 -834453 -1752884 -2009102 -2451621
7171b451621j109050j104614l64775M28074J006804J108822K9351j941636k719912
$$ -2451621 -3560671 -4665285 -5030060 -4601986 -3595182 -2486360 -2457009 -4398645 -7118557
7162g118557q91335J812036K488067R83575k88413j33275K48817Q3830M76828
$$ -7118557 -8009892 -6197856 -3709789 -2726214 -3014627 -3147902 -2899085 -2815255 -2338427
7153b338427K027678L076343J850857r12156k850472k632406p29967J564247K854804
$$ -2338427 -310749 2765594 4616451 3704295 853823 -1778583 -2508550 -944303 1910501
7144A910501K212293K44288q94077K38218K233566K065801j214043m759910m713851
$$ 1910501 4122794 4367082 3473005 3711223 5944789 8010590 6796547 2036637 -2677214
7135b677214p45153L053032K711933o96440k399350l13255K326778K011268l7262
$$ -2677214 -3422367 -369335 2342598 1646158 -753192 -1066447 1260331 3271599 3234337
7126C234337n86297J51277k37607j000570R05496M436182M338451p50508m997956
$$ 3234337 2648040 2799317 2561710 1561140 2466636 6902818 11241269 10490761 5492805
7117E492805l321789J357742K747138K2083k405884k017507m68912N02603J242695
$$ 5492805 2171016 3528758 6275896 6297979 3892095 1874588 1405676 1908279 3150974
7108C150974K037358K083446J090030l61847j982762l317725k893607k42220K118023
$$ 3150974 5188332 7271778 8361808 7999961 6017199 2699474 -194133 -436353 1681670
7099A681670J558026n90126r91348L41902L37511j671225k793830j533630k5498
$$ 1681670 3239696 2649570 1658222 2000124 2337635 666410 -2127420 -3661050 -3686548
7090c686548p7465m76553J58761J011700J371601K359744M247924M703676K142340
$$ -3686548 -3764013 -4240566 -4081805 -3070105 -1698504 661240 4909164 9612840 11755180
7081A1755180j285782k496704j548958o16793m74840m49674o02771j369280j742555
$$ 11755180 10469398 7972694 6423736 5806943 5332103 4882429 4279658 2910378 1167823
7072A167823k70233K326849L543360K185777l71054j993091j663932K76623K578469
$$ 1167823 897590 3224439 6767799 8953576 8582522 6589431 4925499 5202122 7780591
7063G780591L722625K992854J052714q43616j925007k050365j542810j268457
$$ 7780591 11503216 14496070 15548784 14705168 12780161 10729796 9186986 7918529
7055G918529k066078l564277m244875l101634o36710J852261L101219K177855
$$ 7918529 5852451 2288174 -1956701 -5058335 -5695045 -3842784 -741565 1436290
7047A436290o17609l093893l065402j150590O2066j99471j66999R59983J488610
$$ 1436290 818681 -2275212 -5340614 -6491204 -6429138 -6628609 -6795608 -5835625 -4347015
7038d347015L97986o11993J0994J083592R68244L06204K55516R828j391901k515344
$$ -4347015 -3949029 -4561022 -4550028 -3466436 -2498192 -2191988 -1936472 -1926644 -3318545 -5833889
7028e833889j544759N38577J557931J670523K369053L055607J910530l67604j043533
$$ -5833889 -7378648 -6840071 -5282140 -3611617 -1242564 1813043 3723573 3355969 2312436
7019B312436L94613J521632Q60719l19969o17259l09222J08839Q30743J427752
$$ 2312436 2707049 4228681 5089400 4769431 4152172 3842950 3951789 4782532 6210284
7010F210284Q25759o05935j019212N139N44200o33900k012996j595069K85462
$$ 6210284 7036043 6430108 5410896 5416035 5960235 5326335 3313339 1718270 2003732
7001B003732J723421J681517N56870o80669r19215N49587K845698L639990J599115
$$ 2003732 3727153 5408670 5965540 5284871 4365656 4915243 7760941 11400931 13000046
6992A3000046j721939l366970k201671M3101R60533J69187n44574K77173J738600
$$ 13000046 11278107 7911137 5709466 5752567 6713100 6882287 6337713 6614886 8353486
6983H353486J786208R2611j552930j901552j718511j954052k127193j608587q51056
$$ 8353486 10139694 10232305 8679375 6777823 5059312 3105260 978067 -630520 -1481576
6974a481576n9772J494639L217436K479572j399855m608477l503590o1886J142389
$$ -1481576 -1541348 -46709 3170727 5650299 4250444 -358033 -3861623 -3923509 -2781120
6965b781120n308K47782K467457K883610J36071j993673p28704J238304L88468
$$ -2781120 -2786428 -2538646 -71189 2812421 2948492 954819 226115 1464419 1852887
6956A852887j934419j857164J195607M052728L870959N16177l825885n839075
$$ 1852887 -81532 -1938696 -743089 3309639 7180598 7696775 3870890 -1968185
6948a968185l521579J065774L274593J419107j225323j225479Q30721K583751
$$ -1968185 -5489764 -4423990 -1149397 269710 -955613 -2181092 -1350371 1233380
6940A233380L358983L153142J175548j834519k732851n78190Q11903j342713l439090
$$ 1233380 4592363 7745505 8921053 7086534 4353683 3775493 4587396 3244683 -194407
6931a94407q12673M018041M433202j0877k852728q05422J737428L56742k740506
$$ -194407 -1007080 3010961 7444163 7433286 4580558 3775136 5512564 5869306 3128800
6922C128800l061136o93391J004771Q90200N29670P94164J092117J115953R33142
$$ 3128800 67664 -625727 379044 1269244 1798914 2593078 3685195 4801148 5734290
6913E734290M4984j715514l089183k868023j683025q11931j18800J230892K863062
$$ 5734290 5779274 4063760 974577 -1893446 -3576471 -4388402 -4507202 -3276310 -413248
6904d13248L660173L426887K513433N48700k607135n152860m651117j204421K271834
$$ -413248 3246925 6673812 9187245 9735945 7128810 1975950 -2675167 -3879588 -1607754
6895a607754L241596J785200m28736j995001k217189j019442P78120J799606J368660
$$ -1607754 1633842 3419042 2990306 995305 -1221884 -2241326 -1463206 336400 1705060
6886A705060Q8470j021751j462606j231883n78131m8012j04098l53575J65666
$$ 1705060 1793530 771779 -690827 -1922710 -2500841 -2548853 -2652951 -3006526 -2840860
6877b840860J505123K360380J791366P24842P65088J913647K621984J989778O55816
$$ -2840860 -1335737 1024643 2816009 3540851 4305939 6219586 8841570 10831348 11487164
6868A1487164o21678j816277k527589j657941N38856J496108o23259l742500m028852
$$ 11487164 10865486 9049209 6521620 4863679 5402535 6898643 6275384 2532884 -1495968
6859a495968r97150K033579K841931K822901L466146L245747M61547k916145l412643
$$ -1495968 -2493118 -459539 2382392 5205293 8671439 11917186 12378733 9462588 6049945
6850F049945j117621N49613n6537r98852n15492L44986J03842n16675r3258R90341
$$ 6049945 4932324 5481937 5425400 4426548 3911056 4256042 4359884 3843209 3749951 4740292
6840D740292J262993K72990j471188l517524m893699l766352J95045L868739L577774
$$ 4740292 6003285 6276275 4805087 1287563 -3606136 -7372488 -7177443 -3308704 269070
6831B69070n1385k520576j299457J119358J207141p65257j965783j508127r34381
$$ 269070 217685 -2302891 -3602348 -2482990 -1275849 -2041106 -4006889 -5515016 -6449397
6822f449397p38430N08636K865256L623869R81552k747458l716168j298073J729355
$$ -6449397 -7187827 -6679191 -3813935 -190066 791486 -1955972 -5672140 -6970213 -5240858
6813e240858K988558K436320J026541l12669m82800Q00503J766225N94080j257022
$$ -5240858 -2252300 184020 1210561 897892 415092 1215595 2981820 3575900 2318878
6804B318878m81909K768531M244754J729068j438284j443088K66382k07000k672696
$$ 2318878 1836969 4605500 8850254 10579322 9141038 7697950 7964332 7757332 5084636
6795E084636l290899q53648J480641J222802j60328j91973J073433J969558J814325
$$ 5084636 1793737 940089 2420730 3643532 3483204 3291231 4364664 6334222 8148547
6786H148547J114200K72767q11057k315115l922581m350339k231148J526343L535570
$$ 8148547 9262747 9535514 8724457 6409342 2486761 -1863578 -4094726 -2568383 967187
6777I67187J974533m63855l00795J281125L80993k842274l918656j272372J082755
$$ 967187 2941720 2477865 2177070 3458195 3839188 996914 -2921742 -4194114 -3111359
6768c111359K9888j802175o24944K635430M469512L976608K459677L12841k051669
$$ -3111359 -3081471 -4883646 -5508590 -2873160 1596352 5572960 8032637 8345478 6293809
6759F293809k446475q6069J451396j105417m649806l370758K225939N445421K966587
$$ 6293809 3847334 3761265 5212661 4107244 -542562 -3913320 -1687381 3758040 6724627
6750F724627j124964k314911j532519j494780j637740k14119J763871K352746
$$ 6724627 5599663 3284752 1752233 257453 -1380287 -1594406 169465 2522211
6742B522211K185832K682619K580270j09691l801407m615533j710276J711897
$$ 2522211 4708043 7390662 9970932 9861241 6059834 1444301 -265975 1445922
6734A445922K770882J641584j85535j780930k421241j634623l39218j25097q20605
$$ 1445922 4216804 5858388 5672853 3891923 1470682 -163941 -503159 -628256 -1448861
6725a448861n31821J324527K890167K597909J244203K15746o93326k187958l484385
$$ -1448861 -1980682 -656155 2234012 4831921 6076124 6291870 5598544 3410586 -73799
6716g3799l203367j566310j7755J016877K347571L897043L953260J398670k147598
$$ -73799 -3277166 -4843476 -4861231 -3844354 -1496783 2400260 6353520 7752190 5604592
6707E604592l510101j409583J850817K687622J57587l093900m111316k946653
$$ 5604592 2094491 684908 2535725 5223347 5380934 2287034 -1824282 -4770935
6699d770935j723354j265524n30940P75245J315895N49203j04135K85459N60241
$$ -4770935 -6494289 -7759813 -8290753 -7515508 -6199613 -5650410 -5754545 -5469086 -4908845
6690d908845r8241j88838J523279L309814L040962J825212J905046K290738L91696
$$ -4908845 -5007086 -5195924 -3672645 -362831 2678131 4503343 6408389 8699127 9090823
6681I090823k812849l775462k501843k573994m126445k474154L673343Q119248
$$ 9090823 6277974 2502512 669 -2573325 -6699770 -9173924 -5500581 2618667
6673B618667N552795m35073k900066j577927j284013k699015j787808K047800
$$ 2618667 8171462 7736389 4836323 3258396 1974383 -724632 -2512440 -464640
6665d64640M163130K303743O9033N49173J634364N14647j425122j479215r0014
$$ -464640 3698490 6002233 6071266 6620439 8254803 8769450 7344328 5865113 5775099
6656E775099P34599Q18626P32167k29194k077189k431463J44716L043565K928803
$$ 5775099 6509698 7328324 8060491 7831297 5754108 3322645 3467361 6510926 9439729
6647I439729M84501j221739j550597k094364k818469k002041K99985J905336J672290
$$ 9439729 9924230 8702491 7151894 5057530 2239061 237020 537005 2442341 4114631
6638D114631M60981r22998k268873k649345j132590J163073K066291J396340P72274
$$ 4114631 4575612 3652614 1383741 -1265604 -2398194 -1235121 831170 2227510 2999784
6629B999784N84506l11830j881882k549280j849018r13409j6255J634393L144815
$$ 2999784 3584290 3272460 1390578 -1158702 -3007720 -3921129 -3937384 -2302991 841824
6620H41824K049737j561461l864598k162461J239606K142428r3414k302344j804414
$$ 841824 2891561 1330100 -2534498 -4696959 -3457353 -1314925 -1408339 -3710683 -5515097
6611e515097Q75165L150291K998786P75091r53957n7789K296117K652837k14676
$$ -5515097 -4639932 -1489641 1509145 2284236 1330279 1272490 3568607 6221444 6006768
6602F006768l298131l041367K07036K877349K513900O4158j690265r15350J691774
$$ 6006768 2708637 -332730 -125694 2751655 5265555 5329713 3639448 2724098 4415872
6593D415872L378300J944900j603125l915290l346572j781871j437554j522472
$$ 4415872 7794172 9739072 8135947 4220657 874085 -907786 -2345340 -3867812
6585c867812j5011K430557K996972J045664n57777O74479L474973M620291K980889
$$ -3867812 -3882823 -1452266 1544706 2590370 2032593 2707072 6182045 10802336 13783225
6576A3783225L47569j290596j836771k193829k424390j798436m06311L70441m38786
$$ 13783225 14130794 12840198 11003427 8809598 6385208 4586772 4180461 4550902 4112116
6567D112116j847951j950281l45910J345026J557797N96056m5016L41111Q86338
$$ 4112116 2264165 313884 -32026 1313000 2870797 3466853 3421837 3762948 4649286
6558D649286K91420j408629k409694j011217J869131L040183Q43492k326789k903159
$$ 4649286 4940706 3532077 1122383 111166 1980297 5020480 5863972 3537183 634024
6549F34024q61043O62333K79051L46J094329J354556j165616l958562k921164
$$ 634024 -227019 435314 714365 714711 1809040 3163596 1997980 -1960582 -4881746
6540d881746J466620M251364K666197l64272p47632J139023J609959p05440k983750
$$ -4881746 -3415126 836238 3502435 3138163 2390531 3529554 5139513 4434073 1450323
6531A450323k239918P36846K668055J943297l775j159779j153732o17977J16086
$$ 1450323 -789595 -52749 2615306 4558603 4554828 3395049 2241317 1623340 1739426
6522A739426N94662k30957k424635l805789k218619J226102L184232K346037N49932
$$ 1739426 2334088 2103131 -321504 -4127293 -6345912 -5119810 -1935578 410459 960391
6513I60391n20215j181132j553019l56637K425698M183901L178998J290053Q12417
$$ 960391 440176 -740956 -2293975 -2650612 -224914 3958987 7137985 8428038 9240455
6504I240455O47268j149144k894858j515205J685848K210597m24151j575636R17283
$$ 9240455 9887723 8738579 5843721 4328516 6014364 8224961 7800810 6225174 7142457
6495G142457K851022L97615l375387l080165O19414K283006J80182j749718q58703
$$ 7142457 9993479 10391094 7015707 3935542 4554956 6837962 7018144 5268426 4409723
6486D409723J97729j604597m536384m835388k122591Q55173K408483L044082L281547
$$ 4409723 4607452 3002855 -1533529 -6368917 -8491508 -7636335 -5227852 -2183770 1097777
6477A097777K939497K303387J838243R51817r87102k733681k438728n98349O59697
$$ 1097777 4037274 6340661 8178904 9130721 8143619 5409938 2971210 2372861 3032558
6468C032558J093958K254073L582538K145449k294170n342790l615786M31337
$$ 3032558 4126516 6380589 9963127 12108576 9814406 4471616 855830 1287167
6460A287167K279754J616208J258719J606280M69009k127765l243031j622213
$$ 1287167 3566921 5183129 6441848 8048128 8517137 6389372 3146341 1524128
6452A524128O10483J642956K068576K360724J513311m64914j686793j505090j613718
$$ 1524128 2134611 3777567 5846143 8206867 9720178 9255264 7568471 6063381 4449663
6443D449663k433379j516737K156455N205430M180681O87039j057964k24261L96954
$$ 4449663 2016284 499547 2656002 7861432 12042113 12729152 11671188 11446927 11843881
6434A1843881p82175k375524k855101k308924j192541L49256J598705J543206
$$ 11843881 11061706 8686182 5831081 3522157 2329616 2678872 4277577 5820783
6426E820783K98635j099661k143523k746339k247704k81613J716886J768960J17832
$$ 5820783 6119418 5019757 2876234 129895 -2117809 -2399422 -682536 1086424 1204256
6417A204256r27376l5236J675492K338698J351172l96868j443269j039550n5687
$$ 1204256 276880 241644 1917136 4255834 5607006 5210138 3766869 2727319 2671632
6408B671632Q792o78960l19986J405244K142051L09174k138187k488575j139369
$$ 2671632 2680424 2001464 1681478 3086722 5228773 5537947 3399760 911185 -228184
6399b28184k46102l7041P10560J709231J644246P46804P1973q08339k479616l300361
$$ -228184 -474286 -511327 199233 1908464 3552710 4299514 4371487 3563148 1083532 -2216829
6389b216829j754591M9091p89368k687792j759785J392451K348244L99691l53633
$$ -2216829 -3971420 -3922329 -4711697 -7399489 -9159274 -7766823 -5418579 -5018888 -5372521
6380e372521J542974K343230J11862j553709J6913J770852O24960q44779P64401
$$ -5372521 -3829547 -1486317 -1374455 -2928164 -2911251 -1140399 -515439 -1360218 -595817
6371e95817L136787K002717j381587k174501L09872K172759J423591L390m58832
$$ -595817 2540970 4543687 3162100 987599 1297471 3470230 4893821 4897211 4438379
6362D438379n67114p02437l76681j71238r81366j408627O67257L857832M130211
$$ 4438379 3871265 3168828 2792147 2620909 1639543 230916 898173 4756005 8886216
6353H886216M65389l476737m148673j931251N90717J817092J762222J275421J213199
$$ 8886216 9351605 5874868 1726195 -205056 385661 2202753 3964975 5240396 6453595
6344F453595J274706O9747k375069l459975j451432J404340J998235J106198J519821
$$ 6453595 7728301 7798048 5422979 1963004 511572 1915912 3914147 5020345 6540166
6335F540166K742680J904771o66887j652108o72140r29331k950925k918779P53243
$$ 6540166 9282846 11187617 10520730 8868622 8196482 7267151 4316226 1397447 2150690
6326B150690M052653L404216Q34884j46389r0918j337897l268400l740132k952587
$$ 2150690 6203343 9607559 10442443 10296054 10205136 8867239 5598839 1858707 -1093880
6317a093880k213231r05601J655010L213054J298194k379275l942740k650283
$$ -1093880 -3307111 -4212712 -2557702 655352 1953546 -425729 -4368469 -7018752
6309g018752p18080Q50407K421360K867135Q89693j327115k68697L077045M028683
$$ -7018752 -7736832 -6886425 -4465065 -1597930 -708237 -2035352 -2304049 772996 4801679
6300D801679J363081r13299j02213J381229O63257j213982k019386j877463j453489
$$ 4801679 6164760 5251461 5149248 6530477 7193734 5979752 3960366 2082903 629414
6291F29414P3643K290270K031176j847951m987561l001667J648769K837641m58210
$$ 629414 703057 2993327 5024503 3176552 -1811009 -4812676 -3163907 -326266 -784476
6282g84476l375022k710457l63120J289165K673723M097977L740132J021543j208765
$$ -784476 -4159498 -6869955 -7233075 -5943910 -3270187 827790 4567922 5589465 4380700
6273D380700n38391J364634J551599K16283l69913K16828M91595q317l65919m78364
$$ 4380700 3842309 5206943 6758542 6974825 6604912 6821740 7313335 7305018 6939099 6460735
6263F460735j345334l102042m354155l595537n52087L268038M853574K131074
$$ 6460735 5115401 2013359 -2340796 -5936333 -6488420 -3220382 1633192 3764266
6255C764266k720876m418423r50516L240506L048732l50641j874267l07366P70490
$$ 3764266 1043390 -3375033 -4325549 -1085043 1963689 1613048 -261219 -568585 201905
6246B01905m89905j452150K20358L009975M324969L585951J176529k411254m899377
$$ 201905 -288000 -1740150 -1519792 1490183 5815152 9401103 10577632 8166378 3267001
6237C267001l223892J633588M096640R68974l825476m397655m12718L602754M429838
$$ 3267001 43109 1676697 5773337 6742311 2916835 -1480820 -1893538 1709216 6139054
6228F139054K413055q06073l458829l618873j131157J091729L54190k006627k608968
$$ 6139054 8552109 7746036 4287207 668334 -462823 628906 983096 -1023531 -3632499
6219c632499r38067M03118l09656k213654l632959l384279j049347K087057L510179
$$ -3632499 -4570566 -4167448 -4477104 -6690758 -10323717 -13707996 -14757343 -12670286 -9160107
6210i160107K774568K500888L875425L889031M69072k614762q94220L109289L410047
$$ -9160107 -6385539 -3884651 -9226 3879805 4348877 1734115 839895 3949184 7359231
6201G359231L64147p0144L184150M231843L55049l222361k159917J27066q25414
$$ 7359231 7723378 7653234 10837384 15069227 15424276 12201915 10041998 10169064 9343650
6192I343650k662934r61490K384497K071074j756456l877487k194388J28710N81528
$$ 9343650 6680716 5719226 8103723 10174797 8418341 4540854 2346466 2475176 3056704
6183C056704K50808J97791o72236k682697l644227j770186J672563L838217L177653
$$ 3056704 3307512 3505303 2833067 150370 -3493857 -5264043 -3591480 246737 3424390
6174C424390M24822k106472k212287J3039J913096J327319o94864j560244o71271
$$ 3424390 3849212 1742740 -469547 -456508 1456588 2783907 2089043 528799 -142472
6165a42472M07836O29709M06813K44438J65174K64057M27645l1472j131383j428409
$$ -142472 265364 895073 1301886 1546324 1711498 1975555 2403200 2371728 1240345 -188064
6155a88064n2631J414273J048106k92118k77357R80421R59646j185186l066272
$$ -188064 -240695 1173578 2221684 1929566 1652209 2632630 3592276 2407090 -659182
6146f59182k421500j42255J224062Q70026L87600J215399K306452J215594k193575
$$ -659182 -3080682 -3222937 -1998875 -1128849 -741249 474150 2780602 3996196 1802621
6137A802621m414041k452968J514412K584449J79509j200299O21197J921788k74712
$$ 1802621 -2611420 -5064388 -3549976 -965527 -786018 -1986317 -1365120 556668 281956
6128B81956k491072l94941L346801K710326k063237m735788k512963Q00856J621485
$$ 281956 -2209116 -2604057 742744 3453070 1389833 -3345955 -5858918 -5058062 -3436577
6119c436577Q68139J37289j057155k228099r49936K563389M196694J928263q71185
$$ -3436577 -2568438 -2431149 -3488304 -5716403 -6666339 -4102950 93744 2022007 1150822
6110A150822r68663j33582j005527j812656L45009L607493L623229L39245k059613
$$ 1150822 182159 48577 -956950 -2769606 -2424597 1182896 4806125 5145370 3085757
6101C085757j526577k81783l46471p79428m50448m91634k189830m267781m101432
$$ 3085757 1559180 1277397 930926 151498 -298950 -790584 -2980414 -7248195 -11349627
6092a1349627j042083K661412M246190L181758J286977L11632J62591N3439L12778
$$ -11349627 -12391710 -9730298 -5484108 -2302350 -1015373 -703741 -541150 -487711 -174933
6083a74933J390508J818743k10360l084307k651153J886198N805400M688386J38451
$$ -174933 1215575 3034318 2823958 -260349 -2911502 -1025304 4780096 9468482 9606933
6074I606933k821375k314138p57088m88430j103579j035477L21335K193719K921519
$$ 9606933 6785558 4471420 3714332 3225902 2122323 1086846 1408181 3601900 6523419
6065F523419J340801j312017k017009J30652K086978Q43196k194133l294067j762698
$$ 6523419 7864220 6552203 4535194 4665846 6752824 7596020 5401887 2107820 345122
6056C45122k87858m38454q86667l13712O95263J293247J574211J417541J99588
$$ 345122 57264 -381190 -1267857 -1581569 -886306 406941 1981152 3398693 3598281
6047C598281j573085k216340j266402k57887l68687r26366j014677q71277p37463
$$ 3598281 2025196 -191144 -1457546 -1715433 -2084120 -3010486 -4025163 -4896440 -5633903
6038e633903J5067J357619J674333p4516k289066k514432p50028O54988L25338
$$ -5633903 -5618836 -4261217 -2586884 -2661400 -4950466 -7464898 -8214926 -7559938 -7234600
6029g234600m58202Q9011J556228J865921K22605j592410j454987K85140J347159
$$ -7234600 -7692802 -7603791 -6047563 -4181642 -3959037 -5551447 -7006434 -6721294 -5374135
6020e374135P21489j16075L07935J279058J401081J017129J329838J865612R86188
$$ -5374135 -4652646 -4768721 -4460786 -3181728 -1780647 -763518 566320 2431932 3418120
6011C418120j120142k111566p57559J250142J670566M81672p79862j276670j210518
$$ 3418120 2297978 186412 -571147 678995 2349561 2831233 2051371 774701 -435817
6002d35817p08171K40329R95241O31684p52418j901463j834335q87388o9436K07230
$$ -435817 -1143988 -903659 91582 723266 -29152 -1930615 -3764950 -4652338 -4721774 -4514544
5992d514544L18074N04238L53283m53468j287144j176590k04465N62968P90111
$$ -4514544 -4196470 -3692232 -3338949 -3792417 -5079561 -6256151 -6460616 -5897648 -5107537
5983e107537J525126L411444N079843M493360J593912j505184k980318k996492
$$ -5107537 -3582411 -170967 4908876 9402236 10996148 9490964 6510646 3514154
5975C514154k761477k731349k290685r18924P74488J476564Q31625K95239J424928
$$ 3514154 752677 -1978672 -4269357 -5188281 -4413793 -2937229 -2105604 -1810365 -385437
5966c85437L341664L328041O31798j914140j564478L57787L86763j803899k754577
$$ -385437 2956227 6284268 6916066 5001926 3437448 3795235 4181998 2378099 -376478
5957c76478l42726K909345L091930r1289l227953l320425o03199K350489L129417
$$ -376478 -719204 2190141 5282071 5190782 1962829 -1357596 -1960795 389694 3519111
5948C519111J229055j685235l123344k009329L42396J859451K039776J930182
$$ 3519111 4748166 3062931 -60413 -2069742 -1727346 132105 2171881 4102063
5940D102063J982269J176535j059729l060306k470924M83864K700110J791523
$$ 4102063 6084332 7260867 6201138 3140832 669908 1153772 3853882 5645405
5932E645405j056502k720228j774824O11253K653294L323042K213731j61136j924482
$$ 5645405 4588903 1868675 93851 705104 3358398 6681440 8895171 8734035 6809553
5923F809553j481352J18678K31797j607478k964514k213132p27136j57303K27132
$$ 6809553 5328201 5446879 5678676 4071198 1106684 -1106448 -1833584 -1990887 -1763755
5914a763755J595537K849874K246783M91564k18375M84043J034026O96028K65183
$$ -1763755 -168218 2681656 4928439 5420003 5201628 5685671 6719697 7415725 7680908
5905G680908J87273n7434o33555j021457j070848j111181j138015r62956p82485
$$ 7680908 7868181 7810747 7177192 6155735 5084887 3973706 2835691 1872735 1090250
5896A090250o30922l0200P85017M92994j066541j687506K80408L123063L981771
$$ 1090250 459328 429128 1214145 1707139 640598 -1046908 -766500 2356563 6338334
5887F338334K595411O08750j293810k848974k497974L00339K375841N11787l050131
$$ 6338334 8933745 9542495 8248685 5399711 2901737 3202076 5577917 6089704 3039573
5878C039573l189679M21342L085758K690537K201896L366015L375089K80475l040417
$$ 3039573 -150106 271236 3356994 6047531 8249427 11615442 14990531 15271006 12230589
5869A2230589l443939k059490j092774J38181K416410L367520J104290j696789
$$ 12230589 8786650 6727160 5634386 5772567 8188977 11556497 12660787 10963998
5861A0963998j678506m26833j623053m352842m275785p92701J827667Q69967j467635
$$ 10963998 9285492 8858659 7235606 2882764 -1393021 -2185722 -358055 511912 -955723
5852i55723k148027j305356p59319j024874j290889q93991J37834J123587J170154
$$ -955723 -3103750 -4409106 -5168425 -6193299 -7484188 -8378179 -8240345 -7116758 -5946604
5843e946604M52925N65724K375224M294033M294636K852809J979338K017179J564014
$$ -5946604 -5493679 -4927955 -2552731 1741302 6035938 8888747 10868085 12885264 14449278
5834A4449278J27321j380213k520983l444277l297450j004900K132869L081878
$$ 14449278 14576599 13196386 10675403 7231126 3933676 2928776 5061645 8143523
5826H143523J046445j305556j546707o08407r29904k761833l780281k071115J397676
$$ 8143523 9189968 7884412 6337705 5729298 4799394 2037561 -1742720 -3813835 -2416159
5817b416159L505030K196066j084915k763393j186067J647896L006204K751496
$$ -2416159 1088871 3284937 2200022 -563371 -1749438 -101542 2904662 5656158
5809E656158K402266K030914K41830k903531m909986l542144M08798L643870L492738
$$ 5656158 8058424 10089338 10331168 7427637 2517651 -1024493 -615695 3028175 6520913
5800F520913N27258k056074k047893p25643o42983j671119j552066j88671j19819
$$ 6520913 7048171 4992097 2944204 2218561 1575578 -95541 -1647607 -1836278 -1956097
5791a956097j846965k283313J63251K435888J645476n7623R26954L661114M359864
$$ -1956097 -3803062 -6086375 -5923124 -3487236 -1841760 -1899383 -972429 2688685 7048549
5782G048549K317524K1276j335473k333922k397043o28102J104200J02941k586762
$$ 7048549 9366073 9387349 8051876 5717954 3320911 2692809 3797009 3899950 1313188
5773A313188l562358k429679j552364j122299O85938K924918K515908M8484l98916
$$ 1313188 -2249170 -4678849 -6231213 -7353512 -6667574 -3742656 -1226748 -1178264 -1577180
5764a577180J918001L139905J572944J57643L96936m30593l356834m594392j800390
$$ -1577180 340821 3480726 5053670 5211313 5608249 5177656 1820822 -2773570 -4573960
5755d573960J500813J638923M21542Q67361J604777L17508r06037J027859M178234
$$ -4573960 -3073147 -1434224 -1012682 -145321 1459456 1776964 870927 1898786 6077020
5746F077020M179037R89767j771534k610370k677016k038637j21895J280732O3071
$$ 6077020 10256057 11245824 9474290 6863920 4186904 2148267 2026372 3307104 3370175
5737C370175k004718j607219M15039L68069j833538k509804o80055L64277r81913
$$ 3370175 1365457 -241762 173277 541346 -1292192 -3801996 -4482051 -4117774 -5099687
5728e099687j762366N14548L696798M170020J645126j253091k335466j280833
$$ -5099687 -6862053 -6347505 -2650707 1519313 3164439 1911348 -424118 -1704951
5720a704951P48813J769349M87409k081116l477732k496685r1609J993982K318483
$$ -1704951 -956138 813211 1300620 -780496 -4258228 -6754913 -6846522 -4852540 -2534057
5711b534057L81463k171243k181250R91024L432712J534952k450409l380528q16575
$$ -2534057 -2152594 -4323837 -6505087 -5514063 -2081351 -546399 -2996808 -6377336 -7193911
5702g193911Q08273m42918j378608M36029K859060L409462L233643L975733M055085
$$ -7193911 -6385638 -6828556 -8207164 -7771135 -4912075 -1502613 1731030 5706763 9761848
5693I761848J479824j944557k658332l20888K086394K259949L85460k217103m133545
$$ 9761848 11241672 9297115 6638783 6317895 8404289 10664238 11049698 8832595 4699050
5684D699050m128453k204109l8928Q43898O92751L92236q9257q66632j018595
$$ 4699050 570597 -1633512 -1672440 -828542 -135791 256445 167188 -699444 -1718039
5675a718039J35019J626731K191896K056906J935515J364505k03339j615960j361772
$$ -1718039 -1583020 43711 2235607 4292513 6228028 7592533 7389194 5773234 4411462
5666D411462j18572P2467j074321j796941j177547l57838l02032l5306J769734
$$ 4411462 4292890 4365357 3291036 1494095 316548 -41290 -343322 -378628 1391106
5657A391106M385520N419289L513273q0934k867470l664825l292145k766337j797420
$$ 1391106 5776626 11195915 14709188 14628254 11760784 8095959 4803814 2037477 240057
5648B40057Q6548J746149J441733m19491j399210m42498O50571K35627m50683
$$ 240057 326605 2072754 3514487 3094996 1695786 1253288 1903859 2139486 1688803
5639A688803O48000K820127L269032J082091j490896k058069q34301K73889K25617
$$ 1688803 2336803 5156930 8425962 9508053 8017157 5959088 5124787 5398676 5624293
5630E624293l84817o05288l34589j22635j65699J7908P13174J256635Q24163k31317
$$ 5624293 5239476 4634188 4299599 4176964 4011265 4029173 4742347 5998982 6823145 6591828
5620F591828p41587m43644k20946l41259J99617J778025K876289K047252K43152
$$ 6591828 5850241 5406597 5185651 4844392 5044009 6822034 9698323 11745575 11988727
5611A1988727m45871P1236j55654j844431k976056j570722J230966K348554P26847
$$ 11988727 11542856 11614092 11458438 9614007 6637951 5067229 6298195 8646749 9373596
5602I373596j303960j108421Q80714J963209Q82091p76845j287222j310498k281584
$$ 9373596 8069636 6961215 7841929 9805138 10687229 9910384 8623162 7312664 5031080
5593E031080l252065j625605K617595N570423L821799q83347l340093j207020
$$ 5031080 1779015 153410 2771005 8341428 12163227 11279880 7939787 6732767
5585F732767K140663K036583j381929l356305q96940L013980L224159p75343m371436
$$ 6732767 8873430 10910013 9528084 6171779 5274839 8288819 11512978 10737635 6366199
5576F366199m142707j788116n65585n76091j7506R09754N79278n78735n39120
$$ 6366199 2223492 435376 -130209 -706300 -723806 185948 765226 186491 -352629
5567c52629N56433L49413j621994k825844j650340K91204Q68356L9398j284925
$$ -352629 203804 553217 -1068777 -3894621 -5544961 -5253757 -4385401 -4346003 -5630928
5558e630928k519025k438073L36597M318899N361367J994170j888138k114598
$$ -5630928 -8149953 -10588026 -10251429 -5932530 -571163 1423007 -465131 -2579729
5550b579729K46058J324431M37886J23942J244105J706771J64283j929953k491954
$$ -2579729 -2333671 -1009240 -571354 -447412 796693 2503464 2667747 737794 -1754160
5541a754160j013015J632152L879551M050427J913851n00281j222512r74516j649399
$$ -1754160 -2767175 -1135023 2744528 6794955 8708806 8208525 6986013 6011497 4362098
5532D362098k831000k258407L81078K622645K559124Q80143q17837j750493j556897
$$ 4362098 1531098 -727309 -346231 2276414 4835538 5715681 4897844 3147351 1590454
5523A590454k05399J125237R19588l51797o01096O72326J569311R27741J24196
$$ 1590454 1385055 2510292 3429880 3078083 2476987 3149313 4718624 5646365 5770561
5514E770561N41449J204582N36826j082877k224918k618682k654599j676828J133732
$$ 5770561 6312010 7516592 8053418 6970541 4745623 2126941 -527658 -2204486 -1070754
5505a070754M491410N604411L461487K19325j258780m62789O82868L35278j237692
$$ -1070754 3420656 9025067 12486554 12705879 11447099 10984310 11667178 12002456 10764764
5496A0764764k219121j568527l34937l23486j766065k962041k208233N32072L859501
$$ 10764764 8545643 6977116 6642179 6318693 4552628 1590587 -617646 -85574 3773927
5487C773927O041902N731104K529644k415798o681922p985808n581579o49098
$$ 3773927 9815829 15546933 18076577 15660779 8978857 993049 -4588530 -5237628
5479e237628M236065O416926N015431J793036m98612q36148m42747o67691j351562
$$ -5237628 -1001563 5415363 10430794 12223830 11725218 10889070 10446323 9778632 8427070
5470H427070j591328j093875j35987R76090J628087Q30514j497431l581239l356743
$$ 8427070 6835742 5741867 5605880 6581970 8210057 9040571 7543140 3961901 605158
5461F05158j072891P61957M39864r49676j362695p02021m15888o29179K01708
$$ 605158 -467733 294224 734088 -215588 -1578283 -2280304 -2696192 -3325371 -3123663
5452c123663K112865K354210p50905m241942l671641O84314L857538K799591j22882
$$ -3123663 -1010798 1343412 592507 -3649435 -7321076 -6636762 -2779224 20367 -102515
5443a02515j320536n77842M51967J530225K890743L161459J335875o62918n48219
$$ -102515 -1423051 -2000893 -1548926 -18701 2872042 6033501 7369376 6706458 6158239
5434F158239L46974r79482m006986n073018k850355J06954J676113K550132L423633
$$ 6158239 6505213 5525731 1518745 -3554273 -6404628 -6297674 -4621561 -2071429 1352204
5425A352204L105600R80453j264720j981669j598675j107181n69308k52446j080187
$$ 1352204 4457804 5438257 4173537 2191868 593193 -513988 -1083296 -1335742 -2415929
5416b415929k673408l008645j325518O35019J492517K090937L122902L316461
$$ -2415929 -5089337 -8097982 -9423500 -8788481 -7295964 -5205027 -2082125 1234336
5408A234336J840112K90421J80020M27833m68398j659745j681250j140554j123587
$$ 1234336 3074448 3364869 3544889 3972722 3504324 1844579 163329 -977225 -2100812
5399b100812o17858J610671L980225M012251K238639J057321N57776j057146l304334
$$ -2100812 -2718670 -1107999 2872226 6884477 9123116 10180437 10738213 9681067 6376733
5390F376733l440661j096876O26514j82772j544727j091073L32400N82178j76190
$$ 6376733 2936072 1839196 2465710 2282938 738211 -352862 -20462 561716 385526
5381C85526p5748J198093J868176O92850j325540k218382j302196L12546J319261
$$ 385526 309778 1507871 3376047 4068897 2743357 524975 -777221 -464675 854586
5372H54586J781439K466575K882784J444097j757978m006337l356009j629596
$$ 854586 2636025 5102600 7985384 9429481 7671503 3665166 309157 -1320439
5364a320439j815064l426760l298467q13275Q61900k98319j890718o00324K954253
$$ -1320439 -3135503 -6562263 -9860730 -10674005 -9812105 -10110424 -12001142 -12601466 -9647213
5355i647213N082493L756048O16192j339871p17592J380937K479539J047777j702586
$$ -9647213 -4564720 -808672 -192480 -1532351 -2249943 -869006 1610533 2658310 955724
5346I55724k965167j814905m34763q82815j921256q86249K020801L624090K151005
$$ 955724 -2009443 -3824348 -4259111 -5141926 -7063182 -7949431 -5928630 -2304540 -153535
5337a53535m57712j518217r96259l93352K57104J939701L730398L053023l15278
$$ -153535 -611247 -2129464 -3125723 -3519075 -3261971 -1322270 2408128 5461151 5145873
5328E145873k783811j292439K308821L431306O95611k571854k879148m55859K039061
$$ 5145873 2362062 1069623 3378444 6809750 7505361 4933507 2054359 1598500 3637561
5319C637561K806600J841343N3187j308110j379490q50814j393883l023334l322511
$$ 3637561 6444161 8285504 8338691 7030581 5651091 4800277 3406394 383060 -2939451
5310b939451o25288L160469M542618K569165n49338k405110k511854j823113j484855
$$ -2939451 -3564739 -404270 4138348 6707513 6158175 3753065 1241211 -581902 -2066757
5301b066757j888032k032157l62090K846340M860086L569928L38149j747484j665260
$$ -2066757 -3954789 -5986946 -6349036 -3502696 1357390 4927318 5265467 3517983 1852723
5292A852723q35202m68659m83021o19804p65565m04640O59049J501776J483613
$$ 1852723 1017521 548862 65841 -553963 -1319528 -1724168 -1065119 436657 1920270
5283A920270J486481J940220J074110k141345m699344k939380J437181L017264
$$ 1920270 3406751 5346971 6421081 4279736 -419608 -3358988 -1921807 1095457
5275A095457N05688j670011n85933J154319P60727N056J267472K642364J173261
$$ 1095457 1601145 -68866 -654799 499520 1260247 1265303 2532775 5175139 6348400
5266F348400j704570k333232o71755L22553n0458M8512O08008m44608k772356
$$ 6348400 4643830 2310598 1638843 1961396 1910938 1959450 2567458 2122850 -649506
5257f49506l184328p74058J227544M14125j218684q82865M61466K5507j944258
$$ -649506 -3833834 -4607892 -3380348 -2966223 -4184907 -5067772 -4606306 -4580799 -6525057
5248f525057k297567K98491L297064L557331J076082j478372k061660j052558
$$ -6525057 -8822624 -8524133 -5227069 -1669738 -593656 -2072028 -4133688 -5186246
5240e186246Q508M51414O96650J027751J182734J240620J806223K713245K542742
$$ -5186246 -5177738 -4726324 -4029674 -3001923 -1819189 -578569 1227654 3940899 6483641
5231F483641M91202j953610k515189j070082J99462l23785j841290k498478j623261
$$ 6483641 6974843 5021233 2506044 1435962 1635424 1311639 -529651 -3028129 -4651390
5222d651390o8595J030791J275018J071011J067280J438071J679305J246192K51711
$$ -4651390 -4719985 -3689194 -2414176 -1343165 -275885 1162186 2841491 4087683 4339394
5213D339394p21964j287499j369124r29345j19881M41456J57031p12100j152011
$$ 4339394 3617430 2329931 960807 31462 -88419 353037 510068 -202032 -1354043
5204a354043n07987P38828J418015Q54905l82185j072934q87802r29486k027941
$$ -1354043 -1862030 -1123202 294813 1149718 767533 -305401 -1193203 -2122689 -4150630
5195d150630k934304j674064J157068K333752K95308k223466j694536J282770
$$ -4150630 -7084934 -8758998 -7601930 -5268178 -4972870 -7196336 -8890872 -7608102
5187g608102K965629J922047P89133J959985L931188L551770M46155k670748l511756
$$ -7608102 -4642473 -2720426 -1931293 28692 3959880 7511650 7957805 5287057 1775301
5178A775301k376952q28160K91381R25948R31762J53721q85166j227881n80635
$$ 1775301 -601651 -1429811 -1138430 -212482 719280 873001 -12165 -1240046 -1820681
5169a820681L55815P94647N99290J0544o06462m49882J203610L350942L320906
$$ -1820681 -1464866 -670219 -70929 -60385 -666847 -1116729 86881 3437823 6758729
5160F758729L4361l673113m102544j655518j91437j259569j995114L9828K904564
$$ 6758729 6793090 3119977 -982567 -2638085 -2829522 -4089091 -6084205 -6044377 -3139813
5151c139813L429016J927192Q23753K56725j451872l625173l249998K29915L242972
$$ -3139813 289203 2216395 3040148 3296873 1845001 -1780172 -5030170 -4800255 -1557283
5142a557283K626383l14466j868167o55825J224784J146506j087891l106441k387476
$$ -1557283 1069100 754634 -1113533 -1769358 -544574 601932 -485959 -3592400 -5979876
5133e979876R91567M123925M287941J894268l54064q48120m63226p31472j901667
$$ -5979876 -4988309 -864384 3423557 5317825 4963761 4115641 3652415 2920943 1019276
5124A019276k972837k679147m60351K592610M042058K625378K25551k31498J236714
$$ 1019276 -1953561 -4632708 -5093059 -2500449 1541609 4166987 4392538 4161040 5397754
5115E397754J642691o49937l506682l937121j977224l02751o50478j818573j312787
$$ 5397754 7040445 6390508 2883826 -1053295 -3030519 -3333270 -3983748 -5802321 -7115108
5106g115108J448988L949665L229633j65392k298019r19064J253265M30770k517299
$$ -7115108 -5666120 -1716455 1513178 1347786 -950233 -1869297 -616032 -185262 -2702561
5097b702561l350566q14433J952189K620656K449067K756603K439515R64339L34772
$$ -2702561 -6053127 -6867560 -4915371 -2294715 154352 2910955 5350470 6314809 6649581
5088F649581J474135J787818n74893k923709k230085n89757j881882m703708m043437
$$ 6649581 8123716 9911534 9336641 6412932 4182847 3593090 1711208 -2992500 -7035937
5079g035937L66440L025869J149106j150914K66226L034181K452345r24390k356979
$$ -7035937 -6669497 -3643628 -2494522 -3645436 -3379210 -345029 2107316 1182926 -1174053
5070a174053j52447K458894K559731J007814o9123l03525l19279n6633O38920
$$ -1174053 -1326500 1132394 3692125 4699939 4630816 4327291 4008012 3951379 4590299
5061D590299J111624Q79264N59141P55852R12753K93343p44802j545222k361112
$$ 4590299 5701923 6581187 7140328 7896180 8808933 9102276 8357474 6812252 4451140
5052D451140l432401l623266j763746R11581J631364k08037j945604j099649J486343
$$ 4451140 1018739 -2604527 -4368273 -3456692 -1825328 -2033365 -3978969 -5078618 -3592275
5043c592275L025489K281122M69470p01439p39811l46139n07091j550234k735316
$$ -3592275 -566786 1714336 2183806 1482367 742556 396417 -110674 -1660908 -4396224
5034d396224l020138k249550r66211P42278K890847M086504K369832j618980m308700
$$ -4396224 -7416362 -9665912 -10632123 -9889845 -6998998 -2912494 -542662 -2161642 -6470342
5025f470342l379067m76188J716978K997955M109989L905415J217513j896685
$$ -6470342 -9849409 -10325597 -8608619 -5610664 -1500675 2404740 3622253 1725568
5017A725568k378709q95520o87674k036287j878301O60585K485108J649466N05247
$$ 1725568 -653141 -1548661 -2236335 -4272622 -6150923 -5490338 -3005230 -1355764 -850517
5008h50517J580255L354985K802755Q0620j931775j643169k72770j3666j893789
$$ -850517 729738 4084723 6887478 6968098 5036323 3393154 3120384 3106718 1212929
4999A212929m752552n775383l206642J126396L511955K750487R56383k867k30844
$$ 1212929 -3539623 -9315006 -12521648 -11395252 -7883297 -5132810 -4176427 -4179294 -4410138
4990d410138K33199J818745K931920P94397l571308n028400j497320K206851J052510
$$ -4410138 -4176939 -2358194 573726 1368123 -2203185 -7231585 -8728905 -6522054 -5469544
4981e469544k800843l300508R66078N699239P050397M987398J274238k340568
$$ -5469544 -8270387 -11570895 -10604817 -4905578 2144819 7132217 8406455 6065887
4973F065887m175439l765687k758427k509685j779718P89207L340340L106759
$$ 6065887 1890448 -1875239 -4633666 -7143351 -8923069 -8133862 -4793522 -1686763
4965a686763J017062N04765K109125K683474K48051l249999m601167k717679Q57906
$$ -1686763 -669701 -164936 1944189 4627663 4875714 1625715 -2975452 -5693131 -4835225
4956d835225L269215K556625n515q01899J281692K662750J51067l680777l735539
$$ -4835225 -1566010 990615 985100 183201 1464893 4127643 4278710 597933 -3137606
4947c137606J64962L039286J797464j180735k175854q37325L74401l99698k467509
$$ -3137606 -2972644 66642 1864106 683371 -1492483 -2329808 -1955407 -2355105 -4822614
4938d822614l332362j501504J270346J953180P36542Q98848L270780M447225K440042
$$ -4822614 -8154976 -9656480 -8386134 -6432954 -5696412 -4797564 -1526784 2920441 5360483
4929E360483J2090m73304j082149l387094m236138j437484R51596q56056k919442
$$ 5360483 5372573 4899269 3817120 430026 -3806112 -5243596 -4292000 -5148056 -8067498
4920h067498P6779M772032L851660j841575m851907l083309j099827m85161J588023
$$ -8067498 -7990719 -3218687 632973 -1208602 -6060509 -9143818 -10243645 -10728806 -9140783
4911i140783M273442L100327j135200k621393n64706n009j886664j753133P59378
$$ -9140783 -4867341 -1767014 -2902214 -5523607 -6088313 -6093322 -7979986 -9733119 -8973741
4902h973741J047244p55621L39312L360251J788435l538646m212344P22108K682183
$$ -8973741 -7926497 -8682118 -8342806 -4982555 -3194120 -6732766 -10945110 -10223002 -7540819
4893g540819n36243j119227K505545J473423n868164q763930l677872j535264
$$ -7540819 -8077062 -9196289 -6690744 -5217321 -11085485 -19849415 -23527287 -25062551
4885b5062551o649267p498879M72082L531153m856102r360437j317795J930841
$$ -25062551 -31711818 -39210697 -38738615 -35207462 -40063564 -49424001 -50741796 -48810955
4877d8810955j1007244k0131854j1301947j2046551m5894365p1367944k5483172
$$ -48810955 -59818199 -79950053 -91252000 -103298551 -149192916 -220560860 -246044032
4870b46044032P3811025J30551864R2897143J7430426j6236955n270541K113635
$$ -246044032 -172233007 -41681143 51216000 68646426 52409471 47138930 49252565
4863D9252565q425135j1303013P91573N835941l470359q147363N1025N170445
$$ 49252565 40827430 29524417 30315990 36151931 32681572 24534209 24585234 29755679
4855B9755679j917354q249475l826430K356211J314573j256828O02133J409285
$$ 29755679 27838325 19588850 15762420 18118631 19433204 18176376 18778509 20187794
4847B0187794k947487n386312n27683M780764L001293k275167m127096k842430
$$ 20187794 17240307 11853995 11326312 16107076 19108369 16833202 12706106 9863676
4839I863676j477766P44404L931111M061047J38120k255856N0691K303653M14860
$$ 9863676 8385910 9130314 13061425 17122472 17260592 15004736 15055427 17359080 17773940
4830A7773940k042196q44885J536448J168542p31260j625134k459908l766028
$$ 17773940 15731744 14886859 16423307 17591849 16860589 15235455 12775547 9009519
4822I009519k611217J635607M043780J628961j269013k25317J982574Q30469k187475
$$ 9009519 6398302 8033909 12077689 13706650 12437637 12212320 14194894 15025363 12837888
4813A2837888l128337k554179k875741k530383R86497N191714N631131K625411
$$ 12837888 9709551 7155372 4279631 1749248 2735745 7927459 13558590 16184001
4805A6184001j98354j878080l566324m237452k276694K42685K2667j816736j392651
$$ 16184001 15985647 14107567 10541243 6303791 4027097 4269782 4292449 2475713 1083062
4796A083062J405539K707437Q06270j703274k273992j403078o59866l75020J1273
$$ 1083062 2488601 5196038 6002308 4299034 2025042 621964 -37902 -412922 -401649
4787d01649R25472K192267K738593J474695q26443j996881j656545j825882l122870
$$ -401649 523823 2716090 5454683 6929378 6102935 4106054 2449509 623627 -2499243
4778b499243k927986N83453M856930N922089L336677k8639j698026j160497P68312
$$ -2499243 -5427229 -4843776 13154 5935243 9271920 9243281 7545255 6384758 7153070
4769G153070K311512J785720k86121j532439j036721k16884K32472J313998K597210
$$ 7153070 9464582 11250302 10964181 9431742 8395021 8178137 8410609 9724607 12321817
4760A2321817J715263j183267k239459K62740K401933J99420m334236o208709
$$ 12321817 14037080 12853813 10614354 10877094 13279027 13478447 9144211 2935502
4752B935502m084368o34549J534033J337856j164562l737310k873156J527335
$$ 2935502 -1148866 -1783415 -249382 1088474 -76088 -3813398 -6686554 -5159219
4744e159219M958112M433141K609207K679338K878259L29806k967068l059384
$$ -5159219 -201107 4232034 6841241 9520579 12398838 12728644 9761576 6702192
4736F702192n21830J020840R02879R90039R65008q51060l171384l144843j236539
$$ 6702192 6180362 7201202 8104081 9094120 10059128 9208068 6036684 2891841 1655302
4727A655302k80270o49583n85811k2101J94334J187924L533442L917647k68553
$$ 1655302 1375032 725449 139638 117537 311871 1499795 5033237 8950884 8682331
4718H682331m976929m342878P9948J764145k03036o22299J878515K683625K79109
$$ 8682331 3705402 -637476 -557528 1206617 1003581 381282 2259797 4943422 5222531
4709E222531o72190K002448L814617J692770o59588K00105J234227j232469m614726
$$ 5222531 4550341 6552789 10367406 12060176 11400588 11600693 12834920 11602451 6987725
4700F987725m422702j529871J25630j01320l88646q08124k025721k009741J090681
$$ 6987725 2565023 1035152 1160782 1059462 670816 -137308 -2163029 -4172770 -3082089
4691c082089M482145L841202j40934k616895j433992P46222J082791o1912p84343
$$ -3082089 1400056 5241258 5100324 2483429 1049437 1795659 2878450 2816538 2032195
4682B032195k07700J141605K104878J981352J458961J565900J331563j443111
$$ 2032195 1824495 2966100 5070978 7052330 8511291 10077191 11408754 9965643
4674I965643o038565q021421m637419J142009M264638L450283J079138r05627
$$ 9965643 3927078 -4094343 -8731762 -7589753 -3325115 125168 1204306 298679
4666B98679k173025k323002q48871J604684L777783M987475M657616K188369j215725
$$ 298679 -1874346 -4197348 -5046219 -3441535 336248 5323723 9981339 12169708 10953983
4657A0953983k456334k86044K516467K753863Q76342p09936j480442k259208k490577
$$ 10953983 8497649 8211605 10728072 13481935 14358277 13648341 12167899 9908691 7418114
4648G418114j111961Q16145J181061j04887j446835k151065k390360j647928K78797
$$ 7418114 6306153 7122298 8303359 8198472 6751637 4600572 2210212 562284 841081
4639H41081J686791J043828j55855O56294K966025L760320J871485r17230k786211
$$ 841081 2527872 3571700 3415845 4072139 7038164 10798484 12669969 11752739 8966528
4630H966528l316716k342033n5187J828819J577429P2427m69058j17224p83996
$$ 8966528 5649812 3307779 3252592 5081411 6658840 6731267 6262209 6144985 5360989
4621E360989k283037k111928J70720J513616k45303l062660l492813j025794K034258
$$ 5360989 3077952 966024 1136744 2650360 2405057 -657603 -4150416 -5176210 -3141952
4612c141952L715715L814593L001623J930590J036398L83313k68211r82653j461139
$$ -3141952 573763 4388356 7389979 9320569 10356967 10740280 10472069 9489416 8028277
4603H028277j461422j190340j195343j782820k304918j430780R55172K573371
$$ 8028277 6566855 5376515 4181172 2398352 93434 -1337346 -382174 2191197
4595B191197J251174j421207j471739J634081L529243J149875k521031k795403
$$ 2191197 3442371 2021164 549425 2183506 5712749 6862624 4341593 1546190
4587A546190P7291K254953K498733K725938L165127J567074k170776m567556l144606
$$ 1546190 1623481 3878434 6377167 9103105 12268232 13835306 11664530 7096974 3952368
4578C952368M18496K927546L098838J434122r56949k401483j673278M8058J15490
$$ 3952368 4370864 7298410 10397248 11831370 10874421 8472938 6799660 6847718 6963208
4569F963208j927914l577298k969761j178389M7112Q31959K157045L725653M105576
$$ 6963208 5035294 1457996 -1511765 -2690154 -2643042 -1811083 345962 4071615 8177191
4560H177191K318730j097654l919322l599268k07200K667984J912206r52934k085040
$$ 8177191 10495921 9398267 5478945 1879677 1672477 4340461 6252667 5299733 3214693
4551C214693r61580l16358q37533k03707J888517K265544k58928k133874n72834
$$ 3214693 2253113 1936755 1099222 895515 2784032 5049576 4790648 2656774 2083940
4542B083940J780722J134123j382606j883468l8317R26625l14517j582407j081062
$$ 2083940 3864662 4998785 3616179 1732711 1694394 2621019 2306502 724095 -356967
4533c56967L14910J212326J638443K010820J926420Q55216q48197k067776j771796
$$ -356967 -42057 1170269 2808712 4819532 6745952 7601168 6752971 4685195 2913399
4524B913399p8532J270713M69299j843066k993876j912283m88602o1227J134950
$$ 2913399 2834867 4105580 4574879 2731813 -262063 -2174346 -2662948 -2724175 -1589225
4515a589225M592611P515234N661861l31020m854830m038254J61238L319420L518072
$$ -1589225 3003386 10518620 16180481 15849461 10994631 6956377 7117615 10437035 13955107
4506A3955107J727522o73049k833035l887779l317905j874908j065081j392967
$$ 13955107 15682629 15009580 12176545 8288766 4970861 3095953 2030872 637905
4498F37905j655947m20420J937285L267659K165537o1984r08900P4870Q83796
$$ 637905 -1018042 -1438462 498823 3766482 5932019 5870035 4961135 5036005 5919801
4489E919801P3938j393166j945336j457467n57881N71545J484488J127551k76517
$$ 5919801 5993739 4600573 2655237 1197770 639889 1211434 2695922 3823473 3546956
4480C546956o04330J000594J968862j18105l144511k971288K42416J986296J50278
$$ 3546956 2942626 3943220 5912082 5793977 2649466 -321822 -79406 1906890 2057168
4471B057168j930282p97827K013761K755048J024809n26789p87718j224862k463036
$$ 2057168 126886 -670941 1342820 4097868 5122677 4595888 3808170 2583308 120272
4462A20272k798357j086451J007231J132258n15931j539480m58111J716275K979208
$$ 120272 -2678085 -3764536 -2757305 -1625047 -2140978 -3680458 -4138569 -2422294 556914
4453E56914K452729P79802q69436j711743j626189r74308j15120J003132K544371
$$ 556914 3009643 3789445 2920009 1208266 -417923 -1392231 -1507351 -504219 2040152
4444B040152M023787M348672K968617N47525j889867l845628m759811l493938
$$ 2040152 6063939 10412611 13381228 13928753 12038886 8193258 3433447 -60491
4436f0491O7572L344376L122766j40143k096645L0608L419898L218827p60640
$$ -60491 7081 3351457 6474223 6334080 4237435 4268043 7687941 10906768 10146128
4427A0146128l635818k130171R47285P10648k862233m684198j416474L869685
$$ 10146128 6510310 4380139 5327424 6038072 3175839 -1508359 -2924833 944852
4419I44852N524692K449279r60276q83357J383788K088705K25150j984062k722313
$$ 944852 6469544 8918823 7958547 7075190 8458978 10547683 10772833 8788771 6066458
4410F066458k322347j581205n77768L99033O02144J97525L76918J431655K134296
$$ 6066458 3744111 2162906 1585138 1984171 2586315 2783840 3160758 4592413 6726709
4401F726709J746397J206620J440730J836774J425588L90534o32179j628457k554144
$$ 6726709 8473106 9679726 11120456 12957230 14382818 14773352 14141173 12512716 9958572
4392I958572k792668k382131k496795l335169k887742K90056M096758M965217
$$ 9958572 7165904 4783773 2286978 -1048191 -3935933 -3645877 450881 5416098
4384E416098K534459k8157m39156K39128J94816j98998N00485K093785K907360
$$ 5416098 7950557 7922400 7483244 7722372 7917188 7718190 8218675 10312460 13219820
4375A3219820K235067J015680j04162j923187m920151p241521o166621j887179
$$ 13219820 15454887 16470567 16366405 14443218 9523067 2281546 -3885075 -5772254
4367e772254J728485J379674j575376k877341q31204J853753J986784j49333j767227
$$ -5772254 -4043769 -2664095 -4239471 -7116812 -7948016 -6094263 -4107479 -4256812 -6024039
4358f024039j242309M70882J527029J202503K26812l75221n64171j111893j951423
$$ -6024039 -7266348 -6795466 -5268437 -4065934 -3839122 -4214343 -4778514 -5890407 -7841830
4349g841830j581949P99100L343456L481625J478518K0314K14848L34800q41976
$$ -7841830 -9423779 -8624679 -5281223 -1799598 -321080 -300766 -85918 248882 -593094
4340e93094j798690o92334J773052L307853K698633N58621j442399j566533L36246
$$ -593094 -2391784 -3084118 -1311066 1996787 4695420 5254041 3811642 2245109 2581355
4331B581355J838680M50673k645174l798990k211224r14913j508893j625304M06125
$$ 2581355 4420035 4870708 2225534 -1573456 -3784680 -4699593 -6208486 -7833790 -7427665
4322g427665K156528J325878l7371P25094J831779J84904k599571k231277J247005
$$ -7427665 -5271137 -3945259 -3982630 -3257536 -1425757 -1240853 -3840424 -6071701 -4824696
4313d824696L390788K149566K05050L1611P10271O81900K15338j36629q04353
$$ -4824696 -1433908 715658 920708 952319 1662590 2344490 2559828 2423199 1618846
4304A618846j796530k186553j675262p65467O55852K696553L725625K083474n62433
$$ 1618846 -177684 -2364237 -4039499 -4804966 -4149114 -1452561 2273064 4356538 3794105
4295C794105p72369J443549K336472J34127k374384k345284q08942j95251n84393
$$ 3794105 3021736 4465285 6801757 6935884 4561500 2216216 1407274 1212023 627630
4286F27630o54004l93047n90904q58620j60328J280310J997242R59610j332151
$$ 627630 -26374 -419421 -1010325 -1868945 -2029273 -748963 1248279 2207889 875738
4277H75738l045519k421271J76859K079171J508042K46058J063102L091631K655329
$$ 875738 -2169781 -4591052 -4414193 -2335022 -826980 -580922 482180 3573811 6229140
4268F229140j083527m382587l920316r24525J198910J239646M65518Q8464K03059
$$ 6229140 5145613 763026 -3157290 -4081815 -2882905 -1643259 -1177741 -1089277 -886218
4259h86218M38579L98641j30443q04206r85552m79091N65274K083125L496766
$$ -886218 -447639 -48998 -179441 -983647 -1969199 -2448290 -1883016 200109 3696875
4250C696875L373199J103799j672639k903368k743703k680064k882408k408348
$$ 3696875 7070074 8173873 6501234 3597866 854163 -1825901 -4708309 -7116657
4242g116657j169709M35699K726674N066881M458248o94485o390367o750906j874692
$$ -7116657 -8286366 -7850667 -5123993 -57112 4401136 3706651 -2683716 -9434622 -11309314
4233a1309314K091150J243282j593075j687261J713907N618909O739573L831243
$$ -11309314 -9218164 -7974882 -9567957 -11255218 -9541311 -3922402 2817171 6648414
4225F648414j102633l733385j938421J034788Q18877j671072k031297K76258J306200
$$ 6648414 5545781 1812396 -126025 908763 1727640 56568 -1974729 -1698471 -392271
4216c92271n85385k498256k338964j504935j105042j97102R85453O04455q37274
$$ -392271 -977656 -3475912 -5814876 -7319811 -8424853 -8621955 -7636502 -7032047 -7869321
4207g869321o44583J075018J377025J84795O63159K961673L420610J308574K31584
$$ -7869321 -8513904 -7438886 -6061861 -5877066 -5213907 -2252234 1168376 2476950 2708534
4198B708534J266492J139908r08004j316387M74540J25767l364427m972101k504287
$$ 2708534 3975026 5114934 4206930 2890543 3365083 3490850 126423 -4845678 -7349965
4189g349965n01299j524362j515311J703511L457408R50595j093340P99216K527142
$$ -7349965 -7851264 -9375626 -10890937 -9187426 -5730018 -4779423 -5872763 -5073547 -2546405
4180b546405Q77125j43479J932535J869543l037369n778874j542865K430328r03514
$$ -2546405 -1669280 -1812759 119776 1989319 -1048050 -6826924 -8369789 -5939461 -6842975
4171f842975n348935k402276L177384J945192l226553k886249J921309K731064
$$ -6842975 -12191910 -14594186 -11416802 -9471610 -12698163 -15584412 -13663103 -10932039
4163a0932039o36576j605536k62168j446395l249488j095169J066625k228628
$$ -10932039 -11568615 -13174151 -13436319 -14882714 -18132202 -19227371 -18160746 -20389374
4155b0389374n050899L23271O804495K983266n751500o234626j644058m193971
$$ -20389374 -25440273 -25117002 -18312507 -15329241 -21080741 -27315367 -28959425 -33153396
4147c3153396r594476n051649K046221n691948j9729295j6862385p234681k4874360
$$ -33153396 -42747872 -47799521 -45753300 -51445248 -71174543 -88036928 -95271609 -120145969
4139a20145969n8283971m3366987M2350888J24601553J19053615M1971750j8312929
$$ -120145969 -178429940 -221796927 -179446039 -54844486 64209129 106180879 87867950
4132H7867950k0401349k693052m063817j2614770p005284K051187k150422r702060
$$ 87867950 67466601 64773549 60709732 48094962 41089678 43140865 40990443 31288383
4124C1288383m774994N035050M441845k399873k479827K268131J771778k397055
$$ 31288383 26513389 31548439 35990284 33590411 31110584 33378715 35150493 32753438
4116C2753438k217802K61189k004223o222005m803897L30449J871822N75920K013110
$$ 32753438 30535636 30796825 28792602 22570597 17766700 18097149 19968971 20544891 22558001
4107B2558001M300327J500610l960259m216463N89730K743139r2462k382752j137153
$$ 22558001 26858328 28358938 24398679 20182216 20771946 23515085 23422623 21039871 19902718
4098A9902718K03992q50133k195415k189475k244234l116710l441487k804113
$$ 19902718 20106710 19256577 17061162 14871687 12627453 9510743 6069256 3265143
4090C265143k371596k142262q69815J384380L357413M552416M743941K925874
$$ 3265143 893547 -1248715 -2118530 -734150 2623263 7175679 11919620 14845494
4082A4845494p48208l606142l513222j593746J44959J581831K774640K364920
$$ 14845494 14097286 10491144 6977922 5384176 5529135 7110966 9885606 12250526
4074A2250526K25867j196774p49750o17912j899503j876996J025774L409031J995976
$$ 12250526 12476393 11279619 10529869 9911957 8012454 6135458 7161232 10570263 12566239
4065A2566239r28007j460790k42621j58771r06074o61420m88476k066298l333806
$$ 12566239 11638232 10177442 9934821 9776050 8869976 8208556 7720080 5653782 2319976
4056B319976j526949J388353J512874l40331n0758K829523M594343L299955N29633
$$ 2319976 793027 2181380 3694254 3353923 3303165 6132688 10727031 14026986 14556619
4047A4556619k262904m795003n763603l824349n74322J090974J088482J235164
$$ 14556619 12293715 7498712 1735109 -2089240 -2663562 -1572588 -484106 751058
4039G51058J394860M22309k72315J485156M075789L783849N74284k088869k662382
$$ 751058 2145918 2568227 2295912 3781068 7856857 11640706 12214990 10126121 7463739
4030G463739k432131j646890N01975K362571J283472j298613j279806J191065
$$ 7463739 5031608 3384718 3886693 6249264 7532736 6234123 4954317 6145382
4022F145382J509871j612609l553385j012956K899496L547057R94466j420263
$$ 6145382 7655253 6042644 2489259 1476303 4375799 7922856 8917322 7497059
4014G497059j873961r36964J44284J49291j297622k501613j302806J550894L108418
$$ 7497059 5623098 4686134 4830418 4979709 3682087 1180474 -122332 1428562 4536980
4005D536980K507890J409130m5588l518315p651164p584585j728787M903389P028315
$$ 4536980 7044870 8454000 8408412 4890097 -2761067 -10345652 -12074439 -7171050 -142735
3996a42735N377140L601067K239066k57095k893144l002170q10578P13105L94307
$$ -142735 5234405 8835472 11074538 10817443 7924299 4922129 4111551 4824656 5218963
3987E218963Q3376J161208K421209K037970q6962k439703l320061k124893Q434
$$ 5218963 5302339 6463547 8884756 10922726 10835764 8396061 5076000 2951107 2959541
3978B959541J136834O85807m373J24905L12180l62061j103201p34015J02281j38417
$$ 2959541 4096375 4782182 4777809 4902714 5214894 4852833 3749632 3015617 3117898 2979481
3968B979481j335066j840121j014857M8040N30177J104241K483249L836822L717219
$$ 2979481 1644415 -195706 -1210563 -1162523 -632346 471895 2955144 6791966 10509185
3959A0509185K222693J124710J399551J522628n16436l734893m560310j579862
$$ 10509185 12731878 13856588 15256139 16778767 16262331 12527438 7967128 6387266
3951F387266J890925J783455j424187l663356k806841o23042O90327J129437J341874
$$ 6387266 8278191 10061646 8637459 4974103 2167262 1544220 2234547 3363984 4705858
3942D705858R31911l76346j559513j521997m53185O90425J027951l4883j968741
$$ 4705858 5637769 5261423 3701910 2179913 1726728 2417153 3445104 3410221 1441480
3933A441480k544752j29763L250882L580164K43724k783267k249543L72564J698099
$$ 1441480 -1103272 -1233035 2017847 5598011 5841735 3058468 808925 1181489 2879588
3924B879588Q56079p79768k141892k544226j032878J867617L173098Q54404k665190
$$ 2879588 3735667 2955899 814007 -1730219 -2763097 -895480 2277618 3132022 466832
3915D66832l094385m510K567329J500019j606551k869164r34777J830958K577915
$$ 466832 -2627553 -2632063 -64734 1435285 -171266 -3040430 -3975207 -2144249 433666
3906D33666J371777O34323J378528J511466q74815l916821m185008j853516m55620
$$ 433666 1805443 2439766 3818294 5329760 4454945 538124 -3646884 -5500400 -5956020
3897e956020j222368j310058J019303L115173K218183p0754n54814P69596J749662
$$ -5956020 -7178388 -8488446 -7469143 -4353970 -2135787 -2206541 -2761355 -1991759 -242097
3888b42097J770445J267705l75433k957504l446191J21554M230609L775868o35860
$$ -242097 1528348 2796053 2420620 -536884 -3983075 -3861521 369088 4144956 3509096
3879C509096l825952l699139k621149j436604J791547N827841N327859j021640
$$ 3509096 -316856 -4015995 -6637144 -8073748 -6282201 -454360 4873499 3851859
3871C851859o682946n734146r65906J204896M38466J306665M395351N055327J424272
$$ 3851859 -2831087 -8565233 -9531139 -8326243 -7887777 -6581112 -2185761 2869566 4293838
3862D293838k044512j240177J629729J730608j370189l595457k166498J249261
$$ 4293838 2249326 1009149 2638878 4369486 2999297 -596160 -2762658 -1513397
3854a513397L169242K145888m38763k235878k017778m18579J046325J723875K306869
$$ -1513397 1655845 3801733 3362970 1127092 -890686 -1309265 -262940 1460935 3767804
3845C767804L285019L537542J569143j876964l832802k600508k22676j1514k039461
$$ 3767804 7052823 10590365 12159508 10282544 6449742 3849234 3626558 3615044 1575583
3836A575583k933121n74545K797111L438355Q04770k235600l187689k122840k73950
$$ 1575583 -1357538 -1932083 865028 4303383 5108153 2872553 -315136 -2437976 -2711926
3827b711926J669158L295904L895836L045504J165287r35836k542596l012460
$$ -2711926 -1042768 2253136 6148972 9194476 10359763 9423927 6881331 3868871
3819C868871k152157q29544l12388o86906p69729J31636J280386J677261J245123
$$ 3868871 1716714 887170 574782 -112124 -881853 -750217 530169 2207430 3452553
3810C452553M31908m71257j164293j360691j378433j752003j893475m10942K542161
$$ 3452553 3884461 3413204 2248911 888220 -490213 -2242216 -4135691 -4546633 -2004472
3801b004472M572780L814116J313972n42630r89185q48219m68054N01179J669518
$$ -2004472 2568308 6382424 7696396 7153766 6164581 5316362 4848308 5349487 7019005
3792G019005K039794J606055J303187J265640O01034q81907k162474k613229k749160
$$ 7019005 9058799 10664854 11968041 13233681 13834715 12952808 10790334 8177105 5427945
3783E427945k873717k396284j329673j159180k930445n233588n452881k853488
$$ 5427945 2554228 157944 -1171729 -2330909 -5261354 -10494942 -15947823 -18801311
3775a8801311N85026K461574K387622J991119K864635M680474N464434L958233
$$ -18801311 -18216285 -15754711 -13367089 -11375970 -8511335 -3830861 1633573 5591806
3767E591806J345243j97165m25005j052866k554396k879367p43776J495584O27203
$$ 5591806 6937049 6739884 6314879 5262013 2707617 -171750 -915526 580058 1207261
3758A207261k534766l782381j203978K376655L553351K521657J513201J078369
$$ 1207261 -1327505 -5109886 -6313864 -3937209 -383858 2137799 3651000 4729369
3750D729369K64129p01754n63959L61712K16313j301788j977972k42940K295181
$$ 4729369 4993498 4291744 3727785 4089497 4305810 3004022 1026050 783110 3078291
3741C078291K804820P19216k040591l669665l898354l049897j216748J061375
$$ 3078291 5883111 6602327 4561736 892071 -3006283 -6056180 -7272928 -6211553
3733f211553K369791J774929L66191L60988K256679L723503K312528j122415l076266
$$ -6211553 -3841762 -2066833 -1700642 -1339654 917025 4640528 6953056 5830641 2754375
3724B754375j759959N83300P02775j403725k717488j198442J898134L657627K344977
$$ 2754375 994416 1577716 2280491 876766 -1840722 -3039164 -1141030 2516597 4861574
3715D861574j250488m229905l662793L89088M125060L779688L0145k965093k734192
$$ 4861574 3611086 -618819 -4281612 -3892524 232536 4012224 4042369 1077276 -1656916
3706a656916o78869Q96332J439765J255289M98235O9102J035837K081147L98089
$$ -1656916 -2335785 -1439453 312 1255601 1753836 1822938 2858775 4939922 5338011
3697E338011l343775m324582m43914L541198K504413j380585k324514j09893L87639
$$ 5338011 1994236 -2330346 -2774260 766938 3271351 1890766 -433748 -543641 -156002
3688a56002j861535k215749J274081L941293J909304j719159k018916L39975J272253
$$ -156002 -2017537 -4233286 -2959205 982088 2891392 1172233 -846683 -506708 765545
3679G65545Q3626o02093j28636m23127j740485j807393L02868K469313K460920
$$ 765545 849171 247078 118442 -304685 -2045170 -3852563 -3549695 -1080382 1380538
3670A380538N50518j248236j139977J101571L458688L063160k38621k849047j923723
$$ 1380538 1931056 682820 -457157 644414 4103102 7166262 6927641 4078594 2154871
3661B154871M16001Q9909k732395l764440p69861L658744N892211M980181K095999
$$ 2154871 2570872 2660781 -71614 -3836054 -4605915 -947171 4945040 9925221 12021220
3652A2021220j006781k428591j581755n80822j517830k470298L3454M246798L873096
$$ 12021220 11014439 8585848 7004093 6423271 4905441 2435143 2468597 6715395 10588491
3643A0588491k470001p502482m867058J627295L489374m37472l417710j391332
$$ 10588491 8118490 616008 -4251050 -2623755 865619 428147 -2989563 -4380895
3635d380895J972330J905920q45041k511795j898119o37126P0294L98694O16758
$$ -4380895 -2408565 -502645 -1347686 -3859481 -5757600 -6394726 -6324432 -5925738 -5308980
3626e308980P62275J032125J291572Q14256n57841j656492j243264M77808K179446
$$ -5308980 -4546705 -3514580 -2223008 -1408752 -1966593 -3623085 -4866349 -4388541 -2209095
3617b209095K702677J686858k90493j729421j183524J112022L094921K835384
$$ -2209095 493582 2180440 1889947 160526 -1022998 89024 3183945 6019329
3609F019329L05500k837223m553030l560349l10007K784996L150342P91688j439267
$$ 6019329 6324829 3487606 -1065424 -4625773 -4935780 -2150784 999558 1791246 351979
3600C51979r32723J804253L811022K845099l51297k649754j480833K356372N126823
$$ 351979 -580744 1223509 5034531 7879630 7528333 4878579 3397746 5754118 10880941
3591A0880941M056095K86349k941755m141934l993152k851775n45587J457640
$$ 10880941 14937036 15223385 12281630 8139696 4146544 1294769 749182 2206822
3583B206822Q37740j696513k340897L45911K774054J523841j248671q61961K909318
$$ 2206822 3044562 1348049 -992848 -646937 2127117 3650958 2402287 1540326 4449644
3574D449644N432396L459088j270027m851418n118690k406369J252101L098836
$$ 4449644 9882040 13341128 12071101 7219683 2100993 -305376 946725 4045561
3566D045561J758591j000060k134108j163389l36097p57642o86290J293742L494575
$$ 4045561 5804152 4804092 2669984 1506595 1170498 412856 -273434 1020308 4514883
3557D514883L267237P16779j483878j525674k68737M10029L0464k47495M63538
$$ 4514883 7782120 8498899 7015021 5489347 5220610 5630639 5661103 5413608 5877146
3548E877146J207521K15385k415524m114530k742155P32697L566779M423322L748263
$$ 5877146 7084667 7300052 4884528 769998 -1972157 -1239460 2327319 6750641 10498904
3539A0498904J825697j295403m045150l951999q45878K329437K823878Q72113
$$ 10498904 12324601 11029198 6984048 3032049 2186171 4515608 7339486 8211599
3531H211599j449297k681527k511168j263790P9935L69506l64377q85153n91727
$$ 8211599 6762302 4080775 1569607 305817 385752 755258 390881 -494272 -1085999
3522a085999l25731q27513j563880j690155j035969L50620K286968L524625K347720
$$ -1085999 -1411730 -2239243 -3803123 -5493278 -6529247 -6178627 -3891659 -367034 1980686
3513A980686r08675l347395k692420P4850K231141K402753J227177j4948m72318
$$ 1980686 1072011 -2275384 -4967804 -4892954 -2661813 -259060 968117 953169 480851
3504D80851k21805k48618j082357j511477k22539J472792J050709q27962o00835
$$ 480851 259046 10428 -1071929 -2583406 -2805945 -1333153 -282444 -1110406 -1711241
3495a711241K362265L860143J113259k550798k648898l42677j26223k633523m288445
$$ -1711241 651024 4511167 5624426 3073628 424730 82053 -44170 -2677693 -6966138
3486f966138l234168j200448L62278J847584K868778J990344j09176p03290P46413
$$ -6966138 -10200306 -11400754 -11038476 -9190892 -6322114 -4331770 -4440946 -5144236 -4397823
3477d397823J615256M68526p23101j21883J083682J037077J04949l12810L5392
$$ -4397823 -2782567 -2314041 -3037142 -3159025 -2075343 -1038266 -933317 -1246127 -1210735
3468a210735P22822J601827K143354J546568M15358L76458J202357O33708j871087
$$ -1210735 -487913 1113914 3257268 4803836 5219194 5595652 6798009 7431717 5560630
3459E560630l752456l130011j375323j94858J103284L105451L718779J247920
$$ 5560630 1808174 -1321837 -2697160 -2892018 -1788734 1316717 5035496 6283416
3451F283416j877171j914218P70451K445155J533610N4036l55569n43992j304199
$$ 6283416 4406245 2492027 3262478 5707633 7241243 7295279 6939710 6395718 5091519
3442E091519j560305l92595J101735J343101M28115l37802k14942N17155J271852
$$ 5091519 3531214 3138619 4240354 5583455 6011570 5673768 5458826 5975981 7247833
3433G247833J590236J144978j39187j798580k718768j761005P86289K641777J738046
$$ 7247833 8838069 9983047 9843860 8045280 5326512 3565507 4351796 6993573 8731619
3424H731619q33856j791723j99085J079276j56870j818046q35440J734613K242947
$$ 8731619 7897763 6106040 5906955 6986231 6829361 5011315 4175875 5910488 8153435
3415H153435J30631j645294j790747k317516m044148m358656j659007J198556
$$ 8153435 8284066 6638772 4848025 2530509 -1513639 -5872295 -7531302 -6332746
3407f332746R26215j028088q54357J488363K423073P52540m85623Q46659K552879
$$ -6332746 -5406531 -6434619 -7288976 -5800613 -3377540 -2625000 -3110623 -2263964 288915
3398B88915J847182k79893j223468j254618k413088l992094l111175m0812J077243
$$ 288915 2136097 1856204 632736 -621882 -3034970 -7027064 -10138239 -10179051 -9101808
3389i101808j578076m179595k789639P08050J812190M42796L33305K251442K747809
$$ -9101808 -10679884 -14859479 -17649118 -16941068 -15128878 -14686082 -14352777 -12101335 -9353526
3380i353526L76732j471891L0013K736601L228273J900515J245212J381972P05600
$$ -9353526 -8976794 -10448685 -10418672 -7682071 -4453798 -2553283 -1308071 73901 779501
3371G79501n85935j003418p76258j082029j049781J001307L659710L487258M83583
$$ 779501 193566 -809852 -1586110 -2668139 -3717920 -2716613 943097 4430355 4913938
3362D913938j151092Q71022L195851J473664l397884o300081m285663K95394L062959
$$ 4913938 3762846 4633868 7829719 9303383 5905499 -394582 -4680245 -4384851 -1321892
3353a321892K413925M80283K6055J296187K389579K233460J764984J708325R62781
$$ -1321892 1092033 1572316 1598371 2894558 5284137 7517597 9282581 10990906 11953687
3344A1953687j246557l160909k806236j456628j807908l196717k235833J325645
$$ 11953687 10707130 7546221 4739985 3283357 1475449 -1721268 -3957101 -2631456
3336b631456L253629J031455k077424j826597R39016K318012J490270J013452
$$ -2631456 622173 1653628 -423796 -2250393 -1311377 1006635 2496905 3510357
3328C510357J870390K101579O77277n98919j01006J226074J691428J131880K44254
$$ 3510357 5380747 7482326 8159603 7560684 7459678 8685752 10377180 11509060 11753314
3319A1753314o46005j049304j70217J479247J852869J27973j783204k081514j929381
$$ 11753314 11107309 10058005 9887788 11367035 13219904 13347877 11564673 9483159 7553778
3310G553778l250521m864029l722978J92929L192603K782377O95565j44733N76214
$$ 7553778 4303257 -560772 -4283750 -4090821 -898218 1884159 2579724 2434991 3011205
3301C011205J347036J440721Q63073p11845k924804l975870k929291j415565q11783
$$ 3011205 4358241 5798962 6662035 5950190 3025386 -950484 -3879775 -5295340 -6107123
3292f107123N61634M267457P281249N085707j036983m606366k798592N5660j93955
$$ -6107123 -5545489 -1278032 6003217 11088924 10051941 5445575 2646983 2702643 2508688
3283B508688j434721L1141K703336K424358p05517k722632j949422m27495K55812
$$ 2508688 1073967 1105108 3808444 6232802 5527285 2804653 855231 427736 683548
3274F83548N83243O27798l98669j820843j826596l58475J038490K024588L151506
$$ 683548 1266791 1894589 1495920 -324923 -2151519 -2509994 -1471504 553084 3704590
3265C704590L255913Q37340k153069k120277J78120N4603l467422n264173j766501
$$ 3704590 6960503 7797843 5644774 3524497 3702617 3757220 289798 -4974375 -6740876
3256f740876L403347M840087K827342J418259J681565J239314q09220k554269
$$ -6740876 -3337529 1502558 4329900 5748159 7429724 8669038 7859818 5305549
3248E305549k533489j235048M26312J646685J244719q89552k337173o80558K749629
$$ 5305549 2772060 1537012 1963324 3610009 4854728 3965176 1628003 947445 3697074
3239C697074M115147K054764q59201j810638p41049P07589J321014P95245l76928
$$ 3697074 7812221 9866985 9007784 7197146 6456097 7163686 8484700 9279945 8903017
3230H903017r29532N7892J636104J648924o58456l503117m354906k362501R83447
$$ 8903017 7973485 8031377 9667481 11316405 10657949 7154832 2799926 437425 1420872
3221A420872L133818K645829N07256j031503j105056q27534j008382q42614K11163
$$ 1420872 4554690 7200519 7707775 6676272 5571216 4743682 3735300 2892686 3103849
3212C103849R70314N19333J16212J041663J806102O5873l324376m887853l171964
$$ 3103849 4074163 4593496 4709708 5751371 7557473 7623346 4298970 -588883 -3760847
3203c760847l57301J151027J453977J689565J783463R33432p28622j998486j748822
$$ -3760847 -4118148 -2967121 -1513144 176421 1959884 2893316 2164694 166208 -1582614
3194a582614M0835J950846K010909k97973l085996l824375j823839J552200M354135
$$ -1582614 -1541779 409067 2419976 2122003 -963993 -4788368 -6612207 -5060007 -705872
3185g05872M986301K910958k83982j722455o95147Q5638j418693k953516j337338
$$ -705872 4280429 7191387 6907405 5184950 4489803 4575441 3156748 203232 -1134106
3176a134106J978978K576485j68466k184025j083995P08066N98993k91629o3773
$$ -1134106 844872 3421357 3252891 1068866 -15129 692937 1291930 1000301 936528
3167I36528M31598l47500j568013j685304j141648r10400k83331J315491K200540
$$ 936528 1368126 1020626 -547387 -2232691 -3374339 -4284739 -4568070 -3252579 -1052039
3158a052039J008608k35862J095902L574905L389666J87980k297217j638715N28317
$$ -1052039 -43431 -279293 816609 4391514 7781180 7969160 5671943 4033228 4561545
3149D561545J750439J744514J119033j81130j703330j947424n78739N42172O232
$$ 4561545 6311984 8056498 9175531 8994401 7291071 5343647 4764908 5307080 5313312
3140E313312j084337j239679j123921j952957k621537r47454K605381M879689
$$ 5313312 4228975 2989296 1865375 -87582 -2709119 -3656573 -1051192 3828497
3132C828497M053713J719476K45560j71774o85959j419283j516079r66303q22807
$$ 3828497 7882210 9601686 9847246 9675472 8989513 7570230 6054151 5087848 4265041
3123D265041j600542k621963l074485k719689j445874P23243K778785L087788
$$ 4265041 2664499 42536 -3031949 -5751638 -7197512 -6474269 -3695484 -607696
3115f07696J412936m00048p41937l50645p94323j599603p62752J922650L998523
$$ -607696 805240 405192 -336745 -687390 -1481713 -3081316 -3844068 -1921418 2077105
3106B077105L496748J425997J08618K45575Q49326J187637J362104J384785J026328
$$ 2077105 5573853 6999850 7108468 7354043 8203369 9391006 10753110 12137895 13164223
3097A3164223M67027k6677r29931k706404m225659l462598l56669K397527K446291
$$ 13164223 13631250 13604573 12674642 9968238 5742579 2279981 1923312 4320839 6767130
3088F767130O34868m90971k28393q3722q83345j473328q62344o391l20513j473626
$$ 6767130 7401998 6911027 6682634 6598912 5715567 4242239 3379895 3373504 3052991 1579365
3078A579365j878412p45036J335683L226413L780872K419494K54557m09884Q53281
$$ 1579365 -299047 -1044083 291600 3518013 7298885 9718379 9972936 9563052 10416333
3069A0416333J246115j435765m769237m459678o54548K042986J297590j9565R21628
$$ 10416333 11662448 10226683 5457446 997768 343220 2386206 3683796 3664231 4585859
3060D585859K400271J461437j133229k381325j562440l77874J2349m19937j514684
$$ 4585859 6986130 8447567 7314338 4933013 3370573 2992699 3005048 2585111 1070427
3051A070427k226002q19969J923835K204029j107953l226490j66391M113716K997794
$$ 1070427 -1155575 -1975544 -51709 2152320 1044367 -2182123 -2348514 1765202 4762996
3042D762996k231201l977242j49162K907868O83388l286695m237560k920753j855361
$$ 4762996 2531795 -1445447 -1594609 1313259 1996647 -1290048 -5527608 -8448361 -10303722
3033a0303722l82687K151969L013789P04065r75381J494201N060776M626395J029640
$$ -10303722 -10686409 -8534440 -5520651 -4816586 -5791967 -4297766 763010 5389405 6419045
3024F419045r84622n62069p94088k423411l192029k794118l099568l679838k225958
$$ 6419045 5434423 4872354 4078266 1654855 -1537174 -4331292 -7430860 -11110698 -13336656
3015a3336656N61741J510324O32128J192768L526758L943673J073520j607289
$$ -13336656 -12774915 -11264591 -10632463 -9439695 -5912937 -1969264 -895744 -2503033
3007b503033j396237m5229K33517K86048J230006J942793J748516K085767L108453
$$ -2503033 -3899270 -3944499 -3710982 -3424934 -2194928 -252135 1496381 3582148 6690601
2998F690601K248916j102684l112453j004454K203968K171963m05794j951077
$$ 6690601 8939517 7836833 4724380 3719926 5923894 8095857 7690063 5738986
2990E738986k039794k712373l466455j868356J438028K970274J812361O16095
$$ 5738986 3699192 986819 -2479636 -4347992 -2909964 60310 1872671 2488766
2982B488766O76011M0786k248395l689478k087808Q80565K035557Q61651n65976
$$ 2488766 3164777 3205563 957168 -2732310 -4820118 -3939553 -1903996 -1042345 -1608321
2973a608321n86853O88589K153497K590460J439370m16751j220844k96691J203396
$$ -1608321 -2195174 -1506585 646912 3237372 4676742 4259991 3039147 2742456 3945852
2964C945852J837168J274509j25602j969235l493571l681614k411435o16794J093287
$$ 3945852 5783020 7057529 6931927 4962692 1469121 -2212493 -4623928 -5240722 -4147435
2955d147435K758881L594334K016460j607861l957172k491742R21659K372096
$$ -4147435 -1388554 2205780 4222240 2614379 -1342793 -3834535 -2912876 -540780
2947e40780J175327J56678P97235J165369k65250j570431l49647K138587K540444
$$ -540780 634547 791225 1588460 2753829 2488579 918148 568501 2707088 5247532
2938E247532K79287j822496j710762l38783P92639J924829L567195M568631L463582
$$ 5247532 5526819 3704323 1993561 1654778 2447417 4372246 7939441 12508072 15971654
2929A5971654Q07855j419507k245928k249783k116667j935410j739286j638864
$$ 15971654 16779509 15360002 13114074 10864291 8747624 6812214 5072928 3434064
2921C434064j466536j083441p75758n85663K18803J958298L360806K925059J181564
$$ 3434064 1967528 884087 108329 -477334 -258531 1699767 5060573 7985632 9167196
2912I167196J32195M90945R58120L49047j063583k608562m044606m767673l721329
$$ 9167196 9299391 9790336 10748456 11097503 10033920 7425358 3380752 -1386921 -5108250
2903e108250j062799J223555J427640R2463r00530n23351P93899J980226K024920
$$ -5108250 -6171049 -4947494 -3519854 -3427391 -4327921 -4851272 -4057373 -2077147 -52227
2894e2227O20308j101745j180738R13986L161717L077361O54118j605646j549188
$$ -52227 568081 -533664 -1714402 -800416 2361301 5438662 6092780 4487134 2937946
2885B937946L31330J577444N42454j621809k126101k3010K198924J598457j230727
$$ 2937946 3269276 4846720 5389174 3767365 1641264 1618254 3817178 5415635 4184908
2876D184908k954123k170691r55048j027074r60226R26730K953770K101931j275942
$$ 4184908 1230785 -939906 -1894954 -2922028 -3882254 -2955524 -1754 2100177 824235
2867H24235l547284k588872j06026J308432J421666J757700L156438M945462N773082
$$ 824235 -2723049 -5311921 -5417947 -4109515 -2687849 -930149 2226289 7171751 12944833
2858A2944833M625507J651857j594758l354297l404648k987720k843759k251733
$$ 12944833 17570340 19222197 17627439 14273142 10868494 7880774 5037015 2785282
2850B785282n23258J416501J841209L09206j773019k613860j625165L14839J670740
$$ 2785282 2262024 3678525 5519734 5828940 4055921 1442061 -183104 131735 1802475
2841A802475J316162o11433k547736k595435m22978K025611K474798J078075K14045
$$ 1802475 3118637 2507204 -40532 -2635967 -3058945 -1033334 1441464 2519539 2733584
2832B733584J021290J488842n67652l682836m170538j214279J932030K439351
$$ 2733584 3754874 5243716 4676064 993228 -3177310 -4391589 -2459559 -20208
2824b0208J232065O21290Q16703O35892q307m29432p34196j016256j78246K122095
$$ -20208 1211857 1833147 2649850 3285742 3277435 2848003 2113807 1097551 919305 3041400
2814C041400L423501J202495k822489m185633j670269J175208J303188J01353
$$ 3041400 6464901 7667396 4844907 659274 -1010995 164213 1467401 1568754
2806A568754N35353K619518L787238K552371J8625j731890j633777m14275R2022
$$ 1568754 2104107 4723625 8510863 11063234 11081859 9349969 7716192 7301917 7393939
2797G393939j032859k418089k133338o08581N590n23626o4029J832233K315818
$$ 7393939 6361080 3942991 1809653 1201072 1206662 683036 619007 2451240 4767058
2788D767058l86007l534815l561123j244957n755l59673K25068K390438L640965
$$ 4767058 4381051 846236 -2714887 -3959844 -3965599 -4325272 -4100204 -1709766 1931199
2779A931199K592106J035636O13987M65074k82480m49064P25917J414355m1178
$$ 1931199 4523305 5558941 6172928 6638002 6355522 5906458 6632375 8046730 8005552
2770H005552j979704j693262L97457J566855R54470N2822n95645k099149m191724
$$ 8005552 6025848 4332586 4730043 6296898 7251368 7304190 6708545 4609396 417672
2761D17672m467538j934521R47417J433217O2061o33406K49758J458527J923924
$$ 417672 -4049866 -5984387 -5036970 -3603753 -3541692 -4175098 -3925340 -2466813 -542889
2752e42889J819005J483928Q44516J19756k373O79066J316438P62756j159203
$$ -542889 1276116 2760044 3604560 3724316 3721943 4401009 5717447 6480203 5321000
2743E321000l098975l161839j087726Q02977Q1423k319655k878116l60578K186936
$$ 5321000 2222025 -939814 -2027540 -1224563 -1143140 -3462795 -6340911 -6701489 -4514553
2734d514553J804644j12388k91662J303257J930360P74403k35557k23970m55130
$$ -4514553 -2709909 -2822297 -3113959 -1810702 119658 894061 658504 434534 -20596
2725b0596r94862J70920L205781M815358K753499o19814j742774p37823k19674
$$ -20596 -1015458 -844538 2361243 7176601 9930100 9310286 7567512 6829689 6610015
2716F610015q41191r54437J69558J476439K053249J710784K12066j896778k402375
$$ 6610015 5768824 4814387 4983945 6460384 8513633 10224417 10436483 8539705 6137330
2707F137330N9005L042973K724572o51686k738950j201365J063469L23083k740984
$$ 6137330 6196335 9239308 11963880 11312194 8573244 7371879 8435348 8758431 6017447
2698F017447m296459k469780R01630L001682K719565O86291j872498l766397m091335
$$ 6017447 1720988 -748792 152838 3154520 5874085 6560376 4687878 921481 -3169854
2689c169854k684999n27032P57211M86884J768J150199L352181L596003N18386
$$ -3169854 -5854853 -6381885 -5624674 -5137790 -5136022 -3985823 -633642 2962361 3480747
2680C480747k903724k745087N89755K906027J894373l29346r52078k23255m8061
$$ 3480747 577023 -2168064 -1578309 1327718 3222091 2892745 1940667 1717412 1669351
2671A669351o81295p55213K32558J163387R77946J07039k4718J258417K680510
$$ 1669351 988056 232843 465401 1628788 2606734 2713773 2689055 3947472 6627982
2662F627982K042199r61173l658863l419109j213660l76695j941626l330201k127155
$$ 6627982 8670181 7709008 4050145 631036 -582624 -959319 -2900945 -6231146 -8358301
2653h358301Q73136L194172L468331J881395l95753j364752K74767K701997K188328
$$ -8358301 -7485165 -4290993 -822662 1058733 662980 -701772 -427005 2274992 4463320
2644D463320j830385n084732l847563O7746K200880J580911Q04463J043814O53709
$$ 4463320 2632935 -2451797 -6299360 -6231614 -4030734 -2449823 -1645360 -601546 52163
2635E2163j051861k003321n89142J740530K589737J758574R04489J125899K024940
$$ 52163 -999698 -3003019 -3592161 -1851631 738106 2496680 3401169 4527068 6552008
2626F552008K459598J392092j358293m475250n817050m427502j569755O15304
$$ 6552008 9011606 10403698 9045405 4570155 -1246895 -5674397 -7244152 -6628848
2618f628848J060115J53042j100358j710647j063084N20784J704599J331073j64545
$$ -6628848 -5568733 -5415691 -6516049 -8226696 -9289780 -8768996 -7064397 -5733324 -5897869
2609e897869j059066l40269J025393J335739M16238j68256O52687J907940J970223
$$ -5897869 -6956935 -7297204 -6271811 -4936072 -4519834 -4688090 -4035403 -2127463 -157240
2600a57240Q08124j65923j28467M02239P08865O25060J47347n48097o60913M15381
$$ -157240 650884 484961 356494 758733 1467598 2092658 2240005 1691908 1030995 1446376
2590A446376J723863J551846j86577j800567k235124j954813j193335N07752K322501
$$ 1446376 3170239 4722085 4535508 2734941 499817 -1454996 -2648331 -2140579 181922
2581A81922K154496l2280j309080j05331Q93786j218738m551811m708334j104063
$$ 181922 2336418 2304138 995058 889727 1783513 564775 -3987036 -8695370 -9799433
2572i799433K328478K536268M54669j439903j950122j052086O59027J827348J583953
$$ -9799433 -7470955 -4934687 -4480018 -5919921 -7870043 -8922129 -8263102 -6435754 -4851801
2563d851801J151733K123919L230087J664019j939837l248775m61531K468919
$$ -4851801 -3700068 -1576149 1653938 3317957 1378120 -1870655 -2332186 136733
2555A36733J468855j414388j049876K826270M874262J836263k727782l398218
$$ 136733 1605588 191200 -858676 1967594 6841856 8678119 5950337 2552119
2547B552119j61138K118938N47819k489322l345234j766444J14939J424414K594842
$$ 2552119 2390981 4509919 5057738 2568416 -776818 -2543262 -2428323 -1003909 1590933
2538A590933K856928Q71158k058680k640449m30781J076880k11815j730950q05713
$$ 1590933 4447861 5319019 3260339 619890 189109 1265989 1054174 -676776 -1482489
2529a482489N65342q90044l752882l711591k41419K909902L568507L118790K478621
$$ -1482489 -917147 -1807191 -5560073 -9271664 -9513083 -6603181 -3034674 84116 2562737
2520B562737N84166k142705l080666j739071r57762j998661k238085J3620K095363
$$ 2562737 3146903 1004198 -2076468 -3815539 -4773301 -6771962 -9010047 -8996427 -6901064
2511f901064J275340p66730r56104M21492J357755K039178L419353L946012J759279
$$ -6901064 -5625724 -6392454 -7348558 -6927066 -5569311 -3530133 -110780 3835232 5594511
2502E594511j280106j839846m22791l31829j940248k315476o34575L75887o44491
$$ 5594511 4314405 2474559 2051768 1719939 -220309 -2535785 -3170360 -2794473 -3438964
2493c438964j276564N01585K865794K824912J18063l123205m713393l321198Q00401
$$ -3438964 -4715528 -4213943 -1348149 1476763 1594826 -1528379 -6241772 -9562970 -8762569
2484h762569M781929N060418J770222r16226l32803J145887J41590k464938l181533
$$ -8762569 -3980640 1079778 2850000 1933774 1600971 2746858 2888448 423510 -2758023
2475b758023j281615O70943J035275P66030Q61927R43743Q85511J398880K163691
$$ -2758023 -4039638 -3368695 -2333420 -1567390 -705463 238280 1123791 2522671 4686362
2466D686362J567312n93430k110623j440798m4155O4625l76970P52403L125530
$$ 4686362 6253674 5660244 3549621 2108823 2064668 2129293 1752323 2504726 5630256
2457E630256M008588K178543m43430j670183j657423j684594j936990j834904
$$ 5630256 9638844 11817387 11373957 9703774 8046351 6361757 4424767 2589863
2449B589863j490036j434642j503493j142763l76511M66560J417184K312953K271402
$$ 2589863 1099827 -334815 -1838308 -2981071 -3357582 -2891022 -1473838 839115 3110517
2440C110517Q57971q09000j302913o64837K21362J181445K147739J947214j50063
$$ 3110517 3968488 3159488 1856575 1191738 1413100 2594545 4742284 6689498 6539435
2431F539435k239276j683718Q23227J750844k97518k776686l163764k016535q08597
$$ 6539435 4300159 2616441 3439668 5190512 4892994 2116308 -1047456 -3063991 -3872588
2422c872588N61051K136182K147371n13466l559071l649311p04368K275488L130751
$$ -3872588 -3311537 -1175355 972016 458550 -3100521 -6749832 -7454200 -5178712 -2047961
2413b047961K372378J514847J310250J508615J221623j51098j687875j590481
$$ -2047961 324417 1839264 3149514 4658129 5879752 5728654 4040779 2450298
2405B450298K35159J712632J608082J011437N07538j445454m873130n779068j210329
$$ 2450298 2685457 4398089 6006171 7017608 7525146 6079692 1206562 -4572506 -5782835
2396e782835M868648N444030p7594m799267l492038J305571L899428K552899l11027
$$ -5782835 -914187 4529843 4452249 -347018 -3839056 -2533485 1365943 3918842 3607815
2387C607815k340510l010023k602653j717254j219961j346847j357433p11618
$$ 3607815 1267305 -1742718 -4345371 -6062625 -7282586 -8629433 -9986866 -10698484
2379a0698484L01466J523609L235472M924285N112859L249561O85059r56752j485549
$$ -10698484 -10397018 -8873409 -5637937 -713652 4399207 7648768 8333827 7377075 5891526
2370E891526j777132k593775l963350m814000l471602J34468L198435K907245
$$ 5891526 4114394 1520619 -2442731 -7256731 -10728333 -10593865 -7395430 -4488185
2362d488185L39865q25964N39239J962340J855463J791825K972933L576366J872860
$$ -4488185 -4148320 -4974284 -4435045 -2472705 -617242 1174583 4147516 7723882 9596742
2353I596742m46605o74783Q24934J449937J88312j605472k476851k005559l69443
$$ 9596742 9150137 8475354 9300288 10750225 10938537 9333065 6856214 4850655 4481212
2344D481212J508246J979897L74818j822813k701051k156740j346328q11805l74062
$$ 4481212 5989458 7969355 8344173 6521360 3820309 1663569 317241 -494564 -868626
2335h68626j01532k17130o24290j237233j982442k168604j232716l13529j000311
$$ -868626 -970158 -1187288 -1811578 -3048811 -5031253 -7199857 -8432573 -8746102 -9746413
2326i746413k117484o25586L209159M973888K522840k75629O67539L384676L531472
$$ -9746413 -11863897 -12489483 -9280324 -4306436 -1783596 -2059225 -1391686 1992990 5524462
2317E524462J662044J621291L174619K044934k590988o128654n390752k769234
$$ 5524462 7186506 8807797 11982416 14027350 11436362 5307708 -83044 -2852278
2309b852278j562664j251609j2566J303793P62296j105400k054624j230176N13048
$$ -2852278 -4414942 -5666551 -5679117 -4375324 -3613028 -4718428 -6773052 -8003228 -7490180
2300g490180K302505L480772L090982Q66517j708424k571623j120188J422013
$$ -7490180 -5187675 -1706903 1384079 2250596 542172 -2029451 -3149639 -1727626
2292a727626L090751K397673n27122l569806m347539k656365m02460Q44127J077032
$$ -1727626 1363125 3760798 3233676 -336130 -4683669 -7340034 -7742494 -6898367 -5821335
2283e821335Q60430O86098J218449K394095K415339j29468l112978k638544J352636
$$ -5821335 -4960905 -4274807 -3056358 -662263 1753076 1623608 -1489370 -4127914 -2775278
2274b775278M221230K790067m55581j371641J15665R31662k48468j885900k447853
$$ -2775278 1445952 4236019 3780438 2408797 2524462 3456124 3207656 1321756 -1126097
2265a126097j862681o00129N71776L23310j770544l793877l360670p55500J467829
$$ -1126097 -2988778 -3588907 -3017131 -2693821 -4464365 -8258242 -11618912 -12374412 -10906583
2256a0906583J862633J348717J046578N95709p28363k358838k750664j130292
$$ -10906583 -9043950 -7695233 -6648655 -6052946 -6781309 -9140147 -11890811 -13021103
2248a3021103J354610K433659J108156q86099r72907Q92064K241232J864360J511553
$$ -13021103 -11666493 -9232834 -8124678 -9010777 -9983684 -9091620 -6850388 -4986028 -3474475
$$ [...]
##END NTUPLES=NMR SPECTRUM
##END=
