##TITLE=31Pdec_DE-101_TFA2
CDCl3, 64 sc
 14.8.2025
##JCAMPDX= 6.0         $$ Bruker NMR JCAMP-DX V2.0
##DATA TYPE= NMR SPECTRUM
##DATA CLASS= NTUPLES
##ORIGIN= UXNMR, Bruker Analytische Messtechnik GmbH
##OWNER= root
$$ XWIN-NMR		Version 3.5
$$ Thu Aug 14 14:11:11 2025 Russian Standard Time (UT+4h)  she@DPX200
##.OBSERVE FREQUENCY= 81.013821
##.OBSERVE NUCLEUS= ^31P
##.ACQUISITION MODE= SIMULTANEOUS
##.ACQUISITION SCHEME= undefined
##.AVERAGES= 64
##.DIGITISER RES= 17
##SPECTROMETER/DATA SYSTEM= spect
##.PULSE SEQUENCE= zgpg30
##.SOLVENT NAME= DMSO
##.SHIFT REFERENCE= (INTERNAL, DMSO, 0, 198.062)
##AUDIT TRAIL= $$ (NUMBER, WHEN, WHO, WHERE, WHAT)
$$ ##TITLE= Audit trail, XWIN-NMR		Version 3.5
$$ ##JCAMPDX= 5.01
$$ ##ORIGIN= Bruker BioSpin GmbH
$$ ##OWNER= she
$$ F:/spectra/data/she/nmr/P31/2/pdata/1/auditp.txt
$$ ##AUDIT TRAIL=  $$ (NUMBER, WHEN, WHO, WHERE, WHAT)
(   1,<2025-08-14 14:10:22.54 +0400>,<she>,<DPX200>,
      <created by zg, POWCHK disabled, PULCHK disabled
       configuration hash MD5:
       00 E9 B6 7A A2 85 ED C7 34 08 36 98 17 FE 4E 26
       data hash MD5: 32K
       1E 17 A8 D8 D6 08 E8 CA 0E 5B 42 CC 54 5E 2A 7A>)
(   2,<2025-08-14 14:10:25.03 +0400>,<she>,<DPX200>,
      <Start of raw data processing
       efp BC_mod = 2 LB = 1.5 FT_mod = 6 PKNL = 1 PHC0 = 1776.589 PHC1 = 6.499474 SI = 64K 
       data hash MD5: 64K
       3B 85 D3 E2 58 4F 1D 42 30 23 FA 5A 9E 5B 0D 32>)
(   3,<2025-08-14 14:10:40.59 +0400>,<she>,<DPX200>,
      <pk PHC0 = -4.938706 PHC1 = 0 
       data hash MD5: 64K
       8E 89 B1 04 82 C5 2F 31 80 0F DD F9 19 91 6B 6D>)
(   4,<2025-08-14 14:10:46.09 +0400>,<she>,<DPX200>,
      <abs ABSG = 5 
       data hash MD5: 64K
       7C 77 75 76 D1 73 7F F3 97 26 E5 77 6D C4 03 90>)
$$ ##END=
$$ 
$$ hash MD5
$$ 66 C3 BF EA F3 DC FF 75 9A EC BA 77 4E 61 AA 7A
##$RELAX= 
##$RELAX= 
##$RELAX= 
##$RELAX= 
##$RELAX= 
##$RELAX= 
##$RELAX= 
##$RELAX= 
$$ Bruker specific parameters
$$ --------------------------
##$DU= <F:/spectra>
##$EXPNO= 2
##$NAME= <P31>
##$PROCNO= 1
##$TYPE= <nmr>
##$USER= <she>
##$AMP= (0..31)
100 100 100 100 100 100 100 100 100 100 100 100 100 100 100 100 100 100 
100 100 100 100 100 100 100 100 100 100 100 100 100 100 
##$AQSEQ= 0
##$AQ_mod= 1
##$AUNM= <au_zg>
##$AUTOPOS= <>
##$BF1= 81.014009
##$BF2= 200.13
##$BF3= 200.13
##$BF4= 200.13
##$BF5= 200.13
##$BF6= 200.13
##$BF7= 200.13
##$BF8= 200.13
##$BYTORDA= 1
##$CFDGTYP= 0
##$CFRGTYP= 5
##$CHEMSTR= <none>
##$CNST= (0..31)
1 1 145 1 1 1 1 1 1 1 1 1 1 1 1 1 1 1 1 1 1 1 1 1 1 1 1 1 1 1 1 1 
##$CPDPRG= <waltz16>
##$CPDPRG1= <>
##$CPDPRG2= <waltz16>
##$CPDPRG3= <>
##$CPDPRG4= <mlev>
##$CPDPRG5= <mlev>
##$CPDPRG6= <mlev>
##$CPDPRG7= <mlev>
##$CPDPRG8= <mlev>
##$CPDPRGB= <>
##$CPDPRGT= <>
##$D= (0..31)
0 1 0 0 0 0 0 0 0 0.06 0 0.03 2e-05 3e-06 0 0 0.0002 0 0 0 0 0 0 0 0 0 
0 0 0 0 0 0 
##$DATE= 1755166221
##$DBL= (0..7)
120 120 120 11 120 120 24 19 
##$DBP= (0..7)
150 150 150 150 150 150 150 150 
##$DBP07= 0
##$DBPNAM0= <>
##$DBPNAM1= <>
$$ [...]
##$SUBNAM3= <"">
##$SUBNAM4= <"">
##$SUBNAM5= <"">
##$SUBNAM6= <"">
##$SUBNAM7= <"">
##$SUBNAM8= <"">
##$SUBNAM9= <"">
##$SW= 400.765351723535
##$SWIBOX= (0..15)
0 1 3 0 0 0 0 0 0 0 0 0 0 0 0 0 
##$SW_h= 32467.5324675325
##$TD= 32768
##$TD0= 1
##$TE= 0
##$TE2= 300
##$TE3= 300
##$TEG= 300
##$TL= (0..7)
0 120 53 12 22 120 120 120 
##$TP= (0..7)
150 150 150 150 150 150 150 150 
##$TP07= 0
##$TPNAME0= <>
##$TPNAME1= <>
##$TPNAME2= <>
##$TPNAME3= <>
##$TPNAME4= <>
##$TPNAME5= <>
##$TPNAME6= <>
##$TPNAME7= <>
##$TPOAL= (0..7)
0.5 0.5 0.5 0.5 0.5 0.5 0.5 0.5 
##$TPOFFS= (0..7)
0 0 0 0 0 0 0 0 
##$TUNHIN= 0
##$TUNHOUT= 0
##$TUNXOUT= 0
##$USERA1= <user>
##$USERA2= <user>
##$USERA3= <user>
##$USERA4= <user>
##$USERA5= <user>
##$V9= 5
##$VALIST= <valist>
##$VCLIST= <CCCCCCCCCCCCCCC>
##$VD= 0
##$VDLIST= <DDDDDDDDDDDDDDD>
##$VPLIST= <PPPPPPPPPPPPPPP>
##$VTLIST= <TTTTTTTTTTTTTTT>
##$WBST= 1024
##$WBSW= 4
##$XGAIN= (0..3)
0 0 0 0 
##$XL= 0
##$YL= 0
##$YMAX_a= 13972
##$YMIN_a= -9792
##$ZGOPTNS= <>
##$ZL1= 120
##$ZL2= 120
##$ZL3= 120
##$ZL4= 120
##$ABSF1= 198.0616
##$ABSF2= -202.7028
##$ABSG= 5
##$ABSL= 3
##$ALPHA= 0
##$AQORDER= 0
##$ASSFAC= 0
##$ASSFACI= 0
##$ASSFACX= 0
##$ASSWID= 0
##$AUNMP= <proc_1d>
##$AZFE= 0.1
##$AZFW= 0.5
##$BCFW= 0
##$BC_mod= 2
##$BYTORDP= 0
##$COROFFS= 0
##$CY= -3
##$DATMOD= 1
##$DC= 0
##$DFILT= <>
##$DTYPP= 0
##$F1P= 0
##$F2P= 0
##$FCOR= 1
##$FTSIZE= 65536
##$FT_mod= 6
##$GAMMA= 0
##$GB= 0
##$INTBC= 1
##$INTSCL= 9.790993e-09
##$ISEN= 30
##$LB= 1.5
##$LEV0= 0
##$LPBIN= 0
##$MAXI= 10000
##$MC2= 0
##$MEAN= 0
##$ME_mod= 0
##$MI= 50
##$NCOEF= 0
##$NC_proc= -9
##$NLEV= 6
##$NOISF1= 182.463
##$NOISF2= 159.3651
##$NSP= 0
##$NTH_PI= 0
##$NZP= 0
##$OFFSET= 198.0616
##$PC= 4
##$PHC0= 1771.65
##$PHC1= 6.499474
##$PH_mod= 1
##$PKNL= yes
##$PPARMOD= 0
##$PSCAL= 0
##$PSIGN= 0
##$REVERSE= no
##$SF= 81.0140089999434
##$SI= 65536
##$SIGF1= 159.3651
##$SIGF2= -187.1042
##$SINO= 113.3802
##$SIOLD= 16384
##$SREGLST= <1H.CDCl3>
##$SSB= 0
##$STSI= 65536
##$STSR= 0
##$SW_p= 32467.5324675325
##$SYMM= 0
##$S_DEV= 0
##$TDeff= 32768
##$TDoff= 0
##$TI= <>
##$TILT= no
##$TM1= 0
##$TM2= 0
##$TOPLEV= 0
##$USERP1= <user>
##$USERP2= <user>
##$USERP3= <user>
##$USERP4= <user>
##$USERP5= <user>
##$WDW= 1
##$XDIM= 65536
##$YMAX_p= 136138397
##$YMIN_p= -550562549
$$ End of Bruker specific parameters
$$ ---------------------------------
##NTUPLES= NMR SPECTRUM
##VAR_NAME=  FREQUENCY,     SPECTRUM/REAL,   SPECTRUM/IMAG
##SYMBOL=    X,             R,               I
##VAR_TYPE=  INDEPENDENT,   DEPENDENT,       DEPENDENT
##VAR_FORM=  AFFN,          ASDF,            ASDF
##VAR_DIM=   65536,         65536,           65536
##UNITS=     HZ,            ARBITRARY UNITS, ARBITRARY UNITS
##FACTOR=    0.49542278885378, 1,            1
##FIRST=     16045.7642231865, 0,            0
##LAST=      -16421.768244346, 0,            0
##MIN=       -16421.768244346, -550562549,   0
##MAX=       16045.7642231865, 136138397,    0
$$ Real data points
##PAGE= N=1
##DATA TABLE= (X++(R..R)), XYDATA
$$ [...]
##PAGE= N=2
##DATA TABLE= (X++(I..I)), XYDATA
7356b0313601N548155J0099325Q142718L615449J44770p51325K125049O808533
7348A5419073O918244j61217p243264o570401j527670p75389l835727k850511
7340f26862K470466L240369l332967q094587m080294K688715K980709k045981
7332f800432m243743q14917L836474N840276N134679K545033r50353k811591j404548
7323C30878O30659m17297l214503k699226K276215O786476O510908K944086j03039
7314A3045157k192632n240201q374566p789255k443659L313563M984702L589226
7306a107665L070721L530915J396150l508784o040192l117970J385666K632317
7298a758842J815467K550725L567784J046078l586338m891647k245286q00161
$$ y = [-20313601, -14765446, -4666121, 3476597, 7092046, 7236816, 6485491, 8610540, 15419073, 22337317, 22176100, 14932836, 8362435, 6834765, 6059376, 2223649, -626862, 1843604, 5083973, 1751006, -6343581, -10423875, -7735160, -4754451, -6800432, -11044175, -11859092, -8022618, -2182342, 2952337, 5497370, 4547017, 1735426, 330878, 961537, 544240, -2670263, -5369489, -3093274, 3693202, 10204110, 13148196, 13045157, 10852525, 5612324, -2762242, -10551497, -12995156, -9681593, -4696891, -1107665, 1963056, 5493971, 6890121, 3381337, -2658855, -5776825, -4391159, -1758842, 56625, 2607350, 6175134, 7221212, 3634874, -1256773, -3502059, -4302220]
7290d302220k576689k962938J453306O946547P783078L433884j996887m314163
7282C463918j507919M727688Q294927M065443m278289p017342j393817M173116
7274A0527725K472453k376505k709092P23010J981658P55250J429061L745634
7266A6549194L122232k63858j045246J742777K240313k875471r041043j0662457
7258b33559q075876m707742j732653J281015L786051N128177N496886M304633
7250E246932N24492l961170m921729j692507R52135o79368l943448l962610l46242
7241a2783515L198730M007454K392629o8601j711583j414274j1840R3882j752385
7232h049503l080850j733860J058472K649053K275525Q38794p23423j262584K71792
$$ y = [-4302220, -6878909, -9841847, -8388541, -1441994, 6341084, 9774968, 7778081, 3463918, 1955999, 6683687, 14978614, 19044057, 14765768, 7748426, 6354609, 10527725, 13000178, 10623673, 7914581, 8637591, 10619249, 11374499, 12803560, 16549194, 19671426, 19407568, 18362322, 20105099, 22345412, 19469941, 10428898, -233559, -8309435, -13017177, -14749830, -13468815, -9682764, -4554587, 942299, 5246932, 5771424, 1810254, -3111475, -4803982, -3851847, -4531215, -8474663, -12437273, -12783515, -9584785, -5577331, -3184702, -3253303, -4964886, -6379160, -6391000, -6297118, -8049503, -11130353, -12864213, -11805741, -9156688, -6881163, -6042369, -6765792, -8028376, -7756584]
7223g756584K605628K504735o34782k951150j194662K732088M834810M106221
7215D246304J687063k167865o412851p081987j788100N053310O560698K376742
7207B473314j517770j627794l55166k91903p18390j254908l567787o859222o527408
7198b0247034q76186M700073M269891o24120l421264j030745L791174O982958
7190f455253O567050K704626k208761m315899k261914M47456K0034j928055r66973
7181h397689K798407M529512J938229j903255m072275n408045o568477n105020
7173b2188613L5766M772454N039815L121393L955324O735025N848328K28629m062295
7164C485826k610045R95415J073521j666055k182365N32347K360609J028565q44259
$$ y = [-7756584, -5150956, -2646221, -3281003, -6232153, -7426815, -4694727, 140083, 4246304, 5933367, 3765502, -2647349, -9729336, -11517436, -6464126, 96572, 2473314, 955544, -672250, -1027416, -1319319, -2037709, -3292617, -6860404, -13719626, -20247034, -21123220, -16423147, -12153256, -12777376, -16198640, -17229385, -13438211, -6455253, 111797, 2816423, 607662, -3708237, -5970151, -5522695, -5502661, -7430716, -8397689, -5599282, -1069770, 868459, -1034796, -5107071, -10515116, -17083593, -22188613, -22152847, -17380393, -12340578, -9219185, -5263861, 1471164, 7319492, 7548121, 3485826, 875781, 1871196, 2944717, 1278662, -903703, -371356, 1989253, 3017818, 2173559]
7155B173559r50201j125102l277647m925615k698661J605402K920385N99577l04460
7146e982763L066560O124188K752927n637820j0840027p483443J093319P207820
7138i699239O628379J089159m699606o891305m836407j347431Q5995o02311Q1387
7129b0191379M119508Q616670R536474O972725L742379M12080l925253o665375
7121B617829l275020M630057Q551830L986322k845294l867891l93291Q41785n16799
7112I729528J046449N538587N848583l90730n847310m665139j289042k352245
7104G618681n885364n824526k727531j763834k745650r21353L120010L199252
7096e930315j624481m220010k52889N175652N606483J993790r89400k276058k994068
$$ y = [2173559, 1223358, 98256, -3179391, -8105006, -10803667, -9198265, -6277880, -5678303, -5982763, -2916203, 3207985, 5960912, 323092, -10516935, -18000378, -16907059, -9699239, -3070860, -1981701, -6681307, -13572612, -18409019, -19756450, -19670455, -20272766, -20191379, -16071871, -7455201, 2081273, 9053998, 12796377, 13208457, 9283204, 2617829, -657191, 3972866, 12524696, 16511018, 13665724, 9797833, 9404542, 10246327, 9729528, 10775977, 16314564, 22163147, 21772417, 15925107, 11259968, 9970926, 7618681, 1733317, -4091209, -6818740, -8582574, -11328224, -12249577, -9129567, -5930315, -7554796, -11774806, -12027695, -6852043, -1245560, 748230, -241170, -2517228, -5511296]
7087e511296j906876K051433N363206L598623j822633n143500l614880M74527
7079f511396L886054M809881K516738j413695k717611O74206M553456L439335
7071I236968j573742m689845l978451k533025j710696K98664K597107J290239
7063a062781k811744l115762K535903P010735M231338j357402k097172P30985
7055D064100P3026m166271m627218Q85130M952579J923778l265676k860827J877853
7046a143526L113243j167659l937845K37746O586412O194475j557772p464414
7038H60660m253653M093455P850593L948409j638909l383423k673190k796605
7030B007337k553559N97215M280306L870374K83105p83229K057834L240838j032141
$$ y = [-5511296, -7418172, -5366739, -3533, 3595090, 1772457, -3371043, -6985923, -6511396, -2625342, 2184539, 4701277, 3287582, 569971, 1244177, 5797633, 9236968, 7663226, 2973381, -1005070, -3538095, -5248791, -4950127, -2353020, -1062781, -3874525, -6990287, -4454384, 2556351, 6787689, 5430287, 3333115, 4064100, 4137126, -29145, -4656363, -3771233, 1181346, 3105124, -160552, -3021379, -1143526, 1969717, 802058, -3135787, -2898041, 3688371, 9882846, 8325074, 860660, -3392993, 700462, 8551055, 12499464, 10860555, 7477132, 4803942, 2007337, -546222, 50993, 4331299, 8201673, 8484778, 7701549, 9759383, 13000221, 11968080]
7021A1968080o298804n821603J54507N323902N698405K903958j88966k924248
7013A0815231n088170n023336j630050L241213O202120N732010L204273Q67104
7005A8320395l24612q82942j527270k257140k614189k435138k002335j601223
6997D675546j301187j048890n22936Q90796L157589M596352K959542j727809o072455
6988E606548o093212j231238M830052P461709N159842N36806k486166k332622
6980A1451719n18840Q92516J508465J754028J145329q75758k975258k961947j044831
6971H375423k1091j497175l822718m809499m625737m536775m484689l751559k597852
6962b1771672j246021J367289N434626Q187736O988956L621881J930051J628852
$$ y = [11968080, 5669276, -152327, 2180, 5326082, 11024487, 13928445, 13739479, 10815231, 5727061, 703725, -926325, 2314888, 8517008, 14249018, 17453291, 18320395, 17995783, 17112841, 15585571, 13328431, 10714242, 8279104, 6276769, 4675546, 3374359, 2325469, 1802533, 2693329, 5850918, 10447270, 13406812, 11679003, 5606548, -486664, -1717902, 3112150, 10573859, 15733701, 16270507, 13784341, 11451719, 10932879, 11825395, 13333860, 15087888, 16233217, 15357459, 12382201, 9420254, 8375423, 8354332, 6857157, 3034439, -1775060, -6400797, -10937572, -15422261, -19173820, -21771672, -23017693, -21650404, -16215778, -8028042, -1039086, 2582795, 4512846, 6141698]
6954F141698j056258n927537p246441k322252L157939K873221q35565j323672
6946f538867J195103L29044m780067o678659j503759L809244J847936l482046
6938a5802071l102978K650144M509344r37682n826173l152380L115403M908393
6930a3638000J627445j026705m08085J058239J759280L035129N266568O376001
6922D049872N018354J914355k306862p221650j0241213p907271r42086M949477
6914a2687024M983724R8949m948622o218106k896520K414500N051457K644713
6906a1556929j210550p64650L631636N164996L95625m983221l942161J892003
6898a1373251N058415L070360Q00549K113685M295290K642028k912010q142393
$$ y = [6141698, 5085440, -842097, -8088538, -10410790, -7252851, -4379630, -5215195, -6538867, -5343764, -5014720, -9794787, -16473446, -17977205, -14167961, -12320025, -15802071, -18905049, -16254905, -11745561, -12683243, -18509416, -21661796, -18546393, -13638000, -12010555, -13037260, -13445345, -12387106, -10627826, -7592697, -2326129, 4049872, 9068226, 10982581, 8675719, 1454069, -8787144, -16694415, -17636501, -12687024, -7703300, -7604351, -12552973, -18771079, -21667599, -19253099, -14201642, -11556929, -12767479, -13532129, -9900493, -4735497, -4339872, -9323093, -13265254, -11373251, -6314836, -3244476, -2443927, -330242, 3965048, 6607076, 3695066, -4447327]
6890d447327r629692p489822l858321k60263L138462N974829O333766K734735
6882g503633k191008k768673K687449Q088907O313876j342103o400400l881966
6874f997551K206121N029884K872402r95335l435395l915170l572487l871501
6866a2679032n105096n170293j630095L889046N945324K146657k552493j571898
6858a6727880M700569R506399Q339620L436102o21515k297303k740141k801265
6850G94586k522034k097486j564795l97836J404934K801661L251382L455262L342730
6841H468404J008539m243267r132542r526576n860459k476847j545539r95842
6833b4304129P48918J862369J149153J329593M525560P119351M085783k618863
$$ y = [-4447327, -14077019, -21566841, -25425162, -25685425, -22546963, -16572134, -10238368, -7503633, -9694641, -12463314, -9775865, -1686958, 4626918, 3284815, -3115585, -6997551, -4791430, 238454, 3110856, 2115521, -1319874, -5235044, -8807531, -12679032, -17784128, -22954421, -24584516, -20695470, -14750146, -12603489, -15155982, -16727880, -12027311, -2520912, 5818708, 9254810, 8633295, 6335992, 3595851, 794586, -1727448, -3824934, -5389729, -5787565, -4382631, -1580970, 1670412, 5125674, 8468404, 9476943, 5233676, -3898866, -13425442, -19285901, -21762748, -23308287, -24304129, -23555211, -21692842, -20543689, -19214096, -14688536, -7569185, -3483402, -6102265]
6825f102265n466222j794118K461557J642183j779176j873818J789641M574456
6817f547762M248715L086012K794799J901807p28201l312377l823754k741451
6809e122212j406703K52399K277646K618517o75143n490402o611263j788704M873005
6800a1072860P337007M586678J124007P54690K503030L621264L740211L555817
6792A6149844J818270k517884o425709n664833j472931L34855k155986m245309
6784d179683k178742J457821K633154J533942O365k043859l666642j114505N590155
6775a961994Q780874K512922p563656j0949165o275249p32599K223010N355853
6767h610004Q519575P095508J219523k587324j605645k89780r12261j2478K333588
$$ y = [-6102265, -11568487, -13362605, -10901048, -9258865, -11038041, -12911859, -11122218, -6547762, -2299047, 786965, 3581764, 5483571, 4755370, 1442993, -2380761, -5122212, -6528915, -6276516, -3998870, -1380353, -2055496, -7545898, -14157161, -15945865, -11072860, -3735853, 850825, 1974832, 2729522, 5232552, 8853816, 12594027, 16149844, 17968114, 15450230, 9024521, 3359688, 1886757, 2221612, 65626, -4179683, -6358425, -4900604, -2267450, -733508, -727143, -2771002, -6437644, -7552149, -1961994, 6818880, 9331802, 1768146, -9181019, -15456268, -16188867, -13965857, -8610004, -90429, 7005079, 8224602, 5637278, 4031633, 3741853, 2829592, 2817114, 5150702]
6758E150702j87776p948601j0558043k232560O966262N212632l155277n336499
6750a2089160k59088J859171k499291n806161l425680K09684J552700L303937
6742a7153888O521922P034831L829755K271014M276803L599024l362769r660065
6734b643373p801933j484320O88395j342532o73918L921605N893257J791896l327470
6725d978393l567214K69040L536459M231565L613440K697209J019876j683506
6717E138476m237382m647819j882938K509534M942636L127802j114306l597349
6709B38654k577480n75415p23989k446107k254407J411481N956000Q030078P377088
6700A4435903N332474J150907o263506j3017204j1857453j950873P448160P722056
$$ y = [5150702, 4962926, -2985675, -13543718, -15776278, -8810016, -3597384, -6752661, -12089160, -12348248, -10489077, -12988368, -18794529, -22220209, -22010525, -20457825, -17153888, -10631966, -3597135, 232620, 2503634, 6780437, 10379461, 7016692, -2643373, -10445306, -11929626, -11241231, -12583763, -13257681, -9336076, -3442819, -1650923, -4978393, -8545607, -8276567, -4740108, -508543, 3104897, 5802106, 6821982, 5138476, 901094, -3746725, -5629663, -3120129, 1822507, 4950309, 3836003, 238654, -2338826, -2914241, -3638230, -6084337, -8338744, -6927263, -971263, 7058815, 14435903, 19768377, 20919284, 14655778, 1638574, -10218879, -12169752, -4721592, 3000464]
6692C000464J931211o24728J672197J873500k843516o147806l073497J810112
6684b402063J723026k191952l802220j460567J281376K249821K330283J595824
6676f76472j065306m446410n518628l958905k583846k605385j727805J830723
6668b0752034N944908O799823L315753j567444l522033p51729M099985O275503
6660a57268L645741j492967n519898o866619n793530k982634L11976K681839M477823
6651a1695537P060204Q892329N878317j741665o648073l168746L989312N406210
6643G972351l5908m158065j839373K143149J217220l304652m878763j143840L596277
6634d31604M425094J125595k729087l918925k138255O29456K446664K775651J741053
$$ y = [3000464, 4931675, 4306947, 5979144, 7852644, 5009128, -1138678, -4212175, -2402063, -679037, -2870989, -6673209, -8133776, -6852400, -4602579, -2272296, -676472, -1741778, -6188188, -11706816, -15665721, -18249567, -20854952, -22582757, -20752034, -14807126, -8007303, -4691550, -6258994, -9781027, -10532756, -6432771, -157268, 3488473, 1995506, -3524392, -10391011, -16184541, -19167175, -18855199, -16173360, -11695537, -4635333, 4256996, 10135313, 8393648, 1745575, -1423171, 2566141, 7972351, 7936443, 3778378, 1939005, 4082154, 5299374, 1994722, -2884041, -4027881, -431604, 3993490, 5119085, 2389998, -1528927, -3667182, -3037726, -591062, 2184589, 3925642]
6625C925642p34008m101938o462179o170991l822967j440357j51471L01148N78428
6616a8078693J441905L319926M843335L331469j400048n280987m331430N96617
6608a5557906N620691Q475588Q633057N221650j034512n598539m751157j474326
6600d65454j588003m640340m531454M05484M264274K399972k218512m162208k305346
6591a2841587J272020M736494O052868L313934j449080k668629J581592O536440
6583F534052P471325N162483J806021l264673r593541j2459379r173781m309399
6575a7826892k883435k358039J989804P455229P650687L573679K279014N055758
6567D935805N541489O55609m679908o024747n284304m829752k338210M035477
$$ y = [3925642, 3191634, -910304, -7372483, -13543474, -17366441, -18806798, -18958269, -18657121, -18078693, -16636788, -13316862, -8473527, -5142058, -6542106, -11823093, -16154523, -15557906, -9937215, -1461627, 7171430, 12393080, 11358568, 5760029, 1008872, -465454, -2053457, -6693797, -11225251, -10819767, -6555493, -4155521, -6374033, -10536241, -12841587, -11569567, -6833073, -780205, 2533729, 1084649, -1583980, -2388, 6534052, 14005377, 19167860, 20973881, 17709208, 8115667, -4343712, -13517493, -17826892, -20710327, -23068366, -21078562, -13623333, -5972646, -2398967, -119953, 4935805, 10477294, 11132903, 6452995, 428248, -4856056, -9685808, -12024018, -7988541]
6559g988541J0332317J1449398P853812L602632L50853k895462o058585p490812
6551I155612o214595k596629J943961M723254L487062l45719k631903j995352
6543E525691j370677k621060l467142k259248j703531l936435n369988j547034
6535a6749424M975869P166538L398996m85356K24422L088614L053486m91286l943998
6526B37861m831968m060252l191576j861341Q97761L742922L483340n76475m353555
6517a0513283l366264J243556M032367K751984R46587J812118L407152K805016
6509C119233J597632L087023O067146O049220K065361j976520k974079k063633
6501A4971383j712449k419593l232063l189429j542473J469515L686949K856756
$$ y = [-7988541, 2343776, 13793174, 21646986, 25249618, 25600471, 22705009, 16646424, 9155612, 2941017, 344388, 2288349, 7011603, 10498665, 10152946, 7521043, 5525691, 4155014, 1533954, -1933188, -4192436, -5895967, -9832402, -15202390, -16749424, -11773555, -4607017, -1208021, -1693377, -1468955, 1619659, 4673145, 4181859, 237861, -4594107, -8654359, -11845935, -13707276, -12809515, -9066593, -5583253, -6159728, -10513283, -13879547, -12635991, -8603624, -5851640, -4905053, -3092935, 314217, 3119233, 4716865, 7803888, 13871034, 19920254, 21985615, 20009095, 17035016, 14971383, 13258934, 10839341, 7607278, 4417849, 2875376, 4344891, 8031840, 10888596]
6493A0888596l72185l160197m073299l862972l020152j282888L69029J28659j728873
6484f114282k949686k684164k105422j474485K47015K434132K993945K280391
6476g372556K872755M231292K165883l917735p837709m615843J983959M578457
6468g911497K271998N36353K362206M750393M158910J103752j612568k175661
6460C483886m63133K263828L992692L865232K899128J453473j896955o405821
6452I192330p158710j811466L185788j15071q449005r945531j006714P644056
6444h464323N846254k424779o465567l916066o77357L99968J957319M358787L922606
6435e463158K03106j929980O1011K236167O38642k640996l298703j368677l18722
$$ y = [10888596, 10516411, 7356214, 3282915, -580057, -3600209, -4883097, -4514068, -4385409, -6114282, -9063968, -11748132, -13853554, -15328039, -15081024, -12646892, -9652947, -7372556, -4499801, -268509, 1897374, -2020361, -9858070, -14473913, -12489954, -7911497, -5639499, -5103146, -2740940, 2009453, 6168363, 7272115, 5659547, 3483886, 3020753, 5284581, 9277273, 13142505, 16041633, 17495106, 15598151, 9192330, 2033620, 222154, 3407942, 3292871, -5156134, -15101665, -16108379, -8464323, -2618069, -5042848, -11508415, -15424481, -16101838, -15701870, -13744551, -9385764, -5463158, -5260052, -7190032, -7129021, -4892854, -4254212, -6895208, -10193911, -11562588, -11881310]
6426a1881310j534150k831746j758623J487651M098516L266245k71857k067846
6418a1493120L50413K880014J65192n092412m337269L821935R710499N762857
6410A768109k622272n366201j803082R59648K61452j12067J305466J700354J128971
6401b779622L052829N971804K994995o711592j3758365j0786708k424565K591222
6393b1850002L281743L656849L326352m91484m556778k540689M004941O319028
6385h850040J456671l276423j677065K745655L749029J886585J395262J844189
6377g26137n12088m990878o531466l625417p51216j409565l133845j993898J149767
6368b2524743K370634J090659R69379M058641P329899O881616L441235R00920
$$ y = [-11881310, -13415460, -16247206, -18005829, -16518178, -12419662, -9153417, -9425274, -11493120, -11142707, -8262693, -8097501, -13189913, -17527182, -13705247, -3994748, 1768109, -854163, -6220364, -8023446, -7063798, -6802346, -6914413, -5608947, -3908593, -2779622, 273207, 6245011, 9240006, 2528414, -11229951, -22016659, -24441224, -21850002, -18568259, -14911410, -11585058, -12076542, -16633320, -19174009, -15169068, -8850040, -7393369, -10669792, -12346857, -9601202, -5852173, -3965588, -2570326, -726137, -1238225, -6229103, -12760569, -16385986, -17137202, -18546767, -21680612, -23674510, -22524743, -20154109, -19063450, -18094071, -14035430, -6705531, 176085, 3617320, 4518240]
6360D518240L72513q39162l830916n293108k421887J974739K570712j545377o213192
6351a0707438p749387n955234k088649K424396M921854K990675j734466m539219
6343b2437468l646208j815780n96358K515286Q188592J1057688O522558j134603
6335a346293l466331M43259L195346K94231m135351m839963k759733j133955P71098
6326a2977692M623743O962523K885496m851351p175407r98676N572274M093928
6318a865162k484016m313795J384789P126183O271146J369167j316721r52050
6310E219541j399763m006291o035493n588837l695306j177741K617987O828260
6302g237643Q217526N209787M42723k409944k558269j553116p39214o08908r70260
$$ y = [4518240, 4890753, 4051591, 220675, -5072433, -7494320, -5519581, -2948869, -4494246, -10707438, -18456825, -24412059, -26500708, -24076312, -19154458, -16163783, -17898249, -22437468, -26083676, -27899456, -28495814, -25980528, -17791936, -6734248, -211690, -1346293, -4812624, -4369365, -1174019, -879788, -5015139, -9855102, -12614835, -13748790, -12977692, -8353949, -1391426, 1494070, -3357281, -10532688, -11531364, -5959090, -1865162, -4349178, -8662973, -7278184, -152001, 6119145, 7488312, 6171591, 5219541, 3819778, -186513, -6222006, -11810843, -15506149, -16683890, -14065903, -7237643, 979883, 6189670, 6632393, 4222449, 1664180, 111064, -628150, -1237058, -2207318]
6293b207318o31398J310486L215913K523366L84813R78624M403976M757372j051421
6284A3684413o815755m957976J929085M282731o99250n798869n165837j807189
6276e348647p41121r49495R76249L552417K601731j346336l408191j795280j42037
6267f600710j397578l228714j759804K333177M309189J746623j902787j653381
6259h153985K193212M118108Q69759l965355n163062l088960j792246j520930
6251a6503459J339895O562130Q361283L840229k193804m505293m715452o505482
6243a4319953p801654m196467K385242N551486M190313L382889N189484N603741
6235a4919K609179M77543K417900M605288K229435k777532n093686l864050k077575
$$ y = [-2207318, -2838716, -1528230, 1687683, 4211049, 4595862, 5574486, 9978462, 14735834, 13684413, 6868658, 1910682, 3839767, 8122498, 7423248, 1624379, -3541458, -5348647, -6089768, -7039263, -6063014, -2510597, 91134, -1255202, -4663393, -6458673, -6600710, -7998288, -11227002, -12986806, -10653629, -6344440, -4597817, -6500604, -8153985, -5960773, -1842665, -972906, -4938261, -10101323, -13190283, -14982529, -16503459, -15163564, -8601434, -240151, 3600078, 1406274, -3099019, -7814471, -14319953, -22121607, -26318074, -23932832, -18381346, -14191033, -10808144, -5618660, -14919, 2594260, 3071803, 5489703, 10094991, 12324426, 9546894, 4453208, 589158, -1488417]
6226a488417o71481J210976J840158j219857n391996n185907m68840L082756K856204
6217e436404K553704M296035L839411j820382p286676n488330J432785M650033
6209c259824J037167l327375k504113K144278N699787N854844L251521m10431
6201H485854k418791o57604K696375K450226k456234o687213n973198k862125
6193g422710j499646p69899K295931N532208M391480L7685j893243k44336N66469
6184I93939r28545m88409L721452O550572L340174k764316n343344l091222M40775
6175B431076K532215K547073O7493l727885m756477q20391L542997J920745m660504
6166i23658q366201n337588r64928j903518o505138p128734p87430O353754O524915
$$ y = [-1488417, -2159898, -948922, 891236, -328621, -5720617, -10906524, -11375364, -8292608, -5436404, -2882700, 1413335, 5252746, 3432364, -3854312, -9342642, -7909857, -3259824, -2222657, -5550032, -8054145, -5909867, -210080, 5644764, 8896285, 8485854, 6067063, 5409459, 8105834, 10556060, 8099826, 1412613, -4560585, -7422710, -8922356, -9692255, -7396324, -1864116, 2527364, 2565049, 671806, 427470, 993939, 65394, -423015, 3298437, 9849009, 13189183, 10424867, 5081523, 1990301, 2431076, 4963291, 7510364, 7577857, 3849972, -906505, -1726896, 1816101, 3736846, -923658, -9289859, -14627447, -15592375, -17495893, -24001031, -31129765, -31917195, -25563441, -19038526]
6157a9038526L34231l692471o1799O174953N981051j219219o648786m469070O12691
6148b2026945J365497j185505o17902M040993O902692M318543n03924l073614
6140a0780165k958156j892406o09482L99131J71620p06046L806K634802M423480
6131i313416L308165M67324k132296l846974l636518K63451O478746R529214O153447
6122G271143K83977j977815n67948m54593l409955n612829m167530j491304q25031
6113a0951885p68737K059701O531571P358626K554628k891884l066185J162028
6105A987863L469152M65117m532471o785579n974306m642106l294647l72610L692115
6096a5987472N613464L108824k182246o128955n509493m34278N305843O930087
$$ y = [-19038526, -18704295, -22396766, -22458565, -16283612, -10302561, -11521780, -18170566, -22639636, -22026945, -20661448, -21846953, -22464855, -18423862, -11521170, -7202627, -7706551, -10780165, -13738321, -15630727, -16240209, -15841078, -15669458, -16375504, -16371698, -13736896, -9313416, -6005251, -5537927, -7670223, -11517197, -15153715, -14890264, -8411518, 1117696, 7271143, 7555120, 5577305, 5009357, 4554764, 1144809, -4468020, -8635550, -10126854, -10951885, -11720622, -9660921, -3129350, 4229276, 6783904, 3892020, 825835, 1987863, 5457015, 5922132, 1389661, -5395918, -11370224, -16012330, -19306977, -19679587, -15987472, -10374008, -7265184, -9447430, -15576385, -21085878, -21520156, -16214313, -9284226]
6088i284226L244521k011165m547616l828621j404598K510757P312767Q953442
6080I45261L812710m681146q647478n892913k261774k142651k223774J690755
6072a9401010O485854N874470K23796l584658j901518J140691L94475k730694
6064a3498594k647829J792371M780408J345002m807283n354614P66679M877055
6056a2746805R08068n008346l294001M545267Q450050N319314K250196L117055
6048C540798K279588l912296q781884n589940J113590K665479m01546q71650K826734
6039g131127N412780M018960R38752j729300l361267k149484K095929M255494
6031B350737L29966m329052j732532N160704N641433j659441o062906k170912
$$ y = [-9284226, -6039705, -8050870, -12598486, -16427107, -17831705, -15320948, -8008181, 945261, 4757971, 76825, -8570653, -14463566, -16725340, -18867991, -21091765, -19401010, -12915156, -7040686, -6816890, -10401548, -12303066, -11162375, -10767900, -13498594, -16146423, -14354052, -9573644, -8228642, -13035925, -18390539, -17623860, -12746805, -11838737, -16847083, -20141084, -15595817, -7145767, -1826453, 423743, 3540798, 5820386, 1908090, -6873794, -12463734, -11350144, -8684665, -9086211, -9957861, -7131127, -1718347, 2300613, 3239365, 1510065, -1851202, -4000686, -1904757, 2350737, 2680703, -1648349, -3380881, 1779823, 7421256, 5761815, -301091, -2472003]
6023b472003J320087l760571j1200746r824574l11127O757355O157690K510514
6015a0823375Q09776M86317k16828k81941J292571K620228J365780j658817l088838
6006i495127j001370K272005K163658k317344n953525l249203L523289O324181
5998g733436K254451k247480o86322M369962N605347J416152k817483k775369
5990b614178p8254J221546j26728j948528j828830j00248N00431j397218l195826
5981i567833j403692L331312P133813Q423316Q671920P684661L217784l457331
5973B4033950p075016n777183l635246l177408j674924J343073J67222p176996
5965b972528j1883132n969038M204823O279015L93678k236581J891712L923821
$$ y = [-2472003, -1151916, -4912487, -16113233, -25937807, -26248934, -19491579, -13333889, -10823375, -10013599, -9527282, -9744110, -10026051, -8733480, -6113252, -4747472, -6406289, -9495127, -10496497, -8224492, -6060834, -8378178, -14331703, -17580906, -14057617, -7733436, -5478985, -7726465, -8412787, -4042825, 1562522, 2978674, 161191, -2614178, -2692432, -1470886, -1597614, -3546142, -5374972, -5475220, -4974789, -6372007, -9567833, -10971525, -7640213, -506400, 7916916, 16588836, 24273497, 27491281, 24033950, 16958934, 11181751, 7546505, 4369097, 2694173, 4037246, 4204468, -2972528, -14855660, -20824698, -16619875, -10340860, -9947182, -12183763, -10292051, -6368230]
5957f368230j005109n124777j351461N032635N736757K603915K482605M521563
5949F527898K386076l552257n931261k373249Q05953r20417l151859p2231N638598
5940f42749N861406j444818q683600p891796n36416M735931L146831r40578j109065
5931g504854K135049L289650R86515k48373J822781K663431k065015r007395j1053848
5922a8982059o596619m01886L565775N521415O074175L855977j087064m833613
5914a2883899l409730K150234O676424O431091K531552q97564r01446K063825
5906A760487N252657O290177M563926N99352m693072r568048j1329620q209207
5898a5333348j558113M647680O861185M587310N91440j145974J236262N056134
$$ y = [-6368230, -7373339, -12498116, -13849577, -8816942, -3080185, -476270, 2006335, 6527898, 8913974, 5361717, -569544, -2942793, -2136840, -3057257, -6209116, -6281347, -642749, 5218657, 3773839, -4909761, -12801557, -13337973, -8602042, -5455211, -6395789, -7504854, -5369805, -2080155, -1093640, -1342013, 480768, 3144199, 1079184, -7928211, -18982059, -25578678, -25980564, -22414789, -16893374, -10819199, -6963222, -8050286, -12883899, -16293629, -14143395, -7466971, -1035880, 1495672, 598108, -303338, 1760487, 7013144, 13303321, 17867247, 18466599, 13773527, 4205479, -7124141, -15333348, -16891461, -12243781, -5382596, -795286, -203846, -1349820, -113558, 4942576]
5890D942576M939768j128054q123137q708819j997892M867523N124936J07958
5882B4859l523767k372364R86184K999486L114699K219553P26105j21118J704770
5873E758407N063557M706927j964979r395072r899077m173466k46937j592989
5865a1743629k509913K118578Q297885Q833039L557859j947284n076497p404326
5857e874288q496476n290126J399019N553272L519132j183438k937957p37563
5849a4048425K204301K785528K22546l523621m296282K85648O290174O737300
5841c342831J087711l123404r80083K642102J438596j614501O44411O399670N894677
5832I046348l485053j1714116r498857n01556N065036M164251J885639J594628
$$ y = [4942576, 9882344, 8754290, 631153, -8077666, -10075558, -5208035, -83099, 24859, -3498908, -5871272, -4885088, -1885602, 1229097, 3448650, 4174755, 4053637, 5758407, 10821964, 15528891, 13563912, 4168840, -5730237, -9903703, -10150640, -11743629, -14253542, -12134964, -3837079, 4995960, 8553819, 6606535, 1530038, -5874288, -14370764, -19660890, -18261871, -12708599, -9189467, -10372905, -13310862, -14048425, -11844124, -9058596, -8836050, -12359671, -16655953, -16370305, -10080131, -3342831, -2255120, -5378524, -6358607, -3716505, -2277909, -3892410, -3247999, 3151671, 9046348, 5561295, -6152821, -15651678, -16153234, -11088198, -6923947, -5038308, -3443680]
5824c443680J263190o02338j776841p78927L86852L49738J220931M299946O200666
5815G119537L104153l084884o735818n635038k465537J51345J982969K426395
5807c136878r0932m336996n719296k018105L120161M967135L587127K268275K348836
5798I89327K773468L106461L595072L253276J012707j970639l877351m925022
5790C957299n625758m112188P89611N270893M373035l72103k592979o55110M35539
5781A468239j868108l190564l00699K223824j307994q260233j0690720n769048
5773b7695303J943619P428281R661592R479935P212584L152551k073284p576340
5765A533635j1038743r098237j643591N850408P723869M821391K311408J948458
$$ y = [-3443680, -2180490, -2782828, -4559669, -5338596, -4951744, -4602006, -3381075, 918871, 7119537, 10223690, 7138806, 402988, -5232050, -7697587, -7546242, -5563273, -3136878, -3227810, -7564806, -13284102, -15302207, -12182046, -7214911, -3627784, -1359509, 989327, 3762795, 6869256, 10464328, 13717604, 14730311, 12759672, 8882321, 3957299, -1668459, -5780647, -4991036, 279857, 4652892, 4280789, 1687810, 1032700, 1468239, -399869, -3590433, -3891132, -1667308, -2975302, -11235535, -21926255, -27695303, -25751684, -18323403, -8661811, 818124, 8030708, 11183259, 9109975, 1533635, -9505108, -18603345, -20246936, -14396528, -6672659, -1851268, 460140, 2408598]
5757B408598Q04797k566055n406244n339732l783783k972807k521059r23112J564795
5748a8734602L309482L353532K068177P15455O13276J584172J540562p79843l298243
5739i628032l050851n26363J295594J721754K454380K805718n60402p218397j0553257
5730b3259856n280754N049259J1571924R862729L318891k054277l104575k09880
5722d106539M171093O537851M183054k082965p550905p416541j552403M984640
5714b832715O842441L566200r04207l500730m708659n405262m062186J50201L750272
5705g104645K638089j406302k543212M35107K144547q90653m567744l452262J048453
5696a3698622L300864K016722J189069K939259M235956K090458j554229k572214
$$ y = [2408598, 3213395, 647340, -4758904, -10098636, -13882419, -16855226, -19376285, -20299397, -18734602, -15425120, -12071588, -10003411, -9287956, -8674680, -7090508, -5549946, -6329789, -9628032, -12678883, -13205246, -11909652, -10187898, -7733518, -4927800, -5488202, -12706599, -23259856, -28540610, -23491351, -11919427, -2056698, 1262193, -792084, -3896659, -4106539, 64554, 6602405, 10785459, 8702494, 1151589, -6264952, -7817355, -2832715, 4009726, 7575926, 6671719, 3170989, -1537670, -6942932, -11005118, -10854917, -7104645, -4466556, -5872858, -8416070, -7980963, -5836416, -6727069, -11294813, -14747075, -13698622, -10397758, -8381036, -7191967, -4252708, -16752, 2073706, 519477, -2052737]
5688b052737m66393J115726n68793l756423m530718j823797J402438K093089P24067
5679g863541M9771J462644L954757N595327M465076m30298o807359r155399m584053
5670a3313075K276997M319887J470149J71142K942513M529187R06274l804762
5662e01688l837170o06124L51306j779875k842680o31384K889505N343092N790647
5653D175629L836219N71558r45590K81357O97176k256658m838384k668088R21544
5644b25237o29020n569518n205017K284507P834322M439257l246535o840737n782240
5635a2940218n261088o663545o197097j609713M296851O774949L603547k700594
5627b0696908o211214l145683L249746O184220M054754J707307K445637M178793
$$ y = [-2052737, -2519130, -1403404, -1972197, -5728620, -10259338, -12083135, -10680697, -8587608, -7863541, -7813770, -6351126, -2396369, 3198958, 7664034, 7233736, 426377, -8729022, -13313075, -11036078, -6716191, -5246042, -5074900, -2132387, 2396800, 3303074, -501688, -4338858, -4944982, -4593676, -6373551, -9216231, -9847615, -6958110, -1615018, 4175629, 8011848, 8583406, 7637816, 7919173, 8616349, 6359691, 1521307, -1146781, -225237, -854257, -6423775, -11628792, -9344285, -1509963, 2929294, -317241, -7157978, -12940218, -18201306, -24864851, -31061948, -32671661, -28374810, -21599861, -17996314, -20696908, -26908122, -30053805, -26804059, -20619839, -16565085, -14857778, -12412141, -8233348]
5619h233348N040750O370785P109822K407871p141587j1868965n695299L519096
5611h490875M748001p5422p71076L767688M824177j54324l013555J095974O037801
5602G968389N503343K180915O06213q83667m408495n833226j603036L082658J370568
5593G983662l620275l073490L430733P000946L016888k589134l148464o32034
5585H368832j022378m757254o721886m057860J81098J412246j034684l903653
5577a1535539m212125k103279M89742K611622M360495M925359K843166j174950
5569c795509l683789k107474K229752N510978M805236j9810n704650o731568j53877
5560i650711R555458J3807917R842036L756469J244981j19011m844809r952276
$$ y = [-8233348, -3192598, 3178187, 10288009, 12695880, 5554293, -6314672, -12009971, -8490875, -3742874, -3818296, -4589372, -821684, 4002493, 3848169, 834614, 1930588, 7968389, 13471732, 15652647, 16258860, 15375193, 10966698, 5133472, 3530436, 6613094, 7983662, 4363387, 1289897, 4720630, 11721576, 14738464, 12149330, 9000866, 8368832, 7346454, 2589200, -4132686, -8190546, -8009448, -6597202, -7631886, -11535539, -15747664, -17850943, -17361201, -14749579, -10389084, -5463725, -2620559, -3795509, -7479298, -9586772, -7357020, -1846042, 2959194, 2939384, -2765266, -9496834, -9650711, -95253, 13712664, 23554700, 27311169, 28556150, 28437139, 23592330, 13640054]
5552A3640054q452573q42445M317981K185404k527067l641717j690798o11602
5544B377237q56986j46838J706491K897882L024128K881100J956974n68630k919278
5535A0352080k125075J394798L594008K250711K84988J567869M678891L732196
5527B5730466l751971j2149188j3462503o927111L57525K865841K791552M349685
5519a95704N866719K656377m032444p222353m215103o70722k033763n652081n532249
5510b1031323j608796P96048o01264k196879n65944K769640M372372L770340K940526
5501a1355280K598175J622306k37355j465121j151149l83515j81613L10439J813697
5492h429416K543916O11019j931928j092913K525283L314942j292225o376766
$$ y = [13640054, 5187481, 4345036, 8663017, 10848421, 8321354, 4679637, 2988839, 2377237, 1520251, 1373413, 3079904, 5977786, 9001914, 11883014, 13839988, 13271358, 10352080, 8227005, 9621803, 13215811, 15466522, 15751510, 17319379, 21998270, 25730466, 21978495, 9829307, -3633196, -10560307, -10202782, -7336941, -4545389, -195704, 5671015, 8327392, 4294948, -2927405, -7142508, -7813230, -9846993, -15499074, -21031323, -22640119, -21844071, -22445335, -24642214, -25208158, -22438518, -18066146, -14295806, -11355280, -8757105, -7134799, -7372154, -8837275, -9988424, -10371939, -10553552, -10243113, -8429416, -5885500, -5274481, -7206409, -8299322, -5774039, -2459097, -3751322, -10128088]
5484a0128088o345212k647662l81682j57558J122108L144668K199524j731041
5476a4924943l910210j923762J525414M116211O689498Q727724O912242J355972
5468H568146k033380L59577L724822J561214m722993p967761m915262R63685M889620
5459D27668M753473P14602m984336q040031n480478O65542N459526O491924N082727
5450E090617K910827K30356k654048m549307m556386k902254n53635J390789K406375
5441c186666K870075K800510P99217l623201p165861n573300K97427M952339N440675
5432b388785L878840K146473m59260k607095m57200M790961N431222j648390q441272
5423B45494o642029L95311L780833K467355K071205L769733L607893J159893j60678
$$ y = [-10128088, -16473300, -19120962, -19502644, -19660202, -18538094, -15393426, -13193902, -14924943, -18835153, -20758915, -19233501, -15117290, -8427792, 299932, 7212174, 8568146, 6534766, 6894343, 10619165, 12180379, 7457386, -510375, -5425637, -4461952, 427668, 5181141, 5895743, 911407, -7128624, -12609102, -11943560, -6484034, 7890, 5090617, 8001444, 8231800, 5577752, 1028445, -3527941, -6430195, -6983830, -5593041, -3186666, -316591, 2483919, 3283136, -340065, -7505926, -13079226, -12781799, -7829460, -2388785, 1490055, 3636528, 3177268, 570173, 112973, 4903934, 10335156, 8686766, 245494, -6396535, -6001224, -2220391, 246964, 2318169, 6087902, 9695795, 10855688, 10695010]
5414A0695010q09996m357225q877594p844944q98198M424918L664741O29895o16153
5405c989546j512020l574905l999782q07016K813883L253668J605376Q56727J344386
5396d009229J530980M92350j847767m247700l760342O36216M557201K968594k188843
5387e868540m496106k423425J13583J817807M917283P826636N497202j290722
5379F093718n344168l909891j828587j657107K87251M939076O966234M299807
5371I846333J938113J951739l65778n355341n081693K514810O921244J598370
5363A3967797l800031Q12231P929123M111695p793626j3287328q435220k306771
5355h802130K36372L081021O481277M607761k382836o176707l154521R58599J728725
$$ y = [10695010, 9885014, 5527789, -3349805, -11194749, -12092947, -7668029, -4003288, -3373393, -3989546, -5501566, -9076471, -13076253, -13883269, -11069386, -7815718, -6210342, -5353615, -4009229, -2478249, -1985899, -3833666, -8081366, -11841708, -11205492, -6648291, -3679697, -5868540, -10364646, -12788071, -12674488, -10856681, -5939398, 1887238, 7384440, 6093718, 749550, -3160341, -4988928, -6646035, -6358784, -1419708, 5546526, 9846333, 11784446, 13736185, 13370407, 8015066, 2933373, 5448183, 12369427, 13967797, 10167766, 10979997, 18909120, 23020815, 15227189, 1939861, -6495359, -8802130, -8565758, -5484737, 996540, 5604301, 3221465, -2955242, -6109763, -5151164, -3422439]
5346c422439J508682J960120O20718k356254k906250j050371j593728m592151
5338a1831673m220721J19059J130710l962946p528798l273373M134171O944003
5330a8489568N015283K822145J622201M18366P8074J285162K131186J721873K241547
5321a153731M111975L600626j244560o597228q045878n682778j644711K488202
5313a4168083L752796n01523o130818m427833N167947J1874582Q241123O24173
5305D432364j600019j2392j572901m982772l488905J527581J093858o507437j1182949
5296b2293572m724324P638572J3543334P703454l426824r381500n998222J474326
5288a5464756M841609J928675k425469l944412l741446m048148l414400K36234
$$ y = [-3422439, -1913757, 46363, 667081, -1689173, -4595423, -5645794, -7239522, -11831673, -16052394, -15933335, -14802625, -18765571, -26294369, -29567742, -25433571, -18489568, -13474285, -10652140, -9029939, -8611573, -8533499, -7248337, -5117151, -3395278, -1153731, 2958244, 6558870, 5314310, -1282918, -9328796, -15011574, -16656285, -14168083, -10415287, -10916810, -17047628, -21475461, -16307514, -4432932, 3808191, 4432364, 2832345, 2819953, 1247052, -3735720, -7224625, -5697044, -4603186, -11110623, -22293572, -27017896, -19379324, -5835990, 1867464, -1559360, -10940860, -16939082, -15464756, -10623147, -8694472, -11119941, -15064353, -18805799, -22853947, -26268347, -26032113]
5280b6032113M821354O376604M140417J41806l947921o347499m504760R80016
5272b4372096M396654J556985l717733m661974j380846j15656l420774o632972
5264c8348412m830951J158692O873965R036152P357015M118385K538657L688624
5256h407873N185030M493497K330730P44500m37612k412691m290683m442228l629302
5247a0866632l487639l211322j224512J187551J676916R96735J392064K168609
5239a1368230J385867P08190L062517N888286L061602n149530j0121354n815814
5231a8348466L037790P257235M161383j514037m942541n253824l516162p46848
5223a9865470J577653J765313r9302j604858m23746L042510N909695N704322K789293
$$ y = [-26032113, -21210759, -14834155, -10693738, -10551932, -14499853, -20847352, -25352112, -24372096, -19975442, -18418457, -22136190, -26798164, -28179010, -28294666, -31715440, -38348412, -43179363, -42020671, -35146706, -26110554, -18753539, -14635154, -12096497, -8407873, -3222843, 1270654, 3601384, 4345884, 3908272, 1495581, -2795102, -7237330, -10866632, -14354271, -17565593, -18790105, -17602554, -15925638, -14928903, -13536839, -11368230, -9982363, -9274173, -6211656, -323370, 2738232, -2411298, -12532652, -18348466, -15310676, -8053441, -3892058, -5406095, -10348636, -15602460, -19118622, -19865470, -18287817, -16522504, -16621806, -18226664, -18650410, -15607900, -9698205, -3993883, -1204590]
5214a204590k19081j190010k24887J056903J223352J72118n72818R28252M277642
5205D246881N836744K694963k817834n430112l887140k184934l055614m217240
5197h814286l015077p87092L19650J252251L136927L684363Q38584k546009k472175
5188h402864m02514r58654m015242m486950l21093M174708M371695R82688j965128
5179a1023354k180013n80863O34385L19814n11324L2973J840419K491286R75823
5170h000854k01894J356263M062861M591062K449127k30488j906031k009505J40122
5161B50663L777119N530587K972823j730539m306124l196871J42222L430671L721938
5152A0592489j255112q501713j0157161l038103N597715O970790K137132j449732
$$ y = [-1204590, -1423671, -2613681, -2838568, -1781665, -558313, -386195, -959013, -30761, 4246881, 10083625, 12778588, 9960754, 4530642, 643502, -1541432, -4597046, -8814286, -11829363, -12616455, -12296805, -11044554, -7907627, -4223264, -3384680, -5930689, -8402864, -8805378, -9764032, -13779274, -18266224, -18587317, -14412609, -10040914, -9058226, -11023354, -13203367, -13784230, -13149845, -12830031, -13341355, -13308382, -11467963, -8976677, -8000854, -8202748, -6846485, -2783624, 1807438, 4256565, 4026077, 2120046, 110541, 250663, 4027782, 9558369, 12531192, 10800653, 6494529, 3297658, 3439880, 6870551, 10592489, 9337377, 835664, -9321497, -12359600, -6761885, 208905, 2346037, 896305]
5144H96305j334432p93229p85658O19345K125820Q58721n99818K463181O766224
5135A0216459L950590n218146r869579n325831k48616k493259p199291n945929
5127b2133602o3292L423250L529771M370388O049080M961400J644918P12595K867474
5118E361982L267980r42067o162365p189228l645195J88402P61844p36049k05396
5109i300092L501219O256659M251984j0103j387494m63113k325608o794630p044537
5100a3315715n23651N768018N313732J208877l41954j30455k371669n056009k379090
5091a1827916M549973P667096L590311j598762j581856J654195J995861j652520
5083B796382m450551k673773J620250L645367J802507j052516j999010j722410
$$ y = [896305, -438127, -1231356, -2017014, -1397669, 728151, 1586872, 987054, 3450235, 10216459, 14167049, 8948903, -920676, -6246507, -6495123, -8988382, -16187673, -22133602, -22196894, -18773644, -15243873, -10873485, -4824405, 136995, 1781913, 2494508, 5361982, 8629962, 7687895, 1525530, -5663698, -9308893, -9120491, -8358647, -9094696, -9300092, -5798873, 457786, 4709770, 4699667, 3312173, 2849060, 523452, -6271178, -13315715, -13839366, -8071348, -2757616, -1548739, -1890693, -2021148, -4392817, -9448826, -11827916, -7277943, 389153, 3979464, 2380702, 798846, 2453041, 4448902, 2796382, -1654169, -4327942, -2707692, 937675, 2740182, 1687666, -311344, -2033754]
5075b033754k404689l629179l252625j739041k057517m662827o062130l783330
5067b9625092L22934L387310N066302N708020L977839p01208n264957n603021
5059b2731873j378012L645982N515789L235082j088431m284174m792609l296394
5051b5174640l47779M660869J0114586J0661315L684114m669268o009524j416308
5043h496635N00252k548072l193565K542724P792932N746291M48663l43125K623404
5034E072869K911271l97122k339816r96864N30448L57980k56765j060843l325357
5025D95801o005440o264765m286548l230077l788680k882934R43669M206825K695137
5016a8117012k644999o083260l576229K176454M795462K725646J699200N931826
$$ y = [-2033754, -4438443, -8067622, -11320247, -13059288, -15116805, -19779632, -25841762, -29625092, -29302158, -25914848, -20848546, -15140526, -11162687, -11863895, -17128852, -22731873, -24109885, -20463903, -14948114, -11713032, -12801463, -17085637, -21878246, -25174640, -25522419, -20861550, -10746964, -85649, 3598465, -1070803, -7080327, -8496635, -7996383, -10544455, -13738020, -11195296, -3402364, 2343927, 2792590, 2449465, 5072869, 7984140, 7587018, 5247202, 4250338, 4780786, 5138766, 4882001, 3821158, 495801, -5509639, -11774404, -16060952, -19291029, -23079709, -25962643, -25018974, -20812149, -18117012, -20762011, -26845271, -30421500, -28245046, -23449584, -20723938, -19024738, -13092912]
5008a3092912J0315190P361680j17899j725919M550867Q601749L863716k809957
5000A6946515l246854j344306n261239j2305261j2397350m122015K951565K302827
4992a6476118j716318k053005J538962M068314K457223j393791l014747P5409
4984a6514071N520080Q452389P008210L536537J08730l552219o689511o758330
4976h888185m219795l305226n280066n888169k560906J175371K056826K130844
4968b4779306L247222K554554j299641l338955L07460N347335N962675L642356
4960h356300K991785L386729J499535j909360m084122n373559o644790n893168
4952b4383250k651320p59608j711786j276404K152767L317915J32162p80756M056558
$$ y = [-13092912, -2777722, 4583958, 4466059, 2740140, 7291007, 15892756, 19756472, 16946515, 13699661, 12355355, 7094116, -5211145, -17608495, -21730510, -18778945, -16476118, -18192436, -20245441, -18706479, -14638165, -12180942, -13574733, -16589480, -16514071, -10993991, -2541602, 4466608, 8003145, 8111875, 4559656, -2129855, -8888185, -13107980, -16413206, -21693272, -27581441, -30142347, -28966976, -26910150, -24779306, -21532084, -18977530, -20277171, -23616126, -23308666, -17961331, -11998656, -8356300, -5364515, -1977786, -478251, -2387611, -6471733, -11845292, -18490082, -24383250, -27034570, -27794178, -29505964, -30782368, -28629601, -25311686, -25179524, -25960280, -21903722]
4943b1903722P015764K208693l380364j970871J628275M33982j050185K868744
4935a4149684N300547r17985o728508p74180Q478578M772589q093307j2170005
4927b4281955m976285m23433j993382J219830J0399331J2504134M232612j375605
4919d694753J691433K789644m501949j0849053q730117m494804m490452m466304
4911c7746355p51652J918285O90764j63246N39945j570497n111305l113324K874870
4902d2432515L772644k57529l03787L189534J086529m990513m047340K713089
4894d1269888L577567k19371K733095P953511L05263j3814426j2226639K061674
4886e0899214K340607j3543443j7311772k300458L421333r894507j6095455p120006
$$ y = [-21903722, -14887958, -12679265, -16059629, -18030500, -16402225, -15968243, -17018428, -14149684, -8849137, -9767122, -16495630, -17269810, -8791232, -4018643, -12111950, -24281955, -29258240, -29681673, -31675055, -30455225, -20055894, -7551760, -3319148, -4694753, -3003320, -213676, -4715625, -15564678, -24294795, -28789599, -33280051, -37746355, -38498007, -36579722, -35888958, -36052204, -35512259, -37082756, -42194061, -45307385, -42432515, -38659871, -38917400, -39221187, -36031653, -34945124, -39935637, -43982977, -41269888, -37692321, -37911692, -35178597, -27225086, -26919823, -40734249, -52960888, -50899214, -48558607, -62102050, -79413822, -81714280, -78292947, -88187454, -104282909, -111402915]
4878a11402915j0584088k9397749k6746442o158035l1210438j05263693j09630555
4871d30393915M0567572K32454404K67436441J19776350l6612266o6774661k0032451
4864A06421474k549772k0120685j9075981O05143L99304j5725379j3615418L656698
4856C9995384N145782q611685j0670552P58066M254644j391512O38880P791121
4848C7910128L122798q718090p724901M304481P372263m74704l453075n41506
4840C1797394n118372j4480960j1535596L059797J0151052M545729K88763K193123
4832B0900930k75389p868352p235451L324951Q627250L006671j066391K918779
4824B2332998M887325q45797m564524N4934M328690R94570l434071j586648K922541
$$ y = [-111402915, -121987003, -151384752, -178131194, -184289229, -215499667, -320763360, -430393915, -389826343, -157371939, 110064502, 229840852, 193228586, 126453925, 106421474, 103871702, 83751017, 64675036, 65280179, 65679483, 49954104, 36338686, 39995384, 45141166, 36529481, 25858929, 26616995, 30871639, 29480127, 30119007, 37910128, 41032926, 32314836, 24589935, 28894416, 36266679, 35791975, 32338900, 31797394, 26679022, 12198062, 662466, 3722263, 13873315, 18419044, 18707807, 20900930, 20625541, 12757189, 5521738, 8846689, 17473939, 20480610, 19414219, 22332998, 27220323, 26374526, 21810002, 21864936, 26193626, 27188196, 23754125, 22167477, 25090018]
4815B5090018M200290K839529K70389m247081p036398k578970M290618K212523
4807B5040918p559331j0607490k110842N473196L423635l51820K268892N084149
4799B0661307Q0365p602064q610512m121408j125997m23201J153586K780030K429831
4790E221937K239247L872149L867384L3340l199620k198959j097804m458419q241266
4781c962011n661697J623875N476288K491225k685146m443984k378324m78222
4773a0017996k110861n460359m703588J908581P337660M354661k978349m004094
4765a5674345K704572P248539L854360j042417k16206L449850L364018j30648
4757C557723j935383m90671J670537K385743Q08481k780344n035821j520711O240424
$$ y = [25090018, 29290308, 32129837, 32400226, 28153145, 21116747, 18537777, 22828395, 25040918, 17481587, 6874097, 4763255, 10236451, 13660086, 13308266, 15577158, 20661307, 20741672, 13139608, 4529096, 407688, -718309, -1141510, 12076, 2792106, 5221937, 7461184, 11333333, 15200717, 15234057, 12034437, 9835478, 8737674, 4279255, -3962011, -9623708, -7999833, -2523545, -32320, -2717466, -7161450, -9539774, -10017996, -12128857, -17589216, -22292804, -20384223, -13046563, -8691902, -11670251, -15674345, -12969773, -5721234, -1866874, -2909291, -3125497, 324353, 3688371, 3557723, 1622340, 1131669, 2802206, 5187949, 5996430, 3216086, -1819735, -3340446, 2899978]
4748B899978J0098638N273115l029645o558201l828059M13896J909025l31256
4740F847491m677722p182701m335071J696494L848433r16115o659527n686160
4732a7064878J782519Q378300Q583183M292762J592385L178328M852166J231974
4724A6826739n315132o234362K72367M313517j506265r083652n591978O806191
4716D87425J3533319Q207812j386994p773069j1331469j1788628n748161L190523
4708a2609242M858694j313137l119966M589637R788797K362117q634498q896501
4700a2974099o04335L263356l15512l251558j985505p42612o02785K300295P132774
4691g779981P527514K035739l235461m102353k961284k409459j128759J701240
$$ y = [2899978, 12998616, 18271731, 15242086, 8683885, 4855826, 5269722, 7178747, 6847491, 2169769, -5012932, -9348003, -7651509, -3803076, -4719191, -11378718, -17064878, -15282359, -6904059, 1679124, 5971886, 7564271, 10742599, 15594765, 16826739, 11511607, 5277245, 5549612, 9863129, 8356864, -726788, -6318766, 487425, 14020744, 22228556, 20841562, 13068493, 1737024, -10051604, -15799765, -12609242, -7750548, -9063685, -12183651, -7594014, 2194783, 4556900, -4077598, -12974099, -13578434, -10315078, -10630590, -13882148, -15867653, -16610265, -17213050, -14912755, -7779981, -252467, 1783272, -1452189, -5554542, -8515826, -10925285, -12054044, -10352804]
4683a0352804L601880K777748O77659j094061k845212m512319m430642j692224
4675a7869975K201407M590700L579967l87463l826150l024421R87447K873749
4667a0874739K12733k969026k419529J28510M63313j486134k490140j144209J463361
4658a9115860M135042N516312M041300Q74567J43175L095630N006615J469179
4650E165960m913882p801692m964190K20840L144812J619886k464518l750128
4642a3742912R91236P078946O645126R4344l745249r18999K087987k57266l939175
4633e705962l576335j128245J16642K414160O777467O882471j236946r932315
4625e389063r909222l653173P28750K977214O987601R244064L782855m660665
$$ y = [-10352804, -6750924, -3973176, -3295517, -4389578, -7234790, -11747109, -16177751, -17869975, -15668568, -11077868, -7497901, -7885364, -11711514, -14735935, -13748488, -10874739, -10662006, -13631032, -16050561, -15922051, -15458738, -16944872, -19435012, -20579221, -19115860, -14980818, -9464506, -5423206, -4548639, -4405464, -1309834, 3696781, 5165960, 252078, -7549614, -12513804, -12292964, -9148152, -7528266, -9992784, -13742912, -12751676, -5672730, 972396, 1066740, -2678509, -3597508, -1509521, -1766787, -5705962, -9282297, -10410542, -10293900, -7879740, -1102273, 5780198, 4543252, -5389063, -15298285, -18951458, -18222708, -15245494, -8257893, 986171, 4769026, 108361]
4617A08361n414614J779487P169962O559416M619451L466799J32383m256410m527426
4608I637409j631746j706265m350148l182493J323759J864955j526823n90136
4600a61488N008748M341035o681348j6495929j4180791l939436L846684O560255
4592b1702270P028969N748488K994511J901752L051239K317682r57129j134670
4584g51428L459258N999918K686940k89818J727427K811245k247139o454768j398882
4575E542753P375403P874625K27328m282515q02924L575887K000499l671428p668013
4566A0171615o599708l33341P694472J1066216O415372j544042n407569m119781
4558A7343234k174513j952512k192554k356890k967413k650973K30332M026220
$$ y = [108361, -5306253, -3526766, 3643196, 10202612, 14822063, 18288862, 18421245, 14164835, 9637409, 8005663, 6299398, 1949250, -1233243, 90516, 1955471, 428648, -161488, 4847260, 9188295, 2506947, -13988982, -28169773, -32109209, -28262525, -21702270, -14673301, -8924813, -5930302, -4028550, -977311, 1340371, 383242, -751428, 2707830, 8707748, 11394688, 11104870, 12832297, 15643542, 13396403, 6941635, 5542753, 12918156, 20792781, 21020109, 16737594, 15934670, 19510557, 21511056, 17839628, 10171615, 3571907, 3238566, 10933038, 21999254, 28414626, 26870584, 21463015, 17343234, 15168721, 13216209, 11023655, 8666765, 5699352, 3048379, 3278711, 7304931]
4550G304931N998523O257115N563271K205736l995830p883117n247823j21369
4542A0081437Q26780j398923q22795K518218K734651j317946m161306l257934
4534E202182k314748l216832k517745R35904K015408k586708p726447o279486
4526a6488472J255493P959468Q891194M753972p91840m127501l277966N11111
4518a314541L191059J893126j692510l198920o43028L409944M975492L453549
4510A0074171K406588M752381Q121637P338723J528375m419035o523339o231928
4502A7047573o152199n213877j750849J868968K329562Q53437Q84179K099656
4494A1966450J723451K72538L85758Q31651j986320o273166n400569J565238O083832
$$ y = [7304931, 13303454, 19560569, 25123840, 27329576, 23333746, 15450629, 10202806, 10081437, 10908217, 9509294, 8686499, 11204717, 13939368, 12621422, 8460116, 5202182, 2887434, -329398, -2847143, -1911239, 104169, -2482539, -10208986, -16488472, -15232979, -7273511, 1617683, 6371655, 5579815, 1452314, -1825652, -1314541, 1876518, 3769644, 2077134, -1121786, -1764814, 1645130, 6620622, 10074171, 12480759, 17233140, 25354777, 32693500, 34221875, 29802840, 23279501, 17047573, 10895374, 5681497, 3930648, 5799616, 8129178, 8982615, 9866794, 11966450, 13689901, 13962439, 14348197, 15179848, 13193528, 6920362, 1519793, 3085031, 9168863]
4485I168863J041716q845711j2529792o500881J630337L468409j60294j638057
4477a4365410K794230Q049344P174831J045074k518169P39684O037415O535417
4469A5492416K094356k124694k954226j348401O67866J251689j407124o475372
4461E196510r065955n619562L03731J946471j507892m168676j894522K710862
4453a2099033M591350K202752j772530l454616j255916K126091K202425j210875
4445h670352k744536J049448O074637O610048L812596K886049M101717L066856
4437A6186463j111567m391989m384585k490338L12833L794077M824123P6757p101278
4428E714496r133321m489168Q30928K772704L128125K909119j33175m783417m988829
$$ y = [9168863, 10210579, 1364868, -11164924, -17665805, -16035468, -12567059, -12727353, -14365410, -11571180, -3521836, 3652995, 4698069, 2179900, 2919584, 8956999, 15492416, 17586772, 15462078, 12507852, 11159451, 11827317, 13079006, 11671882, 5196510, -3869445, -9489007, -9185276, -7238805, -8746697, -12915373, -14809895, -12099033, -7507683, -5304931, -7077461, -10532077, -11787993, -9661902, -7459477, -8670352, -11414888, -10365440, -4290803, 2319245, 6131841, 9017890, 13119607, 16186463, 15074896, 10682907, 6298322, 3807984, 4120817, 7914894, 12739017, 12815774, 5714496, -3418825, -7907993, -7077065, -4304361, -1176236, 1732883, 1599708, -3183709, -8172538]
4419h172538R50509O630396O908712M492900L136631J117817l356451o497878
4411E210098m650985o70879J002940J069428J879025J929218n63302k959217k579319
4402c32993j472788j534550P0310M605852O447734J436609m646079m380594o48565
4393d55064n63568j833625K955223J0773911J0278528M35645o139184k251709
4385A3200157L472097J308366m927750o087646k353157k94194p91631L08683K442945
4376F277870P87140m043105n357787j039085K298064j011368p065452p760009
4368a6913732j900867L552268K926788j141327j723773L244398Q476863Q348688
4360D869306L950958Q94669J404112K118432K14313k127397j815978m01334j542007
$$ y = [-8172538, -7222029, -591633, 6317079, 10809979, 13946610, 15064427, 11707976, 5210098, 559113, -111766, 891174, 1960602, 3839627, 5768845, 5205543, 2246326, -332993, -1805781, -3340331, -3270021, 1335831, 7783565, 9220174, 4574095, 193501, -455064, -1018632, -2852257, 102966, 10876877, 21155405, 21591050, 15451866, 13200157, 16672254, 17980620, 13052870, 6965224, 4612067, 4317873, 3526242, 3834925, 6277870, 7065010, 3021905, -2335882, -3374967, -1076903, -2088271, -9153723, -16913732, -18814599, -15262331, -12335543, -13476870, -15200643, -11956245, -3479382, 4869306, 8820264, 9714933, 11119045, 13237477, 13451790, 11324393, 9508415, 9107081, 7565074]
4351G565074m253582l403747K169674O196693K414340o863897j2767972r634752
4343a8578169j92929Q463320J1319210P785212O76183n597379p630546n461759
4335i216857j809677J294546L599775M506256K718639j011165l723939m200164
4327g842586l885184k480677K742569J0209831J2021225M241864n254050o447901
4319C305091j259040P02942j895688j144965M818571P270385J399902n307070
4311G890128n254210k161542k727088m522005j213382N526891Q570215O402770
4303A2511777L240257P03121k504315m579221k408087J544031J627205k045973
4295H088795l916993k168046j101589l927841q731062j1824030j0415143k928891
$$ y = [7565074, 3311492, -92255, 2077419, 8274112, 10688452, 3824555, -8943417, -18578169, -18771098, -10307778, 1011432, 8796644, 9472827, 3875448, -3755098, -9216857, -11026534, -9731988, -6132213, -1625957, 1092682, 81517, -3642422, -7842586, -11727770, -14208447, -11465878, -1256047, 10765178, 15007042, 9752992, 3305091, 2046051, 2748993, 853305, -291660, 4526911, 11797296, 13197198, 7890128, 2635918, 474376, -2252712, -6774717, -7988099, -2461208, 6109007, 12511777, 15752034, 16455155, 13950840, 9371619, 6963532, 8507563, 10134768, 8088795, 4171802, 2003756, 902167, -3025674, -11756736, -23580766, -33995909, -36924800]
4287c6924800Q056642J4578078J1025188K133273k601698r65709J868736L020793
4279A90503L570674K103586l883827r994478q110522R10218P035612N552509K212586
4270d13139J259915j254783p432982j0683657n758308K088128M947648L022889
4262a4224289J230570J027846J832866M707396Q203914O347044k369127r512865
4254b756645p557117r47748J416935m20232m56680J408946O31888j679905k28965
4245a0589523L814062L867907j30625q63655L669007O147068J932385l294157
4237D552469k520627K567271N613240M605438J747143j876702o201651q966235
4229d79654p557641l462451r75485j284459j032746K186586N472956M188638j022835
$$ y = [-36924800, -28868158, -14290080, -3264892, -1131619, -3733317, -4699026, -2830290, 190503, 3761177, 5864763, 1980936, -8013542, -16124064, -15213846, -8178234, -2625725, -413139, 846776, -408007, -7840989, -18524646, -24282954, -22194826, -17247178, -14224289, -12993719, -11965873, -10133007, -5425611, 2778303, 9125347, 6756220, -2756645, -10313762, -11261510, -9844575, -10264807, -10721487, -9312541, -8680653, -10360558, -10589523, -6775461, -2907554, -3038179, -3901834, -232827, 5914241, 7846626, 4552469, 2031842, 4599113, 10212353, 14817791, 16564934, 14688232, 8486581, -479654, -8037295, -11499746, -12475231, -13759690, -14792436, -12605850, -7132894, -2944256, -3967091]
4220c967091m034983j378794K442656J175164l725449m999204n57619L561583
4212a1483737K754043J09090j25882N81884n43619j394390R74685L930963K985447
4203b211516q65754l203670k963317j618668J448301O600712R752810P265500
4195A4204398K628770J216507R45825l564990r537279q598762q35736L857577
4187C16310N79994l872205k712250R68211J139779j242892j263383J584322L590456
4178i11658K725423K83748j452700p01635K531994N159761L725388m94911k374004
4169H491406j3508K617087J508723k219071m450444k851350J189730L392649J49707
4160G814929o305675q504910l117908L433195L784748K40487m09149J101878j201141
$$ y = [-3967091, -8002074, -9380868, -6938212, -5763048, -9488497, -14487701, -15045320, -11483737, -8729694, -8620604, -8746486, -8164602, -8708221, -10102611, -9127926, -5196963, -2211516, -3077270, -6280940, -9244257, -10862925, -9414624, -2813912, 6938898, 14204398, 16833168, 18049675, 18995500, 15430510, 5893231, -2705531, -3541267, 316310, 896304, -2975901, -5688151, -4719940, -3580161, -4823053, -6086436, -4502114, -911658, 1813765, 2097513, 644813, -56822, 2475172, 7634933, 11360321, 10865410, 8491406, 8477898, 11094985, 12603708, 10384637, 5934193, 3082843, 4272573, 7665222, 7814929, 1509254, -6995656, -10113564, -6680369, -2895621, -2655134, -3064283, -1962405, -3163546]
4151c163546o691484q479411m252829K455551R196138J2942675P403484l371737
4143F038841L782441M2513998Q1632568O9428331K763352n8125426o1979603k7222908
4135E8831594o219534j2844014j9261392j0183720j208961l861602p236264k488274
4127d472167J636607j740992m356620K17402M358808J601238j624207O01165K774679
4118a004087J43352j551610J831067L726196k31474k609481J849137M773120j204129
4109E722091p557932l496038M846625M171512l589490m657043L922471J0141785
4101I503981N618549m441112j1361483j2483432q419492P0142R235040J2940769
4093F62962R301378K912289p28003J5593L270065N290831K473700m903236j1662920
$$ y = [-3163546, -9855030, -18334441, -22587270, -20131719, -10935581, 2007094, 9410578, 6038841, 9821282, 52335280, 133967848, 203396179, 206159531, 148034105, 86054502, 58831594, 52612060, 39768046, 20506654, 10322934, 9113973, 5252371, -1983893, -4472167, -2835560, -4576552, -8933172, -8715770, -4356962, -2755724, -4379931, -3778766, -1004087, -860735, -2412345, -581278, 3144918, 2913444, 303963, 2153100, 6926220, 5722091, -1835841, -5331879, -485254, 3686258, 96768, -4560275, -637804, 9503981, 15122530, 10681418, -680065, -13163497, -21582989, -21512847, -12277807, 662962, 9964340, 12876629, 12148626, 12164219, 15434284, 20725115, 23198815, 18295579, 6632659]
4084F632659j2887032q584914j710168M978408P946885L896032m265874p474086
4076a1468090j628529N849916N998783K28985l847302l834160k505300k60688
4068a1466385M149424P717400N908321J39177m015294m551503l121497m6175M330879
4059i55653O373143M210057K567472M880550N042632l068842j1930800q872248
4051a753689L456090Q973090J678424o518005n052881J420647M358723M578826
4043A1141225O065015O161546J292465m249767m115685J11219K234744Q19688
4035A9460450j374622l520555n818558n855271k239068Q56004j174834n836643
4027e503097o695374k394017K365971L391717M94787l810620n609496j959638
$$ y = [6632659, -6254373, -14839287, -16549455, -11571047, -3624162, 271870, -3994004, -11468090, -13096619, -7246703, -1247920, -1018935, -4866237, -8700397, -11205697, -11466385, -7316961, 400439, 6308760, 6447937, 2432643, -2118860, -5240357, -5286532, -955653, 5417490, 9627547, 12195019, 17075569, 22118201, 19049359, 7118559, -1753689, 1702401, 10675491, 12353915, 5835910, 783029, 2203676, 6562399, 11141225, 17206240, 23367786, 24660251, 20410484, 16294799, 16406018, 18640762, 19460450, 18085828, 14565273, 8746715, 2891444, 652376, 1508380, 333546, -5503097, -12198471, -14592488, -12226517, -8834800, -8340013, -12150633, -17760129, -19719767]
4019a9719767M701767P557298M207169M70285J276757K808358j40049l800150
4011b638332r48842O074833P561716J388836l627137j163473M329437O121569
4003A7098607M461504K629791J9668m715434p862618m804029J853142M531839
3995A3212470R13090l498733l912887k262919k222381k514012L43495M689603
3987D747726M520893j577382o927223n046319J634056N222435K933513l10262
3979E197437Q8047K350153K298936j60398j849420j819025k398832m618558n584730
3970f496390k336221K854179L719801k149713q592038p248880J458173P870707
3962a0920382N434278q31885j992122K549786O155413N701931M090101K762451
$$ y = [-19719767, -15018000, -7460702, -3253533, -2783248, -1506491, 1301867, 1161818, -2638332, -3587174, 2487659, 10049375, 11438211, 7811074, 6647601, 10977038, 17098607, 21560111, 24189902, 24209570, 19494136, 11631518, 6827489, 8680631, 13212470, 14125560, 10626827, 6713940, 4451021, 2228640, -285372, 58123, 4747726, 9268619, 7691237, 764014, -4282305, -2648249, 2574186, 5507699, 5197437, 5285484, 7635637, 9934573, 9774175, 7924755, 6105730, 3706898, -911660, -6496390, -8832611, -5978432, -2258631, -4408344, -13000382, -20249262, -18791089, -10920382, -5486104, -6317989, -8310111, -5760325, 395088, 6097019, 10187120, 12949571]
3954A2949571m86874m881020n321903p60565K524404p6964m760439n786702l545643
3945a0146135j317548J194076N186109P365385L910190k197470m169182r73006
3937a147581J810392O59453j676955j615911J44088R65375O65122J025491K108030
3928B937504J427564k277145n619112l642397K625977N334867K66619n411235
3920d357358k536634N193065N324924l792073q817143j360770Q770462Q444901
3912F869374L83565l158613L77115K901214P65044j121129J00892J071681k6084
3903H163059l96176P70107J28917l281247n717891m956955l446206l576225m323441
3894a6636058l669092p29398M192643Q166100O391538q37344n093190l05750O955265
$$ y = [12949571, 12462697, 7581677, 2259774, 1499209, 4023613, 3946649, -813790, -6600492, -10146135, -11463683, -10269607, -5083498, 2281887, 6192077, 3994607, -174575, -1147581, 662811, 1322264, -354691, -1970602, -1826514, -861139, -196017, 829474, 2937504, 4365068, 2087923, -3531189, -7173586, -4547609, 787258, 1053877, -4357358, -6893992, -1700927, 3623997, -168076, -8985219, -10345989, -1575527, 6869374, 7252939, 4094326, 4471441, 7372655, 8137699, 7016570, 7117462, 8189143, 8163059, 7766883, 8536990, 8665907, 5384660, -333231, -5290186, -8736392, -12312617, -16636058, -20305150, -21034548, -16841905, -8675805, -2284267, -3121611, -8214801, -8520551, -1565286]
3885a565286O077520j396016m426024k06476K353856j767321o111432m416727
3877a1457906J50823K160755J866714J348206K29702m84817K498752P839459Q821745
3868A2973433L329519k523715m046164l493545k754027M67790M920089L900890
3860A2774270l281278p378056l224223J640781l64238n017067n474345l931624
3852a4255780m418979k923677M171210R889837P096860J856084L178734O148282
3844A0742571L61696r832162j0352089n43929N675714K342799j395494P05219
3836b295675K752070M64820m86548L186686M505583j234998o958875n520707j491012
3827g078656k026873m100308r11909N201714O819142M322723M309708P028198
$$ y = [-1565286, 4512234, 3116218, -1309806, -1516282, 837574, -929747, -7041179, -11457906, -11307083, -9146328, -7279614, -5931408, -5701706, -6186523, -3687771, 4151688, 12973433, 16302952, 13779237, 9733073, 6239528, 3485501, 3953291, 8873380, 12774270, 9492992, 2114936, -1109287, 531494, 167256, -4849811, -10324156, -14255780, -18674759, -21598436, -17427226, -7537389, -440529, 1415555, 4594289, 10742571, 11104267, 1272105, -9079984, -9623913, -3948199, -1605400, -3000894, -2295675, 456395, 921215, 434667, 3621353, 8126936, 6891938, -66937, -5587644, -7078656, -9105529, -13205837, -14117746, -8916032, -2096890, 2225833, 6535541, 13563739]
3819A3563739N473422k175014p767968m162529M455324P434117P67183q177822
3811I410452r651096l230058K213240N92758l381388j844468M071927O146073
3803D327440J802500k662190k576088j049522j860321l161857k450011j805841
3795i435890l136715l082725J733330P918448R265962N170468L74479j779737
3787G027620j655223n86685K53295n05516k778625m231077l377955j528519L03711
3778g078974L432199P820888R725929O537154J156161k065799l066721m048871
3770A2411966m561141k978773o59134j56505j004706j373687j947541l701670
3762c971191l877759M20395N750363N281823j465865p052425n559414N32880M459236
$$ y = [13563739, 19037161, 16862147, 9094179, 4931650, 9386974, 16821091, 17588274, 9410452, -240644, -3470702, -1257462, -664704, -4046092, -5890560, -1818633, 4327440, 6129940, 3467750, 891662, -157860, -2018181, -5180038, -7630049, -9435890, -12572605, -15655330, -13922000, -6003552, 3262410, 8432878, 8807357, 7027620, 5372397, 4785712, 5039007, 4533491, 1754866, -2476211, -5854166, -7382685, -7078974, -3646775, 4174113, 13900042, 20437196, 21593357, 19527558, 16460837, 12411966, 7850825, 4872052, 4212918, 4056413, 3051707, 1678020, -269521, -3971191, -7848950, -7428555, -1678192, 3603631, 2137766, -4914659, -10474073, -9941193, -5481957]
3753e481957K995218j311526l532194j077435L449699M415455P7919l822720o38421
3744d925962P725176J2129120P659627l36732l687715j594276j95223l381265
3736A3392750p519637o418695K38701N778683M464964j488524n231376m430613
3728a213747l207282m518253n398883k532793J584152K432228P00517P29953L130546
3719h293562M106290K009179k80528m39571K0529p33301j333951N38218M276345
3710a30352O675605N388628J073298l414229n598460n412043m401937l038923
3702h858413m47195K559408K710470j282279n545128n218007o06174L674590M735466
3693h277262L638006K178204M91492j884818m602504o289684m896550L22473N985807
$$ y = [-5481957, -2486739, -3798265, -7330459, -8407894, -4958195, -542740, -464821, -4287541, -4925962, 2799214, 14928334, 22587961, 22251229, 18563514, 16969238, 16774015, 13392750, 5873113, -545582, -306881, 5471802, 9936766, 8448242, 3216866, -1213747, -4421029, -8939282, -14338165, -16870958, -15286806, -12854578, -12154061, -11424108, -8293562, -4187272, -2178093, -2458621, -2898192, -2877663, -3610964, -4944915, -4406697, -130352, 6545253, 11933881, 13007179, 9592950, 3994490, -1417553, -5819490, -8858413, -9305608, -6746200, -4035730, -5318009, -10863137, -16081144, -16687318, -13012728, -8277262, -4639256, -2461052, -1969560, -3854378, -8456882, -14746566, -19643116, -19320643, -13334836]
3684a3334836O405035P06642m636624l735845J080650L778981L785394M813871
3676a136732O588990M923511j3826k684647r78587M44010j894301m803306m252774
3667c807662j789299j183614k407277k972423k550542k437358k257349o12104
3659b0017628J969656L285973K200080j52204j129522J625746P298959J0755793
3651E836853P135075j742077q474152q331415l312600K478530P217382R625824
3643A0433420P543365J333668m698249p331486q011060q855057q495430n206996
3635b3287825j084483Q13288J239906K911157N650402O942162N925753L652071
3627B762431P35454k272111l593389k211628K27461J987473L710695N579613M747447
$$ y = [-13334836, -6929801, -6223159, -10859783, -14595628, -13514978, -9735997, -5950603, -1136732, 5452258, 10375769, 10361943, 7677296, 6698709, 7142719, 5248418, 445112, -3807662, -5596961, -6780575, -9187852, -12160275, -14710817, -17148175, -19405524, -20017628, -18047972, -14761999, -12561919, -12714123, -13843645, -12217899, -4918940, 5836853, 12971928, 11229851, 2755699, -5575716, -8888316, -6409786, 807596, 10433420, 17976785, 19310453, 14612204, 7280718, -730342, -9585399, -18080829, -23287825, -24372308, -23559020, -22319114, -19407957, -13757555, -6815393, -889640, 2762431, 3497885, 1225774, -2367615, -4579243, -4351782, -2364309, 1346386, 6925999, 11673446]
3618A1673446l56859n403058m826969n3810K045221j133682m643223l336960J731483
3609d304411N846649O236521L357086q61474m143527m805323l071580p58305P92650
3600a711714J608354K023399K007151J628643J127299N08212k56128j034545k001283
3591C899388l276351l676567j641238J681454K583155l69720l999465m957981
3583i757325l911953k871343j288628J730120L956582L054914J212703K311800
3575e563130N772498P579209O293092L592651N311m909876q824805q302944m101829
3566h459823n6342K790911N696529O736155K527657m298068o553157k839883O59745
3557c796276O18481J053372M322340N775837K298451j323728p56583o5135m041804
$$ y = [11673446, 11316587, 5913529, 1086560, 1032750, 3077971, 1944289, -2698934, -6035894, -4304411, 1542238, 7778759, 11135845, 10274371, 6130844, 1325521, -1746059, -2504364, -1711714, -103360, 1920039, 3927190, 5555833, 6683132, 7191344, 6935216, 5900671, 3899388, 623037, -3053530, -4694768, -3013314, -430159, -799879, -4799344, -9757325, -13669278, -16540621, -17829249, -16099129, -12142547, -9087633, -7874930, -5563130, 209368, 7788577, 14081669, 17674320, 17679631, 12769755, 3944950, -4357994, -8459823, -8516165, -5725254, -28725, 6707430, 9235087, 4937019, -1616138, -4456021, -3796276, -3177795, -2124423, 2197917, 7973754, 10272205, 8948477, 8191894, 8126759, 4084955]
3548D084955q592807p242889k412659q84297j692319J178508O177729N478811
3540c904968r73445l785378J239388O956346O946309M150000K701369M50396l805095
3531I974922m147454K769901Q616966M099096n803052q313333k139958J599527
3523F656615j957640m158037J623164Q054805N060684m554909r632533o567289
3515e475140j768780N3399J370619M578697O493942L245275l781660r795729j1479055
3506a6558432q043049m78163P706364J1319471Q022309J260740l095429k418246
3498b284435J191892L699849K403822k020307n492776m022666J532933N750614
3490G58926M961808J516111J07647J682338L196806K096474j247642m668586n810786
$$ y = [4084955, -4507852, -11750741, -14163400, -15047697, -16740016, -15561508, -9383779, -3904968, -4878413, -8663791, -7424403, -468057, 6478252, 10628252, 13329621, 13780017, 9974922, 5827468, 8597369, 17214335, 21313431, 15510379, 7197046, 5057088, 6656615, 4698975, 540938, 2164102, 10218907, 15279591, 10724682, 1092149, -5475140, -7243920, -7190521, -5819902, -1241205, 5252737, 8498012, 4716352, -5079377, -16558432, -24601481, -25079644, -17373280, -6053809, 1968500, 3229240, 133811, -2284435, -1092543, 2607306, 5011128, 2990821, -2501955, -6524621, -4991688, 758926, 5720734, 7236845, 7344492, 9026830, 12223636, 14320110, 13072468, 8403882, 2593096]
3481B593096l529381N37331K845078J961758J81456m24601j005782k395703j724965
3472i61713K964051P071083M307760l470349p510942l954333J692803L526776
3464C665136K426965J168665j462617o352733q402365k058408R092726J4517185
3456A2594554R076549j220686o729617m158266J930350N097462L268138M3192
3448A9901676P1488K952667L443624j093633o218663o409511l111468k197866
3440G338314m603495n132263j295019K373505J506165j308781r75488K161136
3432F4074L582522K005043M22618J0650j889176o136027q474610n001661J655215
3423a3761352N146883L178076q43771l399618m477028m921966l673733J27253
$$ y = [2593096, -936285, -398954, 2446124, 4407882, 4589338, 4164737, 3158955, 763252, -961713, 2002338, 9073421, 13381181, 9910832, 2399890, -1554443, 138360, 3665136, 6092101, 7260766, 5798149, -554584, -8956949, -11015357, -1922631, 12594554, 21671103, 20450417, 13720800, 9562534, 11492884, 16590346, 19858484, 19901676, 19973164, 22925831, 26369455, 25275822, 19057159, 12647648, 9536180, 7338314, 2734819, -2397444, -3692463, -1318958, 187207, -1121574, -2097062, 64074, 3646596, 5651639, 6074257, 6084907, 4195731, -1940296, -10414906, -15416567, -13761352, -8614469, -5436393, -6280164, -9679782, -14156810, -19078776, -22752509, -22625256]
3415b2625256M409320O118830M986831L299681K474232J662933m42042l669125
3407c784596n921810m156558K624133J0172105J1179022L468710n708180p146227
3399G26599n58386N799330N838047J581137j893937k629756j236667J504081L871989
3390A3002437L338034O7916k408114k183421j653568k967490m278288l579976
3382f62470k796980l994505m497056q23066M362316M753247m63660n070467m152470
3373a3345111L83684L979859N314505N785406N697180L699298o13464n247198
3365E654159p322466n825571k660055m99525J78542P34368J329860O12749j037795
3356h835734q88900K018662M969076N687870N312129M950066K874781j402455
$$ y = [-22625256, -18215936, -12097106, -7110275, -3810594, -1336362, 326571, -115471, -3784596, -9706406, -13862964, -11238831, -1066726, 10112296, 13581006, 7872826, 726599, 168213, 5967543, 11805590, 13386727, 11492790, 8863034, 7626367, 9130448, 13002437, 16340471, 16408387, 14000273, 11816852, 10163284, 7195794, 2917506, -662470, -3459450, -7453955, -11951011, -12774077, -8411761, -3658514, -4122174, -9192641, -13345111, -12961427, -8981568, -3667063, 2118343, 7815523, 11514821, 10901357, 5654159, -1668307, -7493878, -10153933, -10653458, -10474916, -9740548, -8410688, -7797939, -8835734, -9724634, -7705972, -2736896, 2950974, 8263103, 13213169, 16087950, 14685495]
3348A4685495l791230j085073K857477J708504m176880q476172p678053l913468
3340i869400J73113L847709N688575L978477L00311j838755k166027k920144l417934
3331f224075q59274L343944M073333L30535l193465l570395k834933k387544n14025
3322a1835899K396954K575112k76238j057457K254525M267648O64695m528623
3314e539283n220863k056858L74795J041790J606918J400429j038346l642160
3306a3073578l158942k16762K071644K715343K394726P30813k149331l551367
3298a4237454j479345K069190M172075M690510M062677J171917k946123l533999
3290f030552J129146N550549M749250J791409J607756J948128j717889o068392
$$ y = [14685495, 10894265, 9809192, 12666669, 14375173, 10198293, 1722121, -5955932, -9869400, -9696287, -5848578, -160003, 3818474, 4118785, 2280030, 114003, -2806141, -6224075, -7083349, -3739405, 333928, 664463, -2529002, -6099397, -8934330, -11321874, -11835899, -9438945, -6863833, -7140071, -8197528, -5943003, -1675355, -1010660, -5539283, -10760146, -12817004, -12442209, -11400419, -9793501, -8393072, -9431418, -13073578, -16232520, -16449282, -14377638, -11662295, -9267569, -8536756, -10686087, -14237454, -15716799, -13647609, -9475534, -4785024, -722347, 449570, -2496553, -6030552, -4901406, 649143, 5398393, 7189802, 8797558, 10745686, 9027797, 2959405]
3282B959405m110269K227467L494180k760709p871352m626459L512191Q551544
3274A375998P373955K363501k524852m122987k325228j065682l419041o201254
3266h545590m312252M08172J160484k829221m537153k013N910018P269029M578408
3257i00118J424275j130072l458926m718783m026661j387677L293332Q473425
3249b431205R082265K299413n310304m225308L750813O582707l40523p379812
3241B028046n867104m53875M28784k138763k246594l63099n97989j603765N28799
3232a0285560L590606K296340k211123m075531k249963n10813O16481L948334
3224h881229Q158222P943169K285539l987241p371268q328176o649325r00719
$$ y = [2959405, -1150864, 1076603, 4570783, 1810074, -6061278, -10687737, -7175546, 1375998, 8749953, 11113454, 8588602, 4465615, 2140387, 1074705, -2344336, -8545590, -12857842, -12449670, -11289186, -14118407, -18655560, -18657573, -12747555, -5478526, -900118, 524157, -605915, -4064841, -8783624, -12810285, -14197962, -10904630, -2431205, 6651060, 8950473, 3640169, -585139, 3165674, 9748381, 9407858, 2028046, -3839058, -4292933, -3864149, -6002912, -8249506, -8612605, -9210594, -10814359, -10285560, -6694954, -4398614, -6609737, -10685268, -12935231, -13446044, -12829563, -8881229, -723007, 7220162, 9505701, 5518460, -1852808, -10180984, -16830309, -17731028]
3216a7731028O284323Q574505L768371l377070p488743p296902l321402L713263
3208a6874683J0301760J1126431N619218l1735k06310L498862N268423K496622
3200B1198588k034766m137696k715084n89411j180106m306116o431394n568955
3192e764940l567957k171574j60492K886781L782642Q81071j525257O19902L693309
3183a326515J710088l305196l940710P29805M040109K587923l001j098170k357791
3174b963458l134553N51857O945719P121185k116677j1371069j0925011l576960
3166a9468967J550296K520125M062332P307633Q292368N414739J616208n74369
3158A0720365j167920o93093l20893k422658o596755p330669r86915O772517O834302
$$ y = [-17731028, -11446705, -2872200, 896171, -2480899, -9969642, -17266544, -20587946, -16874683, -6572923, 4553508, 10172726, 10140991, 9934681, 13433543, 18701966, 21198588, 19163822, 15026126, 12311042, 11721631, 10541525, 6235409, -195985, -5764940, -9332897, -11504471, -11664963, -8778182, -4995540, -4114469, -5639726, -5019824, -1326515, 383573, -2921623, -6862333, -6132528, -2092419, 495504, 492503, -605667, -2963458, -6098011, -5546154, 1399565, 8520750, 6404073, -4966996, -15892007, -19468967, -17918671, -15398546, -11336214, -4028581, 4263787, 9678526, 11294734, 10720365, 9552445, 8859352, 8538459, 6115801, -480954, -7811623, -8798538, -2026021, 4808281]
3149D808281q63337p129539o091459j574399M86660l4321N8188J546424K925313
3140e868189L271355K335271J60931j452686K19818M392065N781402Q24544o907629
3131B756882j0269579o553279K78584M584183M180412R50441j693825j740607
3123g506788j16484O17251l81982r31598J093441M225729M778658J727569j657752
3114A848044j900002L42339J425042l62496k587752j817769J901741M528573K219910
3105E597630l922421p785621m237569M280011R014102M778331l047379m950254
3097b73170j6840K924159j706670p995653p605612k136206L72700j494934j137090
3088a9069316M438905R729584R777073O888653M543456J021825n477853j0375647
$$ y = [4808281, 3944944, -3184595, -9276054, -10850453, -10363793, -10398114, -10339926, -8793502, -5868189, -2596834, -261563, -100632, -1553318, -1333500, 3058565, 8839967, 9664511, 2756882, -7512697, -14065976, -13787392, -9203209, -5022797, -4072356, -5766181, -7506788, -7623272, -7006021, -7388003, -8319601, -7226160, -3000431, 1778227, 3505796, 1848044, -51958, 290381, 1715423, 1352927, -1234825, -3052594, -1150853, 3377720, 5597630, 1675209, -6110412, -10347981, -6067970, 2946132, 7724463, 4677084, -273170, -290010, 2634149, 927479, -7068174, -14673786, -16809992, -16437292, -17932226, -19069316, -14630411, -4900827, 4876246, 11764899, 16308355, 17330180, 11852327, 1476680]
3080A476680q056584r70723L071481J510295r64222p00210M36211o8136j080235
3071e345443p17773K5010p25322k152099j611913J787013O080416Q542893P926401
3062A3809183M857943Q09155k890591n044085m475875j274531K012107K304236
3054A0107542k64605k322922j792457l75364k96553r32886p58525n71118j994583
3045G98529m011025l836225q34543K684136M311910L464198R75305j562010k507908
3036e17633j605619k76343J99385l02716j880019m529938o234744m253351J60366
3027a9240612K059965K37981j2631M525120Q237346M608681k499081l309630L348094
3018b044767Q265512N505472j84978k456546k572163m607333o844429m391148
$$ y = [1476680, -6579904, -7550627, -4479146, -2968851, -3933073, -4633283, -4197072, -4265208, -5345443, -6063216, -6038206, -6763528, -8915627, -10527540, -8740527, -2660111, 5882782, 13809183, 18667126, 19476281, 16585690, 11541605, 7065730, 5791199, 7803306, 10107542, 9842937, 7520015, 5727558, 5352194, 5055641, 4122755, 3364230, 2793112, 798529, -3212496, -7048721, -7883264, -5199128, -887218, 2576980, 3552285, 1990275, -517633, -2123252, -2399595, -2200210, -2502926, -4382945, -8912883, -15147627, -19400978, -19240612, -17180647, -16942666, -16955297, -12430177, -4192831, 415850, -2083231, -5392861, -2044767, 6220745, 11726217, 11541239, 9084693, 6512530, 1905197, -4939232, -9330380]
3010i330380J851011M727651p1777p879983r518805j226989J0391132J4236168
3002C178028O582835m291684p704252l117397J042558m8618k472668k076221j166859
2993a0074278k765929l924947o01361M505321N352205J844661m79903O39112J679398
2984c825721L36320p09984R13263K872930J966860r90635l222776m409590n723821
2975a2793154o167396l509346J613109N736004O859427N956261M007072O85458
2967B387435l011207m129962j911412K08949m61559j467810N71769L496132K345085
2958a972580k323329m534168j880474J304482J402877L93338N98042L49962j187526
2949g849376n26177L530652M915756j308933r578587j0575074m704541n78780
$$ y = [-9330380, -7479369, -2751718, -2823495, -10703478, -20222283, -21449272, -11058140, 3178028, 9760863, 5469179, -2235073, -5352470, -4309912, -4358530, -6831198, -8907419, -10074278, -12840207, -16765154, -17366515, -12861194, -7508989, -5664328, -6144231, -5505119, -3825721, -3489401, -4199385, -3286122, -413192, 1553668, 563033, -2659743, -7069333, -12793154, -18960550, -22469896, -20856787, -15120783, -8261356, -2305095, 1701977, 2387435, -623772, -4753734, -6665146, -6456197, -6917756, -8385566, -7813797, -4317665, -1972580, -4295909, -8830077, -10710551, -9406069, -8003192, -7609854, -7011812, -6661850, -7849376, -8375553, -4844901, 70855, -1238078, -10816665, -21391739, -26096280, -26675060]
2941b6675060j478971k164390N94792L159803K785553K413424M507816O516414
2933a0340619N777150L532904J273632j596374l944145k549555J527148K206119
2925d113740k435460o182778m060980J40143P37536q60734M1738L046606M320415
2916i367254L303750J860036l58295l912974n637245k639818J898270K729514
2908a2124016M18432o01008K9113r68003l187063k487010J385629L336601N28945
2899a3668380l582191m601087k629026n83217o9465n30739o24267M42988J938241
2890b3907143K322649J773827K324252M166748M396892J556319j506035j939417
2882a0811908p09577R05809M329376Q849398Q586559P13221p204799n890079K104189
$$ y = [-26675060, -28154031, -30318421, -29723629, -26563826, -23778273, -21364849, -16857033, -10340619, -4563469, -1030565, 243067, -1353307, -5297452, -7847007, -6319859, -4113740, -6549200, -12731978, -16792958, -16652815, -15915279, -16776013, -16734275, -13687669, -9367254, -6063504, -4203468, -4561763, -8474737, -14111982, -16751800, -14853530, -12124016, -11705584, -12306592, -12277479, -13245482, -16432545, -18919555, -17533926, -14197325, -13668380, -17250571, -21851658, -24480684, -25063901, -25133366, -25664105, -26288372, -25845384, -23907143, -21584494, -19810667, -17486415, -13319667, -8922775, -7366456, -8872491, -10811908, -11521485, -10615676, -6286300, 2563098, 11149657, 11862878, 4658079, -1232000, 872189]
2873H72189N874774J884946k559757j631866J973564L894366M041983L201542
2865A7551741N69506k642024l095432j022849l63697j712446j463902N28126k51515
2856H097508m186604n276596j122050K481055J253868p80456N21492J792495q36856
2847A943856l752389k365531N6999j724908m897474l390098P06028P5035n075079
2838a8423561o697184j635006L885245M128719J024963p83793k12099J258082
2830a7454634K190292J171796j654691k352135K605898R241242R202686J835831
2822D786285l314880L30217O667683N818407j652938o294484l636690O03806M9855
2813C357261l593188m441254j355580J200762J98485j768782m49096M066185P353515
$$ y = [872189, 6746963, 8631909, 6072152, 4440286, 6413850, 10308216, 14350199, 17551741, 18121247, 15479223, 12383791, 11360942, 10997245, 9284799, 7820897, 8349023, 8097508, 3910904, -1365692, -2487742, -6687, 1247181, 466725, 988217, 2780712, 1943856, -1808533, -4174064, -4117065, -5841973, -10739447, -14129545, -13423517, -13348482, -18423561, -25120745, -26755751, -22870506, -18741787, -17716824, -18500617, -18712716, -17454634, -15264342, -14092546, -15747237, -18099372, -15493474, -6252232, 2950454, 4786285, 1471405, 1801622, 8469305, 14287712, 12634774, 6340290, 2703600, 3307406, 3357261, -235927, -4677181, -6032761, -4831999, -4633514, -6402296, -6851392, -2785207, 4568308]
2804D568308O202037K221412p70768j475283j619477k387773k586986j209668
2796B941802J2375j280806m010734m287434q88280K387229J960446K6548J318555
2787a820299N253993O054426J625870k740561k340644l8520q90020l787447m316359
2778b999561l029538l835325n663703l602524J608752L512986R67988O98267N376489
2769f966169P574788J321005p396041q882042l287301J658485K549366K121501
2761a1306408J860104P17209j12936J491654L159097Q54992l305021l165848J378236
2752h428921L650083O70402k624716j708789J327949K506742J331931j171924
2744d447243m492904o026423j849349O606194J1730224R250799L727367O34474
$$ y = [4568308, 10770345, 12991757, 12220989, 10745706, 9126229, 6738456, 4151470, 2941802, 2954177, 1673371, -2337363, -6624797, -7513077, -5125848, -3165402, -3138854, -1820299, 3433694, 9488120, 11113990, 8373429, 6032785, 5994265, 5104245, 1316798, -2999561, -6029099, -9864424, -15528127, -19130651, -17521899, -14008913, -13040925, -12342658, -6966169, 608619, 1929624, -5466417, -14348459, -17635760, -15977275, -13427909, -11306408, -9446304, -8729095, -8842031, -7350377, -4191280, -3336288, -6641309, -9807157, -8428921, -4778838, -4108436, -6733152, -8441941, -7113992, -4607250, -3275319, -4447243, -8940147, -14966570, -16815919, -10209725, 1520499, 10771298, 14498665, 15133139]
2736A5133139j703339o779478j1228217q857035j071328M168569L543777J817007
2728d976905L035404M468361K128241k270606l807443j469248R68722O39902q08940
2719b092512j81424K481519L968810K662008J057596J760206K639508l33542n471483
2710F490686n531985J871129Q525423N359228m744237j0136246n750720J466302
2702b450420L810109K549934K355502J869454l264486j0587626j1633216l490386
2694b0841135O264399Q731359L829028j570311k748963j032412N0227o55586j462623
2685i436017m37016J990417L159463J660931j73913L45641J073198k432898q312232
2676a2562426q137480J087105J0168286R189029J609150j179556L004370N297737
$$ y = [15133139, 13429800, 6650322, -4577895, -13434930, -14506258, -10337689, -6793912, -4976905, -1941501, 2526860, 4655101, 2384495, -1422948, -2892196, -1923474, -1283572, -2092512, -2273936, 207583, 4176393, 6838401, 7895997, 9656203, 12295711, 11962169, 6490686, 958701, 2829830, 11355253, 16714481, 11970244, 1833998, -3916722, -2450420, 1359689, 3909623, 6265125, 8134579, 4870093, -5717533, -17350749, -20841135, -14576736, -5845377, -2016349, -3586660, -6335623, -7368035, -7317808, -7973394, -9436017, -9873033, -7882616, -4723153, -3062222, -3236135, -2890494, -1817296, -4250194, -12562426, -20699906, -19612801, -9444515, -255486, 1353664, 174108, 3178478, 8476215]
2668H476215J474347j314442K390748O178307J892970o964330j0481787o755634
2660e103606k543845j823855j977396p78462M48257J390622L882298P017187O739383
2651G250583K114000k707557m455767m303465l821881j857437K085255N006843
2643f89426L837500n72689m821519o267872l850711J697577O947866P682426L537121
2634G500273j184905k601720j150511N00183Q98516j34792k370195m341136l671083
2625f555370M0220M109408N685862M324238J120924k595951m986705m495806k005736
2616e358916o5003P83814K320389M439337L909918p05655n725625o505107k972777
2607i879625J320544L994137N260465N781627N538443M496232K814511N99807
$$ y = [8476215, 9950562, 8636120, 11026868, 17205175, 19098145, 12133815, 1652028, -5103606, -7647451, -9471306, -11448702, -12227164, -11778907, -10388285, -6505987, 511200, 7250583, 9364583, 6657026, 2201259, -2102206, -5924087, -7781524, -5696269, -689426, 3148074, 2575385, -2246134, -8514006, -12364717, -10667140, -3719274, 3963152, 7500273, 6315368, 3713648, 2563137, 3063320, 3961836, 3827044, 1456849, -2884287, -6555370, -6515150, -2405742, 3280120, 7604358, 8725282, 6129331, 1142626, -3353180, -5358916, -5423919, -4640105, -2319716, 2119621, 6029539, 5323884, -401741, -6906848, -9879625, -8559081, -4564944, 695521, 6477148, 12015591, 16511823, 19326334, 19926141]
2599A9926141j722498l292104l598348k871899j699053q92835j033165j050989
2591C765250J186518M809158M682060j890502q940114p861789O34006O869637
2583C254224N606667K382551L586383O758736N752701O34617l450285m306359
2575B0219235m054627m213807m203310l801609l385422k645720j807180k421362
2567f313802m316437m172072k59010L971156M540142K557485J273727K26601k915739
2558e407949o628941o698843k259218L440272P300171P869118M419904j368931
2550F65583m661382k749493P69709J412326P26374K398718M346850J811723l408305
2541A312103m783785j701342j08563j889933k079672J309099L114438L52248j865736
$$ y = [19926141, 18203643, 14911539, 11313191, 8441292, 6742239, 5849404, 4816239, 3765250, 4951768, 9760926, 14442986, 12552484, 3612370, -4249419, -3615413, 3254224, 8860891, 11243442, 14829825, 21588561, 27341262, 27975879, 24525594, 20219235, 16164608, 11950801, 7747491, 3945882, 560460, -2085260, -3892440, -6313802, -10630239, -14802311, -15061321, -11090165, -6550023, -3992538, -2718811, -2492210, -5407949, -12036890, -18735733, -20994951, -17554679, -10254508, -2385390, 2034514, 665583, -3995799, -6745292, -5975583, -4563257, -3836883, -1438165, 2908685, 4720408, 1312103, -3471682, -5173024, -5281587, -7171520, -9251192, -7942093, -4827655, -4475407, -6341143]
2532f341143J287882O170232O344967J855151k344787l568119k366778L90496
2524A427901L045009K706428o94171k748830o12077K483948K437953L31358j020862
2515G356657k591485n684853o459696p96808P221332Q887506K801489l234433
2507G499709l042040R73823L083277J300926k691847o235504o178899o53431P178533
2498A234547J0499698O583159M24057j886914p78804j125168m601135p875146
2490B474294p891422n445556k634919N64861N043304Q943237Q090342J436974
2482A0581115n541473n820039M84561N543210L793489o45349k58896M451314N506007
2473A8093939n32296p227231p634161l813105k420870m357185m578604q79883
$$ y = [-6341143, -5053261, 1116971, 7461938, 9317089, 6972302, 3404183, 1037405, 1427901, 4472910, 7179338, 6485167, 3736337, 3124260, 5608208, 8046161, 8377519, 7356657, 4765172, -919681, -7379377, -8176185, -954853, 7932653, 10734142, 7499709, 4457669, 5431492, 8514769, 9815695, 7123848, 888344, -5290555, -5943986, 1234547, 11734245, 18317404, 18741461, 16854547, 16075743, 14950575, 10349440, 2474294, -5417128, -10862684, -13497603, -12932742, -7889438, 1053799, 9144141, 10581115, 5039642, -780397, -295836, 5247374, 9040863, 8395514, 8136618, 12587932, 18093939, 17561643, 10334412, 2700251, -1112854, -3533724, -7890909, -12469513, -13349396]
2465a3349396K963600L428306J706257L63672l03042l95271J345377M371229M500588
2456D631320p29076o699489o119763J536722Q981155J0007544N859661J546884
2448A9014958q17049k675307n228333p689303q699774p723626n232690k347637
2440b1398761J37222K622324N597204P628596O256653J496779l396477n391384
2432f447844m002746J84668O222118J0816334R467592K390359m014736n135476
2424I480269m423531p174165j1027653r042086j057937N011661M108089j50765
2416a4276118k501545k818701k725933q83782L812164Q116627Q155876M801262
2408A679850J480568q90367k917352l303079j068540P99298r26157l553309j613924
$$ y = [-13349396, -10385796, -6957490, -5251233, -4887561, -5190603, -5585874, -4240497, 130732, 4631320, 3902244, -2797245, -8917008, -7380286, 1600869, 11608413, 17468074, 19014958, 18197909, 15522602, 10294269, 2604966, -6094808, -13818434, -19051124, -21398761, -21261539, -18639215, -13042011, -5413415, 843238, 2340017, -1056460, -6447844, -10450590, -10265922, -4043804, 6772530, 16240122, 18630481, 14615745, 9480269, 5056738, -2117427, -13145080, -22187166, -23245103, -18233442, -14125353, -14276118, -16777663, -19596364, -22322297, -23206079, -19393915, -11277288, -3121412, 1679850, 3160418, 2270051, -647301, -3950380, -5018920, -4219622, -5145779, -8699088, -10313012]
2399a0313012M037551O164013J509584m258898m668591r19450J492032J165746
2391e791025J097104K263206J920293j149720l662796k162029J835280L372516
2383b277171J75028m588345o063648l160836O19903J486895n60975k455272k082977
2374a8907398l61948P57573J029922J653009K926783L557886K634046J340744
$$ y = [-10313012, -6275461, -111448, 1398136, -2860762, -7529353, -8448803, -6956771, -5791025, -4693921, -2430715, -510422, -1660142, -5322938, -7484967, -5649687, -2277171, -2102143, -6690488, -12754136, -15914972, -15295069, -13808174, -14369149, -16824421, -18907398, -19269346, -18511773, -17481851, -15828842, -12902059, -9344173, -6710127, -5369383]
$$ [...]
##END NTUPLES=NMR SPECTRUM
##END=
