##TITLE=31Pdec_DE-101_rm3h
, 64 sc
 10.7.2025
##JCAMPDX= 6.0         $$ Bruker NMR JCAMP-DX V2.0
##DATA TYPE= NMR SPECTRUM
##DATA CLASS= NTUPLES
##ORIGIN= UXNMR, Bruker Analytische Messtechnik GmbH
##OWNER= root
$$ XWIN-NMR		Version 3.5
$$ Thu Jul 10 14:04:47 2025 Russian Standard Time (UT+4h)  she@DPX200
##.OBSERVE FREQUENCY= 81.013821
##.OBSERVE NUCLEUS= ^31P
##.ACQUISITION MODE= SIMULTANEOUS
##.ACQUISITION SCHEME= undefined
##.AVERAGES= 64
##.DIGITISER RES= 17
##SPECTROMETER/DATA SYSTEM= spect
##.PULSE SEQUENCE= zgpg30
##.SOLVENT NAME= CDCl3
##.SHIFT REFERENCE= (INTERNAL, CDCl3, 0, 198.062)
##AUDIT TRAIL= $$ (NUMBER, WHEN, WHO, WHERE, WHAT)
$$ ##TITLE= Audit trail, XWIN-NMR		Version 3.5
$$ ##JCAMPDX= 5.01
$$ ##ORIGIN= Bruker BioSpin GmbH
$$ ##OWNER= she
$$ F:/spectra/data/she/nmr/P31/2/pdata/1/auditp.txt
$$ ##AUDIT TRAIL=  $$ (NUMBER, WHEN, WHO, WHERE, WHAT)
(   1,<2025-07-10 14:03:23.93 +0400>,<she>,<DPX200>,
      <created by zg, POWCHK disabled, PULCHK disabled
       configuration hash MD5:
       00 E9 B6 7A A2 85 ED C7 34 08 36 98 17 FE 4E 26
       data hash MD5: 32K
       53 7F EA 17 B9 10 79 F0 09 FF C1 CB 71 61 95 DE>)
(   2,<2025-07-10 14:03:26.65 +0400>,<she>,<DPX200>,
      <Start of raw data processing
       efp BC_mod = 2 LB = 1.5 FT_mod = 6 PKNL = 1 PHC0 = 1476.407 PHC1 = -122.5013 SI = 64K 
       data hash MD5: 64K
       23 13 9A 0F 42 AC DA 61 28 84 83 A9 C9 06 2C 00>)
(   3,<2025-07-10 14:03:53.96 +0400>,<she>,<DPX200>,
      <abs ABSG = 5 
       data hash MD5: 64K
       89 E5 BA 86 C2 C6 0E 73 A0 CA 12 7C 95 48 E6 6D>)
(   4,<2025-07-10 14:04:16.45 +0400>,<she>,<DPX200>,
      <pk PHC0 = 7.732166 PHC1 = 0 
       data hash MD5: 64K
       B0 01 26 B9 A3 F4 04 06 54 B9 69 B4 30 A0 58 4C>)
$$ ##END=
$$ 
$$ hash MD5
$$ 28 0B DD 1C C2 DC B1 AF F1 6D E7 4F 68 09 CD 46
##$RELAX= 
##$RELAX= 
##$RELAX= 
##$RELAX= 
##$RELAX= 
##$RELAX= 
##$RELAX= 
##$RELAX= 
$$ Bruker specific parameters
$$ --------------------------
##$DU= <F:/spectra>
##$EXPNO= 2
##$NAME= <P31>
##$PROCNO= 1
##$TYPE= <nmr>
##$USER= <she>
##$AMP= (0..31)
100 100 100 100 100 100 100 100 100 100 100 100 100 100 100 100 100 100 
100 100 100 100 100 100 100 100 100 100 100 100 100 100 
##$AQSEQ= 0
##$AQ_mod= 1
##$AUNM= <au_zg>
##$AUTOPOS= <>
##$BF1= 81.014009
##$BF2= 200.13
##$BF3= 200.13
##$BF4= 200.13
##$BF5= 200.13
##$BF6= 200.13
##$BF7= 200.13
##$BF8= 200.13
##$BYTORDA= 1
##$CFDGTYP= 0
##$CFRGTYP= 5
##$CHEMSTR= <none>
##$CNST= (0..31)
1 1 145 1 1 1 1 1 1 1 1 1 1 1 1 1 1 1 1 1 1 1 1 1 1 1 1 1 1 1 1 1 
##$CPDPRG= <waltz16>
##$CPDPRG1= <>
##$CPDPRG2= <waltz16>
##$CPDPRG3= <>
##$CPDPRG4= <mlev>
##$CPDPRG5= <mlev>
##$CPDPRG6= <mlev>
##$CPDPRG7= <mlev>
##$CPDPRG8= <mlev>
##$CPDPRGB= <>
##$CPDPRGT= <>
##$D= (0..31)
0 1 0 0 0 0 0 0 0 0.06 0 0.03 2e-05 3e-06 0 0 0.0002 0 0 0 0 0 0 0 0 0 
0 0 0 0 0 0 
##$DATE= 1752141803
##$DBL= (0..7)
120 120 120 11 120 120 24 19 
##$DBP= (0..7)
150 150 150 150 150 150 150 150 
##$DBP07= 0
##$DBPNAM0= <>
##$DBPNAM1= <>
##$DBPNAM2= <>
$$ [...]
##$SUBNAM3= <"">
##$SUBNAM4= <"">
##$SUBNAM5= <"">
##$SUBNAM6= <"">
##$SUBNAM7= <"">
##$SUBNAM8= <"">
##$SUBNAM9= <"">
##$SW= 400.765351723535
##$SWIBOX= (0..15)
0 1 3 0 0 0 0 0 0 0 0 0 0 0 0 0 
##$SW_h= 32467.5324675325
##$TD= 32768
##$TD0= 1
##$TE= 0
##$TE2= 300
##$TE3= 300
##$TEG= 300
##$TL= (0..7)
0 120 53 12 22 120 120 120 
##$TP= (0..7)
150 150 150 150 150 150 150 150 
##$TP07= 0
##$TPNAME0= <>
##$TPNAME1= <>
##$TPNAME2= <>
##$TPNAME3= <>
##$TPNAME4= <>
##$TPNAME5= <>
##$TPNAME6= <>
##$TPNAME7= <>
##$TPOAL= (0..7)
0.5 0.5 0.5 0.5 0.5 0.5 0.5 0.5 
##$TPOFFS= (0..7)
0 0 0 0 0 0 0 0 
##$TUNHIN= 0
##$TUNHOUT= 0
##$TUNXOUT= 0
##$USERA1= <user>
##$USERA2= <user>
##$USERA3= <user>
##$USERA4= <user>
##$USERA5= <user>
##$V9= 5
##$VALIST= <valist>
##$VCLIST= <CCCCCCCCCCCCCCC>
##$VD= 0
##$VDLIST= <DDDDDDDDDDDDDDD>
##$VPLIST= <PPPPPPPPPPPPPPP>
##$VTLIST= <TTTTTTTTTTTTTTT>
##$WBST= 1024
##$WBSW= 4
##$XGAIN= (0..3)
0 0 0 0 
##$XL= 0
##$YL= 0
##$YMAX_a= 33027
##$YMIN_a= -37591
##$ZGOPTNS= <>
##$ZL1= 120
##$ZL2= 120
##$ZL3= 120
##$ZL4= 120
##$ABSF1= 198.0616
##$ABSF2= -202.7028
##$ABSG= 5
##$ABSL= 3
##$ALPHA= 0
##$AQORDER= 0
##$ASSFAC= 0
##$ASSFACI= 0
##$ASSFACX= 0
##$ASSWID= 0
##$AUNMP= <proc_1d>
##$AZFE= 0.1
##$AZFW= 0.5
##$BCFW= 0
##$BC_mod= 2
##$BYTORDP= 0
##$COROFFS= 0
##$CY= -3
##$DATMOD= 1
##$DC= 0
##$DFILT= <>
##$DTYPP= 0
##$F1P= 0
##$F2P= 0
##$FCOR= 1
##$FTSIZE= 65536
##$FT_mod= 6
##$GAMMA= 0
##$GB= 0
##$INTBC= 1
##$INTSCL= 9.790993e-09
##$ISEN= 30
##$LB= 1.5
##$LEV0= 0
##$LPBIN= 0
##$MAXI= 10000
##$MC2= 0
##$MEAN= 0
##$ME_mod= 0
##$MI= 50
##$NCOEF= 0
##$NC_proc= -8
##$NLEV= 6
##$NOISF1= 182.463
##$NOISF2= 159.3651
##$NSP= 0
##$NTH_PI= 0
##$NZP= 0
##$OFFSET= 198.0616
##$PC= 4
##$PHC0= 1484.139
##$PHC1= -122.5013
##$PH_mod= 1
##$PKNL= yes
##$PPARMOD= 0
##$PSCAL= 0
##$PSIGN= 0
##$REVERSE= no
##$SF= 81.0140089999434
##$SI= 65536
##$SIGF1= 159.3651
##$SIGF2= -187.1042
##$SINO= 113.3802
##$SIOLD= 16384
##$SREGLST= <1H.CDCl3>
##$SSB= 0
##$STSI= 65536
##$STSR= 0
##$SW_p= 32467.5324675325
##$SYMM= 0
##$S_DEV= 0
##$TDeff= 32768
##$TDoff= 0
##$TI= <>
##$TILT= no
##$TM1= 0
##$TM2= 0
##$TOPLEV= 0
##$USERP1= <user>
##$USERP2= <user>
##$USERP3= <user>
##$USERP4= <user>
##$USERP5= <user>
##$WDW= 1
##$XDIM= 65536
##$YMAX_p= 434928481
##$YMIN_p= -34816313
$$ End of Bruker specific parameters
$$ ---------------------------------
##NTUPLES= NMR SPECTRUM
##VAR_NAME=  FREQUENCY,     SPECTRUM/REAL,   SPECTRUM/IMAG
##SYMBOL=    X,             R,               I
##VAR_TYPE=  INDEPENDENT,   DEPENDENT,       DEPENDENT
##VAR_FORM=  AFFN,          ASDF,            ASDF
##VAR_DIM=   65536,         65536,           65536
##UNITS=     HZ,            ARBITRARY UNITS, ARBITRARY UNITS
##FACTOR=    0.49542278885378, 1,            1
##FIRST=     16045.7642231865, 0,            0
##LAST=      -16421.768244346, 0,            0
##MIN=       -16421.768244346, -34816313,    0
##MAX=       16045.7642231865, 434928481,    0
$$ Real data points
##PAGE= N=1
##DATA TABLE= (X++(R..R)), XYDATA
$$ [...]
46607B121076l45539j757312l52257K305881K381672q75833l583183k378281R95669
46598a488107K255099M10687j335212l85206J720484J669227q88183k766596j631532
46589b439339P96222J386253K12307K8702J486408K070849O11855n93463m9349
46580C510445J8097k011187l203458o37237K800581K398174n22500q39453J249091
46571B762553M14731l920228n469438j351655K741663J747042q92612J9977K367754
46562a580213J105403k365728k609591M57063J937170N74010j08971Q73335M23796
46553a293726j991558k636594k21889J514485L57334n02543J825340M800327M489905
46544F341081J267063j868743l733197m441961l067929N92494L694854L250428
$$ plain form
46607 2121076 1775537 18225 -334032 1971849 4353521 3477688 -105495 -2483776 -1488107
46598 -1488107 766992 1177679 -157533 -542739 1177745 2846972 1958789 -807807 -2439339
46589 -2439339 -1643117 -256864 -44557 -15855 1470553 3541402 4153257 3559794 3510445
46580 3510445 3528542 1517355 -1686103 -2323340 477241 2875415 2352915 1513462 2762553
46571 2762553 3177284 -742944 -6212382 -7564037 -4822374 -3075332 -3967944 -3947967 -1580213
46562 -1580213 -474810 -2840538 -5450129 -4993066 -3055896 -2481886 -2590857 -1717522 -1293726
46553 -1293726 -3285284 -5921878 -6143767 -4629282 -4271948 -4774491 -2949151 1851176 6341081
46544 6341081 7608144 5739401 2006204 -2435757 -5503686 -4911192 -1216338 2034090
46536B034090L66334j298751n66069M01358j28951j181126p87576J448421L727240
46527D014970L546908L71331l034451l263288o38029R07492q83991l545327l540817
46518f065202r69772J344947J951428J753333J760137J859937J586063Q00898
46510D021769k12764q03745p25817r24293k173430k952861r59312K802607M302805
46501B374959K043586p35043j208953r81039k163580k749972n430L823793M017060
46492D415381O24088j566653l58296J059379l26630k868679l163847p19898K112634
46483g92521L077692J557191j351821l306468k517583K23711K370459K639062
46475A899722J898090J118126K05116q78646j562954j673235j578806j207120
$$ plain form
46536 2034090 2400424 1101673 535604 936962 808011 -373115 -1160691 287730 4014970
46527 4014970 7561878 7933209 4898758 1635470 997441 1904933 1020942 -2524385 -6065202
46518 -6065202 -7034974 -5690027 -3738599 -1985266 -225129 1634808 3220871 4021769
46510 4021769 3809005 3005260 2279443 1355150 -818280 -3771141 -4730453 -1927846 2374959
46501 2374959 4418545 3683502 2474549 1493510 -670070 -3420042 -3425472 398321 4415381
46492 4415381 5039469 3472816 3114520 4173899 3847269 978590 -2185257 -2905155 -792521
46483 -792521 2285171 3842362 2490541 -815927 -3333510 -3109799 -739340 1899722
46475 1899722 3797812 4915938 5121054 4242408 2679454 1006219 -572587 -1779707
46467a779707l72942N9740q15874j863531r49036J753424L659448L271090J589115
46458D551727k01598j889053k552464o66269K828711M261327J828665j759380
46450F401666l069764k281962j667473j721155j385318p31817o52548n94962P55799
46441d947534K688323K705380q1701l525941m865158l379255m26455K080419K994911
46432f757011K583679K065175K047015J686228K7730k261160l424378k689309
46424f722031r43423N48258J288775J424344J223937R03091O14742N01853P52316
46415d08138J295113J450612N69768p08172o52319J455688L965908M332554J753580
46406A3054594j999460m102483k955931M23682L099331K984981J036386j48608
$$ plain form
46467 -1779707 -2152649 -2092909 -2908783 -4772314 -5721350 -3967926 -308478 2962612 4551727
46458 4551727 4350129 2461076 -91388 -757657 2071054 6332381 8161046 6401666
46450 6401666 3331902 1049940 -617533 -2338688 -3724006 -4455823 -5108371 -5703333 -4947534
46441 -4947534 -2259211 446169 364468 -3161473 -8026631 -11405886 -11832341 -9751922 -6757011
46432 -6757011 -4173332 -2108157 -61142 1625086 1652816 -608344 -4032722 -6722031
46424 -6722031 -7665454 -7117196 -5828421 -4404077 -3180140 -2277049 -1662307 -1160454 -408138
46415 -408138 886975 2337587 2907355 2199183 1546864 3002552 6968460 11301014 13054594
46406 13054594 11055134 6952651 3996720 4420402 7519733 10504714 11541100 11392492
46398A1392492J94822L60706p95711k134153k479539k639039l511682l822235
46390c434339j990916P77112J826880J114379J285491L301404M479021K174424
46382I533456k337388n358609n254476l763884k991803k645404j003735K176869
46374a1644974M901151N233124L456427J315923k23821j471751k675418l472477
46366d581816l629786l056449j131817K344767N367913N005890J340307j911893
46358b52884j991508l06081N43552O82214J422584J773906j09455k978269l601339
46349d817280j674196j31898k32561R4381J957869L079022J606416n46524o85319
46340a350090N18304O17031m10241n27496N12754O72320p86369j728805k28706
$$ plain form
46398 11392492 11587314 11948020 11152309 9018156 6538617 3899578 387896 -3434339
46390 -3434339 -5425255 -4648143 -2821263 -1706884 -421393 2880011 7359032 9533456
46382 9533456 7196068 1837459 -3417017 -7180901 -10172704 -12818108 -13821843 -11644974
46374 -11644974 -6743823 -1510699 1945728 3261651 3037830 1566079 -1109339 -4581816
46366 -4581816 -8211602 -11268051 -12399868 -10055101 -4687188 318702 1659009 -252884
46358 -252884 -2244392 -2550473 -2006921 -1324707 97877 1871783 1762328 -1215941 -4817280
46349 -4817280 -6491476 -6623374 -6855935 -6761554 -4803685 -1724663 -118247 -664771 -1350090
46340 -1350090 -831786 -214755 -624996 -1152492 -639738 32582 -753787 -2482592 -2711298
46331b711298K342368K717587j48008l419891l424022j70565K191092L86973l403821
46322e639585m047062m21428K909617K132565n86362p72746J713887L190287K152143
46313F31316Q48857P95842N59178q13715j526204k12968J220533M22197j533537
46304C91499j712763K86700J989025J583137l56041k390019l418471k511057L58150
46295e779840L175101L424023J285047l50421M01159K264107K983292K033506
46287I435974L03177j373155k272175j776093n80554o53013k572314m071937k871144
46278f431234L8612J769270J371689K46305o03919j257714j048902J065862L694289
46269a155742L394390o15371m424490m141907r64405P78383m54185k023440j360355
$$ plain form
46331 -2711298 -368930 2348657 2200649 -1219242 -4643264 -4813829 -2622737 -2235764 -5639585
46322 -5639585 -9686647 -10108075 -7198458 -5065893 -5652255 -6425001 -4711114 -1520827 631316
46313 631316 1480173 2276015 2835193 2021478 495274 282306 1502839 1925036 391499
46304 391499 -1321264 -1034564 954461 2537598 2181557 -208462 -3626933 -6137990 -5779840
46295 -5779840 -2604739 819284 2104331 1753910 2155069 4419176 7402468 9435974
46287 9435974 9739151 8365996 6093821 4317728 3737174 3084161 511847 -3560090 -6431234
46278 -6431234 -6392622 -4623352 -3251663 -3005358 -3609277 -4866991 -5915893 -4850031 -1155742
46269 -1155742 2238648 1623277 -2801213 -6943120 -7907525 -7129142 -7583327 -9606767 -10967122
46260a0967122Q82270K499334K658124K127307J728917J587840J410332Q53717
46252B780719r7819q59973p58857L8097O58933P55368Q37738R88964J57211k248540
46242B251841m554408m095960p16694K268942J755276j196702k612350p42478
46234g642533J863399K163160O63135r7614K27100k86447j931233k307379j70811
46225g519223K095657J703125n07172j453039l45029N12288n55487k132163j811884
46216a0012927M15911J965528P27928k209066l411981r84242K908247M427906
46208f172696K756690P61150O80011J302129O94652l83804n4375J149219J071245
46199A804221l76037j106064m62934k69649j637370k992243k365813q1272J862082
$$ plain form
46260 -10967122 -10084852 -7585518 -4927394 -2800087 -1071170 516670 1927002 2780719
46252 2780719 2682900 1822927 1064070 1102167 1761100 2516468 3354206 4343170 4500381 2251841
46242 2251841 -2302567 -6398527 -7115221 -4846279 -3091003 -4287705 -6900055 -7642533
46234 -7642533 -5779134 -3615974 -2952839 -3050453 -2823353 -3109800 -5041033 -7348412 -7519223
46225 -7519223 -5423566 -3720441 -4227613 -5680652 -6025681 -5513393 -6068880 -8201043 -10012927
46216 -10012927 -9597016 -7631488 -6903560 -9112626 -12524607 -13508849 -10600602 -6172696
46208 -6172696 -3416006 -2654856 -1974845 -672716 21936 -361868 -416243 732976 1804221
46199 1804221 1428184 322120 -140814 -410463 -2047833 -5040076 -7405889 -7487161 -5625079
46190e625079K073861Q56624j84018M56207K254126K614912K05373k411736j771050
46181a530780J333672K717264J044956l34547R48620K348504N81163l058857m650112
46172f00117l100436n79155J280707K529914K865690J416560j269799l221201
46164f77837l272524j820551L03795K114815K195318O0340k518585l302933k280830
46155i198992r01433N34239K482722L884453L006102L75299j731713k594727l133213
46146g277263k984085r18265J620363J353710j374344k064500J092131L935917
46138f616336K849835O82289J941865N024388M509867j30123l590129k719248
46130A952408m86054n56875k088825k256782r86358m86350j666672l154689l106393
$$ plain form
46190 -5625079 -3551218 -2694594 -2878612 -2422405 -168279 2446633 2652006 240270 -1530780
46181 -1530780 -197108 2520156 3565112 3230565 4179185 6527689 7108852 4049995 -600117
46172 -600117 -3700553 -4279708 -2999001 -469087 2396603 3813163 2543364 -677837
46164 -677837 -3950361 -5770912 -5467117 -3352302 -1156984 -1096644 -3615229 -6918162 -9198992
46155 -9198992 -10100425 -9566186 -7083464 -3199011 -192909 182390 -1549323 -4144050 -7277263
46146 -7277263 -10261348 -11179613 -9559250 -8205540 -9579884 -11644384 -10552253 -6616336
46138 -6616336 -3766501 -3084212 -1142347 3882041 8391908 8261785 4671656 1952408
46130 1952408 1466354 909479 -1179346 -3436128 -4422486 -4908836 -6575508 -9730197 -12836590
46121a2836590q76593K279862L782016K373455K84657O25910K469133J669483
46113b28667k366288m541345j347009L131506K570543k423677n297790k914296
46105a3417023R86621K249765J625477J772371K614805K377354R61214k49333
46097a078749n97878k77686N54012J220821L92010j883275l240691j808920J065931
46088e654425K538850J765745R7140j231319j815401j292978K72976J662459J733605
46079a923348R17672J52588p61206k088326k536092r29459J262025J553259J64207
46070d188680m55254M50369J317207J571951K351179L224554J572002l048607
46062B794721o712862n679435j290908J952185J912717K62906o57441l02916M37587
$$ plain form
46121 -12836590 -13713183 -11433321 -7651305 -5277850 -4993193 -4367283 -1898150 -228667
46113 -228667 -2594955 -7136300 -8483309 -5351803 -2781260 -5204937 -10502727 -13417023
46105 -13417023 -12430402 -10180637 -8555160 -6782789 -4167984 -1790630 -829416 -1078749
46097 -1078749 -1676627 -1954313 -1400301 -179480 212530 -1670745 -4911436 -6720356 -5654425
46088 -5654425 -3115575 -1349830 -1252690 -2484009 -4299410 -5592388 -5319412 -3656953 -1923348
46079 -1923348 -1005676 -853088 -1614294 -3702620 -6238712 -7168171 -5906146 -4352887 -4188680
46070 -4188680 -4643934 -4193565 -2876358 -1304407 1046772 4271326 5843328 2794721
46062 2794721 -3918141 -9597576 -10888484 -8936299 -7023582 -6760676 -7418117 -7721033 -7283446
46053g283446M30206q09101k385192k478813l42326K573465M112788L483593J441059
46044a257767o65458j542281p84852L11798m4951j576571k035966n31535J095710
46035g031873J243852Q17259R47355N50426j545173l649207l072254o9405K522158
46026i286862L032204K186303J141620M06847K87502M91322j96277k090862l324473
46017g352676k301847l01997O43597J096911K522571L581282J886923j189906
46009a415142j687125P98677K309155O53000j716604k185639j403637n99490O70268
46000d576537K016583J164825k056110m048968k533666q2266L80056K39397J728664
45991g768022L028733J396362j271646j081011J243144J652264j83977o47245
$$ plain form
46053 -7283446 -6853240 -7662341 -10047533 -12526346 -12868672 -10295207 -6182419 -2698826 -1257767
46044 -1257767 -1923225 -3465506 -4250358 -3938560 -3983511 -5560082 -7596048 -8127583 -7031873
46035 -7031873 -5788021 -4970762 -4023407 -3472981 -5018154 -8667361 -11739615 -11809020 -9286862
46026 -9286862 -6254658 -4068355 -2926735 -2519888 -2232386 -1741064 -1937341 -4028203 -7352676
46017 -7352676 -9654523 -9956520 -9312923 -8216012 -5693441 -2112159 -225236 -1415142
46009 -1415142 -3102267 -2303590 5565 658565 -1058039 -3243678 -4647315 -5246805 -4576537
46000 -4576537 -2559954 -1395129 -3451239 -7500207 -10033873 -10116139 -9736083 -9496686 -7768022
45991 -7768022 -4739289 -3342927 -4614573 -5695584 -4452440 -2800176 -2984153 -3631398
45983c631398R88885J106562j675376l654324j926725J244305K483277J967469
45975c097325J262389q0568k423473l266028l20247M296381O367957M942824K313713
45966I995623j95579k902379m738926l386414P39759L644205K350153j558270
45958C948172m196175l688468j159435J235340J969387O65322j742780l480362
45950f448999l299134j512147L98620J088424N02490J18022J623787M645650O278950
45941C395663M060495q00614m481316m788855k870851o81938J190506K425748
45933b551162J905011m93423k552339k231372n53281R0082l41827L156J167121
45924e558034J145536k70990n76558J175050K111874j42634l260802l368452q64637
$$ plain form
45983 -3631398 -2642513 -1535951 -3211327 -6865651 -8792376 -7548071 -5064794 -3097325
45975 -3097325 -1834936 -1915504 -4338977 -7605005 -7925252 -3628871 2739086 7681910 9995623
45966 9995623 9800044 6897665 2158739 -1227675 -487916 3156289 5506442 3948172
45958 3948172 -248003 -3936471 -5095906 -3860566 -1891179 -1225857 -2968637 -6448999
45950 -6448999 -9748133 -11260280 -10861660 -9773236 -9270746 -9152724 -7528937 -2883287 3395663
45941 3395663 7456158 6655544 2174228 -2614627 -5485478 -6167416 -4976910 -2551162
45933 -2551162 -646151 -1139574 -3691913 -5923285 -6476566 -6386484 -6728311 -6725155 -5558034
45924 -5558034 -4412498 -4683488 -5260046 -4084996 -1973122 -2115756 -5376558 -8745010 -9609647
45915i609647M79681l59144l63300K027077L881886K271084j054924k244116q47622
45906e819025K60759l17463q28817K20230J541520J112208q22141k074454j159614
45897g886797J236298L090968K969727J469718P89087K246677M288318L964427
45889A2168423O35194k934293l822907k289619r09650j165296k168647k456541
45881b943336j695550l66216J128880K401735K784822J857428J29247j265200
45873B031810j586542j063987n70063q10898j599107j807937m18370K089996L794421
45864E9323L320380J494342K57017O5534n24689k319132l735254k747950P7577
45855d052852K005041J609981L98226L72664J225542J072243o97631k613568l144077
$$ plain form
45915 -9609647 -9129966 -9489110 -9852410 -7825333 -3943447 -1672363 -2727287 -4971403 -5819025
45906 -5819025 -5558266 -5875729 -6704546 -6484316 -4942796 -3830588 -4652729 -6727183 -7886797
45897 -7886797 -6650499 -3559531 -589804 879914 1669001 3915678 8203996 12168423
45889 12168423 12803617 9869324 6046417 3756798 2847148 1681852 -486795 -2943336
45881 -2943336 -4638886 -5005102 -3876222 -1474487 1310335 3167763 3297010 2031810
45873 2031810 445268 -618719 -1188782 -1999680 -3598787 -5406724 -5825094 -3735098 59323
45864 59323 3379703 4874045 5131062 5196596 4671907 2352775 -1382479 -4130429 -4052852
45855 -4052852 -2047811 -437830 -39604 333060 1558602 2630845 1933214 -680354 -3824431
45846c824431k454782j759791j579654j207987K32252K524309M228656L858119
45838A6691J294349j948491l914742l673988j783755L36284J433367J270516P25816
45829f243953P62751J174713Q69714l58081j150174m00096R74486J250823M95251
45820b624566M22395J527259K017582M61304j873151k696334j830409j014842
45812e610762j002171p59818J71216M64355p56078j939197r87549J666112L544714
45803e209178L363178K104975R10706k63258j401336j629269o44388M88601J046516
45794a233453J715589K646885K085239r69379l993510l570870l01656J815625
45786a805530R94757m27404m35726m04053j861083l045374j535968J475597K634801
$$ plain form
45846 -3824431 -6279213 -8039004 -9618658 -10826645 -10594393 -8070084 -3841428 16691
45838 16691 1311040 -637451 -4552193 -8226181 -10009936 -9673652 -8240285 -6969769 -6243953
45829 -6243953 -5481202 -4306489 -3436775 -3794856 -4945030 -5345126 -4370640 -3119817 -2624566
45820 -2624566 -2202171 -674912 1342670 1803974 -69177 -2765511 -4595920 -5610762
45812 -5610762 -6612933 -7372751 -7201535 -6737180 -7493258 -9432455 -10420004 -8753892 -5209178
45803 -5209178 -1846000 258975 1169681 906423 -494913 -2124182 -2768570 -2279969 -1233453
45794 -1233453 482136 3129021 5214260 4244881 251371 -3319499 -3621155 -1805530
45786 -1805530 -810773 -1238177 -1673903 -2077956 -3939039 -6984413 -8520381 -7044784 -4409983
45777d409983J261155j93033j74623L44765M98439J041488K309367K873449J595975
45768E146999m62861j503059j294825q27179m49703L60933J671294K569366K130086
45759G341051M57138j327263k015726j318424J3045J038572J340233Q64646k27975
45750F165297j145888q23808M18629N41942j486903l467356k466873P99006K502555
45741A036601R93151r83598n77044R54291M43674k217704l864172k478725L98567
45732f294959K082844J855935Q52785K0559o45433j210323j232128m81753K88503
45723d763970K6363j055246j300434L54797K593938K953436Q92507j357473j474376
45714c130458J60287J065361k38440k435552k945161r46571J632724K456586J572774
$$ plain form
45777 -4409983 -3148828 -3341861 -3516484 -3171719 -2673280 -1631792 677575 3551024 5146999
45768 5146999 4684138 3181079 1886254 1059075 609372 970305 2641599 5210965 7341051
45759 7341051 7798189 6470926 4455200 3136776 3149821 4188393 5528626 6393272 6165297
45750 6165297 5019409 4195601 4614230 5156172 3669269 201913 -2264960 -1465954 1036601
45741 1036601 2029752 1046154 469110 1423401 1867075 -350629 -4214801 -6693526 -6294959
45732 -6294959 -4212115 -2356180 -1503395 -1482836 -2128269 -3338592 -4570720 -5052473 -4763970
45723 -4763970 -4737607 -5792853 -7093287 -6738490 -4144552 -1191116 -298609 -1656082 -3130458
45714 -3130458 -2970171 -1904810 -2143250 -4578802 -7523963 -8470534 -6837810 -4381224 -2808450
45705b808450Q30915P17118l85990k969715m453935k453578J394789L351547K495961
45696d281338J045700L10127n03321j375583q13755J055333J981214J352008J167001
45687f2614J811418O40017k845832m338944r62608L152890K334968j891249l099652
45678e261606K8939K072831q5984k474001p56334K987506L855613J375375p53430
45669I88909n30888L63324M1192j070951j585065j116073k95132J33310j59045
45660c230419q95047j361840r98751J89781J667939K469275J669211l77478j631549
45651b498878n03537J732602K236048M50314j157370p61853L23178n7963j707753
45642a945212k667508j955643k85221J304148K354831K939673L443808L929769
$$ plain form
45705 -2808450 -1977535 -1260417 -1646407 -4616122 -9070057 -11523635 -10128846 -6777299 -4281338
45696 -4281338 -3235638 -2925511 -3428832 -4804415 -5618170 -4562837 -2581623 -1229615 -62614
45687 -62614 1748804 2388821 -457011 -4795955 -5758563 -2605673 -270705 -2161954 -5261606
45678 -5261606 -5232667 -3159836 -3245820 -5719821 -6476155 -3488649 366964 1742339 988909
45669 988909 458021 821345 862537 -208414 -1793479 -2909552 -3204684 -3071374 -3230419
45660 -3230419 -4125466 -5487306 -6486057 -6296276 -4628337 -2159062 -489851 -867329 -2498878
45651 -2498878 -3002415 -1269813 966235 1416549 259179 -502674 -179496 -237459 -1945212
45642 -1945212 -4612720 -6568363 -6853584 -5549436 -3194605 -254932 3188876 7118645
45634G118645L473353J199258j723729k766379j520953o66484k108399l972748
45626i67436l408189q98746O42459J74364o27947m43606K63537R01519J485690
45617b878355J390615m02330l132763m287062k676089R7955J990277K700763K704837
45608d492152J905640N62761L3692R56618J784473P89076j297127k315602j699704
45599c772325o81475K3307P05441R79928j02306j795516j807493J90480J342406
45590d917553l44115k558031j798041J209523K269796j84852k860855k390163
45582a1574291L56760K342557K524812J887626J026259P7853q3463R77439J654779
45573h09669L35495j536641j106080J431209K912341J962852O10730M11433J49253
$$ plain form
45634 7118645 10591998 11791256 10067527 7301148 5780195 5113711 3005312 -967436
45626 -967436 -4375625 -5274371 -4631912 -4457548 -5085495 -5529101 -5265564 -4364045 -2878355
45617 -2878355 -1487740 -1890070 -5022833 -9309895 -11985984 -11888029 -9897752 -7196989 -4492152
45608 -4492152 -2586512 -2023751 -1990059 -1033441 751032 1540108 242981 -2072621 -3772325
45599 -3772325 -4453800 -4430493 -3725052 -2745124 -2847430 -4642946 -6450439 -6259959 -4917553
45590 -4917553 -5261668 -7819699 -9617740 -8408217 -6138421 -6323273 -9184128 -11574291
45582 -11574291 -11217531 -8874974 -6350162 -4462536 -3436277 -3358424 -3441887 -2464448 -809669
45573 -809669 -474174 -2010815 -3116895 -1685686 1226655 3189507 3800237 4211670 4360923
45564D360923j065782j377769P86683L485958L710093J606083k53017p57372r63267
45555I532533j576087k040749j906489j294890k98598O51849N24093o91765j133739
45546A766158K40468J255166o80372m185196n240959k659744P43707K545397L149805
45537c065570L196450J751340j336076l797931l603829j565920K77256J317732
45529f826548J899691J692589L36474j232979j652577p55770O06940J534155J182261
45520c215764p59258k774712k284771R35245L618375K999714N78143j89874J131040
45511C8138J777835J68687k086951k895659k269288j416850q11190j57116N89302
45502g063092R84313O08250l33381o89597Q33666L768785N436962L781128L16781
$$ plain form
45564 4360923 3295141 1917372 2704055 6190013 9900106 11506189 11253172 10495800 9532533
45555 9532533 7956446 5915697 4009208 2714318 2415720 3067569 3591662 2899897 1766158
45546 1766158 2006626 3261792 2581420 -1603776 -6844735 -9504479 -8760772 -6215375 -3065570
45537 -3065570 130880 1882220 546144 -3251787 -6855616 -8421536 -8144280 -6826548
45529 -6826548 -4926857 -3234268 -2897794 -4130773 -5783350 -6539120 -5932180 -4398025 -3215764
45520 -3215764 -3975022 -6749734 -9034505 -8099260 -4480885 -1481171 -903028 -1092902 38138
45511 38138 1815973 1984660 -102291 -2997950 -5267238 -6684088 -7495278 -7652394 -7063092
45502 -7063092 -6078779 -5470529 -5803910 -6493507 -5659841 -1891056 3545906 7327034 7643815
45493G643815j420748m16661P25704k13382j948078j915157q8536J335967J257917
45484D960841O05871Q6364r26635k620227l566419k494967j66350J694613K443572
45475A6663K241674P50020j958632l757598k300505J154834K424881R1722k063090
45466c400031l61438L301709M228389J622317j001958j500509j392874k051194
45458e55589k254293r74122L49795J77963o92881q11202l48661j35095j32602
45449e376687k29684p15438p34028J428351M947669N992662K866517r73050j787261
45440E419051r22298j845690m014793l943567j091678J710608L119100M222095
45432B652828M826810L266938L41216q94594j11048k57397k069396k518895m83103
$$ plain form
45493 7643815 6223067 5806406 6532110 6318728 4370650 2455493 2366957 3702924 4960841
45484 4960841 5566712 5653076 4726441 2106214 -1460205 -3955172 -4121522 -2426909 16663
45475 16663 2258337 3008357 1049725 -2707873 -5008378 -3853544 -1428663 -1336941 -3400031
45466 -3400031 -3761469 -459760 3768629 5390946 4388988 2888479 1495605 -555589
45458 -555589 -2809882 -3784004 -3434209 -3256246 -3949127 -4760329 -5108990 -5244085 -5376687
45449 -5376687 -5606371 -6321809 -7055837 -5627486 -679817 5312845 8179362 7206312 5419051
45440 5419051 4496753 2651063 -1363730 -5307297 -6398975 -4688367 -1569267 2652828
45432 2652828 7479638 10746576 11087792 10193198 10082150 9824753 7755357 5236462 4753359
45423D753359O31591j375099l387916k173777n9391j014620l680390l289272O04767
45414h990748L175359J408167j833051k096081R41360L563578K598441j086448
45406b319423l486419j950944J446405K411541L90577n69227J872297M310787
45398B105594K574889j906449m373679l501738j777381l60883J814291M110623
45390a314733M059879J823787N31823J181035J329130J11452J31654K303122L240055
45381A3397204Q88697j228504N15553L310508J807803l279795n801434l064300
45373F545732R13343J950252J033237J052193J764407J086304n85712o52171J412867
45364A4520452K699262O36570l315650n025329k462405J905125L913743K217481
$$ plain form
45423 4753359 5384950 4009851 621935 -1551842 -1611233 -2625853 -6306243 -9595515 -8990748
45414 -8990748 -5815389 -4407222 -6240273 -8336354 -7394994 -3831416 -1232975 -2319423
45406 -2319423 -5805842 -7756786 -6310381 -3898840 -3508263 -4077490 -2205193 2105594
45398 2105594 4680483 2774034 -1599645 -5101383 -6878764 -7239647 -5425356 -1314733
45390 -1314733 2745146 4568933 5100756 6281791 7610921 7722373 7854027 10157149 13397204
45381 13397204 14285901 13057397 13572950 16883458 18691261 15411466 9610032 6545732
45373 6545732 7459075 9409327 10442564 11494757 13259164 14345468 13759756 13107585 14520452
45364 14520452 17219714 17856284 14540634 9515305 7052900 8958025 12871768 15089249
45356A5089249q78838k682683k776714k207677j680473j540554k162246k983073
45348a823009k278380M95604L056989K816405L59613j502686j549156p90818K41787
45339i73651K085161L965450L733247J268978n22721L59013K106999J814769n61104
45330A3276141k690236k996938j673957K22640J174311l3679k435487l218835
45322A623960j552779k65145j562901l171048j887421P89861P85879j619144j807378
45313h666116J738120M851152M227636K086985J625780J763189N5375k189380
45305E492741k000463j07111J38586j627349k340949o12640J414963J740706P97691
45296B896175n61976k307969l460238j931492K291122N921739N938070K923009
$$ plain form
45356 15089249 14210411 11527728 8751014 6543337 4862864 3322310 1160064 -1823009
45348 -1823009 -4101389 -3605785 -548796 2267609 2627222 1124536 -424620 -1215438 -973651
45339 -973651 1111510 5076960 8810207 10079185 9556464 9915477 12022476 13837245 13276141
45330 13276141 10585905 7588967 5915010 6137650 7311961 7278282 4842795 1623960
45322 1623960 71181 -193964 -1756865 -4927913 -6815334 -6025473 -5239594 -6858738 -8666116
45313 -8666116 -6927996 -2076844 2150792 4237777 5863557 7626746 7682121 5492741
45305 5492741 3492278 3385167 3523753 1896404 -444545 -1057185 357778 2098484 2896175
45296 2896175 2334199 26230 -3434008 -5365500 -3074378 2847361 8785431 11708440
45288A1708440l27011k135576k718201k761597k406998j202748J217047L821131
45280E194487M111898R40760l002058l644929n10027K939750L905931K631388
45272A2567200J22897l177948n606468m694180j126658Q20380j133475m057807
45264f286059m279134k150207L7645J864534L564658L893212K566825K117405
45256A328879L667820L696538o25711n577721n627149j898667L0873p27856k07872
45247e940866J980135J606954j622922k046383K524850O131849L587009j620026
45239D600600l219148j346251m71932j629271k251038j492982n66408P09605L035908
45230b630917M543005K940725k42994j696161j570790k417437l752949k467246
$$ plain form
45288 11708440 11381429 9245853 6527652 3766055 1359057 156309 1373356 5194487
45280 5194487 9306385 10247145 7245087 3600158 3090131 6029881 9935812 12567200
45272 12567200 12690097 9512149 3905681 -788499 -1915157 -1094777 -2228252 -6286059
45264 -6286059 -10565193 -12715400 -12677755 -10813221 -7248563 -3355351 -788526 1328879
45256 1328879 4996699 8693237 8067526 2489805 -3137344 -5036011 -5005138 -5732994 -5940866
45247 -5940866 -3960731 -2353777 -3976699 -6023082 -3498232 2633617 6220626 4600600
45239 4600600 1381452 35201 -436731 -2066002 -4317040 -5810022 -6376430 -5666825 -2630917
45230 -2630917 1912088 4852813 4609819 2913658 1342868 -1074569 -4827518 -7294764
45222g294764J351517L672615K477110M39112L95367J541461J636163K95720j340235
45213C174066k252279j958692r17321o27076j518182j371540J491868M247574
45205B68418K627116k107264l770561j1884M028538L156216p31805k258015m34357
45196G66402R31625o76887l394913l798513p40081L551010N289734K873423p79762
45187D022038j346540J074382K090115M6670q64960K716086P139262O588802J717026
45178B3182881j673817j437043j037630k419083k533514Q45385M413744L836689
45170B3177612M0609k522591k184050j241076j594814k341452j948004m79186
45162A0907048R74495J512172O17587j463416l096735k440248J1927J404560J72410
$$ plain form
45222 -7294764 -5943247 -2270632 206478 645590 1040957 2582418 4218581 4514301 3174066
45213 3174066 921787 -1036905 -1954226 -2581302 -4099484 -5471024 -3979156 268418
45205 268418 2895534 788270 -2982291 -2994175 1034363 4190579 3458774 1200759 766402
45196 766402 1698027 1021140 -2373773 -6172286 -6912367 -3361357 1928377 4801800 4022038
45187 4022038 2675498 3749880 5839995 5886665 5021705 7737791 14877053 21465855 23182881
45178 23182881 21509064 20072021 19034391 16615308 14081794 14927179 19340923 23177612
45170 23177612 23218221 20695630 18511580 17270504 15675690 13334238 11386234 10907048
45162 10907048 11881543 13393715 14011302 12547886 9451151 7010903 7022830 8427390 8599800
45153H599800j448844k94182K953475M127650J183315k775837l583516j428321
45145G333540J45799k42453l02370J476167K826656J054457k536918m073960k278410
45136C402508J33167L66766j072220j727816o50412P02807P73655J57780Q68773
45127B955008L310920M897783K915058j477854l926943k244033P56292J200942
45119H387173p65043k017083j263247N1994J079147K447193L408856J603055k731499
45110A0200546n338538l216930R56926K558557J399104R21296K079844K188356
45102A1749161J98137j046965M16489K151215J318404m49519L33710L094373L822212
45093B1587217J287087j198651j010428K13139j08494j353453j188495N82868
$$ plain form
45153 8599800 7150956 6856774 9810249 13937899 15121214 12345377 8761861 7333540
45145 7333540 7479339 7236886 6934516 8410683 11237339 12291796 9754878 5680918 3402508
45136 3402508 3535675 3902441 2830221 1102405 451993 1154800 1928455 2086235 2955008
45127 2955008 6265928 11163711 14078769 12600915 8673972 6429939 7186231 8387173
45119 8387173 7622130 5605047 4341800 4393794 5472941 7920134 11328990 12932045 10200546
45110 10200546 4862008 1645078 2602004 5160561 6559665 7480961 9560805 11749161
45102 11749161 11947298 10900333 11316822 13468037 14786441 14336922 14670632 17765005 21587217
45093 21587217 22874304 21675653 20665225 20878364 20769870 19416417 18227922 18810790
45085A8810790K023874J895969N07452j441735l049633l012535j055658J040525
45077A5719049J497528Q84444P47206R91690Q24509J168181L178997M982855L365576
45068C3360035j096897m094799l525192j907233j635288j442442K76772J891033
45060B1825989J199910p43114j511691j160009j222953j454023o57625M49440
45052A6725924L33104l17578K69463J498018J233657m34130j466506j562336k165720
45043A4113896k840982j334904K124778M182785L208924J591297J730195K720393
45035B5496382K727590J884620Q43711r84778l468148m291811k009883J243351
45027B1441034K596802K355154K455268K635515J329730o68509r62372K63181
$$ plain form
45085 18810790 20834664 22730633 23238085 21796350 18746717 15734182 14678524 15719049
45077 15719049 17216577 18101021 18848227 19839917 20664426 21832607 25011604 29994459 33360035
45068 33360035 32263138 28168339 24643147 22735914 21100626 19658184 19934956 21825989
45060 21825989 23025899 22282785 20771094 19611085 18388132 16934109 16276484 16725924
45052 16725924 17059028 16741450 17010913 18508931 19742588 19308458 17841952 16279616 14113896
45043 14113896 11272914 9938010 12062788 16245573 19454497 21045794 22775989 25496382
45035 25496382 28223972 30108592 30952303 29967525 26499377 22207566 20197683 21441034
45027 21441034 24037836 26392990 28848258 31483773 32813503 32144994 31182622 31445803
45019C1445803K95159j377037j706699J221688M930732N868069L931363J594759
45011D6203837J01637j020932j546674m24256J726796K460748R38355l24955J202691
45002D9317247M129924M604294J475932k066319k640979p55098M86542l95491
44994E4156052j892879j917682j05210K303615L705066L077513O73306j878508
44986E8121273k805441j809318j30234Q66419O79369m79092k105932l706405n050381
44977D3580258n869798n280026k688614J86574Q9505l304733n512983k627353
44969A8572830K622985L812306l92777m441472l868687r91532l35177j784311
44961A3194165j748544Q12572L122031K751014K84087k054747k462111n25251
$$ plain form
45019 31445803 31740962 30363925 28657226 29878914 34809646 40677715 44609078 46203837
45011 46203837 46305474 45284542 43737868 43313612 45040408 47501156 48439511 48114556 49317247
45002 49317247 53447171 58051465 59527397 57461078 54820099 54065001 54551543 54156052
44994 54156052 52263173 50345491 50240281 52543896 56248962 59326475 59999781 58121273
44986 58121273 55315832 53506514 53376280 54242699 54922068 54442976 52337044 48630639 43580258
44977 43580258 37710460 32430434 29741820 29928394 30017899 26713166 21200183 18572830
44969 18572830 21195815 25008121 24615344 20173872 16305185 15313653 14978476 13194165
44961 13194165 11445621 12258193 15380224 18131238 18415325 16360578 13898467 13373216
44953A3373216K195813K986532Q75004j926417k902289k498290k624910l032441
44945F446218j808488R25780K586592J778393Q9040m41616J90672P56915O29438
44936A1152944O2021l63718j44781N18774N90670l35041q43024N76571K917691
44927A4132107L567411J857029j12693m41347N55685J656411K242825J969260
44919B5426688O94789n81829m19406P54451Q38754o47222j523506m12612Q92740
44910B5022847L48317r52050p28085N00260K53245j590884k260455k88215K256133
44901B2561113K722388J165107n14206j221537j112660m43249N72824J283320
44893B5013100J155447M88959k53372j181836k036548j448585J083513L053513
$$ plain form
44953 13373216 15569029 18555561 19430565 17504148 14601859 12103569 9478659 6446218
44945 6446218 4637730 5563510 8150102 9928495 10017535 9575919 9766591 10523506 11152944
44936 11152944 11214965 10851247 10706466 11225240 11815910 11480869 10637845 11214416 14132107
44927 14132107 17699518 19556547 19443854 19002507 19558192 21214603 23457428 25426688
44919 25426688 26121477 25539648 25120242 25874693 26713447 26066225 24542719 24130107 25022847
44910 25022847 25371164 24419114 23691029 24191289 24444534 22853650 20593195 20304980 22561113
44901 22561113 25283501 26448608 25934402 24712865 23600205 23156956 23729780 25013100
44893 25013100 26168547 26657506 26404134 25222298 23185750 21737165 22820678 25874191
44885B5874191J236999l532899o438852m729086j298484l07665j474616j638916
44877G690672l56079m2600r69542m08725K181833L101174j71190m575292n441930
44868A008321k759030l55255j99606p69313n90497l05313p66191j343180r27162
44859g007226O51493K588656L694450L175920J538800J70931n62081j655738l100307
44850e05102k988403n69624J697427J408116j59763l49879N54835N86212L35992
44841I811J990090M658778M843791J854656j132369k047233k181819k597895k112526
44832C285284k87609J060475R69488Q16015J245405Q72948m85250q35598K2455
44823F663613n68067l007216l464321j12391K826326J386293j482693o40451K682323
$$ plain form
44885 25874191 27111190 23578291 17139439 12410353 11111869 10804204 9329588 7690672
44877 7690672 7334593 7291993 6322451 5913726 8095559 11196733 11025543 6450251 1008321
44868 1008321 -1750709 -2105964 -2305570 -3074883 -3665380 -3970693 -4736884 -6080064 -7007226
44859 -7007226 -6355733 -3767077 -72627 3103293 4642093 4813024 4250943 2595205 -505102
44850 -505102 -3493505 -4063129 -2365702 -957586 -1117349 -1467228 -912393 -326181 9811
44841 9811 1999901 6658679 11502470 13357126 12224757 10177524 7995705 5397810 3285284
44832 3285284 2997675 4058150 5027638 5843653 7089058 7962006 7476756 6641158 6663613
44823 6663613 6095546 3088330 -375991 -488382 2337944 3724237 2241544 1601093 4283416
44814D283416K908205p50864l193628j484431J405217J913123M15131j019813
44806D476356j688941j489262j58560J196541M31630k351310m145147l000218
44798f728911n97665M30874n8113k86434Q15394K656357L745737K921210P42689
44789C641138m59490P31448K508427K112084k9107r63585N3910N06621j086458
44780G014988k846529k742129j347897J40949J951904L803179L519833L28690
44772I822988k401382r69059L060855M345764Q53222l489806m040267r54000J955508
44763H183823K224320P38562n89618j167356j307003r64978j02876M22245j98321
44754G238798j037180k88871J845537K841451J284276j057255j903081j549392
$$ plain form
44814 4283416 7191621 6440757 3247129 1762698 3167915 5081038 5496169 4476356
44806 4476356 2787415 1298153 1139593 2336134 2767764 416454 -3728693 -6728911
44798 -6728911 -7326576 -6895702 -6953815 -7240249 -6424855 -3768498 -22761 2898449 3641138
44789 3641138 3181648 3913096 6421523 8533607 8504500 7540915 7594825 8101446 7014988
44780 7014988 4168459 1426330 78433 219382 2171286 5974465 9494298 9822988
44772 9822988 7421606 6452547 9513402 13859166 14712388 11222582 7182315 6228315 8183823
44763 8183823 10408143 11146705 10557087 9389731 8082728 7117750 7014874 7437119 7238798
44754 7238798 6201618 5912747 7758284 10599735 11884011 10826756 8923675 7374283
44746G374283j430234j099990Q15171L526513M693506L860539K710209J986164
44738B2436161Q28809o75638j118713n65055j004948l007392m386154l432344
44730I074726j279656K57764J169923K145422K752846K184281M86427j873664
44722A4918069m160628m589438j695189K568774L772718O98957k463556j769828
44714G279879J017634J420768j104299k823956j337857J513060K599069J209143
44706I773441p64867j200890L9767J011361K00612j114089n85743J149113P48163
44697I256868k621797n315442m286339j331244J62232P7914K37825O29000M60306
44688b730677R78868L331238N140037L361647m95489k245514j330849p73112j324183
$$ plain form
44746 7374283 5944049 4844059 5659230 9185743 13879249 17739788 20449997 22436161
44738 22436161 23264970 22589332 21470619 20905564 19900616 16893224 12507070 9074726
44730 9074726 7795070 8052834 9222757 11368179 14121025 16305306 16791733 14918069
44722 14918069 10757441 6168003 4472814 7041588 10814306 11513263 9049707 7279879
44714 7279879 8297513 9718281 8613982 5790026 4452169 5965229 8564298 9773441
44706 9773441 9008574 7807684 7847451 8858812 9059424 7945335 7359592 8508705 9256868
44697 9256868 6635071 1319629 -2966710 -4297954 -4135722 -4057808 -3819983 -3190983 -2730677
44688 -2730677 -1751809 1579429 6719466 10081113 9585624 7340110 6009261 5236149 3911966
44679C911966o76065J212921J257978j018047j902983L38681K395185J599249
44671G118885K39914Q31721J171648j487384m469629l102979J481501L267253
44663E050930L6256l564420k839493P79092K431474L43149k651919l110848o49732
44654d175511K349907L564803K745389J198412q4399j169590k211998k673209
44646d56196j972408l79244J152010J758015J295323O63857J170164K726158L230248
44637I187927J181431j568339j759134O41222K279877J385399K2701J44028L58092
44628A1873204j161269l077331l076795j811563j494535j783677m14972K555455
44620A608517M356801L468244J230309p42441k182214k846793k128434o51725
$$ plain form
44679 3911966 3235901 4448822 5706800 4688753 2785770 3124451 5519636 7118885
44671 7118885 7358799 8190520 9362168 7874784 3405155 302176 1783677 5050930
44663 5050930 5087186 1522766 -1316727 -537635 1893839 2236988 -414931 -3525779 -4175511
44654 -4175511 -1825604 1739199 4484588 5683000 5598601 4429011 2217013 -456196
44646 -456196 -2428604 -2807848 -1655838 102177 1397500 2061357 3231521 5957679 9187927
44637 9187927 10369358 8801019 7041885 7683107 9962984 11348383 11371084 11515112 11873204
44628 11873204 10711935 7634604 4557809 2746246 1251711 -531966 -946938 1608517
44620 1608517 5965318 9433562 10663871 9921430 7739216 4892423 2763989 2112264
44612B112264J6506l4199J040013L527846N015638L711547Q95842j267024k496426
44603A2522007l463826l795223k851188j343856m42535q6030L79830P56148N87820
44594B263147K88718K00305m73528k046478k635181l18500L446454N015531L310507
44585I050975J028889N07541O78437n76368k873879l912373k630610k18998J501076
44576B554690J505338q5157j884186j903304M63581L393760M606997L924908K656051
44567A5232678J087679j464905m182136m629273k031236J183163K368461J700767
44559I265198Q78402L57356j61860K40210K537660N013701M477132P14210k768576
44550B0553433l426363k763236l182998l867567k249583J506825M156840L483594
$$ plain form
44612 2112264 2128770 2094571 3134584 6662430 11678068 15389615 16285457 15018433 12522007
44603 12522007 9058181 5262958 2411770 1067914 625379 539349 919179 1675327 2263147
44594 2263147 2551865 2752170 2278642 232164 -2403017 -2721517 724937 5740468 9050975
44585 9050975 10079864 10587405 11265842 10689474 7815595 3903222 1272612 1053614 2554690
44576 2554690 4060028 3974871 2090685 187381 650962 4044722 8651719 12576627 15232678
44567 15232678 16320357 14855452 10673316 6044043 4012807 5195970 7564431 9265198
44559 9265198 10143600 10500956 10339096 10579306 13116966 18130667 22607799 23322009 20553433
44550 20553433 17127070 14363834 11180836 7313269 5063686 6570511 10727351 14210945
44542A4210945O66619j752684k477736j514341O90378L151800M487226M158560
44534B1620767K935209J550074j41410j904164k271013m84002J466901P54697
44526B3527059k268410l949243k007071J382710K515523Q34908j125452j612271
44518A7297753j194152n71019O20666J975292J628205q71234k736611j298770
44510A4850130J827940K565233J46495j698671j13777K800171L016524J35414
44502B3529459k293625j595360Q48494J789401K46769j637713j649587l21057
44494A8916781R7553r92643j691165o58996N71103o2427j622235j313821J179193
44485A4423343L097082K757861J704774J613920J529970O958j936330k220614
$$ plain form
44542 14210945 14877564 13124880 10647144 9132803 9823181 12974981 17462207 21620767
44534 21620767 24555976 26106050 25964640 24060476 21789463 21305461 22772362 23527059
44526 23527059 21258649 17309406 15302335 16685045 19200568 20035476 18910024 17297753
44518 17297753 16103601 15532582 16153248 18128540 19756745 18885511 16148900 14850130
44510 14850130 16678070 19243303 19389798 17691127 17577350 20377521 23394045 23529459
44502 23529459 21235834 19640474 20488968 22278369 22525138 20887425 19237838 18916781
44494 18916781 19014334 18021691 16330526 15671530 16242633 16180206 14557971 13244150 14423343
44485 14423343 17520425 20278286 21983060 23596980 25126950 25133908 23197578 20976964
44477B0976964q21217N97133J194349J148148K89659j310956k149819r78141P91146
44468A9737266P39540p24732p28644J622789L648688K762351k36782k510407k338337
44459B1971732j73702K151266K708773J170552n29963n58984j8008j344516l906151
44450B1470999m125222r34365J993646J384030j067817j897510j181539j153867
44442A4488355j293812Q31817M227026M526060M78972l561197l600782j122344
44434A4974095L65296R34354K686586M498675K935767j644075m294080k201108
44426A8255510J385347K135095N34671j74977L58929j70365j976812k709241j749033
44417A5889124j142827j517666q22340J410214K229547K9858k139617j089930
$$ plain form
44477 20976964 20155747 20752880 21947229 23095377 23385036 22074080 19924261 18946120 19737266
44468 19737266 20476806 19752074 19023430 20646219 24294907 27057258 26820476 24310069 21971732
44459 21971732 21798030 23949296 26658069 27828621 27298658 26739674 26721666 25377150 21470999
44450 21470999 17345777 16411412 18405058 19789088 18721271 16823761 15642222 14488355
44442 14488355 13194543 14026360 18253386 22779446 23258418 19697221 16096439 14974095
44434 14974095 15339391 16273745 18960331 23459006 26394773 24750698 20456618 18255510
44426 18255510 19640857 21775952 22310623 22135646 22494575 22324210 20347398 17638157 15889124
44417 15889124 14746297 13228631 12406291 13816505 16046052 16075910 13936293 12846363
44409A2846363J436039J837719N51121N82429J642834O35529k293887l134998
44401A4103149l61625K480210K194432K41395l90015N08741J380196J673525J497343
44392B3327351O43656k49621L30995K094080K585457J036255j58862M23942P64419
44383C0797672n97081j450838J1311J253678m76341k910098k357809k66838p73105
44374B3230551l156733k702768J225921M022930L446134K483152L026558K496042
44366C4071787m89454k356575l17555K398082J470496j552882j956196N97095
44358C1864798J996753K35517k295541k981928j849917M3325K041111L159438
44350C2213556K423247N84292m17938j27307O973q94247j990929k387024k313017
$$ plain form
44409 12846363 14282402 16120121 16671242 17253671 18896505 19532034 17238147 14103149
44401 14103149 13741524 16221734 18416166 18657561 18267546 18776287 20156483 21830008 23327351
44392 23327351 23971007 23721386 24052381 26146461 28731918 29768173 29609311 30033253 30797672
44383 30797672 30200591 28749753 28761064 30014742 29538401 26628303 24270494 24003656 23230551
44374 23230551 20073818 17371050 18596971 22619901 26066035 28549187 31575745 34071787
44366 34071787 33582333 31225758 30908203 33306285 34776781 33223899 31267703 31864798
44358 31864798 33861551 34097068 31801527 28819599 26969682 27013007 29054118 32213556
44350 32213556 34636803 35221095 34803157 34675850 34682823 33788576 31797647 29410623 27097606
44341B7097606k168179j728373p78889M83091J877188L132414L451614K313277
44333C3679749N60854n60103j241189k495264l874999l720269j994546q47662
44325A9506571j435536k001518n89194J716952K200573N69925m38589J141552
44317B0670736L713399M108801J462360k097809m240568m539793l624236j780781
44309A3672109N09212J797144J134294j75468p0247J236034J720347J056496J131478
44300B2011399K403633K611048P48178m11218J648965M819973N287886L351127
44292D2470991K657638M279781N376104M016489J782236P10442Q34328J870399
44284F3998408M240081O831067O670889L046135l40223K45926L679535N771617
$$ plain form
44341 27097606 24929427 23201054 22422165 22905256 24782444 27914858 31366472 33679749
44333 33679749 34240603 33680500 32439311 29944047 26069048 22348779 20354233 19506571
44325 19506571 18071035 16069517 15480323 17197275 19397848 19967773 19529184 20670736
44317 20670736 24384135 28492936 29955296 27857487 23616919 19077126 15452890 13672109
44309 13672109 14181321 15978465 17112759 16937291 16867044 18103078 19823425 20879921 22011399
44300 22011399 24415032 27026080 27774258 27363040 29012005 33831978 39119864 42470991
44292 42470991 45128629 49408410 54784514 58801003 60583239 61293681 62128009 63998408
44284 63998408 68238489 75069556 81740445 84786580 84446357 84692283 88371818 94143435
44276I4143435M629953J967118O3301l57227K04644O23472j29706j486158j348422
44267I8310410R36884K930721K305304M05418J58560J420259J386218o65494k212672
44258A04975608j550457r9272L82553L31924O85440Q14750n4247r57478n83276
44249A03945545N66709J118225R92496Q54454J09420k473069o114278p857525
44241I1141977n761000j232758K442474L307744K094296R39402J208621K371121
44233I6511877K779334J601686j41348p43112J45204J134543Q06934p06561k084328
44224I9304229k313130j432733p2138J192141J972612K063723J610665J042579
44216A03367948N30780l16886j872140l713671m871023m833104l854556k222924
$$ plain form
44276 94143435 98773388 100740506 100803807 100446580 100651224 101274696 101144990 99658832 98310410
44267 98310410 99247294 102178015 104483319 104888737 105047297 106467556 107853774 107188280 104975608
44258 104975608 103425151 103325879 103708432 104040356 104725796 105540546 105486299 104528821 103945545
44249 103945545 104512254 105630479 106622975 107477429 107586849 105113780 98999502 91141977
44241 91141977 85380977 84148219 86590693 89898437 91992733 92932135 94140756 96511877
44233 96511877 99291211 100892897 100751549 100008437 100153641 101288184 102095118 101388557 99304229
44224 99304229 96991099 95558366 95486228 96678369 98650981 100714704 102325369 103367948
44216 103367948 103898728 103581842 101709702 97996031 93125008 88291904 84437348 82214424
44208H2214424J49744L072331N550167O491873N760577M149895K529313J368709
44200A11287033Q47428R17718J244892J374186J011515J64572p53694j013746
44192A15079904k62675Q04088J096973N98023L82262R62821J666545K077919K734428
44183A25140288L488669K720101j77989k753317k136135Q96183K836352K221107
44175A32235259R90330Q38181R14437J79338m31208J30605R25010P45530M81585
44166A37009067J623229L404746L707583K345432J218093J173478Q48425p97020
44158A50533033k607504k929588j899195p86413J44757J650380L486741L880412
44150A51472623J905535m33122K8939L531153O419906N279314J152791j748105
$$ plain form
44208 82214424 82364168 85436499 90986666 97478539 103239116 107389011 109918324 111287033
44200 111287033 112134461 113052179 114297071 115671257 116682772 116847344 116093650 115079904
44192 115079904 114817229 115621317 116718290 117316313 117698575 118661396 120327941 122405860 125140288
44183 125140288 128628957 131349058 131171069 128417752 126281617 127177800 130014152 132235259
44175 132235259 133225589 134063770 134978207 135157545 134726337 134856942 135781952 136527482 137009067
44166 137009067 138632296 142037042 145744625 148090057 149308150 150481628 151330053 150533033
44158 150533033 147925529 144995941 143096746 142310333 142455090 144105470 147592211 151472623
44150 151472623 153378158 152945036 152973975 156505128 162925034 168204348 169357139 167609034
44142A67609034j070159J583931L457909L627575K755023J796895J923404L981274
44134A85664886O715136P086092M019073N00965j5574J796665K515876J299268
44126B09582387R98515L547088O838405P593342N670427L875185M243992N923407
44118B48272748O612670N238438L133343K929321O084679J1080697J4244129J2989416
44110C10585441Q558892N188482N951106R428613J1277098R373565O239646N362908
44102C71965751O497912O813344N871071O204478Q463658R496459P120013L803064
44094D26235750K882670L460792K349269n08049k169042j550289p63152j680689
44086D28257260l997852o608231q360725p869519n313577l810842n867959r194774
$$ plain form
44142 167609034 166538875 168122806 171580715 175208290 177963313 179760208 181683612 185664886
44134 185664886 192380022 199466114 203485187 203986152 203970578 205767243 208283119 209582387
44126 209582387 210580902 214127990 220966395 228559737 234230164 238105349 242349341 248272748
44118 248272748 254885418 260123856 263257199 266186520 272271199 283351896 297596025 310585441
44110 310585441 319144333 324332815 330283921 339712534 350989632 360363197 366602843 371965751
44102 371965751 378463663 385277007 391148078 397352556 405816214 415312673 422432686 426235750
44094 426235750 429118420 432579212 434928481 434420432 432251390 430701101 429937949 428257260
44086 428257260 424259408 417651177 409290452 401420933 396107356 392296514 386428555 377233781
44078C77233781r851835q891686j0937229j5927041j8106413j5138283j2428408
44071B85952886j4796078j8784997j8106835j3153950r665877j0050656j1427771
44064A89966722j1428156j0920908j0754946j0006158q379390p239045p308573
44057A23929546p544680o809349m960870k362590N5790P73306n24941j945084
44049A00611128k038526k169647l855229n258333l582957L3398J604853j40836
44041H5203851k699519l938204l803940k259235N83311K345729O04096k535200
44033G3500889k537951M00580J339685j179002k600727l90464J332464q41262
44025F9024212k990219j24871M961666N535451J241662j995400j431019m10212
$$ plain form
44078 377233781 367381946 358490260 347553031 331625990 313519577 298381294 285952886
44071 285952886 271156808 252371811 234264976 221111026 211445149 201394493 189966722
44064 189966722 178538566 167617658 156862712 146856554 138477164 131238119 123929546
44057 123929546 116384866 109575517 104614647 102252057 102307847 103081153 102556212 100611128
44049 100611128 98572602 96402955 92547726 87289393 83706436 83739834 85344687 85203851
44041 85203851 82504332 78566128 74762188 72502953 73086264 75431993 76036089 73500889
44033 73500889 70962938 71363518 72703203 71524201 68923474 68533010 69865474 69024212
44025 69024212 66033993 65909122 70870788 76406239 77647901 75652501 74221482 73811270
44017G3811270j423950k236544o80790J509499J966133J104607R0286j445437
44009G2695074l432763l894267j844961N78114J149471O62427P02709M17792j540839
44000F5492757l371745j909466K314897N074948M035814J572637Q97768J663185
43992G5770795J190397j311672l741108l926768j918112O05045K060789J855291
43984G0584657M81787p60911o91892O06092J793651J683188L75300j152363k107182
43975G0812327k192714j392865j11077P18048L53378q79413j882212j918980j108480
43966F2398012J5270R60127J462978J686952K036170K404687K106216J123691
43958G4194103O86404J577465K575041K038049N40888R1018Q74685R21912n82964
$$ plain form
44017 73811270 72387320 70150776 69469986 70979485 72945618 74050225 74140511 72695074
44009 72695074 69262311 65368044 63523083 64101197 65250668 65913095 66615804 67033596 65492757
44000 65492757 62121012 60211546 62526443 67601391 71637205 73209842 74107610 75770795
43992 75770795 76961192 75649520 71908412 67981644 66063532 66668577 68729366 70584657
43984 70584657 71066444 70305533 69613641 70219733 72013384 73696572 74071872 72919509 70812327
43975 70812327 68619613 67226748 67115671 67833719 68187097 67307684 65425472 63506492 62398012
43966 62398012 62413282 63373409 64836387 66523339 68559509 70964196 73070412 74194103
43958 74194103 74880507 76457972 79033013 81071062 81611950 81702968 82577653 83499565 82916601
43949H2916601j794835r14245J442820L603728M799168M652848K655004k75650
43941I7085439j500391J07910K129170J867192J81753m32824k38371j476706l785908
43932I3937264m056244j475483O11282n91481l348750m091593k285169m93553
43924G8206273o58488k289771l876819m448074l859923k816323k566244l525567
43916E4165064m240948k818951M11929K722196K070409l86075j796301j278026
43908D8849297q03738k019045l478584k528955N46047K238950L11676l076818
43900D0038830m053589j745151J277051K607444K267453J445863P50843K76914
43892D2865658J56338L01069L25736J97611K84758M16746k30709j660027k206346
$$ plain form
43949 82916601 81121766 80207521 81650341 85254069 90053237 94706085 97361089 97085439
43941 97085439 95585048 95692958 97822128 99689320 99871073 99438249 99199878 97723172 93937264
43932 93937264 89881020 88405537 89016819 88425338 85076588 80984995 78699826 78206273
43924 78206273 77547785 75258014 71381195 66933121 63073198 60256875 57690631 54165064
43916 54165064 49924116 47105165 47517094 50239290 52309699 51923624 50127323 48849297
43908 48849297 48045559 46026514 42547930 40018975 40565022 42803972 43115648 40038830
43900 40038830 35985241 34240090 35517141 38124585 40392038 41837901 42588744 42865658
43892 42865658 43021996 43323065 43648801 43846412 44131170 44547916 44317207 42657180 40450834
43883D0450834k33199L441642N792371M700544J287655j464427k088038j685414
43875E0201968j558489j149100O34509L065344M213681L518046K086048O95804
43867F1707811n55973p09306J441763M579623N325262K719185k10241r38001r35124
43858G2424999k418693m027165k860111P14042L545362M143477L628821K854218
43850G8004950J556236J87958o2651Q67986K018741K834021K666661K96874l465967
43841H4904809m571363q82727L007235R11040n729293r184709o274309k057792
43833F0122891j278978k055932j069264K12254j205987m001280m418770j832392
43825D4472542J217672K815136K507083J79850l041188m467353l055119j263707
$$ plain form
43883 40450834 40217635 43659277 49451648 54152192 55439847 53975420 51887382 50201968
43875 50201968 48643479 47494379 48128888 51194232 55407913 58925959 61012007 61707811
43867 61707811 61151838 60442532 61884295 66463918 71789180 74508365 74298124 73360123 72424999
43858 72424999 70006306 65979141 63119030 63833072 67378434 71521911 75150732 78004950
43850 78004950 79561186 79749144 79686493 80554479 82573220 85407241 88073902 88370776 84904809
43841 84904809 80333446 79450719 82457954 83368994 77639701 68454992 62180683 60122891
43833 60122891 58843913 56787981 55718717 55930971 54724984 50723704 46304934 44472542
43825 44472542 45690214 48505350 51012433 51192283 48151095 43683742 40628623 39364916
43817C9364916j406415k237839j661858m83382m70225q19133J68399J633428J565188
43808C5653079Q0387j636067l794481o260418o426414k539554K523032M578771
43800B2178335L704234K734185K044897K59275j406018n30913J615792J636669
43792C2236456k5147Q1885J732776Q53321l129199n330916k629466J961518M238956
43783B9990184L913787K673817J124019p3219L87006J659673P62013k503120m121530
43774C3812630j714314J614825J970198Q4466q48727m8068J091274J855019K150633
43765C9967936J584737P89860J427151K935949K175054j361182l290236m82987
43757D3746282L688664M161987J591040M57041J698582K149410N58450n42610
$$ plain form
43817 39364916 37958501 35720662 34058804 33575422 33105197 32286064 32454463 34087891 35653079
43808 35653079 35733466 34097399 30302918 24042500 17616086 15076532 17599564 22178335
43800 22178335 25882569 28616754 30661651 30920926 29514908 28983995 30599787 32236456
43792 32236456 32211309 32293194 34025970 34879291 31750092 26419176 23789710 25751228 29990184
43783 29990184 33903971 36577788 37701807 37628588 38015594 39675267 40437280 37934160 33812630
43774 33812630 32098316 33713141 35683339 35767805 34919078 34871010 35962284 37817303 39967936
43765 39967936 41552673 42342533 43769684 46705633 48880687 47519505 44229269 43746282
43757 43746282 47434946 51596933 53187973 53645014 55343596 57493006 58051456 57508846
43749E7508846O94816K871361L902780L363688J940986Q31970J503051L786197
43741G6403695M767068K089668k239575m065337k512562l06809P49908J308856
43733G6194912J662777R53753k94399q1642J735467K749256J489335q60675k862205
43724H0686579m315049m638062k615953R69332L005404J924383j28921m51784
43716G4435929P88735J762291J843141J590705J193072N31310r9465n43838j241808
43707H0260072k218926k517109j434557N25471K496550M013513M521866L454955
43699H9101835J411174n8189m44612p10976j227228r87609L25926J356487J309271
43690I0076079J372751K449988L233724K428503J360264K024342L530192L094254
$$ plain form
43749 57508846 58203662 61075023 64977803 68341491 70282477 71114447 72617498 76403695
43741 76403695 81170763 83260431 81020856 76955519 74442957 74136148 74886056 76194912
43733 76194912 77857689 78811442 78517043 78435401 80170868 82920124 84409459 83548784 80686579
43724 80686579 76371530 71733468 69117515 70086847 73092251 75016634 74887713 74435929
43716 74435929 75224664 76986955 78830096 80420801 81613873 82145183 82045718 81501880 80260072
43707 80260072 78041146 75524037 74089480 74614951 77111501 81125014 85646880 89101835
43699 89101835 90513009 90454820 90010208 89299232 88072004 87084395 87410321 88766808 90076079
43690 90076079 91448830 93898818 97132542 99561045 100921309 102945651 106475843 109570097
43682A09570097L12030k024424j715082L22430J976285K599492K723816K497814
43674A16262458J770259J027411R37969J141567N99977o87364j325476m88097
43666A19238704N17184k28092k323496l027880q29771K116922K467697O8889j722710
43657A16277447k81934L094114M873373L232679m06846l165471l307102j389900
43649A18926360N46156R05909j56661j341193j854258k009204k306532k610211
43641A10100366k507476k080514j964467k554091l085587j858651J713587N184144
43633A02947311M732500j57709n026285n227153j481159J517584J433320M50219
43625I9188628Q96833J785805J204221k46949n88412L77011J227215J514653K158217
$$ plain form
43682 109570097 109882127 107857703 106142621 106465051 108441336 111040828 113764644 116262458
43674 116262458 118032717 119060128 119998097 121139664 121739641 121052277 119726801 119238704
43666 119238704 119755888 119527796 117204300 114176420 113346649 115463571 117931268 118000157 116277447
43657 116277447 115995513 119089627 123963000 127195679 126788833 123623362 120316260 118926360
43649 118926360 119472516 120378425 120221764 118880571 117026313 115017109 112710577 110100366
43641 110100366 107592890 105512376 103547909 100993818 97908231 96049580 97763167 102947311
43633 102947311 107679811 107522102 102495817 97268664 95787505 97305089 98738409 99188628
43625 99188628 100085461 101871266 103075487 102828538 102240126 102617137 103844352 105359005 107517222
43616A07517222L387098M010750L080012J152910m90390j192932j174787r30041
43608A15359842p32824o10699m99497j48778J039832L409906N909519O412166
43600A30139467M157069J198969J02344P10100Q74020N6909K1667J634658L265306
43591A42160509L366793K755427L039684M273087N429569N918127N468201L840601
43583A76251998J860532J355594K709428L860544L247387K298211L115736N028167
43575A99727597N773689N173216M977768N433136M804341K733968J492684K693069
43567B32809468M625848M408630J745124r02132j450916k83333Q54951J061994
43559B42869634P72138M52335j97280j280026j789403q39102N19876J95209k051751
$$ plain form
43616 107517222 110904320 114915070 117995082 119147992 118657602 117464670 116289883 115359842
43608 115359842 114627018 114016319 113516822 113368044 114407876 117817782 123727301 130139467
43600 130139467 134296536 135495505 135597849 136307949 137181969 137238878 137260545 138895203 142160509
43591 142160509 145527302 148282729 151322413 155595500 161025069 166943196 172411397 176251998
43583 176251998 178112530 179468124 182177552 186038096 189285483 191583694 194699430 199727597
43575 199727597 205501286 210674502 215652270 221085406 225889747 228623715 230116399 232809468
43567 232809468 237435316 241843946 243589070 242686938 241236022 240952689 241807640 242869634
43559 242869634 243641772 244094107 243896827 242616801 240827398 239988296 240508172 240703381 238651630
43550B38651630m118658m472680m014534m231152n000484n386795n368020n559259
43542B00500048o254325p681752r880001j1375198r857673n697323k759885l545486
43534A43448405n449831m715165k405737k678815n862870p511639m988964j216124
43526A08619260k78510k158862l705159k830618r7478K373871K347916o84339
43518A03586081m094507m201565q40129J928937R57365j986801l055107j482979
43510I0811295K80877N02938j94415p72820j162563j448515j337041r17565p74056
43501H4988135q79840l17607J360508L109087L296154J475197j029889k348501
43493H9653244j889581q85458r03412j936383k535609j943162j292225k079877
$$ plain form
43550 238651630 234532972 230060292 226045758 221814606 216814122 211427327 206059307 200500048
43542 200500048 194245723 186563971 176683970 165308772 155451099 149753776 146993891 143448405
43534 143448405 137998574 133283409 130877672 128198857 122335987 114824348 109835384 108619260
43526 108619260 108340750 106181888 102476729 99646111 99548633 101922504 104270420 103586081
43518 103586081 99491574 95290009 94449880 96378817 97336182 95349381 92294274 90811295
43510 90811295 91092172 91595110 91400695 90627875 89465312 88016797 86679756 85762191 84988135
43501 84988135 84108295 83790688 85151196 88260283 91556437 93031634 92001745 89653244
43493 89653244 87763663 86878205 85974793 84038410 81502801 79559639 78267414 76187537
43485G6187537m026332n374991n151434m103026l105293j666180R58758L644556
43477E7363595L922902J168407k004258k696739j245637l09923j013389j888582
43469E3296376j567240m13299Q78591K113113K369505M02945k574782l143422
43461E1361787m99710J569955l1724k951965l022846m70856J293792J413520J756907
43452E0418860K369770J518960Q8255J011214L702706L927680N54659k277488
43444F1314616j691055k10824p35504j643790l83742J615007J603466M42361Q07907
43435F1118442K317340K341277N13536j033563j144643m34068N70149J486678
43427F5735148J285249j21356p13296P81741K444567K268453J784066L181917
$$ plain form
43485 76187537 72161205 66786214 61634780 57531754 54426461 52760281 53719039 57363595
43477 57363595 61286497 62454904 60450646 57753907 56508270 56198347 55184958 53296376
43469 53296376 51729136 51315837 52194428 54307541 56677046 57079991 54505209 51361787
43461 51361787 50862077 52432032 52400308 49448343 46425497 45954641 47248433 48661953 50418860
43452 50418860 52788630 54307590 54395845 55407059 59109765 63037445 63592104 61314616
43444 61314616 59623561 59412737 58677233 57033443 56649701 58264708 59868174 60310535 61118442
43435 61118442 63435782 65777059 66290595 65257032 64112389 63678321 64248470 65735148
43427 65735148 67020397 66899041 66185745 66967486 69412053 71680506 73464572 76646489
43419G6646489M669961K985220n99218j490083J251588L785651L671925K574718
43411I3496251J896302L56957k247767l094841p86458J544691M94179k688449
43403H8970865m224197k957441o89658J178985K604198L212816K084380o84111
43395H9495837l554680m748920l450018n40966J449075L06127l316929o461253
43387F9178273p427742p230378o932801n671213k751351J51241Q84853k17607
43379C9983275j108556r20700m02332j63866j71570n47067j370860k011122j945255
43370C1341947j864738k657845l648493l246184j239835Q33860J663622J414500
43362B2596834R14260O10935O20697J026566J709603K238443K145779J202121
$$ plain form
43419 76646489 81316450 84301670 83702452 82212369 83463957 87249608 90921533 93496251
43411 93496251 95392553 95749510 93501743 90406902 89620444 91165135 91659314 88970865
43403 88970865 84746668 81789227 81099569 82278554 84882752 88095568 90179948 89495837
43395 89495837 85941157 81192237 77742219 77201253 78650328 78956455 75639526 69178273
43387 69178273 61750531 54520153 47587352 41916139 39164788 39316029 40200882 39983275
43379 39983275 38874719 37954019 37551687 37387821 37216251 36669184 35298324 33287202 31341947
43370 31341947 29477209 26819364 23170871 19924687 18684852 19518712 21182334 22596834
43362 22596834 23511094 24122029 24742726 25769292 27478895 29717338 31863117 33065238
43354C3065238m59543k258456l367118l289581k235703q85473J10938N12673N84233
43345B1777208O00106J08804j578734l605166l434967m0422L599572L398860n32842
43336B0292419l803962l309669m59373J917238L192793L850873L215566P57104
43328B5652989j809504k226501p23860O82123J132758J149174O93320o81070k086989
43319B1782440j993687p08655j53512r81618j800668j561531r06287o41167n08008
43310A2527307j17339K90467O35066J272198J903318J517020J38586o33815K01372
43301A7734180J437383J408677N53204P69802K404424L299978J437716k265260
43293B6780104m684559l943130j384494K79456J62741l08348J94619J244646J706095
$$ plain form
43354 33065238 32605695 30347239 26980121 23690540 21454837 20569364 20680302 21192975 21777208
43345 21777208 22377314 22486118 20907384 17302218 13867251 13826829 17426401 20825261 20292419
43336 20292419 16488457 13178788 12719415 14636653 17829446 21680319 24895885 25652989
43328 25652989 23843485 21616984 20893124 21575247 22708005 23857179 24550499 23869429 21782440
43319 21782440 19788753 19080098 18926586 17944968 16144300 14582769 13676482 13035315 12527307
43310 12527307 12409968 12700435 13335501 14607699 16511017 18028037 18166623 17532808 17734180
43301 17734180 19171563 20580240 21133444 21903246 24307670 27607648 29045364 26780104
43293 26780104 22095545 18152415 16767921 17047377 17210118 16901770 17096389 18341035 20047130
43284B0047130J240378P6841j655541l382682l731088j928129R13268K938307
43276A4518484L557444L410674K908166J887263L01083j680346l704316m591335
43268A6607117k808486J027201L365286J562541k271999l653325j480842J212504
43260A3559997K082320J893523J527633n9311l117458n098014l857018j055436
43252E876236J86329k07122K43114K203578L416641K319085N26926N80098K459781
43243A7604666L644235K386171l2097q92697L43855J093926q27593l670668l613263
43234A6036535l6013L372544L536944J700283O93148O64439o2611j349552j388687
43225B3167030m5056O84987j91189j317186j257211k23376R73786J987212K406968
$$ plain form
43284 20047130 21287508 21364349 19708808 16326126 12595038 10666909 11580177 14518484
43276 14518484 18075928 21486602 24394768 26282031 26583114 24902768 21198452 16607117
43268 16607117 13798631 14825832 18191118 19753659 17481660 13828335 12347493 13559997
43260 13559997 15642317 17535840 19063473 19004162 15886704 10788690 6931672 5876236
43252 5876236 6062565 5855443 6098557 8302135 11718776 14037861 14564787 15144885 17604666
43243 17604666 21248901 23635072 23602975 22710278 23054133 24148059 23320466 19649798 16036535
43234 16036535 16000522 19373066 22910010 24610293 25303441 25967880 25905269 24555717 23167030
43225 23167030 23121974 23806961 23615772 22298586 21041375 20817999 21791785 23778997 26185965
43216B6185965J761471N74486p7639m08464j533615k845529k104677P65878K404317
43207B4722193M42827k804140l535972j781656n73377q03968m08151J301054K129809
43198A8688619J043356M37892K143046L698214J686082k640850m485714k074541
43190A8496104J119330J520906K315m35424N67866P55003q11971k299739j845458
43181A7068932K5887J383006J108101n08410k421853l313526k186400N37566K867007
43172A4560310L115431J860712J210940K017874K709623J463493j072294k233948
43164B3632141o53319J737417J776734j079936l859560l380810J33879L421057
43156B1727603L886169K116959N13877K14493J50606j023059k915022l847212
$$ plain form
43216 26185965 27947436 28521922 28444283 28035819 26502204 23656675 21551998 22317876 24722193
43207 24722193 25165020 22360880 18824908 17043252 16469875 15665907 15257756 16558810 18688619
43198 18688619 19731975 20169867 22312913 26011127 27697209 25056359 20570645 18496104
43190 18496104 19615434 21136340 21138655 20703231 21271097 22026100 21214129 18914390 17068932
43181 17068932 17094819 18477825 19585926 19077516 16655663 13342137 11155737 11693303 14560310
43172 14560310 17675741 19536453 20747393 22765267 25474890 26938383 25866089 23632141
43164 23632141 22978822 24716239 26492973 25413037 21553477 18172667 18306546 21727603
43156 21727603 25613772 27730731 28244608 28459101 28609707 27586648 24671626 20824414
43148B0824414l054188j740034j577172k527606k819368j148974J717061L860313
43140A3534446M221507L229655J828486M86588r52415k818485m807560n478995
43132I243227l369939P31737L623600L147375J078952P20803K053934J856852
43124A9086541r07456k807281r02720K422445K520050q77933l356541k094789
43116A3082316O64849J374672j35597j432543j278192o37037m91776m17743L66231
43107A1095180J487645J635164L39143q76638l9149K225124K577136o36848m161250
43098A3645507l616083Q6615J643671p42919k454943L20822M308732M022013K28639
43089A7442054j507229L65027J490605r15968l895733m043625k568517k078161
$$ plain form
43148 20824414 17770226 16030192 14453020 11925414 9106046 7957072 9674133 13534446
43140 13534446 17755953 20985608 22814094 23300682 22348267 19529782 14722222 9243227
43132 9243227 5873288 6605025 10228625 13376000 14454952 15175755 17229689 19086541
43124 19086541 18179085 15371804 14469084 16891529 19411579 18533646 15177105 13082316
43116 13082316 13747165 15121837 14986240 13553697 12275505 11638468 11146692 10728949 11095180
43107 11095180 12582825 14217989 14557132 13680494 13641345 15866469 18443605 17806757 13645507
43098 13645507 10029424 10116039 11759710 11016791 8561848 8882670 13191402 17213415 17442054
43089 17442054 15934825 16299852 17790457 16874489 12978756 8935131 6366614 4288453
43081D288453j794998L41212L136452L589836J652533L8153k7470L71206Q38185
43072A2433562K178900L750254L400391P98469j689455k225504j415639m19620
43064A6811358N13102Q61322l43435k334348k580433m25793J402956O74360j029037
43055A3550052j042942J60743K39580p30208l73379J752117K985975J380818j485183
43046A6437573k594220r98320J660915L121647K258862k71140k417848k333629
43038A4863840j50023K172410K967737K346722J457724J027666J049320J251237
43030B6986633J167968N7057k392667n015866n532862k866575R11820K100993
43022A5416501l42597k972646j812851K363743M812397L076719J3109o22712P74318
$$ plain form
43081 4288453 2493455 2834667 5971119 9560955 11213488 11251641 11224171 11595377 12433562
43072 12433562 14612462 18362716 21763107 22561576 20872121 18646617 17230978 16811358
43064 16811358 17324460 18185782 17842347 15507999 12927566 12501773 13904729 14579089 13550052
43055 13550052 12507110 12667853 12907433 12177225 11803846 13555963 16541938 17922756 16437573
43046 16437573 13843353 12845033 14505948 17627595 19886457 19615317 17197469 14863840
43038 14863840 14713817 16886227 19853964 22200686 23658410 24686076 25735396 26986633
43030 26986633 28154601 28211658 25818991 20803125 15270263 12403688 13315508 15416501
43022 15416501 15073904 12101258 10288407 12652150 17464547 20541266 20554375 19931663 20705981
43013B0705981J244344J44443n25855J4018K44376n29631o95970R04927K723132
43004B4229765K439439M2614k218016k373049n30853J415451J569700n8777j557361
42995B2958913j588010j170347j743625k338439r73414J405599J381059j681315
42987A6250421l794573j686878K402860L838937J838502l60761o97800m14555
42979A7376153q39579j129760m62227j67275j780793m205242m702788k354580
42971A733909R24657K797240K748513J770475R25319P93857J552602K763133L407807
42962A9417512K826446J421826j14931j824172l779562m784833l313127J4235
42954I863394K459414K382387J014144J65811k53760j082281j747229j133443
$$ plain form
43013 20705981 21950325 22094768 21568913 21582931 21827307 21297676 20601706 21506633 24229765
43004 24229765 26669204 26711818 24493802 22120753 21589900 23005351 24575051 24516274 22958913
42995 22958913 21370903 20200556 18456931 16118492 15145078 16550677 17931736 16250421
42987 16250421 12455848 10768970 13171830 17010767 18849269 18488508 17790708 17376153
42979 17376153 16536574 15406814 14944587 14777312 12996519 8791277 4088489 1733909
42971 1733909 2658566 5455806 8204319 9974794 10900113 11693970 13246572 16009705 19417512
42962 19417512 22243958 23665784 23550853 21726681 17947119 13162286 9849159 9863394
42954 9863394 12322808 14705195 15719339 15885150 15631390 14549109 12801880 11668437
42946A1668437L83040J615359K400289K902271K181794j77725j949850o50291
42938A8373324K391381L360142J271943j102565j681393j099034j9917J788621
42930B3282502K897459Q54441l080217m046563o80552K137185O57137j859204
42922B0162188q02560K025774J712317j311785k185407J33657J582638R9829j584304
42913A9832347j301123n48847n74082J64952K418483L834395K689331P80517J75997
42904B7471970m0622j203631j907812m42640J630275J539808l10852j090610k0027
42895B5625859P46299l40818k240255l254463l037521k076472o40274R13739J661921
42886A7358015Q86608p50327j369389L15967L254853M666709K962373l59488k503271
$$ plain form
42946 11668437 12051477 13666836 16067125 18969396 21151190 20973465 19023615 18373324
42938 18373324 20764705 24124847 25396790 24294225 22612832 21513798 21493881 23282502
42930 23282502 26179961 27034402 23954185 19907622 19227070 21364255 22021392 20162188
42922 20162188 19359628 21385402 23097719 21785934 19600527 19734184 21316822 21416651 19832347
42913 19832347 18531224 17982377 17408295 17573247 19991730 23826125 26515456 27295973 27471970
42904 27471970 27431348 26227717 24319905 23877265 25507540 27047348 26736496 25645886 25625859
42895 25625859 26372158 26031340 23791085 20536622 17499101 15422629 14782355 15696094 17358015
42886 17358015 18244623 17494296 16124907 16440874 19695727 24362436 27324809 26965321 24462050
42877B4462050k595956k017802j935945k041950j743528j035924R7129J696405
42869A4884479K903308K449722M61273j549645k669529l026233k228629M52461
42861A1677207L742740M507911J537802k549745m421256l506129j352756O64342
42853A0300116J658197R94640o58915j425914p11224j27210p00516j028906J44201
42844H444469J464804J176021Q3465j8356N95313N77062K62867P66018J360260
42835A4711923N43519j024849j366688l69404N10614J056699J965096K363764
42827A8390674Q89975j077223p32077J546285K494379J258721N14144J340694
42819B4625572J090721j719032m185120l413491j030144j79814n17212L76485
$$ plain form
42877 24462050 21866094 19848292 17912347 15870397 14126869 13090945 13188074 14884479
42869 14884479 17787787 20237509 20698782 19149137 16479608 13453375 11224746 11677207
42861 11677207 15419947 19927858 21465660 18915915 14494659 10988530 9635774 10300116
42853 10300116 11958313 12952953 12294038 10868124 10156900 10029690 9329174 8300268 8444469
42844 8444469 9909273 11085294 11168759 11150403 11745716 12322778 12585645 13351663 14711923
42835 14711923 15255442 14230593 12863905 12494501 13005115 14061814 16026910 18390674
42827 18390674 19280649 18203426 17471349 19017634 21512013 22770734 23284878 24625572
42819 24625572 25716293 23997261 19812141 16398650 15368506 15188692 14671480 15047965
42811A5047965K371455L109278J895252O0184j799292l833655m780706l100294
42803H970187k57169L29501j849544l445909k022853P96729K088310J336103R5698
42794F041053k68519P05299K594472L805147K805558N09061l71665P31304J212579
42785A7764289l36303j329182P14649L475729K714089j342368m232568l603830
42777A3824505j608669n37687K36220J602911K266174J050988o69991r43153Q9776
42768A5311074J144500J649194J140474j053293l706603l673272l74284K104794
42760A2542584M72993k511236k177539N04743M25817l282101n657939l436738
42752c119416O87863K862913K801236J744300j99279k106831j280773K679196
$$ plain form
42811 15047965 17419420 20528698 22423950 22484134 20684842 16851187 12070481 8970187
42803 8970187 8713018 9042519 7192975 3747066 1724213 2520942 4609252 5945355 6041053
42794 6041053 5772534 6477833 9072305 12877452 15683010 16192071 15820406 16551710 17764289
42785 17764289 17427986 16098804 16813453 20289182 23003271 21660903 17428335 13824505
42777 13824505 12215836 11678149 11914369 13517280 15783454 16834442 16164451 15221298 15311074
42768 15311074 16455574 18104768 19245242 18191949 14485346 10812074 10437790 12542584
42760 12542584 13015577 10504341 8326802 8831545 9257362 5975261 317322 -3119416
42752 -3119416 -2431553 431360 3232596 4976896 4777617 2670786 1390013 4069209
42744D069209N781016M740130J628117L14910P49453L15624j183318j792951j337508
42735A3284682j328888j724088j149321K10883R79417J205381J788537K186435
42727A5453038J626778J447347K896498L837761J559033k142867l114272j428669
42719B0134647q78012k034676j407917J588739K648779k91628l272544k650866
42711A3836522m76316n2204m54277M71947J444339O42344J28931K416890N005230
42702B2963406L552334j022206l726427k890473j410336j082047p29760j26097
42694A5528394p64077j846893k74749L814066N807108L000086j470758l292679
42686B0500498k241311m45150J381571L125562L455327J999047J178537K648386
$$ plain form
42744 4069209 9850225 14590355 16218472 16533382 17282835 17598459 16415141 14622190 13284682
42735 13284682 11955794 10231706 9082385 9293268 10272685 11478066 13266603 15453038
42727 15453038 17079816 18527163 21423661 25261422 26820455 24677588 21563316 20134647
42719 20134647 19256635 17221959 15814042 17402781 20051560 19759932 16487388 13836522
42711 13836522 13360206 13308002 12853725 13325672 14770011 15412355 15541286 17958176 22963406
42702 22963406 26515740 25493534 21767107 18876634 17466298 16384251 15654491 15528394
42694 15528394 14764317 12917424 12642675 16456741 22263849 25263935 23793177 20500498
42686 20500498 18259187 17814037 19195608 22321170 25776497 27775544 28954081 31602467
42678C1602467L781622J242141l335570n125026k968227n47786n23879j311562
42670B2814180p81137K03941j51081j428741k031722j672406q48978P97089L429652
42661B0330797N166897L629691n62814l675874k883805N87034K859712J423379
42653B6875017k471201n062215l730931K95831L164254K658084O19677L29520
42645B2678036K148655L210533J393228j927047l652513k395693N12841K576178
42637B4544218K080728o09016k926910k119632J594801M535859L442851n50411
42629B9992488l207005k363997j88307K95339p27659q48914L87637N92382j589107
42620B2342857l670811k273547J933238M502544K741471j094525l168780k735081
$$ plain form
42678 31602467 35384089 36626230 33290660 28165634 25197407 24649621 24125742 22814180
42670 22814180 22033043 22236984 22085903 20657162 18625440 16953034 16104056 16901145 20330797
42661 20330797 25497694 29127385 28564571 24888697 22004892 22591926 25451638 26875017
42653 26875017 24403816 19341601 15610670 15906501 19070755 21728839 22348516 22678036
42645 22678036 24826691 28037224 29430452 27503405 23850892 21455199 21968040 24544218
42637 24544218 26624946 26015930 23089020 20969388 22564189 27100048 30542899 29992488
42629 29992488 26785483 24421486 24233179 24528518 23800859 22951945 23339582 23931964 22342857
42620 22342857 18672046 16398499 18331737 22834281 25575752 24481227 21312447 18577366
42612A8577366j659169p73596O83002K470039K913510J567081J71921K34343J337942
42603B5522439K386051K762031J788682r25070l880514m560952k820870j225626
42595A9046171j064845o18607J244006K658353K021244Q04415N42990j36497k298551
42586B2198679l349052r82288J918466J173541j638196j501667J565465K400941
42578B1785889o77504l267802k353649n66233o09501q27112M57069J023136q47349
42569A4116944k126293K91575L811423L796150P97032o42405R10453K441847J789462
42560B5186188K06041n69539n31222k72382r5244m60014j402758j744901o42855
42551A9673314P08542P49507L1050J5232M51985K00148l83794l01255j10603o90167
$$ plain form
42612 18577366 16918197 16144601 16827603 19297642 22211152 23778233 23950154 24184497 25522439
42603 25522439 27908490 30670521 32459203 31534133 27653619 23092667 20271797 19046171
42595 19046171 17981326 17362719 18606725 21265078 23286322 24090737 24633727 24497230 22198679
42586 22198679 18849627 17867339 19785805 20959346 19321150 17819483 19384948 21785889
42578 21785889 21108385 17840583 15486934 14920701 14311200 13484088 13941157 14964293 14116944
42569 14116944 11990651 12282226 16093649 19889799 20686831 20044426 20954879 23396726 25186188
42560 25186188 25392229 24822690 24291468 24019086 23923842 23463828 22061070 20316169 19673314
42551 19673314 20381856 21131363 21162413 21177645 21629630 21829778 21445984 21144729 21034126 20343959
42541B0343959r17699M87424J847575O35764j998016k532592o98690J47440j322324
42532A5992841k406011j214563K54837j45525j033176k4903K274316L313234K217455
42523A9228505K22447j531099k744577l101525k262432n76285J129447K239660
42515A2604141K329901J049543j264882l222935l313670j343950J142400K052153
42507A0032701P80584r50693j052189J67739N64871l25104m80215R59361J831470
42498A1528525O60378m12783O97013J801018k47233l750373m250891j598696o8549
42489D358409j356264k398711j102237N26876O38626N32680J236267J129136m06489
42480C158293o20546K260765N373633N130858K347338L37412L7199J17785P2656
$$ plain form
42541 20343959 19426260 19913684 21761259 22397023 20399007 17866415 17167725 17315165 15992841
42532 15992841 13586830 12372267 12627104 12481579 11448403 11423500 13697816 17011050 19228505
42523 19228505 19450952 17919853 15175276 12073751 9811319 9235034 10364481 12604141
42515 12604141 14934042 15983585 14718703 11495768 8182098 6838148 7980548 10032701
42507 10032701 10813285 9862592 8810403 8978142 9543013 9217909 8737694 9697055 11528525
42498 11528525 12188903 11776120 12473133 14274151 14026918 10276545 6025654 4426958 4358409
42489 4358409 3002145 603434 -498803 28073 666699 1199379 2435646 3564782 3158293
42480 3158293 2537747 4798512 10172145 15303003 17650341 17987753 18024952 18142737 18215393
42471A8215393P0426o74122k320851k646441j6892L083036K781491o67276l303627
42462A4521137l007730j505570q13800o97912l55128j82104p41740j476591j405542
42453D335020l54479Q92937J247332L04253r29370r36460K29936Q22859K6379
42444E638407o96885L7060J321424J595007J132858J134811J439056J027097k0735
42435A2608100q51107j403585k030246k315179j831823j220759r70261j77088
42427A808052J732920L171378K327963N1483j269588q79842L24548J931789L738980
42418A2937683M204136K019303j072569j852988j44693Q88401o38187k920071
42410A3421015l467165k346004j280899j039375q72103J75561J999402L174739
$$ plain form
42471 18215393 18285819 17611697 15290846 12644405 12627513 15710549 18492040 17824764 14521137
42462 14521137 11513407 10007837 9194037 8496125 8140997 7958893 7217153 5740562 4335020
42453 4335020 3980541 4873478 6120810 6425063 5495693 4559233 4789169 5612028 5638407
42444 5638407 4941522 4978582 6300006 7895013 9027871 10162682 11601738 12628835 12608100
42435 12608100 11756993 10353408 8323162 6007983 4176160 2955401 1985140 1808052
42427 1808052 3540972 6712350 9040313 9091796 7822208 6942366 7266914 9198703 12937683
42418 12937683 17141819 19161122 18088553 16235565 16090872 16979273 16341086 13421015
42410 13421015 9953850 7607846 6326947 5287572 4415469 4591030 6590432 9765171
42402I765171K223505l12668j880152r89204P72865J218494Q02507J319249K388998
42393A5308765J897441l91677k279953k347151j448232p63566m54450n34069j111745
42384G875363j510730r61138k16995n43685j203613k99699J723973K066132j87033
42375F742575k256352j416777J291760K548248Q20354k187189l546323j996406
42367a10Q19850K117468J285170M44669R21466R99325q86017k686128j580627
42358A435066J156628J961730Q17393Q72121K347294J843597j162080k205704
42350G066045J263076N162896M359731j78386l342879k754045l17287J416183
42342A2675334J305574p23999l201199l236728K07281L921520L821379J69544
$$ plain form
42402 9765171 11988676 11676008 9795856 8806652 9579517 10798011 11600518 12919767 15308765
42393 15308765 17206206 16814529 14534576 12187425 10739193 9975627 9521177 8987108 7875363
42384 7875363 6364633 5403495 5186500 4642815 3439202 3139503 4863476 6929608 6742575
42375 6742575 4486223 3069446 4361206 6909454 7729808 5542619 1996296 -110
42367 -110 819740 2937208 4222378 4667047 5588513 6587838 5701821 3015693 1435066
42358 1435066 2591694 4553424 5370817 6242938 8590232 10433829 9271749 7066045
42350 7066045 8329121 13492017 17851748 17673362 14330483 11576438 11259151 12675334
42342 12675334 13980908 13256909 10055710 6818982 7026263 10947783 14769162 14938706
42334A4938706k933170k916257j227516l21754l30414L08334K001072K923310
42326A2442311J112687k570564m563395k677650P97306J856722L5807j558335
42318D874889j210262m03124j63709P88013K706034L104926P78127j402248n71749
42309H500897J613937J674879l15111j323422j84360J279937J467479P91104M41901
42300A3947241J054447K175938K119729l30539l236217k884139O95402K609762
42292A6151624l8116l315963k040888K503367M816572L258328J071321L48776
42284B2755021j23426j097292j456693j084171j284507j845129j175851K93601
42276A4981553L49479j093300j833571j329310j074272q87705R35482L261311
$$ plain form
42334 14938706 12005536 9089279 7861763 7540009 7209595 7517929 9519001 12442311
42326 12442311 13554998 10984434 6421039 3743389 4540695 6397417 6433224 4874889
42318 4874889 3664627 3261503 3097794 3885807 6591841 9696767 10474894 9072646 8500897
42309 8500897 10114834 11789713 11474602 10151180 9966820 11246757 12714236 13505340 13947241
42300 13947241 15001688 17177626 19297355 18966816 15730599 12846460 13541862 16151624
42292 16151624 16113508 12797545 10756657 13260024 18076596 21334924 22406245 22755021
42284 22755021 22631595 21534303 20077610 18993439 17708932 15863803 14687952 14981553
42276 14981553 15331032 14237732 12404161 11074851 10000579 9112874 10048356 13309667
42268A3309667K587468q88605k418410J39877K914853K331318L93779L56254J118209
42259A9844410K4701j869486j752917q1431O29785L92978R16756J439634j87382
42250A9357048k744873k370411J476509M586757L618193O4260k635800l307883
42242A8043800k823593j782275l01673J007930J455514J231993J022188R57632
42234A8811516N42846n75227k038877k848413k135514k50354J149437O77598j186227
42225A2146785k526866j880976O06905L482578M951983M049019J500124r01774
42217B1427778k223284l052939l705550k898175L39562M075373M764600J563440
42209B0290805k126234k364673Q67086L894664L725002J164610q13030j056433
$$ plain form
42268 13309667 15897135 15008530 12590120 12729997 15644850 17976168 18369947 18726201 19844410
42259 19844410 19869111 17999625 16246708 16165277 16795062 17188040 18104796 19544430 19357048
42250 19357048 16612175 14241764 15718273 20305030 23923223 23987483 21351683 18043800
42242 18043800 15220207 13437932 13136259 14144189 15599703 16831696 17853884 18811516
42234 18811516 19354362 18779135 16740258 13891845 11756331 11505977 12655414 13333012 12146785
42225 12146785 9619919 7738943 8345848 11828426 16780409 20829428 22329552 21427778
42217 21427778 19204494 16151555 12446005 9547830 9887392 13962765 18727365 20290805
42209 20290805 18164571 15799898 16666984 20561648 24286650 25451260 24638230 23581797
42201B3581797j397582l551717o130858o160291l082264N36341K493613L258146
42193I547185L953830L954449K229170j68613j101817l88963J35408m61530j133555
42184A6565564j004093p74871j211760j714219j466848r26351r93097j499096
42176F975229j745852j914653k453786k338848K09223M673391P536226O051292
42168A6992222J881326o50888L10288K472685L057508K208725J589990J187958
42160B9049814l80729k898249m132138k937674j058088p33832j623734j504644
42152A3780726L64147K035997J514636l70320q58113J009675K786479J710337
42144B1973564j381756k909685j346998Q33415R62060l709N87618K555730K851631
$$ plain form
42201 23581797 22184215 18632498 12501640 6341349 3259085 3795426 6289039 9547185
42193 9547185 13501015 17455464 19684634 19516021 18414204 18025241 18160649 17699119 16565564
42184 16565564 15561471 14786600 13574840 11860621 10393773 9467422 8474325 6975229
42176 6975229 5229377 3314724 860938 -1477910 -1268687 3404704 10940930 16992222
42168 16992222 18873548 18222660 18532948 21005633 24063141 26271866 27861856 29049814
42160 29049814 28669085 25770836 21638698 18701024 17642936 16909104 15285370 13780726
42152 13780726 14144873 16180870 17695506 17325186 16467073 17476748 20263227 21973564
42144 21973564 20591808 17682123 16335125 17168540 18130600 18126891 18714509 21270239 24121870
42135B4121870k6447l779137n038509k872098R08969L727928M150031K818245
42127B4010852J717452J805816J798493L65042j341573j270515L1630N4459j561226
42118B5610430k336768j019297M28179J20401r56507j063734m90614l64031m30760
42109A9497299J6702L81363j30484o69935J82554K176632L624873L310563J296908
42100B9686475j268802k536035j456708N21935R92506K76674J042821L351356
42092C0610222L477643k09906l653836k708093N65460J325247n53889j229021
42084B7623827J38498M00350j569978k842647j454910P04028J446920J201237
42076B5647325R53827M95550J27084J046876K584555K094383p81081k788984j881306
$$ plain form
42135 24121870 24095423 20316286 15277777 12405679 13314648 17042576 21192607 24010852
42127 24010852 25728304 27534120 29332613 29697655 28356082 27085567 27117197 27171656 25610430
42118 25610430 23273662 22254365 22682544 22802945 21846438 20782704 20292090 19928059 19497299
42109 19497299 19514001 19895364 19764880 19094945 19277499 21454131 25079004 28389567 29686475
42100 29686475 28417673 25881638 24424930 24946865 25939371 26216045 27258866 30610222
42092 30610222 34087865 33877959 30224123 27516030 28081490 29406737 28852848 27623827
42084 27623827 27762325 28162675 26592697 23750050 22295140 22999168 24446088 25647325
42076 25647325 26601152 27096702 27223786 28270662 30855217 32949600 32168519 29379535 27498229
42067B7498229l40058q21945k118148j605743M21664J800307J971902J512715
42059B8318923j00681l149189n433790m610127j909230m76976p38531n95888K99615
42050A1604126M0632j616259k362459j235176k12819n87373o16296J377300L899487
42041A0291163M396185K763447P16548r22251k204378k499654j280066J97091
42033A1458085K11558p64783q58334L3570K61137k77096M07415K666822L579118
42024A6717492R65334k870706l853294j535651O74276K83489j648626k773336
42016E958978k244574p27679O74474R24152r9989q94916j719J438018Q65381j436531
42006D455595j878432J172742M211622L144992q40140l022214j764977n3562l76184
$$ plain form
42067 27498229 27158171 26336226 24218078 22612335 23033999 24834306 26806208 28318923
42059 28318923 28218242 25069053 19635263 15025136 13115906 12638930 11900399 11304511 11604126
42050 11604126 11644758 10028499 7666040 6430864 6218045 5630672 5014376 6391676 10291163
42041 10291163 14687348 17450795 18167343 17245092 15040714 12541060 11260994 11458085
42033 11458085 11669643 10904860 10046526 10080096 10341233 10064137 10471552 13138374 16717492
42024 16717492 17682826 14812120 10958826 9423175 10097451 10380940 8732314 5958978
42016 5958978 3714404 2986725 3661199 4585351 4485362 3590446 3588727 5026745 5892126 4455595
42006 4455595 2577163 3749905 7961527 11106519 10266379 7244165 5479188 5425626 5049442
41997E049442j278419k19755K424195L961810K943403P06006m31396J84377Q61206
41988A4200869l20347k753631l595280j419337J561450K183105K91770j546634
41980H601965j524835k3385J792549K867488K255393K81006p62639O79867K517774
41971A6685183J513556j576895k618838k52000K060881J378219o34933r46155
41963A5609018L25529J108382R88703R99196J200263Q83485K82329J09479J65590
41954B1671974k4178j44135o5606o38534j941133k141581m2376K425779K368551
41945B1468761k35433k803587l517152k605991j050791J63740K11939m82095k16740
41936A0932651J333299J889612J27525j309264M77545L294207K419984j725931
$$ plain form
41997 5049442 3771023 3551268 5975463 9937273 12880676 13586682 13155286 13339663 14200869
41988 14200869 13880522 11126891 7531611 6112274 7673724 9856829 10148599 8601965
41980 8601965 7077130 7053745 8846294 11713782 13969175 14250181 13487542 14167409 16685183
41971 16685183 18198739 16621844 14003006 13751006 15811887 17190106 16555173 15609018
41963 15609018 15934547 17042929 18031632 19030828 20231091 21114576 21396905 21506384 21671974
41954 21671974 21647796 21503661 21438055 20799521 18858388 16716807 16674431 19100210 21468761
41945 21468761 21233328 18429741 14912589 12306598 11255807 11419547 11631486 11149391 10932651
41936 10932651 12265950 14155562 14283087 12973823 13451368 16745575 19165559 17439628
41928A7439628l177396R59988N753183N073112j19712l640138k475433M72209
41920B0285441J714350J582388J960659K260169L27003l330165m961647k313529
41912A7524669J853570K945084L78121k146455k134544j212006j500138j913019
41904A3795282m14026J972922K317102J09067k159724k395939p38089J578328
41896A4064923L079044K251531q44880l477497l001010m56724Q44369l3618r71062
41887A1455076n38023L51279O27319K40245r12859k480147k238673J440070N612138
41878A3556425N236250M06167l119960k024871L98929L80543o75526r0491P07023
41869A4774489p81658k806918k020291O65687J749080J085403J152354J524466
$$ plain form
41928 17439628 14262232 15222220 20975403 26048515 25928803 22288665 19813232 20285441
41920 20285441 21999791 23582179 25542838 27803007 28130010 24799845 19838198 17524669
41912 17524669 19378239 22323323 22701444 20554989 18420445 17208439 15708301 13795282
41904 13795282 13381256 15354178 17671280 17780347 15620623 13224684 12486595 14064923
41896 14064923 17143967 19395498 18550618 15073121 12072111 11615387 12459756 12426138 11455076
41887 11455076 10917053 11268332 11895651 12135896 11223037 8742890 6504217 7944287 13556425
41878 13556425 18792675 19198842 16078882 14054011 14452940 14833483 14157957 14067466 14774489
41869 14774489 13992831 11185913 9165622 9831309 11580389 12665792 13818146 15342612
41861A5342612m45166l670949l720595k1153K676913J736000M39972J756251L019326
41852A7113211P13546l044634l525903q58919L60432j588888l104784j090473
41844D973588K334947K985110L89247j863008r03070K152209L996363K969958
41836A7035344K75805k055940l210213l377819k695192j348098l0201P88606J537753
41827F920045K364827J963729p19036l933375m359147j258416K420349L640193
41819G039169K293811Q6085j679380k260750j292759K48005M52005q29903j251635
41810B804648O18398K798237K693758R61555K58325J060509J214028n87155k981785
41801H840518l670291j501631K765291O296563N652316N77534m292666m036367
$$ plain form
41861 15342612 14897446 11226497 7505902 7484749 10161662 11897662 12337634 14093885 17113211
41852 17113211 17826757 14782123 11256220 10397301 10757733 9168845 6064061 4973588
41844 4973588 7308535 10293645 10682892 8819884 7916814 10069023 14065386 17035344
41836 17035344 17311149 15255209 12044996 8667177 5971985 4623887 4593686 5382292 6920045
41827 6920045 9284872 11248601 10529565 6596190 2237043 978627 3398976 7039169
41819 7039169 9332980 9419065 7739685 5478935 4186176 4434181 4886186 4056283 2804648
41810 2804648 3423046 6221283 8915041 9876596 10134921 11195430 12409458 11822303 8840518
41801 8840518 5170227 3668596 6433887 12730450 18382766 18960300 14667634 10631267
41793A0631267M70109L678202K501857o83490k584568l115329l498979l298945
41785D100124j706051K36047R94609P52330M45152J23263K2964J396406L993850
41776A0358694M602882J134828l219159l526101j87717J485384q62677l290213
41768F495921j772667J772918K604927J18338j704899j98421K615095L148678
41760A3079890P53015k016730k651109j093137Q99949J884185J713186Q05974
41752A3375223o03209k112008k889504k596284j979864j598256n83139J939144
41744B952103M597185M741204J877114j489144k891850k308358j045735J39070
41736F571589R63471J117592Q60358R62130J266044O65215o71262p96220R72583
$$ plain form
41793 10631267 11101376 14779578 17281435 16597945 14013377 10898048 7399069 4100124
41785 4100124 2394073 2630120 3624729 4377059 4822211 4945474 4968438 6364844 10358694
41776 10358694 14961576 16096404 12877245 9351144 9163427 10648811 9786134 6495921
41768 6495921 4723254 6496172 9101099 9219437 7514538 7316117 9931212 13079890
41760 13079890 13832905 11816175 9165066 8071929 8971878 10856063 12569249 13375223
41752 13375223 12772014 10660006 7770502 5174218 3194354 1596098 1012959 2952103
41744 2952103 7549288 12290492 14167606 12678462 9786612 7478254 6432519 6571589
41736 6571589 7535060 8652652 9513010 10475140 11741184 12406399 11735137 10938917 11911500
41727A1911500K295060J010057j399458j901402m08302N25996l769k15329Q17624
41718A2631977J431173L39982r15672k19827J771535K302994O3056l236714m771696
41709I396808l352445k54521K298837L331761L593044L762680L041788O05675
41701B2423627k118693k454889j12027J908373J071496j335849k050389k44277
41693A7087372J624007J320742m54673j590528j540254j373416j331751j87102
41685A3554397K269905L750623K256272n31094j055931Q88443J553195r97994
41677B1687816l366144j625038K420493L399966J27582k666232j092590K796324
41669B1682177M445255K764882K37641j364392k582542l851488l912053j653671
$$ plain form
41727 11911500 14206560 15216617 13817159 11915757 11507455 12033451 12029682 11814353 12631977
41718 12631977 14063150 14403132 13487460 13267633 15039168 17342162 17405218 14168504 9396808
41709 9396808 6044363 5789842 8088679 11420440 15013484 18776164 21817952 22423627
41701 22423627 20304934 17850045 17738018 19646391 20717887 19382038 17331649 17087372
41693 17087372 18711379 20032121 19577448 17986920 16446666 15073250 13741499 13554397
41685 13554397 15824302 19574925 21831197 21300103 20244172 21132615 22685810 21687816
41677 21687816 18321672 16696634 19117127 22517093 22644675 19978443 18885853 21682177
41669 21682177 26127432 28892314 29129955 27765563 25183021 21331533 17419480 15765809
41661A5765809J602734K959401J238257j333530j619403L47489J190141j065675
41653A9085223l620117k361754K082163M560634K110937k173210l360598p83977
41645A5539301J893862J489179j617429m560844m669848j471007K696377M258440
41637A3558031J668204k850613n385233m041627k91224K891409L731885K831739
41629A2112571K040861K063546J473895j179511m659420n846245l527765l7680
41621B440252J496504M90709j063922r71291J228062L865037M497512K496307
41613A4479170K3324p71302q05873k200796m028027l219508M011J487132n64999
$$ plain form
41661 15765809 17368543 20327944 21566201 20232671 18613268 18960757 20150898 19085223
41653 19085223 15465106 13103352 15185515 19746149 21857086 19683876 16323278 15539301
41645 15539301 17433163 18922342 17304913 12744069 8074221 6603214 9299591 13558031
41637 13558031 15226235 12375622 6990389 2948762 2657538 5548947 9280832 12112571
41629 12112571 14153432 16216978 17690873 16511362 11851942 6005697 2477932 2440252
41621 2440252 3936756 4427465 3363543 2392252 3620314 7485351 11982863 14479170
41613 14479170 14502494 13731192 12925319 10724523 6696496 3476988 3480999 4968131 4403132
$$ [...]
##END NTUPLES=NMR SPECTRUM
##END=
