##TITLE=31Pdec_DE-100rm_3h
 , 64 sc
 2.7.2025
##JCAMPDX= 6.0         $$ Bruker NMR JCAMP-DX V2.0
##DATA TYPE= NMR SPECTRUM
##DATA CLASS= NTUPLES
##ORIGIN= UXNMR, Bruker Analytische Messtechnik GmbH
##OWNER= root
$$ XWIN-NMR		Version 3.5
$$ Wed Jul  2 14:49:28 2025 Russian Standard Time (UT+4h)  she@DPX200
##.OBSERVE FREQUENCY= 81.013821
##.OBSERVE NUCLEUS= ^31P
##.ACQUISITION MODE= SIMULTANEOUS
##.ACQUISITION SCHEME= undefined
##.AVERAGES= 64
##.DIGITISER RES= 17
##SPECTROMETER/DATA SYSTEM= spect
##.PULSE SEQUENCE= zgpg30
##.SOLVENT NAME= CDCl3
##.SHIFT REFERENCE= (INTERNAL, CDCl3, 0, 198.062)
##AUDIT TRAIL= $$ (NUMBER, WHEN, WHO, WHERE, WHAT)
$$ ##TITLE= Audit trail, XWIN-NMR		Version 3.5
$$ ##JCAMPDX= 5.01
$$ ##ORIGIN= Bruker BioSpin GmbH
$$ ##OWNER= she
$$ F:/spectra/data/she/nmr/P31/2/pdata/1/auditp.txt
$$ ##AUDIT TRAIL=  $$ (NUMBER, WHEN, WHO, WHERE, WHAT)
(   1,<2025-07-02 14:48:03.95 +0400>,<she>,<DPX200>,
      <created by zg, POWCHK disabled, PULCHK disabled
       configuration hash MD5:
       00 E9 B6 7A A2 85 ED C7 34 08 36 98 17 FE 4E 26
       data hash MD5: 32K
       DE 3C 73 EA 6E B8 80 A5 3C 45 61 C4 9C 8E 7A 56>)
(   2,<2025-07-02 14:48:06.76 +0400>,<she>,<DPX200>,
      <Start of raw data processing
       efp BC_mod = 2 LB = 1.5 FT_mod = 6 PKNL = 1 PHC0 = 1380.012 PHC1 = 103.4951 SI = 64K 
       data hash MD5: 64K
       12 29 E2 78 FF B8 F7 4B 85 77 D5 8E 41 6B 65 4C>)
(   3,<2025-07-02 14:48:57.03 +0400>,<she>,<DPX200>,
      <pk PHC0 = -81.46494 PHC1 = 248.3989 
       data hash MD5: 64K
       D0 E4 43 AD D8 A5 D7 79 CB 35 28 E5 CD 36 14 9C>)
$$ ##END=
$$ 
$$ hash MD5
$$ CB 3E C7 6E D3 40 82 41 24 56 69 CA A7 5B 4D DF
##$RELAX= 
##$RELAX= 
##$RELAX= 
##$RELAX= 
##$RELAX= 
##$RELAX= 
##$RELAX= 
##$RELAX= 
$$ Bruker specific parameters
$$ --------------------------
##$DU= <F:/spectra>
##$EXPNO= 2
##$NAME= <P31>
##$PROCNO= 1
##$TYPE= <nmr>
##$USER= <she>
##$AMP= (0..31)
100 100 100 100 100 100 100 100 100 100 100 100 100 100 100 100 100 100 
100 100 100 100 100 100 100 100 100 100 100 100 100 100 
##$AQSEQ= 0
##$AQ_mod= 1
##$AUNM= <au_zg>
##$AUTOPOS= <>
##$BF1= 81.014009
##$BF2= 200.13
##$BF3= 200.13
##$BF4= 200.13
##$BF5= 200.13
##$BF6= 200.13
##$BF7= 200.13
##$BF8= 200.13
##$BYTORDA= 1
##$CFDGTYP= 0
##$CFRGTYP= 5
##$CHEMSTR= <none>
##$CNST= (0..31)
1 1 145 1 1 1 1 1 1 1 1 1 1 1 1 1 1 1 1 1 1 1 1 1 1 1 1 1 1 1 1 1 
##$CPDPRG= <waltz16>
##$CPDPRG1= <>
##$CPDPRG2= <waltz16>
##$CPDPRG3= <>
##$CPDPRG4= <mlev>
##$CPDPRG5= <mlev>
##$CPDPRG6= <mlev>
##$CPDPRG7= <mlev>
##$CPDPRG8= <mlev>
##$CPDPRGB= <>
##$CPDPRGT= <>
##$D= (0..31)
0 1 0 0 0 0 0 0 0 0.06 0 0.03 2e-05 3e-06 0 0 0.0002 0 0 0 0 0 0 0 0 0 
0 0 0 0 0 0 
##$DATE= 1751453283
##$DBL= (0..7)
120 120 120 11 120 120 24 19 
##$DBP= (0..7)
150 150 150 150 150 150 150 150 
##$DBP07= 0
##$DBPNAM0= <>
##$DBPNAM1= <>
##$DBPNAM2= <>
##$DBPNAM3= <>
##$DBPNAM4= <>
##$DBPNAM5= <>
##$DBPNAM6= <>
##$DBPNAM7= <>
##$DBPOAL= (0..7)
0.5 0.5 0.5 0.5 0.5 0.5 0.5 0.5 
##$DBPOFFS= (0..7)
$$ [...]
##$SUBNAM2= <"">
##$SUBNAM3= <"">
##$SUBNAM4= <"">
##$SUBNAM5= <"">
##$SUBNAM6= <"">
##$SUBNAM7= <"">
##$SUBNAM8= <"">
##$SUBNAM9= <"">
##$SW= 400.765351723535
##$SWIBOX= (0..15)
0 1 3 0 0 0 0 0 0 0 0 0 0 0 0 0 
##$SW_h= 32467.5324675325
##$TD= 32768
##$TD0= 1
##$TE= 0
##$TE2= 300
##$TE3= 300
##$TEG= 300
##$TL= (0..7)
0 120 53 12 22 120 120 120 
##$TP= (0..7)
150 150 150 150 150 150 150 150 
##$TP07= 0
##$TPNAME0= <>
##$TPNAME1= <>
##$TPNAME2= <>
##$TPNAME3= <>
##$TPNAME4= <>
##$TPNAME5= <>
##$TPNAME6= <>
##$TPNAME7= <>
##$TPOAL= (0..7)
0.5 0.5 0.5 0.5 0.5 0.5 0.5 0.5 
##$TPOFFS= (0..7)
0 0 0 0 0 0 0 0 
##$TUNHIN= 0
##$TUNHOUT= 0
##$TUNXOUT= 0
##$USERA1= <user>
##$USERA2= <user>
##$USERA3= <user>
##$USERA4= <user>
##$USERA5= <user>
##$V9= 5
##$VALIST= <valist>
##$VCLIST= <CCCCCCCCCCCCCCC>
##$VD= 0
##$VDLIST= <DDDDDDDDDDDDDDD>
##$VPLIST= <PPPPPPPPPPPPPPP>
##$VTLIST= <TTTTTTTTTTTTTTT>
##$WBST= 1024
##$WBSW= 4
##$XGAIN= (0..3)
0 0 0 0 
##$XL= 0
##$YL= 0
##$YMAX_a= 51682
##$YMIN_a= -61505
##$ZGOPTNS= <>
##$ZL1= 120
##$ZL2= 120
##$ZL3= 120
##$ZL4= 120
##$ABSF1= 0
##$ABSF2= 0
##$ABSG= 0
##$ABSL= 0
##$ALPHA= 0
##$AQORDER= 0
##$ASSFAC= 0
##$ASSFACI= 0
##$ASSFACX= 0
##$ASSWID= 0
##$AUNMP= <proc_1d>
##$AZFE= 0.1
##$AZFW= 0.5
##$BCFW= 0
##$BC_mod= 2
##$BYTORDP= 0
##$COROFFS= 0
##$CY= -3
##$DATMOD= 1
##$DC= 0
##$DFILT= <>
##$DTYPP= 0
##$F1P= 0
##$F2P= 0
##$FCOR= 1
##$FTSIZE= 65536
##$FT_mod= 6
##$GAMMA= 0
##$GB= 0
##$INTBC= 1
##$INTSCL= 9.790993e-09
##$ISEN= 30
##$LB= 1.5
##$LEV0= 0
##$LPBIN= 0
##$MAXI= 10000
##$MC2= 0
##$MEAN= 0
##$ME_mod= 0
##$MI= 50
##$NCOEF= 0
##$NC_proc= -6
##$NLEV= 6
##$NOISF1= 182.463
##$NOISF2= 159.3651
##$NSP= 0
##$NTH_PI= 0
##$NZP= 0
##$OFFSET= 198.0616
##$PC= 4
##$PHC0= 1298.547
##$PHC1= 351.894
##$PH_mod= 1
##$PKNL= yes
##$PPARMOD= 0
##$PSCAL= 0
##$PSIGN= 0
##$REVERSE= no
##$SF= 81.0140089999434
##$SI= 65536
##$SIGF1= 159.3651
##$SIGF2= -187.1042
##$SINO= 113.3802
##$SIOLD= 16384
##$SREGLST= <1H.CDCl3>
##$SSB= 0
##$STSI= 65536
##$STSR= 0
##$SW_p= 32467.5324675325
##$SYMM= 0
##$S_DEV= 0
##$TDeff= 32768
##$TDoff= 0
##$TI= <>
##$TILT= no
##$TM1= 0
##$TM2= 0
##$TOPLEV= 0
##$USERP1= <user>
##$USERP2= <user>
##$USERP3= <user>
##$USERP4= <user>
##$USERP5= <user>
##$WDW= 1
##$XDIM= 65536
##$YMAX_p= 364809886
##$YMIN_p= -64525971
$$ End of Bruker specific parameters
$$ ---------------------------------
##NTUPLES= NMR SPECTRUM
##VAR_NAME=  FREQUENCY,     SPECTRUM/REAL,   SPECTRUM/IMAG
##SYMBOL=    X,             R,               I
##VAR_TYPE=  INDEPENDENT,   DEPENDENT,       DEPENDENT
##VAR_FORM=  AFFN,          ASDF,            ASDF
##VAR_DIM=   65536,         65536,           65536
##UNITS=     HZ,            ARBITRARY UNITS, ARBITRARY UNITS
##FACTOR=    0.49542278885378, 1,            1
##FIRST=     16045.7642231865, 0,            0
##LAST=      -16421.768244346, 0,            0
##MIN=       -16421.768244346, -64525971,    0
##MAX=       16045.7642231865, 364809886,    0
$$ Real data points
##PAGE= N=1
##DATA TABLE= (X++(R..R)), XYDATA
$$ [...]
45868B979233m84364n25380j58018J48311P2673k51513n47266p63784r33628q15349
$$ 2979233 2494869 1969489 1811471 1959782 2032455 1780942 1233676 469892 -463736 -1279085
45858a279085p5138J067702J752762J358300K73457n40604o37940l84537k47223
$$ -1279085 -1354223 -286521 1466241 2824541 3097998 2557394 1919454 1534917 1287694
45849A287694k27237j07912J14272K91559L89796M32550L04720j23698o78498
$$ 1287694 1060457 952545 1066817 1358376 1748172 2180722 2485442 2361744 1683246
45840A683246q98540m93080K67547P15309M08074l87572q87926n50243L47121
$$ 1683246 784706 291626 559173 1274482 1682556 1294984 407058 -143185 203936
45831B03936R46784O73043j82047p68641n53703J70827O74842O00864K40934L114
$$ 203936 1150720 1823763 1641716 873075 319372 490199 1165041 1765905 2006839 2009953
45821B009953j29462l63559n25175k03176M78455P56843K32762m37168l77242
$$ 2009953 1880491 1516932 991757 788581 1267036 2023879 2256641 1819473 1442231
45812A442231K28492L74341k50473p31082k46553P00736R73733L56099k99949
$$ 1442231 1670723 2045064 1794591 1063509 816956 1517692 2491425 2847524 2547575
45803B547575l95725l10770n86686j012381r89525m38955J78027N56813P50669
$$ 2547575 2151850 1841080 1254394 242013 -747512 -1186467 -1008440 -451627 299042
45794B99042P45881L91702j39813l40876o9883J63678m2508l21339r9269M62030
$$ 299042 1044923 1436625 1296812 955936 886053 1049731 1007223 685884 586615 1048645
45784A048645O80772M01056J68975K77234K94709j33655n80075m44507Q3119K71440
$$ 1048645 1729417 2130473 2299448 2576682 2871391 2737736 2157661 1713154 1796273 2067713
45774B067713p9050m01543k48087J25083K72179K37706L68216O73953P77520M83386
$$ 2067713 1988663 1587120 1339033 1464116 1736295 1974001 2342217 3016170 3793690 4277076
45764D277076O8672j27821j82789l99042p01639n64870K45703J090829J037959
$$ 4277076 4345748 4217927 4035138 3636096 2934457 2369587 2615290 3706119 4744078
45755D744078M7720q53412q09721j62533J48269r9320k87896p8403M5379l90941
$$ 4744078 4791798 3938386 3128665 2966132 3114401 3015081 2727185 2648782 2694161 2303220
45745B303220j023868j115762n41263J57771N35392N89891M04514o1943o69184
$$ 2303220 1279352 163590 -377673 -219902 315490 905381 1309895 1247952 578768
45736E78768r42370n09042M16948J153718J145227M45212k97821l84501K34575
$$ 578768 -363602 -872644 -455696 698022 1843249 2288461 1990640 1606139 1840714
45727A840714Q23494O32422k05355q00713n55253K17735P88597P75617K54509
$$ 1840714 2664208 3296630 3091275 2290562 1735309 1953044 2741641 3517258 3771767
45718C771767n10183j128495j176641o13292O4278L93052M57239M96478L29608
$$ 3771767 3261584 2133089 956448 343156 407434 800486 1257725 1754203 2083811
45709B083811k73371q80904q00779j77323P7385l84916q28695n55435J69574P60203
$$ 2083811 1810440 929536 128757 -48566 28819 -356097 -1184792 -1740227 -1570653 -810450
45699h10450J190106J584832J511871N36523q00023j410746j009938l16257N1417
$$ -810450 379656 1964488 3476359 4012882 3212859 1802113 792175 475918 527335
45690E27335J53785J65484r99k66888k36057J87513N36989M65573K39741K12996
$$ 527335 681120 846604 845605 578717 342660 530173 1067162 1532735 1772476 1985472
45680A985472K47880Q2528r8493K5214K44775J0877p16435j240088q97216J54713
$$ 1985472 2233352 2315880 2217387 2242601 2487376 2498253 1781818 541730 -355486 -200773
45670b00773J048644J040536K03789o67887q32217k40484N84449J117893J104140
$$ -200773 847871 1888407 2092196 1424309 592092 351608 936057 2053950 3158090
45661C158090M92790m61705j087263p96975J37045P45933N20721P53p4525K17486
$$ 3158090 3650880 3189175 2101912 1304937 1441982 2187915 2708636 2709389 2634864 2852350
45651B852350K62663p8230l00511o9779K76424K07182l01630p61693p77200m70876
$$ 2852350 3115013 3036783 2736272 2666493 2942917 3150099 2848469 2086776 1309576 838700
45641H38700k34363j63044K7439M56900P59314N85048J76671L2442J71318K29421
$$ 838700 604337 441293 468732 925632 1684946 2269994 2446665 2479107 2650425 2879846
45631B879846J54609J93872K46749l9189m60260l63081K12408L62391k94247r17526
$$ 2879846 3034455 3228327 3475076 3435887 2975627 2612546 2824954 3187345 2893098 1975572
45621A975572p32582k05796j52007l68731j22834N00433P73003N62424L86062
$$ 1975572 1242990 1037194 885187 516456 393622 894055 1667058 2229482 2615544
45612B615544L66516J03940m04578o00307k30525L27932O74229O86075K76148
$$ 2615544 2982060 3086000 2681422 2081115 1850590 2178522 2852751 3538826 3814974
45603C814974m48391q53123m00048L93737M49172l49022r58741o63990P1931M60300
$$ 3814974 3366583 2513460 2113412 2507149 2956321 2607299 1648558 984568 1056499 1516799
45593A516799L16228j30662o29207q29932m76819R0409K63084J12366K48722O42528
$$ 1516799 1833027 1702365 1073158 243226 -233593 -143184 119900 232266 480988 1123516
45583A123516N63448m9567k59656L19423P22530J25538p95981q96327k02864M14697
$$ 1123516 1686964 1637397 1377741 1697164 2419694 2545232 1749251 852924 650060 1064757
45573A064757O24810P08169O77869K89393k92582o35660o78915o00974l21659
$$ 1064757 1689567 2397736 3075605 3364998 3072416 2436756 1757841 1156867 835208
45564H35208K25527O19330M32092l7629j40485K11033N42710M95414L8164o59233
$$ 835208 1060735 1680065 2112157 2074528 1934043 2145076 2687786 3183200 3221364 2562131
45554B562131j121025p94953J16288O14496K61466j09197K60285P83629N53696
$$ 2562131 1441106 646153 762441 1376937 1638403 1529206 1789491 2573120 3126816
45545C126816j42335m89524o10255r99078j129896k51180Q57421P43635k60929
$$ 3126816 2984481 2494957 1884702 885624 -244272 -495452 361969 1105604 844675
45536H44675l79281O95347J260702M65741l36693m560N14716J7584q08015o20747
$$ 844675 465394 1160741 2421443 2887184 2550491 2545931 3060647 3078231 2270216 1649469
45526A649469L23197P39467L63489l5385j22285j32151J3441M48574N79175k04154
$$ 1649469 1972666 2712133 3075622 3040237 2917952 2785801 2799242 3247816 3826991 3622837
45516C622837j269350j371179m02996N38037P24443M35942J20768r5429q9806
$$ 3622837 2353487 982308 579312 1117349 1841792 2277734 2398502 2303073 2213267
45507B213267J68344K35535k67476q26237o01830K67373Q17343O13752N0284n61601
$$ 2213267 2381611 2617146 2349670 1523433 921603 1188976 2006319 2620071 2670355 2108754
45497B108754j161587j295154m89176O43487Q82196J85858k23266J47194L31166
$$ 2108754 947167 -347987 -837163 -193676 688520 874378 651112 798306 1129472
45488A129472k86540q03092l38002M27291L77534k53681m42449p8637J35313Q7310
$$ 1129472 842932 39840 -298162 129129 506663 252982 -189467 -268104 -132791 -45481
45478d5481L08294P56612O99145q0736q59766r35325l38734M78131J046299R70350
$$ -45481 262813 1019425 1718570 1637834 778068 -157257 -495991 -17860 1028439 1998789
45468A998789K70578l44939j93010L94350M70192j39114o44080n99220n00232
$$ 1998789 2269367 1924428 1731418 2125768 2595960 2456846 1812766 1213546 713314
45459G13314p30299p82573j57339O16258O22469j25663p20240n53836J06031O62492
$$ 713314 -16985 -799558 -956897 -340639 281830 156167 -564073 -1117909 -1011878 -349386
45449c49386P90248M88303k0072l52579k47821J34127L88432L40627J51911o993
$$ -349386 440862 929165 909093 556514 308693 442820 831252 1171879 1323790 1316797
45439A316797j57897l86504o79530q80967p33581j19943O05282P97704L30852
$$ 1316797 1158900 772396 92866 -788101 -1521682 -1641625 -1036343 -238639 92213
45430I2213o3983K71427Q83420P59760j27783o40048r6118O86091N53001l35488
$$ 92213 28230 299657 1183077 1942837 1815054 1175006 1078888 1764979 2317980 1982492
45420A982492p88192k60408N42383P61375L93782j0743j33670m9795M9215j7198
$$ 1982492 1194300 933892 1476275 2237650 2631432 2620689 2487019 2437224 2486439 2469241
45410B469241l49011p64827q33956l52376L05472N14303N8136o42851r45654n93432
$$ 2469241 2120230 1355403 521447 169071 474543 988846 1046982 404131 -541523 -1134955
45400a134955M4938L70267K43279J28732L69482N63103J23680o43252o91621L37431
$$ -1134955 -1090017 -719750 -476471 -347739 21743 584846 708526 65274 -626347 -288916
45390b88916J452588J495993N33238m21555p00857m51147o7909K26310L22918
$$ -288916 1163672 2659665 3192903 2771348 2070491 1619344 1551435 1777745 2100663
45381B100663K58041K74394M67810N06274J16287l61140m25521k14580k10537
$$ 2100663 2358704 2633098 3100908 3607182 3723469 3362329 2936808 2722228 2511691
45372B511691l42136j64750J67911M4888m28661m25350J78168M45890n8679m37953
$$ 2511691 2169555 2004805 2172716 2217604 1788943 1363593 1541761 1987651 1928972 1491019
45362A491019O0570P20155N19162j90576l72704q4127k09199p31273p08236J1904
$$ 1491019 1551589 2271744 2790906 2600330 2227626 2143499 1934300 1203027 494791 506695
45352E06695M38359Q5852k91234j02074Q8408l23841q10360n25701L29383Q19570
$$ 506695 945054 1030906 739672 637598 726006 402165 -408195 -933896 -604513 215057
45342B15057N95670J83447J50079N21481Q87007P40401o0367r42609j088473m61526
$$ 215057 810727 994174 1144253 1665734 2552741 3293142 3232775 2290166 1201693 740167
45332G40167J35990K53503L34073O70817O76508o5061p70095m74921M18381O78982
$$ 740167 876157 1129660 1463733 2134550 2811058 2745997 1975902 1500981 1919362 2598344
45322B598344K0987p03448q77022o40091j87884L63344M78167k59243j056875
$$ 2598344 2619331 1915883 1038861 398770 210886 574230 1052397 793154 -263721
45313b63721o12813Q75052J686611R88711l5951j24462K78363J32729l86473m14485
$$ -263721 -876534 -1482 1685129 2673840 2637889 2513427 2791790 2924519 2538046 2123561
45303B123561K1825K18552J27700K72624O08322N81549J69903j60232l97202q59574
$$ 2123561 2145386 2363938 2491638 2764262 3372584 3954133 4124036 3963804 3566602 2707028
45293B707028j214552p18033M64943J216059R73127L59960M3150j29137m61711
$$ 2707028 1492476 774443 1239386 2455445 3428572 3788532 3831682 3702545 3240834
45284C240834p14608n73640j91129J78703N31697P51871M96221j77556o50483
$$ 3240834 2526226 1952586 1761457 1940160 2471857 3223728 3719949 3542393 2891910
45275B891910n91977l82633l23536j13864M04638P17836M96527K80609N12703
$$ 2891910 2299933 1917300 1593764 1479900 1884538 2602374 3098901 3379510 3892213
45266C892213N48691l47765j504477j537593l81179N86755N38660J55574K50357
$$ 3892213 4440904 4093139 2588662 1051069 669890 1256645 1795305 1950879 2201236
45257B201236N09411K55178l30857n41861k47352P6896J78264K26542K75155J22266
$$ 2201236 2710647 2965825 2634968 2093107 1845755 1922651 2100915 2327457 2602612 2724878
45247B724878k05591k98688Q5254N80638N82941l763n91029n66346k2138L74341
$$ 2724878 2519287 2220599 2305853 2886491 3469432 3465669 2874640 2308294 2286156 2660497
45237B660497K54533P8J07498L90448K65454k86103o19386m12707j90706n08030
$$ 2660497 2915030 2915108 3022606 3413054 3678508 3392405 2773019 2360312 2169606 1661576
45227A661576j031697r46824r3323Q05561J057420P35575L85540L14112L93965
$$ 1661576 629879 -316945 -410268 395293 1452713 2188288 2573828 2887940 3281905
45218C281905M20700M01787M32614M38514K29579j58217l71548j73932J51809
$$ 3281905 3702605 4104392 4537006 4975520 5205099 5046882 4675334 4501402 4653211
45209D653211J13336l10176o21676m95618j61224M3392J22806J77610P8590k22224
$$ 4653211 4766547 4456371 3834695 3339077 3177853 3221245 3344051 3521661 3600251 3378027
45199C378027l56703j7400M28112L76514m8218j36173K31886K83985m31742j196213
$$ 3378027 3021324 3003924 3432036 3808550 3760332 3624159 3856045 4140030 3708288 2512075
45189B512075j058129j69259N05217N44821L83150L27040Q6700m80039q54786
$$ 2512075 1453946 1284687 1789904 2334725 2717875 3044915 3131615 2651576 1796790
45180A796790n50674J38247N61061N59512M07413J70529k81016p21185o59998
$$ 1796790 1246116 1384363 1945424 2504936 2912349 3082878 2801862 2080677 1420679
45171A420679j16134K19643j45069q32754j085468o73834j5072M63514P60792
$$ 1420679 1304545 1524188 1379119 546365 -539103 -1212937 -1228009 -764495 -3703
45162c703J082311J382506J271856M71126o36062j146607o18598K51935L90623
$$ -3703 1078608 2461114 3732970 4204096 3568034 2421427 1802829 2054764 2445387
45153B445387k48885o22748r8015O53130O99364J92306l6721J66203J74502k74383
$$ 2445387 2196502 1573754 1475739 2128869 2828233 3020539 2983818 3150021 3324523 3050140
45143C050140o82252o65771m77645l92124k38867Q3773K32502M3285K6818O27756
$$ 3050140 2367888 1702117 1224472 832348 593481 677254 909756 953041 979859 1607615
45133A607615J337759J251870L75734l32037k99798o5805l60532r83083j104148
$$ 1607615 2945374 4197244 4572978 4240941 3941143 3875338 3514806 2531723 1427575
45124A427575m60363L08861N68585M49194M22510M82684K60824j64377k20736
$$ 1427575 967212 1276073 1844658 2293852 2716362 3199046 3459870 3295493 3074757
45115C074757J90114L18382l26970j012328p12191K69102N92888j51517q32994
$$ 3074757 3264871 3583253 3256283 2243955 1531764 1800866 2393754 2242237 1409243
45106A409243n22712J41518P7749n25298n99230J34010Q94864J075548Q07163
$$ 1409243 886531 1028049 1105798 580500 -18730 115280 1010144 2085692 2892855
45097B892855L51352j72718m05370L071N83051L79849o00206j159247n84450K86529
$$ 2892855 3244207 3071489 2666119 2669190 3252241 3632090 3031884 1872637 1288187 1574716
45087A574716L27880k76918n34180k02700R6262N1632j8922K2024r9365l53568
$$ 1574716 1902596 1625678 1091498 888798 985060 1036692 1017770 1039794 940429 586861
45077E86861k63007K38122M71364m8128q36531j050402n31903J78842O30145Q19465
$$ 586861 323854 561976 1033340 985212 148681 -901721 -1433624 -1254782 -624637 194828
45067A94828Q80643Q23559O40021M07962J93174k6939k77841m84689n02665k72620
$$ 194828 1075471 1899030 2539051 2947013 3140187 3113248 2835407 2350718 1848053 1575433
45057A575433M5451J69781K1116j23834L6395L91023N25895K72399r5063k75138
$$ 1575433 1620884 1790665 1811781 1687947 1724342 2115365 2641260 2913659 2818596 2543458
45047B543458l04913l63710m09882k31330J95826N55584M55096j31883o83157
$$ 2543458 2238545 1874835 1464953 1233623 1429449 1985033 2440129 2308246 1625089
45038A625089n56539K38558Q85915O86499k5656l54125j44480j74341q81805j580381
$$ 1625089 1068550 1307108 2193023 2879522 2853866 2499741 2355261 2180920 1299115 -281266
45028b81266j377158l68747O02517J013635R38175N68019P3233k24916j19441
$$ -281266 -1658424 -2027171 -1424654 -411019 527156 1095175 1168408 943492 824051
45019H24051J20006J26591L1170J56873L03209m32n93283p45469j90142N54850
$$ 824051 944057 1070648 1101818 1258691 1561900 1561468 968185 222716 32574 587424
45009E87424R82068J059045Q15222K15423l56869k75659L39868N78760R0435l12770
$$ 587424 1569492 2628537 3443759 3659182 3302313 3026654 3366522 3945282 4035717 3722947
44999C722947L0232N07018K19831n52610q44095n23670l02667m29750m09286l2967
$$ 3722947 3753179 4260197 4480028 3927418 3083323 2559653 2256986 1827236 1417950 1384983
44989A384983K61831K49962L04722O26125P81842M11358j40503l09877p4322J38570
$$ 1384983 1646814 1896776 2201498 2827623 3609465 4020823 3880320 3570443 3496121 3634691
44979C634691O0934k01273m23334n07740n12067n02940l87518k4238M10278M40200
$$ 3634691 3695625 3494352 3071018 2563278 2051211 1548271 1160753 1136515 1546793 1986993
44969A986993o3125n44840m61820l6443J60650R3700J10038J43926j58090o09126
$$ 1986993 1923868 1379028 917208 880765 1041415 1135115 1245153 1389079 1230989 621863
44959F21863o10656j60458R6932l1266J0082M64822P71623N36380J99493K14304
$$ 621863 11207 -149251 -52319 -83585 -73503 391319 1162942 1699322 1898815 2113119
44949B113119K83727L6205j57896K39043R72383J290353R16231J81905n22898
$$ 2113119 2396846 2433051 2275155 2514198 3486581 4776934 5693165 5875070 5352172
44940E352172r41777q90499m92421k23854l23820m44226k15110K35638O54288
$$ 5352172 4410395 3519896 3027475 2803621 2479801 2035575 1820465 2056103 2710391
44931B710391J039551J257331R00672P3106l34024J77751Q73054Q70388M11189
$$ 2710391 3749942 5007273 5907945 5981051 5647027 5824778 6697832 7568220 7979409
44922G979409J43920j58275r72128j666126j208033m98M67395j79024p95817o95362
$$ 7979409 8123329 7965054 6992926 5326800 4118767 4118269 4585664 4406640 3610823 2915461
44912B915461n31771p70937p33297P1860Q78046Q42778L17506Q270k53204q61762
$$ 2915461 2383690 1612753 879456 951316 1829362 2672140 2989646 2997916 2744712 1882950
44902A882950j289892p66388L11970P74418L09668k66900l04584J2917L14070
$$ 1882950 593058 -173330 138640 913058 1222726 955826 651242 664159 978229
44893I78229N37725O25489L89989p0914l23051j75755O6253R7739J6444M4013
$$ 978229 1515954 2141443 2531432 2460518 2137467 1961712 2027965 2125704 2142148 2186161
44883B186161J22943L2798k21590l56088j70698J44724K02766o4394k83549k02404
$$ 2186161 2309104 2341902 2120312 1764224 1593526 1738250 1941016 1876622 1593073 1390669
44873A390669j11849l14249l84274L78934J706529K292255J332562l94232j407910
$$ 1390669 1278820 964571 580297 959231 2665760 4958015 6290577 5896345 4488435
44864D488435j097651n7718P39914O95651j43072j107027j414721r54182l20321
$$ 4488435 3390784 3333066 4072980 4768631 4625559 3518532 2103811 1149629 829308
44855H29308N4590L19094N52792M08172j20555k73806M05034J126896Q22893l17207
$$ 829308 883898 1202992 1755784 2163956 2043401 1769595 2174629 3301525 4124418 3807211
44845C807211j114010r56135k94597K04450K13381l49684j142660j282276k61206
$$ 3807211 2693201 1737066 1442469 1646919 1860300 1510616 367956 -914320 -1175526
44836a175526J103140J481982P27438j17062m12498n13324p03204o44070k05768
$$ -1175526 -72386 1409596 2137034 2019972 1607474 1094150 390946 -253124 -458892
44827d58892J22926Q3402R7673M55031P89640P70030O07638N06327L15142Q7649
$$ -458892 -335966 -252564 -154891 300140 1089780 1859810 2467448 2973775 3288917 3376566
44817C376566K26975O73988P43188K21266j86675q127K70565K10648K02322M86637
$$ 3376566 3603541 4277529 5020717 5241983 5055308 5047181 5317746 5528394 5730716 6217353
44807F217353L82141n12155j245744q72078j26334l39216j221759j309076l47522
$$ 6217353 6599494 6087339 4841595 3969517 3843183 3503967 2282208 973132 625610
44798F25610M18922L85492L47195P69614Q92971K51960k96565J1797N36703L82261
$$ 625610 1044532 1430024 1777219 2546833 3439804 3691764 3395199 3406996 3943699 4325960
44788D325960n8839J14412O52889N53920k26481p15587n38288m22563q43720j158046
$$ 4325960 4267121 4381533 5034422 5588342 5361861 4646274 4107986 3685423 2841703 1683657
44778A683657o09617M62416J030452O67622q3306n10532m93647m15865n75248
$$ 1683657 1074040 1536456 2566908 3234530 3151224 2640692 2147045 1731180 1155932
44769A155932q50235r15134o47540j95921L04240Q42868J272057J203510M62809
$$ 1155932 305697 -609437 -1256977 -1452898 -1148658 -305790 966267 2169777 2632586
44760B632586m71327q23106l75600K61529L51972j33196n04734j58343O86007
$$ 2632586 2161259 1338153 962553 1224082 1576054 1442858 938124 779781 1465788
44751A465788J144231O51547l14602p49821l62373Q7773j15105o32629o14740
$$ 1465788 2610019 3261566 2946964 2197143 1834770 1922543 1807438 1174809 560069
44742E60069L8840N97708O17631M37138L92033K40538j91112l86087J42538Q40579
$$ 560069 598909 1196617 1814248 2251386 2643419 2883957 2692845 2306758 2449296 3289875
44732C289875O47986m58777j245637q14416K20874O04590K9948p04968q75817
$$ 3289875 3937861 3479084 2233447 1419031 1639905 2244495 2274443 1569475 693658
44723F93658n57700k10466q9782k00662m20773m91758j99161K89926N58806N22314
$$ 693658 135958 -74508 -164290 -364952 -785725 -1277483 -1476644 -1186718 -627912 -105598
44713a05598N06411N77527K75140n82076j245654q40867L39990J041855O22117
$$ -105598 400813 978340 1253480 671404 -574250 -1415117 -1075127 -33272 588845
44704E88845k12459m85563j88575J0576j16761j54221J43091M02624J99904k70744
$$ 588845 376386 -109177 -297752 -287176 -403937 -558158 -415067 -12443 187461 -83283
44694h3283l85777J30696Q41516J072692O45857P907l40160l40376k12404m8306
$$ -83283 -469060 -338364 503152 1575844 2221701 2229608 1889448 1549072 1336668 1288362
44684A288362J39608J57560j34032l77572n6696O18829P74856J13141n31053l75828
$$ 1288362 1427970 1585530 1451498 1073926 1017230 1636059 2410915 2524056 1993003 1617175
44674A617175J49901J90477o0287K88023J136596J263187J74552j002309j117360
$$ 1617175 1767076 1957553 1897266 2185289 3321885 4585072 4759624 3757315 2639955
44665B639955n91297n35780r40543q36328J3802P13507O14733J40436o8720l8359
$$ 2639955 2048658 1512878 572335 -263993 -250191 463316 1078049 1218485 1149765 1111406
44655A111406p1148j06476K5111J52719N0083j64951l18184n03024o93519m59835
$$ 1111406 1040258 933782 958893 1111612 1161695 996744 678560 175536 -517983 -977818
44645i77818L47791J008584P76259P3568m2515M58128M82423l91383j099312o89040
$$ -977818 -630027 378557 1154816 1228384 1185869 1643997 2126420 1735037 635725 -53315
44635e3315J90860L32257j52054j38916O07281J073906O27829j19308m30461m50301
$$ -53315 137545 469802 317748 178832 786113 1860019 2487848 2368540 1938079 1487778
44625A487778n50032m99970j0614N27979O24920N41853P73796J048025P08516
$$ 1487778 937746 437776 427162 955141 1580061 2121914 2895710 3943735 4652251
44616D652251j25910o84116p28218p07067p14391k73774O09374J117761P63276
$$ 4652251 4526341 3842225 3114007 2406940 1692549 1418775 2028149 3145910 3909186
44607C909186O5115l74716o99426j123719j188348m88957L99519O05041K16681
$$ 3909186 3974301 3599585 2900159 1776440 588092 99135 498654 1103695 1320376
44598A320376J0228J71912J92858o6486j21856K18416M80663K94473j12361m17689
$$ 1320376 1330604 1502516 1695374 1628888 1507032 1725448 2206111 2500584 2388223 1970534
44588A970534o27736p49715n69139n1799M42039O06866N31021M29206L80852M32963
$$ 1970534 1342798 593083 23944 -27855 414184 1021050 1552071 1981277 2362129 2795092
44578B795092N61001M49819j98195j013721j165681m29327M70472Q05811N84268
$$ 2795092 3356093 3805912 3607717 2593996 1428315 998988 1469460 2275271 2859539
44569B859539J06910n38067j127137j110580l69934L44961L60746J3941r625J91904
$$ 2859539 2966449 2428382 1301245 190665 -179269 165692 526438 540379 530754 722658
44559G22658P3824k23751l4963O25880R54776O02222K11745M05022Q64457Q21448
$$ 722658 796482 572731 537768 1163648 2118424 2720646 2932391 3337413 4201870 5023318
44549E023318N1204r41900j452512j091931o9070Q67878J035625N27596J10259
$$ 5023318 5074522 4132622 2680110 1588179 1519109 2386987 3422612 3950208 4060467
44540D060467L02328P75501P78764p213j101020j608279j064225k8979L73948
$$ 4060467 4362795 5138296 5917060 5909847 4808827 3200548 2136323 2107344 2481292
44531B481292k28517r09090o42689K64367O37771J45183l44600k01788J05331
$$ 2481292 2252775 1343685 700996 965363 1603134 1748317 1403717 1201929 1307260
44522A307260r207k38087l518M84691N42024P7350l35755l28180j05560J1641
$$ 1307260 1298053 1059966 1056448 1541139 2083163 2160513 1824758 1496578 1391018 1402659
44512A402659l8358j34755p4486L35299R42881J123028M10110p67642j420115
$$ 1402659 1364301 1229546 1155060 1490359 2433240 3556268 3966378 3198736 1778621
44503A778621j120922m15529k3006m3536j51848j84313j75594m9860K98386O72277
$$ 1778621 657699 242170 219164 175628 23780 -160533 -336127 -385987 -87601 584676
44493E84676P09277L99185J19395N7538j3119j78985o2275N09951R10676M74550
$$ 584676 1293953 1693138 1812533 1870071 1856952 1677967 1615692 2125643 3036319 3510869
44483C510869l55123m89393J88445O25321K56576j97085j31977j57302q44071
$$ 3510869 3155746 2666353 2854798 3480119 3736695 3539610 3407633 3250331 2406260
44474B406260j347764o07952P18506J040081K25239l73156k03803j18985m60304
$$ 2406260 1058496 450544 1169050 2209131 2434370 2061214 1857411 1738426 1278122
44465A278122l28722N75091J046110L17595n20111k56401N03248N16158o004l9219
$$ 1278122 949400 1524491 2570601 2888196 2368085 2111684 2614932 3131090 3125086 3085867
44455C085867K88761O5391n33698m73164J82398K41452n17804q33645j3739R07623
$$ 3085867 3374628 3440019 2906321 2433157 2615555 2857007 2339203 1505558 1491819 2399442
44445B399442P81565l107l24840J2321K92087Q5033l16958m60380k21411J60302
$$ 2399442 3181007 3177900 2853060 2865381 3157468 3242501 2925543 2465163 2243752 2404054
44435B404054K96621N3465j94275Q718N14811P32324M92318K53235L28528M17607
$$ 2404054 2700675 2754140 2559865 2568583 3083394 3815718 4308036 4561271 4889799 5307406
44425E307406J05080n81329j272414j567142j194927k89001M81590N28167R7213
$$ 5307406 5412486 4831157 3558743 1991601 796674 507673 989263 1517430 1614643
44416A614643j14209m6838k77502q70643j068736m39828M13021P35271O07590
$$ 1614643 1500434 1453596 1176094 305451 -763285 -1203113 -790092 -54821 552769
44407E52769N64429P10592P13726L60843k42279p69807p94246j73856N57597O62737
$$ 552769 1117198 1827790 2541516 2902359 2660080 1890273 1096027 922171 1479768 2142505
44397B142505J72835j77988q1480J6359j06034k8081L72167M85672O0576j63156
$$ 2142505 2315340 2137352 2055872 2072231 1966197 1938116 2310283 2795955 2856531 2693375
44387B693375L47648Q99621O42702n2803l08428k35294n60145j137994j073723
$$ 2693375 3041023 3940644 4583346 4530543 4222115 3986821 3426676 2288682 1214959
44378A214959k32974M96419N30434K09583k8803k20839m43137n76446o70493q65750
$$ 1214959 981985 1478404 2008838 2218421 2189618 1968779 1525642 949196 278703 -587047
44368e87047q64453k09366Q01841J249686Q27422K10063j5846l7069j52277j87818
$$ -587047 -1451500 -1660866 -859025 390661 1218083 1428146 1412300 1375231 1222954 1035136
44358A035136J7753K00886J90487K71731N95935P59871M33878p4717l43645m44633
$$ 1035136 1052889 1253775 1444262 1715993 2311928 3071799 3505677 3430960 3087315 2642682
44348B642682n45101l93395J89575O99049N16077j43384n06551l28313n6044K4885
$$ 2642682 2097581 1704186 1893761 2592810 3108887 2965503 2458952 2130639 2074595 2099480
44338B099480J48627M72096O88806M60641j45294q16179j258816j187166m38424
$$ 2099480 2248107 2720203 3409009 3869650 3724356 2908177 1649361 462195 23771
44329B3771O50550J285619R62700N2917n93409n40986p5942K89251L72456L53851
$$ 23771 674321 1959940 2922640 2975557 2382148 1841162 1765220 2054471 2426927 2780778
44319B780778M26137N22946L88801q3787o10488p28886l33660J37897K26138M2043
$$ 2780778 3206915 3729861 4118662 4034875 3424387 2695501 2361841 2499738 2725876 2767919
44309B767919O8688M11696O28217M30741J57215K09724L45807L3127o29758r25270
$$ 2767919 2836607 3248303 3876520 4307261 4464476 4674200 5020007 5053134 4423376 3498106
44299C498106n17222R4058L20835K21434J76136K26611J50252o1536k19603k90039
$$ 3498106 2980884 3074942 3395777 3617211 3793347 4019958 4170210 4108674 3889071 3599032
44289C599032l60085l48154r8705K75419M51449K90558n9757m16408o90076q09257
$$ 3599032 3238947 2890793 2792088 3067507 3518956 3809514 3749757 3333349 2643273 1834016
44279A834016p26683m75275q8546M13995Q27712P80058K06299l95664n02791j96677
$$ 1834016 1107333 632058 543512 957507 1785219 2565277 2771576 2375912 1873121 1676444
44269A676444O6614J36130K18280L75641M14939K57239N0921p9864j08690j6193
$$ 1676444 1743058 1879188 2097468 2473109 2888048 3145287 3196208 3116344 3007654 2991461
44259B991461P8712j13234n56601o11970J64813J113147J096327N9348q12202
$$ 2991461 3070173 2956939 2400338 1788368 1953181 3066328 4162655 4222003 3409801
44250C409801o82739o6157J26410j42002k66824l5128J92912J25774j33081l19631
$$ 3409801 2727062 2660905 2787315 2645313 2378489 2343361 2536273 2662047 2528966 2209335
44240B209335k39328J48634O29558Q17428N32626k082m35296n78987l75288J34001
$$ 2209335 1970007 2118641 2748199 3565627 4098253 4096171 3660875 3081888 2706600 2840601
44230B840601O73113Q54225N87075J26013l36723p60989r12073m80568K49727
$$ 2840601 3513714 4367939 4955014 5081027 4744304 3983315 3071242 2590674 2840401
44221B840401M63026p9278n65756k84024L01308L10535j43496j88330L41889O11463
$$ 2840401 3303427 3224149 2658393 2374369 2675677 2986212 2842716 2654386 2996275 3607738
44211C607738R9615n89365n94285Q9762P76240R70929O74386P2508o13720j031373
$$ 3607738 3707353 3117988 2523703 2613465 3389705 4360634 5035020 5107528 4493808 3462435
44201C462435q44692j26456N67998O75469J85178l23680k48700M10781J012427
$$ 3462435 2617743 2491287 3059285 3734754 3919932 3596252 3347552 3758333 4770760
44192D770760Q82810j0579r68146j132566k46710J052466J729573J253592K6228
$$ 4770760 5653570 5642991 4674845 3542279 3295569 4348035 6077608 7331200 7357428
44183G357428j081841j476910j087970k06201O09113P41017J26326m59333k45370
$$ 7357428 6275587 4798677 3710707 3504506 4113619 4854636 4980962 4521629 4276259
44174D276259M68065O69504M8007o49742p87717n86188m04102q2495M72301P55418
$$ 4276259 4744324 5413828 5461835 4812093 4024376 3438188 3034086 2951591 3423892 4179310
44164D179310L88895j72237l67721m70289r95488j574657j329675j87466J015128
$$ 4179310 4568205 4395968 4028247 3557958 2562470 987813 -341862 -529328 485800
44155D85800J618812J556886Q69360k52859r86705n07149O69960R71149j70786
$$ 485800 2104612 3661498 4530858 4277999 3291294 2784145 3454105 4425254 4254468
44146D254468j403621j204473J57789J132429Q85918J4699n32023n07068k58943
$$ 4254468 2850847 1646374 1804163 2936592 3822510 3837209 3305186 2798118 2539175
44137B539175q9594Q471J38941K41273J51980p7317j30859R9668K01656k17794
$$ 2539175 2449581 2458052 2596993 2838266 2990246 2912929 2782070 2881738 3083394 2865600
44127B865600q07552q06928j18113N16634N55271L14258L14968M84255M02407
$$ 2865600 2058048 1251120 1133007 1649641 2204912 2519170 2834138 3318393 3720800
44118C720800k7028n58339r74025j115170q06108j24201M59861N64342L59363
$$ 3720800 3693772 3135433 2161408 1046238 240130 115929 575790 1140132 1499495
44109A499495K54610L20878L42665K58273J81982J04255p9995k95138l25555j09666
$$ 1499495 1754105 2074983 2417648 2675921 2857903 2962158 2882163 2587025 2261470 2151804
44099B151804K04947M30432M13703J03243k75606l21770K5154K97997J29749j79211
$$ 2151804 2356751 2787183 3200886 3304129 3028523 2706753 2731907 3029904 3159653 2980442
44089B980442j26097J73243J66887j90096k76517K45375Q37640P92403K04488
$$ 2980442 2854345 3027588 3194475 3004379 2727862 2973237 3810877 4603280 4807768
44080D807768j87429k6117K11746q1727p65783j078062o08910J82851O10906O21959
$$ 4807768 4620339 4594222 4805968 4724241 3958458 2880396 2271486 2454337 3065243 3687202
44070C687202O20803O27432K27777n58587j039322q16995l83841k47713o2977
$$ 3687202 4308005 4935437 5163214 4604627 3565305 2748310 2364469 2116756 2053779
44061B053779O17086J215913Q03411l00570p65964k41668R2215n50072j226683
$$ 2053779 2670865 3886778 4690189 4389619 3623655 3381987 3474202 2924130 1697447
44052A697447p47052M10827Q44967L66839P4293M27251O06005P4619m40522j91168
$$ 1697447 950395 1361222 2206189 2573028 2647321 3074572 3680577 3755196 3314674 3123506
44042C123506L07899J05706o63237j004431n20448K07477N91910O19451M37562
$$ 3123506 3431405 3537111 2873874 1869443 1348995 1556472 2148382 2767833 3205395
44033C205395R6054j28482J89823R03732J166115M42095o79977j100887m71641
$$ 3205395 3301449 3172967 3362790 4266522 5432637 5874732 5194755 4093868 3622227
44024C622227M81294Q14735L15325l96471n77840j50651K75456K17540o8441o9324
$$ 3622227 4103521 4918256 5233581 4837110 4259270 4108619 4384075 4601615 4533174 4463850
44014D463850J47296J26936n8359J59726P69044R41208K76201m46776l52072K97724
$$ 4463850 4611146 4738082 4679723 4839449 5608493 6549701 6825902 6379126 6027054 6324778
44004F324778O32581M36845J11833k14527o79564j047868r55539o45842o20154
$$ 6324778 6957359 7394204 7506037 7291510 6611946 5564078 4608539 3962697 3342543
43995C342543o88252k77262L85817M27803k26811o00447j33456N51164P29018
$$ 3342543 2654291 2377029 2762846 3190649 2963838 2363391 2229935 2781099 3510117
43986C510117N04412K05345k53755q25095r60934m62267J3711l2330j11469L33211
$$ 3510117 4014529 4219874 3966119 3141024 2180090 1717823 1731534 1699204 1587735 1920946
43976A920946Q53551P19088J59939n7182J15644J24653j16512k06981q7690J462
$$ 1920946 2774497 3493585 3653524 3596342 3711986 3836639 3720127 3513146 3425456 3426918
43966C426918J86555O65947R41925L59735o52490r37091k85060K66748K5036m62286
$$ 3426918 3613473 4279420 5221345 5581080 4928590 3991499 3706439 3973187 3998223 3535937
43956C535937m42644l409L61033M84673L90500M5072l63029m72300l53613m27087
$$ 3535937 3093293 3089884 3450917 3935590 4326090 4371162 4008133 3535833 3182220 2755133
43946B755133n58809p6628R51428J402096O78499k73504l38180J49671J28608
$$ 2755133 2196324 2119696 3071124 4473220 5151719 4878215 4540035 4689706 4818314
43937D818314m55561p54238m87393j67544K521L40411P37615N59261k35446p58561
$$ 4818314 4362753 3608515 3121122 2953578 2956099 3296510 4034125 4593386 4357940 3599379
43927C599379l78558M32983Q30982O27821K26504j4692J5494K60016M64044L41264
$$ 3599379 3220821 3653804 4484786 5112607 5339111 5324419 5339913 5599929 6063973 6405237
43917F405237k9074k57096k10756j65742k85775m02491m53316o14925p85475n22134
$$ 6405237 6376163 6119067 5908311 5742569 5456794 5054303 4600987 3986062 3200587 2678453
43907B678453J63753N54936K58988q6569K16027P58170O60237M3779j00550N34235
$$ 2678453 2842206 3397142 3656130 3569561 3785588 4543758 5203995 5247774 5147224 5681459
43897E681459J108896R32146L78901J37912K27554K57649J72015J84425K63617
$$ 5681459 6790355 7722501 8101402 8239314 8466868 8724517 8896532 9080957 9344574
43888I344574J56285k16322o90513j035987j013572n32091M3021R9304m00629
$$ 9344574 9500859 9284537 8594024 7558037 6544465 6012374 6055395 6154699 5754070
43879E754070o90106k03771N50141O51974K2059o00903p40268n52373j94823L95310
$$ 5754070 5063964 4860193 5410334 6062308 6084367 5483464 4743196 4190823 3996000 4391310
43869D391310R47548Q46895O9592m67713l3256Q32828R55802Q3689p90493p46890
$$ 4391310 5338858 6185753 6255345 5787632 5754376 6587204 7543006 7626695 6836202 6089312
43859F089312r0516J39434m18293r77671o86135J83747N77000J01698m75976m08935
$$ 6089312 5998796 6138230 5719937 4742266 4056131 4239878 4816878 4918576 4442600 4033665
43849D033665j1900K8346j26916K06285R08999J041907K74147n66633o87583k86675
$$ 4033665 4021765 4050111 3923195 4129480 5038479 6080386 6354533 5787900 5100317 4813642
43839D813642J01488M71918R71573J243468Q43657k1267p40702j009632q52389
$$ 4813642 4915130 5387048 6358621 7602089 8445746 8424479 7683777 6674145 5821756
43830E821756l25778K81531L48149l49743j093190j032942l09939K60994L98602
$$ 5821756 5495978 5777509 6125658 5775915 4682725 3649783 3339844 3600838 3999440
43821C999440N51483J013266J533805J799190J711826J228590M81241j1095J58558
$$ 3999440 4550923 5564189 7097994 8897184 10609010 11837600 12318841 12307746 12466304
43812A2466304O26500O82544K55966j72800n21947j143077j875259j963841j191706
$$ 12466304 13092804 13775348 14031314 13858514 13336567 12193490 10318231 8354390 7162684
43803G162684l20128n4306k30121l72673m13427m36639l01225M593J07072j85942
$$ 7162684 6842556 6788250 6558129 6185456 5772029 5335390 5034165 5038758 5145830 4959888
43793D959888m61405k91129R7265J67801j79427n86886p36547n67666k06162J11060
$$ 4959888 4498483 4207354 4304619 4472420 4292993 3706107 2969560 2401894 2195732 2306792
43783B306792K56544M33011Q32155J078589N99714l35108o91698j29716L77360
$$ 2306792 2563336 2996347 3828502 4907091 5506805 5171697 4479999 4350283 4727643
43774D727643n6548q88052r63458k01415L88769J44649n59903j000683q58656
$$ 4727643 4671095 3783043 2819585 2618170 3006939 3151588 2591685 1591002 732346
43765G32346k87427K99505N02521L16045J46580K35348L36022K27711J35843K52385
$$ 732346 444919 744424 1246945 1562990 1709570 1944918 2280940 2508651 2644494 2896879
43755B896879K94389M8894j12168J11638K45210k27492q19582o68264L2719K58745
$$ 2896879 3191268 3240162 3127994 3239632 3484842 3257350 2437768 1769504 1802223 2060968
43745B060968k18519m73947R8261Q86760J011068M42001k15649m92101k71142
$$ 2060968 1842449 1368502 1466763 2353523 3364591 3806592 3590943 3098842 2827700
43736B827700K68137O46215M57074m5778j73111K48435O33638M77947p9184o47598
$$ 2827700 3095837 3742052 4199126 4153348 3980237 4228672 4862310 5340257 5261073 4613475
43726D613475r74488q28090j50108N12174M44540j48106k95439K07437L68055
$$ 4613475 3638987 2810897 2660789 3172963 3617503 3469397 3173958 3381395 3749450
43717C749450l85052j143550r09986j83430o7752m30056k20793O80329J251392
$$ 3749450 3364398 2220848 1310862 1127432 1059680 629624 408831 1089160 2340552
43708B340552R68923M48805K27504J9438l90047m96134P0286P86484R78125P24703
$$ 2340552 3309475 3758280 3985784 4005222 3615175 3119041 3189327 3975811 4953936 5678639
43698E678639M03821r5902r40828j565878j232003k20885L89827J78837j90565
$$ 5678639 6082460 5986558 5045730 3479852 2247849 2026964 2416791 2595628 2405063
43689B405063j43024K8405p1225j45182J88294N40718L03218k35537j94641M95647
$$ 2405063 2262039 2290444 2219219 2074037 2262331 2803049 3106267 2870730 2676089 3171736
43679C171736Q74207L96527j82791R7788R98617J437302R48584J00046m43440
$$ 3171736 4045943 4442470 4259679 4357467 5356084 6793386 7741970 7842016 7398576
43670G398576o06679n72982l54459K8331L11409K54829p186r6725J76099N85548
$$ 7398576 6791897 6218915 5864456 5892787 6204196 6459025 6451839 6355114 6531213 7116761
43660G116761O53649R0824q13134j333096j027947k32231L52827M05923Q1300
$$ 7116761 7770410 7861234 7048100 5715004 4687057 4454826 4807653 5213576 5294876
43651E294876l96001p94463p24412k3466P28445P21540M8472l38945k1561K57370
$$ 5294876 4898875 4104412 3380000 3356534 4084979 4806519 4854991 4516046 4494485 4751855
43641D751855k11627r34013r00082k4327Q15761R73051O15035K06842n47M2237
$$ 4751855 4540228 3606215 2706133 2681806 3497567 4470618 5085653 5292495 5291948 5334185
43631E334185K21946K56789L4019r7543K09079O25839M74690k47946p46347n03043
$$ 5334185 5556131 5812920 5846939 5749396 5958475 6584314 7059004 6811058 6064711 5561668
43621E561668M4605K11653J9919K4240M39032Q93938J024120R48323J041895J394851
$$ 5561668 5606273 5817926 5837845 5862085 6301117 7195055 8219175 9167498 10209393 11604244
43611A1604244J623599J234324J62943j078250j828398j823313j305585p29842
$$ 11604244 13227843 14462167 14625110 13546860 11718462 9895149 8589564 7859722
43603G859722m65751o15864q79080p01419J19122J002644J117567M12104k43309
$$ 7859722 7393971 6778107 5899027 5197608 5316730 6319374 7436941 7849045 7605736
43594G605736j20302M80599O81709J40113o26845r37945o57529j82803M7231o5395
$$ 7605736 7485434 7966033 8647742 8787855 8161010 7223065 6565536 6382733 6429964 6364569
43584F364569k81547l34075k18636j27265j05110M9963M31363P52679O79162L38904
$$ 6364569 6083022 5748947 5530311 5403046 5297936 5347899 5779262 6531941 7211103 7550007
43574G550007J94616L79155M82684J72297k38567j38882N62981J270744J369995
$$ 7550007 7744623 8123778 8606462 8778759 8540192 8401310 8964291 10235035 11605030
43565A1605030Q39599J72131n9567N04806J798359L121897L409446K159927J27327
$$ 11605030 12444629 12616760 12557193 13061999 14860358 17982255 21391701 23551628 23678955
43556B3678955j270820j339419o53353j83818k43407m87526o08009o44947p53110
$$ 23678955 22408135 21068716 20415363 20231545 19988138 19500612 18892603 18247656 17494546
43547A7494546r94556j315663j496370j236894n73741o9491j96891o07641n05269
$$ 17494546 16499990 15184327 13687957 12451063 11877322 11807831 11610940 11003299 10498030
43538A0498030J93799O22492J47367p09700r80156n14993J9632K04012K74538
$$ 10498030 10691829 11314321 11461688 10751988 9771832 9256839 9276471 9480483 9755021
43529I755021M78825O80929Q10952J107453J530161J440010M41384p58837j004119
$$ 9755021 10233846 10914775 11725727 12833180 14363341 15803351 16244735 15485898 14481779
43520A4481779j44823P81322R14512N15131K83077K84686M1209o17982j306068
$$ 14481779 14336956 15118278 16032790 16547921 16830998 17115684 17156893 16538911 15232843
43511A5232843j601398j435194r95539n65689m30524o37913q39826o22459M858
$$ 15232843 13631445 12196251 11200712 10635023 10204499 9566586 8726760 8104301 8109159
43502H109159O68689J117823J372835J451722J312157J104054J115594J344220
$$ 8109159 8777848 9895671 11268506 12720228 14032385 15136439 16252033 17596253
43494A7596253J417754J071402M41966k12804p90329j209851j332496j226352
$$ 17596253 19014007 20085409 20527375 20314571 19524242 18314391 16981895 15755543
43486A5755543j219646j427892j478050j022200l56640j67350o66232j250221
$$ 15755543 14535897 13108005 11629955 10607755 10251115 10083765 9417533 8167312
43478H167312j120497j62224Q51405J005498K66349l90092j13679P10932R36969
$$ 8167312 7046815 6884591 7735996 8741494 9007843 8617751 8504072 9215004 10151973
43469A0151973J97680o29816o82862j92737J09461J02721J78468M06670M87500
$$ 10151973 10349653 9719837 9036975 8844238 8953699 9056420 9234888 9641558 10129058
43460A0129058L73689L22709L88387L90968L47868M46109O37437P23285P39655
$$ 10129058 10502747 10825456 11213843 11604811 11952679 12398788 13036225 13759510 14499165
43451A4499165P49845M14726n49836j545848j536110m83617M20142K86148l97665
$$ 14499165 15249010 15663736 15113900 13568052 12031942 11548325 11968467 12254615 11856950
43442A1856950o30904k15788L03753N03667L20788j55571n72881l72654M36539
$$ 11856950 11226046 11010258 11314011 11817678 12138466 11982895 11410014 11037360 11473899
43433A1473899R11001K92380p54139q61821J34374R27225N86653j86898j75877
$$ 11473899 12384900 12677280 11923141 11061320 11195694 12122919 12709572 12522674 12346797
43424A2346797O46953J247495J009895L14668k73143o33471p38217l58542M26097
$$ 12346797 12993750 14241245 15251140 15565808 15292665 14659194 13920977 13562435 13988532
43415A3988532R08115N59473p9403j1889P39951J050261L51638l86758J4525J191562
$$ 13988532 14896647 15456120 15376717 15364828 16104779 17155040 17506678 17119920 17134445 18326007
43405A8326007J715152J115103M32363O09838J288350J670189J777353K103946
$$ 18326007 20041159 21156262 21588625 22198463 23486813 25157002 26934355 29038301
43397B9038301K521192K398468J666552R89580Q05032Q04096N56983K10806L23809
$$ 29038301 31559493 33957961 35624513 36614093 37419125 38223221 38780204 38991010 39314819
43388C9314819J234230K706364M049253M647411M628128M903615O228166Q360428
$$ 39314819 40549049 43255413 47304666 51952077 56580205 61483820 67711986 76072414
43380G6072414J0603494J2989405J6244179K0651621K5869991L1956354L9090581
$$ 76072414 86675908 99665313 115909492 136561113 162431104 194387458 233478039
43373B33478039M5140124M4614950L2355570R221203j6714461l5521376m2167980
$$ 233478039 278618163 323233113 355588683 364809886 348095425 312574049 270406069
43366B70406069l8513115k9932661k0781803j2472024m556722L295862J0691424
$$ 270406069 231892954 201960293 181178490 168706466 164149744 167445606 178137030
43359A78137030J7447125K3896427K9028850K8831495J8748219p57329k2187497
$$ 178137030 195584155 219480582 248509432 277340927 296089146 295331817 273144320
43352B73144320l6357399l9775744l5859578k9703739k3691174j8193373j3858282
$$ 273144320 236786921 197011177 161151599 131447860 107756686 89563313 75705031
43345G5705031j1319082r828606q058534n979100m626655m209357l729461k573526
$$ 75705031 64385949 54557343 46498809 40519709 35893054 31683697 27954236 25380710
43337B5380710j365420r19872j165776j456380j346645p72485O0294P34961R64396
$$ 25380710 24015290 23095418 21929642 20473262 19126617 18354132 18414426 19149387 20113783
43328B0113783J010864J412687K272309L217462L995299M561037M637732L881956
$$ 20113783 21124647 22537334 24809643 28027105 32022404 36583441 41221173 45103129
43320D5103129K555864J304292J16906j675500m066410n884172o174587n356008
$$ 45103129 47658993 48963285 49080191 47404691 43338281 37454109 31279522 25923514
43312B5923514m365656l338291j978428p26557m73275j194025j816136j614306
$$ 25923514 21557858 18219567 16241139 15514582 15041307 13847282 12031146 10416840
43304A0416840r98876o64943n99775l47938J61820N33656M95529K05420k5749
$$ 10416840 9417964 8753021 8153246 7805308 7967128 8500784 8996313 9201733 9175984
43295I175984p4913j1520Q3961J79476K09516Q6196j33316k21887p9923M9318
$$ 9175984 9101071 9089551 9173512 9352988 9562504 9648700 9515384 9293497 9213574 9262892
43285I262892j11988m30092n20596l20675j15778N4848N42028J396273J984476
$$ 9262892 9150904 8720812 8200216 7879541 7763763 7818611 8360639 9756912 11741388
43276A1741388J748759J099771J048804J993571L313657M255090M793888N290059
$$ 11741388 13490147 14589918 15638722 17632293 20945950 25201040 29994928 35284987
43268C5284987N483935M371668J408154k398538n121658n764323n035711m117059
$$ 35284987 40768922 45140590 46548744 44150206 39028548 33264225 28228514 24111455
43260B4111455l289598k292878j385365j073742j080410o72953o708k0008p99414
$$ 24111455 20821857 18528979 17143614 16069872 14989462 14316509 14309801 14289793 13490379
43251A3490379j206943n89462K22542K61076k18300m85031n31561o20798m55868
$$ 13490379 12283436 11693974 11916516 12177592 11959292 11474261 10942700 10321902 9866034
43242I866034J54949M83335j32737j014199j019804k75717J80641J24963J84221
$$ 9866034 10020983 10504318 10371581 9357382 8337578 8061861 8242502 8367465 8551686
43233H551686L66091J8574o62380n38134O75367J772031J744028J039812N62623
$$ 8551686 8917777 8936351 8273971 7735837 8411204 10183235 11927263 12967075 13529698
43224A3529698L67865L5035m09133o18942m76108l0830O28353J127500R96901
$$ 13529698 13897563 13932598 13523465 12904523 12428415 12397585 13025938 14153438 15150339
43215A5150339L97571M5223J67910K70832J98958N20868J385205J932628J549487
$$ 15150339 15547910 15593133 15761043 16031875 16230833 16751701 18136906 20069534 21619021
43206B1619021R03476R18602J397751J559244J409082J625383K397788L250749
$$ 21619021 22522497 23441099 24838850 26398094 27807176 29432559 31830347 35081096
43198C5081096L835194M180846M355444M518089N112492O443632Q321649J0615596
$$ 35081096 38916290 43097136 47452580 51970669 57083161 63526793 71848442 82464038
43190H2464038J3718676J7901409K2843742K8563313L5777622M3570756M7007600
$$ 82464038 96182714 114084123 136927865 165491178 201268800 244839556 291847156
43183B91847156L9469812J8941396q565613l2709125m5930099m7307946m1037098
$$ 291847156 331316968 350258364 341692751 308983626 263053527 215745581 174708483
43176A74708483l2447397k4984730j9462739j5208100j1701047r105711p500190
$$ 174708483 142261086 117276356 97813617 82605517 70904470 61798759 54298569
43169E4298569o318119m987306l703261l014523k850843k537031j740804q77336
$$ 54298569 47980450 42993144 39289883 36275360 33424517 30887486 29146682 28269346
43161B8269346m53369m39651m94510m55797l23243j490N86933J235173J620359
$$ 28269346 27815977 27376326 26881816 26426019 26102776 26101286 26688219 27923392 29543751
43152B9543751J715446J765826J899666K083377K439177L180508M150830M907058
$$ 29543751 31259197 33025023 34924689 37008066 39447243 42627751 46778581 51685639
43144E1685639N448517O320034P649015Q651544Q631360P953275P351007O760154
$$ 51685639 57134156 63454190 71103205 79754749 88386109 96339384 103690391 110450545
43136A10450545N705737M461541L809173L917041M581258O358164J0139804J5724713
$$ 110450545 116156282 120617823 124426996 128344037 132925295 139283459 149423263 165147976
43128A65147976K2276665K9840226L7846200M1557292L3416928J1033114j7455005
$$ 165147976 187424641 217264867 255111067 296668359 330085287 341118401 323663396
43121C23663396l8948958m6394119m2675197l4744197k7018597k0696260j5984220
$$ 323663396 284714438 238320319 195645122 160900925 133882328 113186068 97201848
43114I7201848j2628963r681953o662455m399099l608588l387329k266608j83809
$$ 97201848 84572885 74890932 68228477 63829378 60220790 56833461 54566853 54383044
43106E4383044J716033K820755L490530L961738L843263K805123J083497p71959
$$ 54383044 56099077 58919832 62410362 66372100 70215363 73020486 74103983 73332024
43098G3332024k152336k435715j356343M88474J791199J378083r94112m386415
$$ 73332024 71179688 68743973 67387630 67876104 69667303 71045386 70051274 65664859
43090F5664859p124719p927974o947989n474571m419970l459322j917436J0909
$$ 65664859 58540140 50612166 43664177 38189606 33769636 30310314 28392878 28403787
43082B8403787J481256K148799K502410L123429M080433N048140N621830N448599
$$ 28403787 29885043 32033842 34536252 37659681 41740114 46788254 52410084 57858683
43074E7858683M369630K625146Q58340k02210k47554K47337L09478n43793j656208
$$ 57858683 62228313 64853459 65711799 65509589 65262035 65509372 65818850 65275057 63618849
43065F3618849j935855j106817K34741J656068L148392M259034L984716K065230
$$ 63618849 61682994 60576177 60810918 62466986 65615378 69874412 73859128 75924358
43057G5924358m33099k458720m120240n728389o542837n692119l881794k818143
$$ 75924358 75491259 73032539 68912299 63183910 56641073 50948954 47067160 44249017
43049D4249017k952609l046614k196450j109457q46660j273164j527884j401775
$$ 44249017 41296408 38249794 36053344 34943887 34097227 32824063 31296179 29894404
43041B9894404j401145j705181j821010j336470n26127k5499j24404n39693q33740
$$ 29894404 28493259 26788078 24967068 23630598 23104471 23078972 22954568 22414875 21581135
43032B1581135r29071j077765j331715j319736p80046q0861J95652J01892K90560
$$ 21581135 20652064 19574299 18242584 16922848 16142802 16061941 16257593 16359485 16650045
43023A6650045J065592J916643K203193J926516J507010J054230K83992q44806
$$ 16650045 17715637 19632280 21835473 23761989 25268999 26323229 26607221 25762415
43015B5762415j769174j824927j010535j7486N57109Q03785J119343J488157J607393
$$ 25762415 23993241 22168314 21157779 21140293 21697402 22501187 23620530 25108687 26716080
43006B6716080J652284K264009L533924M624223M885073M839029N395937O438547
$$ 26716080 28368364 30632373 34166297 38790520 43675593 48514622 53910559 60349106
42998F0349106O941089O301823M764054K595212k36349l358259n794365o906975
$$ 60349106 67290195 73592018 78356072 80951284 80714935 77356676 71562311 64655336
42990F4655336o989480o570336n694935m344692l041129k396862k304584k103020
$$ 64655336 57665856 51095520 45400585 41055893 38014764 35617902 33313318 31210298
42982C1210298j422471m48444N20086J340147J897624K102628K076055K103309
$$ 31210298 29787827 29339383 29859469 31199616 33097240 35199868 37275923 39379232
42974C9379232K365874K849815L441644L941362M071684L673087K827478J642146
$$ 39379232 41745106 44594921 48036565 51977927 56049611 59722698 62550176 64192322
42966F4192322P2903j769008l256793l608669k749140j557588j049160j392551
$$ 64192322 64265225 62496217 59239424 55630755 52881615 51324027 50274867 48882316
42958D8882316j874496j761225j012855j29428M92335Q40978J027036J067227
$$ 48882316 47007820 45246595 44233740 44104312 44596647 45437625 46464661 47531888
42950D7531888J062733J338363K165084L481630N074574O825269Q540013R865169
$$ 47531888 48594621 49932984 52098068 55579698 60654272 67479541 76019554 85884723
42942H5884723J0862044J2408343J5299802J8996450K2112433K4281723K6392309
$$ 85884723 96746767 109155110 124454912 143451362 165563795 189845518 216237827
42935B16237827K8249461K7144695K0422222R418481p08776n849849o841834p854715
$$ 216237827 244487288 271631983 292054205 301472686 300763910 294914061 288072227 280217512
42927B80217512j1633976j7265997k2113387k4562346k4593178k2871456k0263401
$$ 280217512 268583536 251317539 229204152 204641806 180048628 157177172 136913771
42920A36913771j7776252j5995419j4513436j2519037j0011893p885930o714253
$$ 136913771 119137519 103142100 88628664 76109627 66097734 58211804 51497551
42913E1497551o046187n172829m059171l118918k482286j965231j483357j020841
$$ 51497551 45451364 40278535 36219364 33100446 30618160 28652929 27169572 26148731
42905B6148731l90197N06359J303798J486112R71854M7996j062370k131864k684904
$$ 26148731 25758534 26264893 27568691 29054803 30026657 30074653 29012283 26880419 24195515
42896B4195515k418406j734729j252775q91332q5706J170932K241980K768023
$$ 24195515 21777109 20042380 18789605 17898273 17812567 18983499 21225479 23993502
42888B3993502K832730K180020L18269k248827l928108l813883k759140k025322
$$ 23993502 26826232 29006252 29324521 27075694 23147586 19333703 16574563 14549241
42880A4549241j665984j061103l03731J4676o9228p0892p5635m80484q79113l81903
$$ 14549241 12883257 11822154 11518423 11533099 11463871 11392979 11317344 10836860 9957747 9575844
42870I575844Q56003J562454J134997M92135O40186J269967J470510J187732J170488
$$ 9575844 10431847 11994301 13129298 13621433 14261619 15531586 17002096 18189828 19360316
42861A9360316J810395K756553L508688L748886L155568J547752n98593k247303
$$ 19360316 21170711 23927264 27435952 31184838 34340406 35888158 35289565 33042262
42853C3042262k742733k463676k294431k559040k757999k388780j724835j489291
$$ 33042262 30299529 27835853 25541422 22982382 20224383 17835603 16110768 14621477
42845A4621477j847423k110513j609625n78652J31311P7932l45355m74787q4757
$$ 14621477 12774054 10663541 9053916 8475264 8606575 8684507 8339152 7864365 7779608
42836G779608N17922Q92658Q60951O14590N10802P54481J283478J907634K430576
$$ 7779608 8297530 9190188 10051139 10665729 11176531 11931012 13214490 15122124 17552700
42827A7552700K672964K586685K327547J950070J116845l90073j844372j991947
$$ 17552700 20225664 22812349 25139896 27089966 28206811 27816738 25972366 23980419
42819B3980419o46068Q32289J215990R13200R95274J314866P27215j019954k794194
$$ 23980419 23334351 24166640 25382630 26295830 27291104 28605970 29333185 28313231 25519037
42810B5519037l604843l600575l278357k655015j697385q27854m52047m57461
$$ 25519037 21914194 18313619 15035262 12380247 10682862 9855008 9402961 8945500
42802H945500n41382n63802l20810M35600J406507J760649J153501K26602k79592
$$ 8945500 8404118 7840316 7519506 7955106 9361613 11122262 12275763 12502365 12222773
42793A2222773l71538l74157k61737N1369K66023J32430o2241L4515K63119L45929
$$ 12222773 11851235 11477078 11215341 11266710 11532733 11665163 11602922 11637437 11900556 12246485
42783A2246485M40590P38939Q97223M80199l07558q88628j054608r64380p27530
$$ 12246485 12687075 13426014 14323237 14803436 14495878 13607250 12552642 11588262 10860732
42774A0860732m81178n16331q04087p82333j48787N81075Q83216J046838J480022
$$ 10860732 10379554 9863223 9059136 8276803 8128016 8709091 9592307 10639145 12119167
42765A2119167J786172J428407P79408M90321L17373k60083p42199l41962L32547
$$ 12119167 13905339 15333746 16113154 16603475 16920848 16660765 15918566 15576604 15909151
42756A5909151j7859j090231j220204j45377M26265l38751r40527o9040J159752
$$ 15909151 15891292 14801061 13580857 13435480 13861745 13522994 12582467 12513427 13673179
42747A3673179J042298j5057m34834j23254k47872r17015j036768l58150J34277
$$ 13673179 14715477 14700420 14265586 14142332 13894460 12977445 11940677 11582527 11716804
42738A1716804L4531Q8060O07507Q07664K69997k25712m175M77866O27182P39933
$$ 11716804 11751335 11839395 12446902 13254566 13524563 13298851 13294676 13772542 14399724 15139657
42728A5139657J208452J563574J261824P97578J044494J893948K487895K556926
$$ 15139657 16348109 17911683 19173507 19971085 21015579 22909527 25397422 27954348
42720B7954348K618418K921971L032778K554654J601351M30715q07027j819118
$$ 27954348 30572766 33494737 36527515 39082169 40683520 41114235 40307208 38488090
42712C8488090k235651k169147k242692k754944l183005k874721j986966j330353
$$ 38488090 36252439 34083292 31840600 29085656 25902651 23027930 21040964 19710611
42704A9710611j353579j647413j546796r69800m49417m14967o86999q02092o70857
$$ 19710611 18357032 16709619 15162823 14193023 13743606 13328639 12641640 11839548 11168691
42695A1168691o34629q49615r35683m87841K42773N43860J56921l19128j52934
$$ 11168691 10534062 9684447 8748764 8260923 8503696 9047556 9204477 8885349 8732415
42686H732415N51820R10407L36670o69856j064366n20530J87700K35995j40436
$$ 8732415 9284235 10194642 10531312 9861456 8797090 8276560 8464260 8700255 8559819
42677H559819q960R22099J883910K080746J590504R20516J94050o52549j218325
$$ 8559819 8550859 9472958 11356868 13437614 15028118 15948634 16142684 15490135 14271810
42668A4271810r40769j8050O50074N69908J29325j73745l45441m56766k40299
$$ 14271810 13331041 13312991 13963065 14532973 14662298 14488553 14143112 13686346 13446047
42659A3446047L63338P60372M42605j53562j87681L98189R35139J171623J594394
$$ 13446047 13809385 14569757 15012362 14858800 14671119 15069308 16004447 17176070 18770464
42650A8770464K496756L447482L982179M232985M466879M422590L542938J652491
$$ 18770464 21267220 24714702 28696881 32929866 37396745 41819335 45362273 47014764
42642D7014764q47376l208357m611719m642598l787796l083088k956507k829133
$$ 47014764 46167388 42959031 38347312 33704714 29916918 26833830 23877323 21048190
42634B1048190k181630j444501j253158j352453j072826n52085m98472q43160
$$ 21048190 18866560 17422059 16168901 14816448 13743622 13191537 12693065 11849905
42626A1849905o98321J46569P02684K23755o62311q81131l33605K82696N73606
$$ 11849905 11151584 11298153 12000837 12224592 11562281 10681150 10347545 10630241 11203847
42617A1203847O29465M42209p1597n69750n00448J30209P31226R18455Q84075
$$ 11203847 11833312 12275521 12203924 11634174 11133726 11263935 11995161 12913616 13797691
42608A3797691R29604J050539J066234Q24564K49189m88152q80299n84812j5J46437
$$ 13797691 14727295 15777834 16844068 17668632 17917821 17429669 16549370 15964558 15964543 16110980
42598A6110980j71522k41461K18488N25321J18638m01660n2538J028220J702184
$$ 16110980 15939458 15697997 15916485 16441806 16560444 16158784 16106246 17134466 18836650
42589A8836650J454252J053648J293887J832351J900766J640198J866616K679180
$$ 18836650 20290902 21344550 22638437 24470788 26371554 28011752 29878368 32557548
42581C2557548L247551L201261L358826M499206O048870O798564O582386O341274
$$ 32557548 35805099 39006360 42365186 46864392 52913262 59711826 66294212 72635486
42573G2635486O587347O760640O383962O017745O506594P836182R384700J0984967
$$ 72635486 79222833 85983473 92367435 98385180 104891774 112727956 122112656 133097623
42565A33097623J3029215J5437480J6883141J5242862R064937q62124j1233107
$$ 133097623 146126838 161564318 178447459 193690321 202755258 201893134 190660027
42558A90660027j8191379k0239447j9048490j7153919j5414135j3230116j0470888
$$ 190660027 172468648 152229201 133180711 116026792 100612657 87382541 76911653
42551G6911653p972653o293067n127396m161257l551880l237015k617846j426332
$$ 76911653 68939000 62645933 57518537 53357280 49805400 46568385 43950539 42524207
42543D2524207k73896J81450J53411L52663J058008J962195K658935K984195L141660
$$ 42524207 42250311 42431761 42585172 42937835 43995843 45958038 48616973 51601168 54742828
42534E4742828L667846M931530O578912P971939R253727J1274521J4284443J7593123
$$ 54742828 58410674 63342204 69921116 77893055 87146782 98421303 112705746 130298869
42526A30298869K0792951K3930014K5462601K1547792R689006o925977k0778946
$$ 130298869 151091820 175021834 200484435 222032227 231721233 224795256 204016310
42519B04016310k6597745k5498275k2137174j9311626j6634103j3309741j0033135
$$ 204016310 177418565 151920290 129783116 110471490 93837387 80527646 70494511
42512G0494511p864221o752745n979686n242913m556825l640618k252599q98549
$$ 70494511 62630290 55877545 49897859 44654946 40098121 36457503 34204904 33306355
42504C3306355m01130p55957j135251j150857j339306k028920k513813k091624
$$ 33306355 32905225 32149268 31014017 29863160 28523854 26494934 23981121 21889497
42496B1889497j349089j398463k068584k012920p82171L48270J73058p57241j055307
$$ 21889497 20540408 19141945 17073361 15060441 14278270 14626540 14799598 14042357 12987050
42487A2987050m30173K49734M21303L28848J64595l06054j056733j507286j265865
$$ 12987050 12556877 12806611 13227914 13556762 13721357 13415303 12358570 10851284 9585419
42478I585419o56658k14720n3994J1676P8411J59584L20959N53580O76446N54588
$$ 9585419 8928761 8714041 8660047 8671723 8750134 8909718 9230677 9784257 10460703 11015291
42468A1015291L18386K75767O65996J431098K069621J868770O30211q80972j602919
$$ 11015291 11333677 11609444 12275440 13706538 15776159 17644929 18275140 17394168 15791249
42459A5791249j329780q17387o86586o95208l24963L40981P42759O45273M04294
$$ 15791249 14461469 13644082 12957496 12262288 11937325 12278306 13021065 13666338 14070632
42450A4070632M19459N92461M53617k44140j148363j588744j253148n00881N4448
$$ 14070632 14490091 15082552 15536169 15292029 14143666 12554922 11301774 10800893 10855341
42441A0855341J62740M6763M0937K74952N91738O28678J33240o41326j060289
$$ 10855341 11018081 11064844 11105781 11380733 11972471 12601149 12734389 12093063 11032774
42432A1032774q31287l56322j06095L8806M30347R44644J175222J162688J364825
$$ 11032774 10201487 9845165 9739070 9777876 10208223 11152867 12328089 13490777 14855602
42423A4855602J955872K643944L114626L194082K705038J678363N65499k88107
$$ 14855602 16811474 19455418 22570044 25764126 28469164 30147527 30713026 30424919
42415C0424919j142541k199967k786255k110523o05459N76421J249106K049753
$$ 30424919 29282378 27082411 24296156 22185633 21580174 22156595 23405701 25455454
42407B5455454K604876J533128j140250l208699k989770j490612o44946n86047
$$ 25455454 28060330 29593458 28453208 25244509 22254739 20764127 20119181 19533134
42399A9533134k15039M66875N08200J19693O93807K448310L622530K627734n6044
$$ 19533134 19318095 19784970 20293170 20412863 21106670 23554980 27177510 29805244 29749200
42390B9749200k646602l890694l703020k744133j894636j685135j856634j732208
$$ 29749200 27102598 23211904 19508884 16764751 14870115 13184980 11328346 9596138
42382I596138j079338k54464L89994P06238M97974k37868q69629o92987L1723
$$ 9596138 8516800 8262336 8652330 9358568 9856542 9618674 8749045 8056058 8087781
42373H087781L71797J00251p4328K04654L78186O5018j63793L19164J168325J517258
$$ 8087781 8459578 8559829 8485501 8690155 9068341 9133359 8969566 9288730 10457055 11974313
42363A1974313J033595Q8341p41349j009087o39881j00570O3772j6930K08717
$$ 11974313 13007908 13096249 12354900 11345813 10705932 10605362 10669134 10652204 10860921
42354A0860921O48793N65123j30884n17371p6968M49357K95806j15579o6168J29397
$$ 10860921 11509714 12074837 11943953 11426582 11349614 11798971 12094777 11979198 11913030 12042427
42344A2042427k33240q29637p36519k145M09555J90956N2829L57466M75700p2018
$$ 12042427 11809187 10979550 10243031 10240886 10650441 10841397 10894226 11251692 11727392 11655374
42334A1655374o96177n32482M02936J383270J922999K077679K006213J663650
$$ 11655374 10959197 10426715 10829651 12212921 14135920 16213599 18219812 19883462
42326A9883462R31436j45720j274378k043747k215742j891493j355429q53231
$$ 19883462 20814898 20669178 19394800 17351053 15135311 13243818 11888389 11035158
42318A1035158n69329n86896p06114n70760k07033j10969m63626o43356o5379
$$ 11035158 10465829 9878933 9172819 8602059 8395026 8284057 7820431 7177075 7111696
42309G111696P84271Q59284O431q10805q09745k34624K64401M51137M01986J45617
$$ 7111696 7895967 8755251 8761682 7950877 7141132 6906508 7170909 7622046 8024032 8169649
42299H169649j80124k05975K04240O05591M50787k22649q32782q49736j94446
$$ 8169649 7989525 7783550 7987790 8593381 9044168 8821519 7988737 7139001 6944555
42290F944555P53958J365711J187067L84769l75206o45628o09861o25716o29593
$$ 6944555 7698513 9064224 10251291 10636060 10260854 9615226 9005365 8379649 7750056
42281G750056l15841K32280M74778N7339p06995j131844q44665r0584N83969Q06765
$$ 7750056 7434215 7666495 8141273 8198612 7491617 6359773 5515108 5424524 6008493 6815258
42271F815258N17538j49333q61902j075300m50402N73454J035850N72805r1520
$$ 6815258 7332796 7183463 6321561 5246261 4795859 5369313 6405163 6977968 6886448
42262F886448j46629K02905K01913k15789m33437k87310l09419o72898p60966
$$ 6886448 6739819 6942724 7144637 6928848 6495411 6208101 5898682 5225784 4464818
42253D464818k11230L33695J20288n84173r11810o12409j83349L7846K31328N19248
$$ 4464818 4253588 4587283 4707571 4123398 3211588 2599179 2415830 2453676 2685004 3204252
42243C204252O30042L68173L9704J11733N94479R98072R04455M21958m4549l81412
$$ 3204252 3834294 4202467 4242171 4353904 4948383 5946455 6850910 7272868 7228319 6846907
42233F846907q33137j374643j406652n09643P38892J297829R54883M52880L05569
$$ 6846907 6013770 4639127 3232475 2722832 3461724 4759553 5714436 6167316 6472885
42224F472885K39499J394j14320K9553l0300m93007p04303j87032L79300J22557
$$ 6472885 6712384 6713778 6599458 6629011 6598711 6105704 5401401 5214369 5593669 5716226
42214E716226o00476p97613m64717m03716o07620k00649Q46771J311447N54229
$$ 5716226 5115750 4318137 3853420 3449704 2842084 2641435 3488206 4799653 5353882
42205E353882m08070m15073K09123M27220J37353L6880L06873M55637K84237J05490
$$ 5353882 4945812 4530739 4739862 5167082 5304435 5341315 5648188 6103825 6388062 6493552
42195F493552K6906k14038o23136p89312m79102P5373N43149P48231N88699J49750
$$ 6493552 6520458 6306420 5683284 4893972 4414870 4490243 5033392 5781623 6370322 6520072
42185F520072j37665P2105M76648M94131J47694k1043P8544m7955m60664m48154
$$ 6520072 6382407 6454512 6931160 7425291 7572985 7551942 7630486 7582531 7121867 6673713
42175F673713L27241J052257Q07186j04551o26397m33358j43613j86581k96711
$$ 6673713 7000954 8053211 8860397 8755846 8129449 7696091 7552478 7365897 7069186
42166G069186k15885j20699q9749J78784P27086R75553M97834k49533n02555k00344
$$ 7069186 6853301 6732602 6642853 6821637 7548723 8524276 9022110 8772577 8270022 8069678
42156H069678J24787K37500L49565M65744K65690k19975m18513o271N53799O27406
$$ 8069678 8194465 8431965 8781530 9247274 9512964 9292989 8874476 8868205 9422004 10049410
42146A0049410K47708k7610J19407M95760P42060O23999Q5163o81337j264000
$$ 10049410 10297118 10269508 10388915 10884675 11626735 12250734 12335897 11654560 10390560
42137A0390560j385746j171743q71459m67335J46319P36416Q87017N73367K03882
$$ 10390560 9004814 7833071 6961612 6494277 6640596 7377012 8264029 8837396 9041278
42128I041278L2804j20281m50636p74116p35870k47431L94428P27566M84918j21155
$$ 9041278 9074082 8953801 8503165 7729049 6993179 6745748 7140176 7867742 8352660 8231505
42118H231505n69398o60933p49737j023350r24542K5405J067720Q83442m39671
$$ 8231505 7662107 7001174 6251437 5228087 4303545 4328950 5396670 6280112 5840441
42109E840441j219787m68898O69340O11521m04045q77055k86821N10944Q59628
$$ 5840441 4620654 4151756 4821096 5432617 5028572 4151517 3864696 4375640 5235268
42100E235268R34344P70507p349j130326j531436q17039N4582J70413j27958j17002
$$ 5235268 6169612 6940119 6932770 5802444 4271008 3453969 3508551 3678964 3551006 3434004
42090C434004N6168j20007l97820j57838M46458O94166M55385K55676K77904J60135
$$ 3434004 3490172 3370165 2972345 2814507 3260965 3955131 4410516 4666192 4944096 5104231
42080E104231j86687l66944k40422j62331k98384l41546j31454M2157J9373R3421
$$ 5104231 4917544 4550600 4310178 4147847 3849463 3507917 3376463 3418620 3437993 3531414
42070C531414M24326O25804L36779j83048m44902m20225m13289m53534k66287
$$ 3531414 3955740 4581544 4918323 4735275 4290373 3870148 3456859 3003325 2737038
42061B737038J90332N26351L59551k10317o51462n13976Q5118N29298L58532j95647
$$ 2737038 2927370 3453721 3813272 3602955 2951493 2437517 2522635 3051933 3410465 3214818
42051C214818n01486k94122J01840K95016K45280Q5039j37238l41839l03662R3238
$$ 3214818 2713332 2419210 2521050 2816066 3061346 3146385 3009147 2667308 2363646 2456884
42041B456884O05409Q34486O51097L14559J77821K88933L04305q1061o04412o30848
$$ 2456884 3062293 3896779 4547876 4862435 5040256 5329189 5633494 5552433 4948021 4317173
42031D317173n0121M10309J49215m21903n29349k09872l2315P9118O62640J373628
$$ 4317173 4267052 4677361 4826576 4404673 3875324 3665452 3633137 3712255 4374895 5748523
42021E748523J109849j13123o97879K95418J541996J246320k45916j019948l96677
$$ 5748523 6858372 6745249 6047370 6342788 7884784 9131104 8885188 7865240 7468563
42012G468563K99796j21914j109557j381112o53332K51426N32542J53236l13007
$$ 7468563 7768359 7646445 6536888 5155776 4502444 4753870 5286412 5439648 5126641
42003E126641l05348J39675M16339J40239k73245j96354K47698L65133m8376m43484
$$ 5126641 4821293 4960968 5377307 5517546 5244301 5047947 5295645 5660778 5612402 5168918
41993E168918l59195M6755M18096O24224O30747M31576K58025M22233Q20301R71113
$$ 5168918 4809723 4856478 5274574 5898798 6529545 6961121 7219146 7641379 8461680 9432793
41983I432793O12530j00210r12305j502944j351845k82626Q82484J026398K22042
$$ 9432793 10045323 9945113 9032808 7529864 6178019 5895393 6777877 7804275 8026317
41974H026317l27950n3874K19834k75245r58156p85739K23976J131886J306636
$$ 8026317 7698367 7644493 7864327 7589082 6630926 5845187 6069163 7201049 8507685
41965H507685Q43740J40145l28570j72436L72062M37199l42633j115085r13697
$$ 8507685 9351425 9491570 9163000 8990564 9362626 9799825 9457192 8342107 7428410
41956G428410m9089M33674L27940K87936M41332J19803q19817j427661r21041
$$ 7428410 7379321 7812995 8140935 8428871 8870203 8990006 8170189 6742528 5821487
41947E821487J84594P47093L44928n10772j153484j290547r79254n01637k07743
$$ 5821487 6006081 6753174 7098102 6587330 5433846 4143299 3164045 2662408 2454665
41938B454665k18992l14227k36596m062K10262L64341N28537O51913N39668J12983
$$ 2454665 2235673 1921446 1684850 1680788 1891050 2255391 2783928 3435841 3975509 4088492
41928D088492l97604o09660l75439L1394J97939K6867k02569k19858m4279J47268
$$ 4088492 3690888 3081228 2705789 2737183 2935122 2961989 2759420 2539562 2495283 2642551
41918B642551K37295J82885R941j28076q9792q060j56098m78549n89862l77535
$$ 2642551 2879846 3062731 3072672 2944596 2854804 2846744 2690646 2212097 1622235 1244700
41908A244700k18181l52516m40952j03057M20191N67753K22605j99955k79898
$$ 1244700 1026519 674003 233051 129994 550185 1117938 1340543 1140588 860690
41899H60690P4447O20420Q62373M31536l38818n93341n6513N00072L63006o8660
$$ 860690 935137 1555557 2417930 2849466 2510648 1917307 1860794 2360866 2723872 2655212
41889B655212k4912L03534J10270n82886q64697l58746K78303N10869O46157R72477
$$ 2655212 2630300 2933834 3044104 2461218 1596521 1237775 1516078 2026947 2673104 3645581
41879C645581R89474J62806j041750j549969r26409K32371J047473J156463Q15175
$$ 3645581 4635055 4797861 3756111 2206142 1279733 1512104 2559577 3716040 4531215
41870D531215M70234L06365J90352L6140L6830L33442O31223M96419k8677m52706
$$ 4531215 5001449 5307814 5498166 5534306 5571136 5904578 6535801 7032220 7003543 6550837
41860F550837m57178j88551K4664m5058m28687q36670p75846j46202M64810M96721
$$ 6550837 6093659 5905108 5929772 5884714 5456027 4619357 3843511 3697309 4162119 4658840
41850D658840J95772J74806M37856M76565J63232j48642l04319m16323l59262
$$ 4658840 4854612 5029418 5467274 5943839 6107071 5958429 5654110 5237787 4878525
41841D878525L0420L36738Q093o07592o04008O2230M83679K51710p0047j28708
$$ 4878525 4908945 5245683 5253776 4646184 4042176 4104406 4588085 4839795 4769748 4641040
41831D641040k86372n82214l90185L36124O47896J37380k36907K81992R29562
$$ 4641040 4354668 3772454 3382269 3718393 4366289 4503669 4266762 4548754 5478316
41822E478316O99793j3891k45039j22391l96024q79452p52175j04902J45299k14350
$$ 5478316 6178109 6164218 5919179 5796788 5400764 4521312 3769137 3664235 3809534 3595184
41812C595184m37958j20168L05602M59412M74674M37581J78380k30753m33123
$$ 3595184 3157226 3037058 3342660 3802072 4276746 4714327 4892707 4661954 4228831
41803D228831l23935q4304K33984N72114N08560k39031j105058j232078o35901
$$ 4228831 3904896 3820592 4054576 4626690 5135250 4896219 3791161 2559083 1923182
41794A923182o9391J43993L15066N17075M12182M380k71454l23241n00603q18054
$$ 1923182 1853791 1997784 2312850 2829925 3242107 3246487 2975033 2651792 2151189 1333135
41784A333135q24197l79464J10341L41093L77093K70444O3594J00236N99848J019418
$$ 1333135 508938 129474 239815 580908 958001 1228445 1292039 1392275 1992123 3011541
41774C011541O69455j24140m03727o3760R5071j87418k89687J7077J48359j22488
$$ 3011541 3680996 3556856 3153129 3089369 3184440 2997022 2707335 2724412 2872771 2750283
41764B750283k38579l65M1529k02639m605P11314Q46801m9557o99607K049J069830
$$ 2750283 2511704 2511339 2552868 2350229 2345624 3056938 3903739 3854182 3154575 3156624 4226454
41753D226454Q17756n68468j349003p57435K03282M38791K8220l34804k39853
$$ 4226454 5044210 4475742 3126739 2369304 2572586 3011377 3039597 2704793 2464940
41744B464940K84560Q45748Q42365P9776q20785j100129p52780k58429K09844
$$ 2464940 2749500 3595248 4437613 4517389 3696604 2596475 1843695 1585266 1795110
41735A795110O48047O83094L9850o90210o64521n5329K18461m3000j28279K35370
$$ 1795110 2443157 3126251 3166101 2475891 1811370 1756041 1974502 1931502 1803223 2038593
41725B038593M08414M2464k25969J68207P52416P61552K77282n9444q5864j85118
$$ 2038593 2447007 2489471 2263502 2431709 3184125 3945677 4222959 4163515 4077651 3892533
41715C892533n12679p75056p53053n51205k72609J48922O63083R66368Q61611
$$ 3892533 3379854 2604798 1851745 1300540 1027931 1176853 1839936 2806304 3667915
41706C667915N71899M69615N79267N90727L56198Q5213o4019k66940o33121q15665
$$ 3667915 4239814 4709429 5288696 5879423 6235621 6320834 6256815 5989875 5356754 4541089
41696D541089m64494J16581L20653J57839J65515L82735K22657l96821o79570
$$ 4541089 4076595 4193176 4513829 4671668 4837183 5219918 5442575 5045754 4366184
41687D366184k27303J42371l59312j107436r30188P1622O99238M95822K51661
$$ 4366184 4138881 4281252 3921940 2814504 1884316 1955938 2655176 3150998 3402659
41678C402659N32389Q08457N03424J0398q292K60454J06795n39986r65403o78892
$$ 3402659 3935048 4743505 5246929 5257327 5249035 5509489 5616284 5076298 4110895 3432003
41668C432003m2388K87838K28443K86421P71562J282868J180825M38817k90378
$$ 3432003 3389615 3677453 3905896 4192317 4963879 6246747 7427572 7866389 7576011
41659G576011m85006l05822k15033l67785n87675o75222n35845k49214j34589
$$ 7576011 7091005 6785183 6570150 6202365 5614690 4939468 4403623 4154409 4019820
41650D019820l90519n75953j8965J031727J405523O40762j83851l2963M21672
$$ 4019820 3629301 3053348 3034383 4066110 5471633 6112395 5928544 5895581 6317253
41641F317253j39481j450088j867784p61337O51862J116598P94209M39820J75196
$$ 6317253 6177772 4727684 2859900 2098563 2750425 3867023 4661232 5101052 5276248
41632E276248k27005n79978n31163j49392K47515M91840M53664j4785o69588q77651
$$ 5276248 5049243 4469265 3938102 3788710 4036225 4528065 4981729 4966944 4297356 3419705
41622C419705m10915J88671L88870L55147M74358O59892O12244L96179K51354
$$ 3419705 3008790 3197461 3586331 3941478 4415836 5075728 5687972 6084151 6335505
41613F335505R8414k84614p67291r59809p09364k39170Q9746J4972l91103o03389
$$ 6335505 6433919 6149305 5382014 4422205 3712841 3473671 3563417 3578389 3187286 2583897
41603B583897j18275P80121J155779N89446k38339n01129l18849l75266p69442
$$ 2583897 2465622 3245743 4401522 4990968 4752629 4251500 3932651 3557385 2787943
41594B787943q97134m26240J74358K53401j98429n71700m03502N7815J79555k07270
$$ 2787943 1890809 1464569 1638927 1892328 1693899 1122199 718697 776512 956067 748797
41584G48797n65467m06081O2842L85497N81982Q64728R72832N76219J26482L34387
$$ 748797 183330 -222751 -159909 225588 807570 1672298 2645130 3221349 3347831 3682218
41574C682218Q51197O01343l96582p94733P550Q00608M09000m97688n53252J74015
$$ 3682218 4533415 5134758 4738176 3943443 3950993 4751601 5160601 4662913 4109661 4283676
41564D283676M90230L9096l49805j49641J77010J10746j77675k40845L5669L65719
$$ 4283676 4773906 4813002 4463197 4313556 4490566 4601312 4423637 4182792 4218461 4584180
41554D584180K99210l44766j030251q80491J46431J017494J038416P75776Q64997
$$ 4584180 4883390 4538624 3508373 2627882 2774313 3791807 4830223 5605999 6470996
41545F470996P77632j02176r45187n34368N77064O65222m64439j136760m90879
$$ 6470996 7248628 7146452 6201265 5666897 6243961 6909183 6444744 5307984 4817105
41536D817105K15772k70206j265196j411626p58390l56654m81537m54986Q4883
$$ 4817105 5032877 4762671 3497475 2085849 1327459 970805 489268 34282 119165
41527A19165P40518J078960J052409P35414K08977k99455n50623n38707l82683
$$ 119165 859683 1938643 2991052 3726466 3935443 3635988 3085365 2546658 2163975
41518B163975j36147J04720J54932K7604J8095K79786N39326M17040j55249q99483
$$ 2163975 2027828 2132548 2287480 2315084 2333179 2612965 3152291 3569331 3414082 2514599
41508B514599j342310j062808j62826O08692O96881N57175R38784J504340J178199
$$ 2514599 1172289 109481 -53345 555347 1252228 1809403 2748187 4252527 5430726
41499E430726k7883p31763j89361N70184L78292l37051m58542J672J75700j09914
$$ 5430726 5402843 4671080 4481719 5051903 5430195 5093144 4634602 4636274 4811974 4702060
41489D702060k85465k61494n24774j063685j232784p74574j36827K88470M94563
$$ 4702060 4416595 4155101 3630327 2566642 1333858 559284 422457 710927 1205490
41480A205490M42717J03738p6580M14402J190516J235759L24317o03087p23797
$$ 1205490 1648207 1751945 1675365 2089767 3280283 4516042 4840359 4237272 3513475
41471C513475k63890J41660L12804L68931L16687K13287K65632M13505K64390
$$ 3513475 3249585 3391245 3704049 4072980 4389667 4602954 4868586 5282091 5546481
41462E546481k43508n92260m42516j70259k57027n71835o70923m31578P796N45515
$$ 5546481 5302973 4710713 4268197 4097938 3840911 3269076 2598153 2166575 2174371 2719886
41452B719886R27304O77757k31340r72846p45053J25926N64552J26393n85139
$$ 2719886 3647190 4324947 4093607 3120761 2375708 2501634 3066186 3192579 2607440
41443B607440q63275o76810l90930k03469p3411J06977M27896Q23542R84465O97122
$$ 2607440 1744165 1067355 676425 472956 399545 506522 934418 1757960 2742425 3439547
41433C439547K72417K44871N75330O11366L7210o07773p13712m91077n52631q62032
$$ 3439547 3711964 3956835 4532165 5143531 5180741 4572968 3859256 3368179 2815548 1953516
41423A953516p57055l2831O32009N87536O9781k32293j25364M5242J18939L37946
$$ 1953516 1196461 1163630 1795639 2383175 2452956 2220663 2095299 2140541 2259480 2597426
41413B597426P78183J030937P06233j0214n50752n63564j33290M25185P62967
$$ 2597426 3375609 4406546 5112779 5102565 4551813 3988249 3854959 4280144 5043111
41404E043111O20279L9129n71196q14936p48038p19450q10227p44285m25438k03737
$$ 5043111 5663390 5702519 5131323 4316387 3568349 2848899 2038672 1294387 868949 665212
41394F65212l59762n99768m42729K5118K44334Q0055J30895Q31739J622928J538361
$$ 665212 305450 -294318 -737047 -711929 -467595 -387540 -256645 575094 2198022 3736383
41384C736383N02177n33823q42725p35749q03609q85900m32439L77583O66678
$$ 3736383 4238560 3704737 2862012 2126263 1322654 436754 4315 381898 1048576
41375A048576J07205n50076n17473k902K47779M6896j42101L396L34781O34036
$$ 1048576 1155781 605705 88232 85330 333109 380005 237904 241300 576081 1210117
41365A210117Q30492P79432L21585k84534m40081J7471M73869L23961j56960j58935
$$ 1210117 2040609 2820041 3141626 2857092 2417011 2434482 2908351 3232312 3075352 2916417
41355B916417N33234J197481J066105K27790n66423p82043n26960k00880j6463
$$ 2916417 3449651 4647132 5713237 5941027 5374604 4592561 4065601 3864721 3848258
41346C848258O2331J17259J74040K32553K75498K57612J47798k9839k14203l27602
$$ 3848258 3910589 4027848 4201888 4434441 4709939 4967551 5115349 5085510 4871307 4543705
41336D543705l03414k06761k93329p11276j094360p94196K39355J121726R81382
$$ 4543705 4240291 4033530 3740201 3028925 1934565 1140369 1379724 2501450 3482832
41327C482832M4175p07794q30584p63488q42614o75904J30032J138357J501062
$$ 3482832 3527007 2819213 1988629 1225141 382527 -293377 -163345 975012 2476074
41318B476074R71056P0381o00434q55339q32959p52424p35080o55030k38012N16189
$$ 2476074 3447130 3517511 2917077 2061738 1228779 476355 -258725 -913755 -1151767 -635578
41308f35578J136968J118402M68376l23108p50358o32381j87098J12655j5050
$$ -635578 501390 1619792 2088168 1765060 1014702 382321 195223 307878 292828
41299B92828k52479k2805O40390R86550N50248j95527n41594m54901l44546l32730
$$ 292828 40349 17544 657934 1644484 2194732 1999205 1457611 1002710 658164 325434
41289C25434k88373k36466j88991Q8883N85489P29295K45276j21586L91131J217367
$$ 325434 37061 -199405 -388396 -299513 285976 1015271 1260547 1138961 1530092 2747459
41279B747459J180029L21730k03059m9373j51560r66888j565426j115461j90932
$$ 2747459 3927488 4249218 4046159 3996786 3845226 2878338 1312912 197451 6519
41270F519J95108P725j61878j44497p6533J54688N49343O15611J28582k54540
$$ 6519 201627 209352 47474 -97023 -173556 -18868 530475 1146086 1274668 1020128
41260A020128N9630N66823M71642L3159O3687M49418L40688l20144o53938l23780
$$ 1020128 1079758 1646581 2118223 2151382 2215069 2664487 3005175 2685031 2031093 1707313
41250A707313l6872k75455n24676k20324L46111N91659M83180L10674J27058j02969
$$ 1707313 1670441 1394986 870310 649986 996097 1587756 2070936 2381610 2508668 2405699
41240B405699j99214n3582R9995O8866M0901K03229L43742J95087j07177k74201
$$ 2405699 2206485 2152903 2252898 2321764 2362665 2565894 2909636 3104723 2997546 2723345
41230B723345l15879l69790l09097N7179N25894O50552L20672j27611l71203m15494
$$ 2723345 2407466 2037676 1728579 1785758 2311652 2962204 3282876 3155265 2784062 2368568
41220B368568m57678o34302q76444q74329l20533N94850J111438O94117j71485
$$ 2368568 1910890 1276588 400144 -474185 -794718 -199868 911570 1605687 1434202
41211A434202m34877J86672Q09378N78805j81528n07158j90996L9506k50133n34537
$$ 1434202 999325 1185997 1995375 2574180 2392652 1885494 1694498 1734004 1483871 949334
41201I49334k36818L00836L45050j12308m55693m58560m33263m07830Q047P32189
$$ 949334 712516 1013352 1358402 1246094 790401 331841 -101422 -509252 -501205 230984
41191B30984R88085L88653m19561o75685m66607k36612M2582N02827P18296K88016
$$ 230984 1219069 1607722 1188161 512476 45869 -190743 -148161 354666 1072962 1360978
41181A360978k73010j47365M88568P16246L04142j06609k44330n51404j057334
$$ 1360978 1087968 940603 1429171 2145417 2449559 2342950 2098620 1547216 489882
41172D89882r82326K0364J093896J271080O78912O2065k98535n47456o28584l97339
$$ 489882 -492444 -472080 621816 1892896 2571808 2633873 2335338 1787882 1159298 761959
41162G61959o4863O2881P8756K44986N12209O72075O97408N49700L5363o90225
$$ 761959 697096 759977 838733 1083719 1595928 2268003 2965411 3515111 3550474 2860249
41152B860249r17677k85936M90250M91310j09126l88310j00073J24343l0712r2253
$$ 2860249 1942572 1656636 2146886 2638196 2529070 2140760 2040687 2165030 2134318 2042065
41142B042065K60837N89901M28470R986j96056k24733m00217o61967o03359j25891
$$ 2042065 2302902 2892803 3321273 3331259 3135203 2910470 2510253 1848286 1244927 1119036
41132A119036L10209J90977m22967q69904n63618K88942Q30982N61669m6392k33706
$$ 1119036 1429245 1620222 1197255 327351 -236267 52675 883657 1445326 1398934 1165228
41122A165228M663P1843j86294k70986L7521K35829p0381m73670m17632j19196
$$ 1165228 1169891 1241734 1055440 784454 821975 1057804 987423 513753 96121 -23075
41112b3075k04737o33865o74114j2832P08899P65557L29513J42765L99757M96402
$$ -23075 -227812 -861677 -1535791 -1548623 -839724 -74167 255346 398111 797868 1294270
41102A294270K1428m84457k24090O06697Q94447R3350r30026r68929l455R13910
$$ 1294270 1315698 831241 607151 1213848 2108295 2201645 1271619 302690 299235 1213145
41092A213145J068247O94529K12833l79279j055626j328727q00554J54793P37021
$$ 1213145 2281392 2975921 3188754 2809475 1753849 425122 -375432 -220639 516382
41083E16382O30507K23128J893L8356P0558j06430l62971l24891J39472N46636
$$ 516382 1146889 1370017 1371910 1410266 1480824 1374394 1011423 686532 826004 1372640
41073A372640K45796o25356j042351l17900Q74715J208075L30154p20176q02217
$$ 1372640 1618436 993080 -49271 -367171 507544 1715619 2045773 1325597 523380
41064E23380M3530P98538O74857j22504p38825n95951N8397N12591M45296K26673
$$ 523380 566910 1365448 2040305 1917801 1178976 583025 641422 1154013 1599309 1825982
41054A825982K65723L44250k0645o84065q79035k66543M86113N34980k8803l58026
$$ 1825982 2091705 2435955 2415310 1731245 852210 585667 1071780 1606760 1577957 1219931
41044A219931l5618M23857L94136K3424o5569K63963M87477K50658q2432n857
$$ 1219931 1184313 1608170 2002306 2025730 1960161 2224124 2711601 2962259 2879827 2873970
41034B873970L21641L09718j33675m42082k82622r7047m05650r46770r98136l71780
$$ 2873970 3195611 3505329 3371654 2929572 2646950 2549903 2144253 1197483 199347 -172433
41024a72433M12209Q70391R48251O54620o9797q64578r26258m312R50772P87467
$$ -172433 239776 1110167 2058418 2713038 2643241 1778663 852405 848093 1798865 2586332
41014B586332l30261j074650o86551J21097K95622j34550l57793j11338O6864
$$ 2586332 2256071 1181421 494870 615967 911589 777039 419246 307908 374772
41005C74772j09769j55644L30459Q82729P85415J40167k87371j67874N6119P09
$$ 374772 265003 109359 439818 1322547 2107962 2248129 1960758 1792884 1849003 1849712
40995A849712r1461J03279L60871K78437k2361p7325J47943J88066j67199n26032
$$ 1849712 1758251 1861530 2222401 2500838 2478477 2401152 2549095 2737161 2569962 2043930
40985B043930n03527k90643l00740n05712n01314j34998K77579L69096Q9502l40728
$$ 2043930 1540403 1249760 949020 443308 -58006 -193004 84575 453671 543173 202445
40975B02445n78246k69961O08408J420725J310175K80687n29651j43834R20665
$$ 202445 -375801 -645762 -37354 1383371 2693546 2974233 2444582 2300748 3221413
40966C221413J246074L98266n35042n46305r5891k63185j024541j286488n59234
$$ 3221413 4467487 4865753 4330711 3784406 3688515 3425330 2400789 1114301 555067
40957E55067K90663K59277m70913q92967m74929L75161R42409Q90345L96945p4903
$$ 555067 845730 1105007 634094 -258873 -733802 -358641 583768 1474113 1871058 1796155
40947A796155j78649o0614k19691p79532j106821n28449O79156J466367J220296
$$ 1796155 1617506 1556892 1337201 557669 -549152 -1077601 -398445 1067922 2288218
40938B288218L84865k51953m67832n27087n45481l90592j05721K0524q9858j07440
$$ 2288218 2673083 2421130 1953298 1426211 880730 490138 384417 404941 315083 207643
40928B07643K45051P37743Q76710N17822J2105k55997k71508k75719m19574o17391
$$ 207643 452694 1190437 2067147 2584969 2597074 2341077 2069569 1793850 1374276 756885
40918G56885o17339j63969P08058J431309J246796J02524r93837r74518j5623
$$ 756885 139546 -24423 683635 2114944 3361740 3464264 2470427 1495909 1480286
40909A480286O56083L31191l77139n67124l00094k39732m26330k13510N65045
$$ 1480286 2136369 2467560 2090421 1523297 1223203 983471 557141 343631 908676
40900I08676J108545O61860m46049j175591r49152j11218O32526Q99696P79960
$$ 908676 2017221 2679081 2233032 1057441 108289 -2929 629597 1529293 2309253
40891B309253N75936M86091M30009J45155m75689j139495j332845q12996Q1126
$$ 2309253 2885189 3371280 3801289 3946444 3470755 2331260 998415 185419 266545
40882B66545O57431M92547j30460m76567j38934M98595P15734L31123q3805O9436
$$ 266545 923976 1416523 1286063 809496 670562 1169157 1884891 2216014 2132209 2201645
40872B201645O67210J008394O27853k08535q33657q65998m85495j07836N3145
$$ 2201645 2868855 3877249 4505102 4296567 3462910 2596912 2111417 2003581 2056726
40863B056726M3381o0197k43602m51801n94212o72446o85046l98852M16004J368119
$$ 2056726 2100107 2039910 1796308 1344507 750295 77849 -607197 -1006049 -590045 778074
40853G78074J530941N87729m73442m64252L78665O79528q5408p93276l49652O29496
$$ 778074 2309015 2896744 2423302 1959050 2337715 3017243 2931835 2138559 1788907 2418403
40843B418403O67318m53298j410856j189897k92263K18563J50510R0293L31405
$$ 2418403 3085721 2632423 1221567 31670 -260593 -42030 108480 198773 530178
40834E30178N83516O28796O37401P06024N74062P7887m33204m79730r1465K65702
$$ 530178 1113694 1742490 2379891 3085915 3659977 3737864 3304660 2824930 2733465 2999167
40824B999167L25997K43027J69284J970k95961m62722l09226q2178j06590k15453
$$ 2999167 3325164 3568191 3737475 3739445 3443484 2980762 2671536 2589358 2482768 2267315
40814B267315N0903O85113J062945P04821r9061o30570n61092k57146l17659q84057
$$ 2267315 2318218 3003331 4066276 4771097 4672036 4041466 3480374 3223228 2905569 2021512
40804B021512j418528j243983l58405M75830O30376L50657K62007L95559K68144
$$ 2021512 602984 -640999 -999404 -523574 106802 457459 719466 1115025 1383169
40795A383169j81918m40761k91836j24447j29429P6722O17617Q77319M56832l9714
$$ 1383169 1201251 760490 468654 344207 214778 291500 909117 1786436 2243268 2203554
40785B203554N6738K97604j87631j164482j511969q65088j0745M21581O51651
$$ 2203554 2260292 2557896 2370265 1205783 -306186 -1171274 -1182019 -760438 -108787
40776a08787R03746Q63000M17334Q7705J56654Q8510n42615j154712r21910j5323
$$ -108787 794959 1657959 2075293 2162998 2319652 2408162 1865547 710835 -211075 -226398
40766b26398O53426O70001M28429L67575N09360O82320O88814L09959m08125r53749
$$ -226398 427028 1097029 1525458 1893033 2402393 3084713 3773527 4083486 3675361 2721612
40756B721612q54730k81502K54277O25147J008529J239227Q87386L3868o14583
$$ 2721612 1866882 1585380 1839657 2464804 3473333 4712560 5599946 5633814 5019231
40747E019231n68760r6303K32828J85196o9966k15594k1841L96725N62593J91088
$$ 5019231 4450471 4354168 4586996 4772192 4702226 4486632 4464791 4861516 5424109 5615197
40737E615197l11450l30463O0673K43284O0413j6140J65890J25420k86258m15554
$$ 5615197 5303747 4973284 5033957 5277241 5337654 5321514 5487404 5612824 5326566 4911012
40727D911012J15283N66766J27546p02297p40653Q2670N69223k0888r89634j272057
$$ 4911012 5026295 5593061 5720607 5018310 4277657 4360327 4929550 4908662 3919028 2646971
40717B646971p53601m8091M73443Q18666Q59896L70077m07703p66072l48606L41158
$$ 2646971 1893370 1845279 2318722 3137388 3997284 4367361 3959658 3193586 2844980 3186138
40707C186138N30274J26928k49050j90717o9858m07520r65405r71248k30367N28493
$$ 3186138 3716412 3843340 3594290 3403573 3333715 2926195 1960790 989542 759175 1287668
40697A287668O12697J85034j96707l89198n16299l97817J92417Q62838R16250
$$ 1287668 1900365 2085399 1888692 1499494 983195 585378 777795 1640633 2556883
40688B556883L51907j06760j02017q9233m37521p27139m01388L36413P84150O22934
$$ 2556883 2908790 2802030 2700013 2610780 2173259 1446120 1044732 1381145 2165295 2788229
40678B788229J04387m18783p30402o79520k70309K36877N72543O96065O20418
$$ 2788229 2892616 2473833 1743431 1063911 793602 1030479 1603022 2299087 2919505
40669B919505K74520k00276l60382n8475J97708k6350l32122r7380M17028L97085
$$ 2919505 3194025 2993749 2633367 2574892 2772600 2746250 2414128 2316748 2733776 3130861
40659C130861j55095l16662K93610Q70526O91730K09134J98151M67148K64604
$$ 3130861 2975766 2659104 2952714 3823240 4514970 4724104 4922255 5389403 5654007
40650E654007m26783r07066q97069p74231o76246k58355M44970P38595K64432
$$ 5654007 5227224 4320158 3423089 2648858 1972612 1714257 2159227 2897822 3162254
40641C162254l75091m97774l03960l62127n72444l80146K02008N58672M52904
$$ 3162254 2787163 2289389 1985429 1623302 1050858 670712 872720 1431392 1884296
40632A884296L25167M65454N40112K33098j87708l21210k19426j28948k6181J51526
$$ 1884296 2209463 2674917 3215029 3448127 3260419 2939209 2719783 2590835 2564654 2716180
40622B716180J50316k11527n59144m25474j7214Q0439j56466k09533M6545J57904
$$ 2716180 2866496 2654969 2095825 1670351 1653137 1733576 1577110 1367577 1414122 1572026
40612A572026k5089j9316M18441P49600M40996k14454n44168l64036L7836M01640
$$ 1572026 1546937 1527621 1946062 2695662 3136658 2922204 2378036 2014000 2051836 2453476
40602B453476N43739K93298j56302k21305K65781O49086L87104q6223j07525J12406
$$ 2453476 2997215 3290513 3134211 2912906 3178687 3827773 4214877 4128654 4021129 4133535
40592D133535j3569k93401j47864J48602j72469q88859r83168m24676l49344j082583
$$ 4133535 4119966 3826565 3678701 3827303 3654834 2765975 1782807 1358131 1008787 -73796
40582g3796j405392m94329P03481R73676N85729M38185M38579M2033l42324O8062
$$ -73796 -1479188 -1973517 -1270036 -296360 289369 727554 1166133 1208166 865842 933904
40572I33904Q75576R53195K43842k44353j69370k25862o68779p93203k51314K60866
$$ 933904 1809480 2762675 3006517 2762164 2592794 2366932 1698153 904950 653636 914502
40562I14502J28491l02168m51697l13266r8386J70097L20044M6740l54277r7460
$$ 914502 1042993 740825 289128 -24138 -122524 47573 367617 414357 60080 -37380
40552c7380Q02933J239634O08768j78653p2617N07795M21440m04221r99393q65391
$$ -37380 765553 2005187 2613955 2435302 2362685 2870480 3291920 2887699 1888306 1022915
40542A022915m35657j34474P7661J73467p5211n03119n00283J72313R82233J258211
$$ 1022915 587258 452784 530445 703912 628701 125582 -374701 -202388 779845 2038056
40532B038056Q80698K12285l42134n76214n18292l37337j34948R4203K32978N3534
$$ 2038056 2918754 3131039 2788905 2212691 1694399 1357062 1222114 1316317 1549295 1602829
40522A602829l35406m02511R2021O27214O07804K04040k5367n3971k69623o17540
$$ 1602829 1267423 864912 956933 1584147 2191951 2395991 2370624 2316653 2047030 1429490
40512A429490n97258j12329L43491M24379K82065J23262j9539k6260K32431N06540
$$ 1429490 832232 719903 1063394 1487773 1769838 1893100 1873561 1847301 2079732 2586272
40502B586272M31323J86087K24565L47422j06790r78239j151789j58808R49022
$$ 2586272 3017595 3203682 3428247 3775669 3668879 2690640 1538851 1380043 2329065
40493B329065R75703J41722m58064l96711j01411J18483L71289O40480O55703
$$ 2329065 3304768 3446490 2988426 2591715 2490304 2608787 2980076 3620556 4276259
40484D276259L10384k57414q75924j223666q13350L15335J168005Q10451l17755
$$ 4276259 4586643 4329229 3453305 2229639 1416289 1731624 2899629 3710080 3392325
40475C392325q87170m47423J34361J29779o8217J60979N72617N24488M1130l17090
$$ 3392325 2505155 2057732 2192093 2321872 2253655 2414634 2987251 3511739 3552869 3235779
40465C235779m05204o02383r78320r87200k38550Q19698J313914Q95616M0348
$$ 3235779 2830575 2228192 1249872 262672 24122 843820 2157734 3053350 3093698
40456C093698n43740n84327k89798N0237K98694L75279J97405j61559m14580l20423
$$ 3093698 2549958 1965631 1675833 1726070 2024764 2400043 2597448 2435889 2021309 1700886
40446A700886O5911M92913P61064P84847N59750K14590l9496j67508l63778o75130
$$ 1700886 1766797 2259710 3020774 3805621 4365371 4579961 4540465 4372957 4009179 3334049
40436C334049p83851m44766M7615J94282j8456j63353m8519R4496J24779K19418
$$ 3334049 2550198 2105432 2153047 2347329 2328873 2165520 2117001 2211497 2336276 2555694
40426B555694M25706M06274q8080p58851j048423p50566j57649K87070L76926
$$ 2555694 2981400 3387674 3299594 2540743 1492320 741754 584105 871175 1248101
40417A248101K88788L72622O71989P46928K42561m73239o76443k87926K0395j46568
$$ 1248101 1536889 1909511 2581500 3328428 3570989 3097750 2421307 2133381 2153776 2007208
40407B007208l41345l8258N49384Q47295P23853M49876J54250k06823n42449p07898
$$ 2007208 1665863 1627605 2176989 3024284 3748137 4198013 4352263 4145440 3602991 2895093
40397B895093p26115o08620k19780L37446N57582K14350j54248k531L28649J52417
$$ 2895093 2168978 1560358 1340578 1678024 2235606 2449956 2295708 2293177 2621826 2774243
$$ [...]
##END NTUPLES=NMR SPECTRUM
##END=
