##TITLE=31Pdec_DE-100m
 CDCl3, 64 sc
 8.7.2025
##JCAMPDX= 6.0         $$ Bruker NMR JCAMP-DX V2.0
##DATA TYPE= NMR SPECTRUM
##DATA CLASS= NTUPLES
##ORIGIN= UXNMR, Bruker Analytische Messtechnik GmbH
##OWNER= root
$$ XWIN-NMR		Version 3.5
$$ Tue Jul  8 16:35:40 2025 Russian Standard Time (UT+4h)  she@DPX200
##.OBSERVE FREQUENCY= 81.013821
##.OBSERVE NUCLEUS= ^31P
##.ACQUISITION MODE= SIMULTANEOUS
##.ACQUISITION SCHEME= undefined
##.AVERAGES= 64
##.DIGITISER RES= 17
##SPECTROMETER/DATA SYSTEM= spect
##.PULSE SEQUENCE= zgpg30
##.SOLVENT NAME= CDCl3
##.SHIFT REFERENCE= (INTERNAL, CDCl3, 0, 198.062)
##AUDIT TRAIL= $$ (NUMBER, WHEN, WHO, WHERE, WHAT)
$$ ##TITLE= Audit trail, XWIN-NMR		Version 3.5
$$ ##JCAMPDX= 5.01
$$ ##ORIGIN= Bruker BioSpin GmbH
$$ ##OWNER= she
$$ F:/spectra/data/she/nmr/P31/2/pdata/1/auditp.txt
$$ ##AUDIT TRAIL=  $$ (NUMBER, WHEN, WHO, WHERE, WHAT)
(   1,<2025-07-08 16:33:35.62 +0400>,<she>,<DPX200>,
      <created by zg, POWCHK disabled, PULCHK disabled
       configuration hash MD5:
       00 E9 B6 7A A2 85 ED C7 34 08 36 98 17 FE 4E 26
       data hash MD5: 32K
       B9 69 1A E7 17 11 9D 0B 4A 36 E3 F7 5B 4B B7 7A>)
(   2,<2025-07-08 16:34:42.15 +0400>,<she>,<DPX200>,
      <Start of raw data processing
       efp BC_mod = 2 LB = 1.5 FT_mod = 6 PKNL = 1 PHC0 = 1780.381 PHC1 = -949.5064 SI = 64K 
       data hash MD5: 64K
       EF 0B 13 62 5D A3 10 59 67 DB 25 A2 A3 E9 3D D3>)
(   3,<2025-07-08 16:35:05.28 +0400>,<she>,<DPX200>,
      <pk PHC0 = -0.9703507 PHC1 = 0 
       data hash MD5: 64K
       4B C7 12 B5 B4 CC D0 D4 A1 9C BC 57 7D 19 06 DC>)
(   4,<2025-07-08 16:35:12.62 +0400>,<she>,<DPX200>,
      <abs ABSG = 5 
       data hash MD5: 64K
       52 60 98 26 B5 6B 42 23 92 38 A7 70 89 EB A7 64>)
$$ ##END=
$$ 
$$ hash MD5
$$ 70 E2 16 6E 08 0F 3B 09 4C 82 2A 00 48 62 3D D3
##$RELAX= 
##$RELAX= 
##$RELAX= 
##$RELAX= 
##$RELAX= 
##$RELAX= 
##$RELAX= 
##$RELAX= 
$$ Bruker specific parameters
$$ --------------------------
##$DU= <F:/spectra>
##$EXPNO= 2
##$NAME= <P31>
##$PROCNO= 1
##$TYPE= <nmr>
##$USER= <she>
##$AMP= (0..31)
100 100 100 100 100 100 100 100 100 100 100 100 100 100 100 100 100 100 
100 100 100 100 100 100 100 100 100 100 100 100 100 100 
##$AQSEQ= 0
##$AQ_mod= 1
##$AUNM= <au_zg>
##$AUTOPOS= <>
##$BF1= 81.014009
##$BF2= 200.13
##$BF3= 200.13
##$BF4= 200.13
##$BF5= 200.13
##$BF6= 200.13
##$BF7= 200.13
##$BF8= 200.13
##$BYTORDA= 1
##$CFDGTYP= 0
##$CFRGTYP= 5
##$CHEMSTR= <none>
##$CNST= (0..31)
1 1 145 1 1 1 1 1 1 1 1 1 1 1 1 1 1 1 1 1 1 1 1 1 1 1 1 1 1 1 1 1 
##$CPDPRG= <waltz16>
##$CPDPRG1= <>
##$CPDPRG2= <waltz16>
##$CPDPRG3= <>
##$CPDPRG4= <mlev>
##$CPDPRG5= <mlev>
##$CPDPRG6= <mlev>
##$CPDPRG7= <mlev>
##$CPDPRG8= <mlev>
##$CPDPRGB= <>
##$CPDPRGT= <>
##$D= (0..31)
0 1 0 0 0 0 0 0 0 0.06 0 0.03 2e-05 3e-06 0 0 0.0002 0 0 0 0 0 0 0 0 0 
0 0 0 0 0 0 
##$DATE= 1751978015
##$DBL= (0..7)
120 120 120 11 120 120 24 19 
##$DBP= (0..7)
150 150 150 150 150 150 150 150 
##$DBP07= 0
##$DBPNAM0= <>
##$DBPNAM1= <>
$$ [...]
##$SUBNAM3= <"">
##$SUBNAM4= <"">
##$SUBNAM5= <"">
##$SUBNAM6= <"">
##$SUBNAM7= <"">
##$SUBNAM8= <"">
##$SUBNAM9= <"">
##$SW= 400.765351723535
##$SWIBOX= (0..15)
0 1 3 0 0 0 0 0 0 0 0 0 0 0 0 0 
##$SW_h= 32467.5324675325
##$TD= 32768
##$TD0= 1
##$TE= 0
##$TE2= 300
##$TE3= 300
##$TEG= 300
##$TL= (0..7)
0 120 53 12 22 120 120 120 
##$TP= (0..7)
150 150 150 150 150 150 150 150 
##$TP07= 0
##$TPNAME0= <>
##$TPNAME1= <>
##$TPNAME2= <>
##$TPNAME3= <>
##$TPNAME4= <>
##$TPNAME5= <>
##$TPNAME6= <>
##$TPNAME7= <>
##$TPOAL= (0..7)
0.5 0.5 0.5 0.5 0.5 0.5 0.5 0.5 
##$TPOFFS= (0..7)
0 0 0 0 0 0 0 0 
##$TUNHIN= 0
##$TUNHOUT= 0
##$TUNXOUT= 0
##$USERA1= <user>
##$USERA2= <user>
##$USERA3= <user>
##$USERA4= <user>
##$USERA5= <user>
##$V9= 5
##$VALIST= <valist>
##$VCLIST= <CCCCCCCCCCCCCCC>
##$VD= 0
##$VDLIST= <DDDDDDDDDDDDDDD>
##$VPLIST= <PPPPPPPPPPPPPPP>
##$VTLIST= <TTTTTTTTTTTTTTT>
##$WBST= 1024
##$WBSW= 4
##$XGAIN= (0..3)
0 0 0 0 
##$XL= 0
##$YL= 0
##$YMAX_a= 9053
##$YMIN_a= -32352
##$ZGOPTNS= <>
##$ZL1= 120
##$ZL2= 120
##$ZL3= 120
##$ZL4= 120
##$ABSF1= 198.0616
##$ABSF2= -202.7028
##$ABSG= 5
##$ABSL= 3
##$ALPHA= 0
##$AQORDER= 0
##$ASSFAC= 0
##$ASSFACI= 0
##$ASSFACX= 0
##$ASSWID= 0
##$AUNMP= <proc_1d>
##$AZFE= 0.1
##$AZFW= 0.5
##$BCFW= 0
##$BC_mod= 2
##$BYTORDP= 0
##$COROFFS= 0
##$CY= -3
##$DATMOD= 1
##$DC= 0
##$DFILT= <>
##$DTYPP= 0
##$F1P= 0
##$F2P= 0
##$FCOR= 1
##$FTSIZE= 65536
##$FT_mod= 6
##$GAMMA= 0
##$GB= 0
##$INTBC= 1
##$INTSCL= 9.790993e-09
##$ISEN= 30
##$LB= 1.5
##$LEV0= 0
##$LPBIN= 0
##$MAXI= 10000
##$MC2= 0
##$MEAN= 0
##$ME_mod= 0
##$MI= 50
##$NCOEF= 0
##$NC_proc= -8
##$NLEV= 6
##$NOISF1= 182.463
##$NOISF2= 159.3651
##$NSP= 0
##$NTH_PI= 0
##$NZP= 0
##$OFFSET= 198.0616
##$PC= 4
##$PHC0= 1779.411
##$PHC1= -949.5064
##$PH_mod= 1
##$PKNL= yes
##$PPARMOD= 0
##$PSCAL= 0
##$PSIGN= 0
##$REVERSE= no
##$SF= 81.0140089999434
##$SI= 65536
##$SIGF1= 159.3651
##$SIGF2= -187.1042
##$SINO= 113.3802
##$SIOLD= 16384
##$SREGLST= <1H.CDCl3>
##$SSB= 0
##$STSI= 65536
##$STSR= 0
##$SW_p= 32467.5324675325
##$SYMM= 0
##$S_DEV= 0
##$TDeff= 32768
##$TDoff= 0
##$TI= <>
##$TILT= no
##$TM1= 0
##$TM2= 0
##$TOPLEV= 0
##$USERP1= <user>
##$USERP2= <user>
##$USERP3= <user>
##$USERP4= <user>
##$USERP5= <user>
##$WDW= 1
##$XDIM= 65536
##$YMAX_p= 269466375
##$YMIN_p= -248228407
$$ End of Bruker specific parameters
$$ ---------------------------------
##NTUPLES= NMR SPECTRUM
##VAR_NAME=  FREQUENCY,     SPECTRUM/REAL,   SPECTRUM/IMAG
##SYMBOL=    X,             R,               I
##VAR_TYPE=  INDEPENDENT,   DEPENDENT,       DEPENDENT
##VAR_FORM=  AFFN,          ASDF,            ASDF
##VAR_DIM=   65536,         65536,           65536
##UNITS=     HZ,            ARBITRARY UNITS, ARBITRARY UNITS
##FACTOR=    0.49542278885378, 1,            1
##FIRST=     16045.7642231865, 0,            0
##LAST=      -16421.768244346, 0,            0
##MIN=       -16421.768244346, -248228407,   0
##MAX=       16045.7642231865, 269466375,    0
$$ Real data points
##PAGE= N=1
##DATA TABLE= (X++(R..R)), XYDATA
$$ [...]
7516B708733p81189o42286q8441k55303j267696k475699k991459k382908j308237
$$ 2708733 1927544 1285258 1196817 941514 -326182 -2801881 -5793340 -8176248 -9484485
7507i484485p30673l57599P68402J950107J244084j044570j811599K96298K239987
$$ -9484485 -10215158 -10572757 -9804355 -7854248 -6610164 -7654734 -9466333 -9170035 -6930048
7498f930048Q74769k134305k619147J52925K938372L355853K303190J429331P79205
$$ -6930048 -6055279 -8189584 -10808731 -10655806 -7717434 -4361581 -2058391 -629060 150145
7489A50145k83080j502108j927000r90610P74904J829950J067502m82689o08772
$$ 150145 -132935 -1635043 -3562043 -4552653 -3777749 -1947799 -880297 -1362986 -1971758
7480a971758Q31551J381020j74734j538052m07196J650436J453772q81706k058443
$$ -1971758 -1140207 240813 66079 -1471973 -1879169 -228733 1225039 343333 -1715110
7471a715110j74106L058955M468265K300626k337558n666251m265100N63254L347200
$$ -1715110 -1889216 1169739 5638004 7938630 5601072 -65179 -4330279 -3767025 -419825
7462d19825J260158k014379j856552O21935J358160L61332Q53253K679950K244047
$$ -419825 840333 -1174046 -3030598 -2408663 -1050503 -689171 164082 2844032 5088079
7453E088079r18978k952742k067063j086629k027683k829812j706727n35732j171364
$$ 5088079 4169101 1216359 -850704 -1937333 -3965016 -6794828 -8501555 -9037287 -10208651
7444a0208651j909279n83275J680759K738016L043614M054124M913304L650341
$$ -10208651 -12117930 -12701205 -11020446 -8282430 -5238816 -1184692 3728612 7378953
7436G378953M99590k346054l397198k566500l79648J894590K512603J146831n83238
$$ 7378953 7878543 5532489 2135291 -431209 -810857 1083733 3596336 4743167 4159929
7427D159929j514120k315497l367777l260427j114587J282780J567079j79250
$$ 4159929 2645809 330312 -3037465 -6297892 -7412479 -6129699 -4562620 -4741870
7419d741870k011544k509563j315479J192984L379179L120539O64557q80798M25278
$$ -4741870 -6753414 -9262977 -10578456 -9385472 -6006293 -2885754 -2221197 -3101995 -2676717
7410b676717K440879J958543p60666k572888j670525O62203K010065J241316n84450
$$ -2676717 -235838 1722705 962039 -1610849 -3281374 -2619171 -609106 632210 47760
7401D7760j151630L87306J716388L00381k166745j499475K193020L642632L19796
$$ 47760 -1103870 -716564 999824 1300205 -866540 -2366015 -172995 3469637 3789433
7392C789433l206262k234510P44628M54949k451660k790398N89527L490317L425242
$$ 3789433 583171 -1651339 -906711 -451762 -2903422 -5693820 -5104293 -1613976 1811266
7383A811266K526859K616843K270614L70348j446669j734285j393919j221404
$$ 1811266 4338125 6954968 9225582 9595930 8149261 6414976 5021057 3799653
7375C799653k59877J667624K485629R05538j176275j217414N96208K043499J658836
$$ 3799653 3539776 5207400 7693029 8598567 7422292 6204878 6801086 8844585 10503421
7366A0503421k60381k197260k271874K0450K460102K197152m06996k053862j098454
$$ 10503421 10243040 8045780 5773906 5794356 8254458 10451610 10044614 7990752 6892298
7357F892298N11582O68278j56896q88805j893901l166256k890369k66451K062654
$$ 6892298 7403880 8072158 7915262 7026457 5132556 1966300 -924069 -1190520 872134
7348H72134J121927j977389l298483j160251K265119M045171L198319N94524j992087
$$ 872134 1994061 16672 -3281811 -4442062 -2176943 1868228 5066547 5661071 3668984
7339C668984k775875j431093L51637Q91279O00855P51152R54013j72292k192230
$$ 3668984 893109 -537984 -186347 704932 1305787 2056939 3010952 2838660 646430
7330F46430k888536j345034Q87377K069781J952573Q28073j050603k350089j121306
$$ 646430 -2242106 -3587140 -2699763 -629982 1322591 2150664 1100061 -1250028 -2371334
7321b371334K215546M241858K721947k37053j444648j458301k919314m911878
$$ -2371334 -155788 4086070 6808017 6570964 5126316 3668015 748701 -4163177
7313d163177l310453K247944O042611L807246o84069p57307L285427M500158l90637
$$ -4163177 -7473630 -5225686 816925 4624171 3940102 3182795 6468222 10968380 10577743
7304A0577743o076902o133498j432210K208509K135018O64526m7873p90812k355012
$$ 10577743 4500841 -1632657 -3064867 -856358 1278660 1943186 1895313 1104501 -1250511
7295a250511l149936j583102J042477K014429R05929L7774J085936K631521K132443
$$ -1250511 -4400447 -5983549 -4941072 -2926643 -2020714 -1982940 -897004 1734517 3866960
7286C866960l26037j905748j022182L52704j14556j261125m10784J718804J650591
$$ 3866960 3540923 1635175 612993 965697 851141 -409984 -820768 898036 2548627
7277B548627j095957k794506j404366K44910m66609j475552j43871J465498R103
$$ 2548627 1452670 -1341836 -2746202 -2501292 -2967901 -4443453 -4587324 -3121826 -3112723
7268c112723k813167k658009J3186N85355j728154k401265P29384L841257L504860
$$ -3112723 -5925890 -8583899 -8570713 -7985358 -9713512 -12114777 -11385393 -7544136 -4039276
7259d039276J803141J876304K453029Q10125j747789j668870J163555L325235
$$ -4039276 -2236135 -359831 2093198 2903323 1155534 -513336 650219 3975454
7251C975454K618989j38698l367175n844169o093332l492023M7678J830268J721572
$$ 3975454 6594443 6455745 3088570 -2755599 -8848931 -12340954 -12293276 -10463008 -8741436
7242h741436J663377K199331J922993L63130j151750j930459k692638l081328
$$ -8741436 -7078059 -4878728 -2955735 -2592605 -3744355 -5674814 -8367452 -11448780
7234a1448780j021687L694624P258062N810152O81405k822091j814833J263222
$$ -11448780 -12470467 -8775843 -1517781 4292371 4973776 2151685 336852 1600074
7226A600074K668240J979988J151243P25094m04754j975375j906249L82288K462458
$$ 1600074 4268314 6248302 7399545 8124639 7719885 5744510 3838261 4220549 6683007
7217F683007K061619K8563j368405j585907j438521r28129K87539J076269n0932
$$ 6683007 8744626 8773189 7404784 5818877 4380356 3452227 3739766 4816035 4765103
7208D765103k187993k654597n88201J909913K459116P48967j775885l168751k190407
$$ 4765103 2577110 -77487 -665688 1244225 3703341 4452308 2676423 -492328 -2682735
7199b682735K90764J679759R90109O70481K860136N198439L741777o97335l166170
$$ -2682735 -2391971 -712212 277897 948378 3808514 9006953 12748730 12051395 8885225
7190H885225j680310M48316L22305o02748m6298J202271J157152k99231k128304
$$ 8885225 7204915 7653231 7975536 7372788 7326490 8528761 9685913 9386682 7258378
7181G258378l557900l486446j148851J532991J415612r82143j805341k84522j63521
$$ 7258378 3700478 214032 -934819 598172 2013784 1031641 -773700 -1058222 -1221743
7172a221743k674251l446390J05642L583666K539235j52899L50371K207195M29199
$$ -1221743 -3895994 -7342384 -7236742 -3653076 -1113841 -1266740 -916369 1290826 1720025
7163A720025l847692n086216k762696j514402k343604j234149K690183M856308
$$ 1720025 -2127667 -7213883 -9976579 -11490981 -13834585 -15068734 -12378551 -7522243
7155g522243L020022R55166J787822L252422K566109J095099Q62357O09569j202292
$$ -7522243 -4502221 -3547055 -1759233 1493189 4059298 5154397 6016754 6626323 5424031
7146E424031k892582k373005o76991J97547M10749P06211L42152q81917j139820
$$ 5424031 2531449 158444 -518547 -321000 89749 795960 1138112 256195 -883625
7137h83625L17276J179488r3532j101236P05196L405875L370447R66754j97686
$$ -883625 -566349 613139 519607 -581629 123567 3529442 6899889 7866643 7668957
7128G668957J097741K260346J032576j643841l285309k694346r44417l37093j854493
$$ 7668957 8766698 11027044 12059620 10415779 7130470 4436124 3491707 3154614 1300121
7119A300121l370469k025672J167151J825119j323700l803035j984853R09771
$$ 1300121 -2070348 -4096020 -2928869 -1103750 -2427450 -6230485 -8215338 -7305567
7111g305567l29703m268197m430953Q79061N803470N284624J553676k57176N97052
$$ -7305567 -7635270 -11903467 -16334420 -15455359 -9651889 -4367265 -2813589 -3070765 -2473713
7102b473713J035963o9849n24160J002765K539452J651146j141526l180570k964177
$$ -2473713 -1437750 -1507599 -2031759 -1028994 1510458 3161604 2020078 -1160492 -4124669
7093d124669j213205R02718K903689M059628L154319N12361j149518J11659K315415
$$ -4124669 -5337874 -4435156 -1531467 2528161 5682480 6194841 5045323 5156982 7472397
7084G472397J975266p57419k271645j075839J22899p96942j816553m16704J953711
$$ 7472397 9447663 8690244 6418599 5342760 5465659 4668717 2852164 2435460 4389171
7075D389171K251693P88250J77391M28179r21065l754153m433921j184361K811414
$$ 4389171 6640864 7429114 7606505 8034684 7113619 3359466 -1074455 -2258816 552598
7066E52598L714528K052543J007763J322154Q78177j027431k014263l48474J792794
$$ 552598 4267126 6319669 7327432 8649586 9527763 8500332 6486069 6137595 7930389
7057G930389Q66235l048923o003066n120359j835165O67959J465133J771112K136411
$$ 7930389 8796624 5747701 -255365 -5375724 -7210889 -6542930 -5077797 -3306685 -1170274
7048a170274J902320R46687l1837q48506j707945j953935q16037P47785R80131
$$ -1170274 732046 1678733 1646896 798390 -909555 -2863490 -3679527 -2931742 -1951611
7039a951611M6481k76478M75083J226672J900543L198214L710060Q64254m257672
$$ -1951611 -1905130 -2181608 -1706525 -479853 1420690 4618904 8328964 9193218 4935546
7030D935546o760613m310334k49979J604154J716197J931980J601632N2556m10083
$$ 4935546 -1825067 -6135401 -6385380 -4781226 -3065029 -1133049 468583 521139 111056
7021A11056J781826L350851M75964m571813n933504k324919J948307L583380L246560
$$ 111056 1892882 5243733 5719697 1147884 -4785620 -7110539 -5162232 -1578852 1667708
7012A667708K030146k92472k627041k416011L88165K501687J769111l71908j845180
$$ 1667708 3697854 3405382 778341 -1637670 -1249505 1252182 3021293 2649385 804205
7003H04205k481143k551965j540958L33288J663158J966145K155685K264090J098966
$$ 804205 -1676938 -4228903 -5769861 -5436573 -3773415 -1807270 348415 2612505 3711471
6994C711471j091084k105299r10072R55562J871384J824407J088802k57084r58703
$$ 3711471 2620387 515088 -394984 560578 2431962 4256369 5345171 5088087 4129384
6985D129384L95840K214995R40494l493046o453216m678581o22879J378350O13973
$$ 4129384 4525224 6740219 7680713 4187667 -2265549 -6944130 -7567009 -6188659 -5574686
6976e574686o96129j202601q32949P75741L491441N474805N077664L126439J552243
$$ -5574686 -6270815 -7473416 -8306365 -7530624 -4039183 1435622 6513286 9639725 11191968
6967A1191968P54445o4804j039695j692144j877571j453804j57756J211920J048223
$$ 11191968 11946413 11881609 10841914 9149770 7272199 5818395 5660639 6872559 7920782
6958G920782n90459j579932q81859P6739L77445J218737K745675K374272r10259
$$ 7920782 7330323 5750391 4868532 4945271 5322716 6541453 9287128 11661400 10751141
6949A0751141l439038j740516J637790J455919k336153m521617k179329J873042
$$ 10751141 7312103 5571587 7209377 8665296 6329143 1807526 -371803 1501239
6941A501239L738892K876900Q34197j354990l028215l324253k093969j05587K045333
$$ 1501239 5240131 8117031 8951228 7596238 4568023 1243770 -850199 -955786 1089547
6932A089547L804333L691284P40666k910899l440685k24731K887778K344109q97955
$$ 1089547 4893880 8585164 9325830 6414931 2974246 2749515 5637293 7981402 7083447
6923G083447l231715k977888j569642j022645j658769k257862j695014j83937
$$ 7083447 3851732 873844 -695798 -1718443 -3377212 -5635074 -7330088 -7514025
6915g514025J136202J707398J917248J739699L66387j816066k436803k22718K319634
$$ -7514025 -6377823 -4670425 -2753177 -1013478 -647091 -2463157 -4899960 -5122678 -2803044
6906b803044J763345j348485l194042k103264l96322l26241j045653q02845K06240
$$ -2803044 -1039699 -2388184 -5582226 -7685490 -8081812 -8408053 -9453706 -10256551 -10050311
6897a0050311P32071N11796j757n91668p54614M66048K879190M479162L640539
$$ -10050311 -9318240 -8806444 -8808201 -9399869 -10154483 -9688435 -6809245 -2330083 1310456
6888A310456J250442l21774J51192J704515K160873M5418l551472n198609k738311
$$ 1310456 2560898 2239124 2390316 4094831 6255704 6301122 2749650 -2448959 -5187270
6879e187270J385963K490896l11468k881438j795013J283481K698590J914492
$$ -5187270 -3801307 -1310411 -1621879 -4503317 -6298330 -5014849 -2316259 -401767
6871d01767J056014R86713O50040m16663j438210k061230k614571k821526j996197
$$ -401767 654247 1640960 2291000 1874337 436127 -1625103 -4239674 -7061200 -9057397
6862i057397m04220J085259K373946L595546L738452J806703q77873j728454m34561
$$ -9057397 -9461617 -8376358 -6002412 -2406866 1331586 3138289 2260416 531962 97401
6853I7401O79045K62733l02430L40895J140854N38321q19253j098458j08825O53431
$$ 97401 776446 1039179 736749 1077644 2218498 2756819 1937566 839108 730283 1383714
6843A383714L75062k34778m02625k36812l7518K25008L82856j06079j290907k226034
$$ 1383714 1758776 1523998 1121373 884561 847043 1072051 1454907 1348828 57921 -2168113
6833b168113j859608k18809J594578K466114K164515J320530O87657M36359J96871
$$ -2168113 -4027721 -4246530 -2651952 -185838 1978677 3299207 3986864 4423223 4620094
6824D620094k25515m63369j71583K69323J37809o07428j244223j277342q95376
$$ 4620094 4394579 3931210 3759627 4028950 4166759 3559331 2315108 1037766 142390
6815A42390k80746P42363J880019K010997O15334r70660r83104K20762M66523
$$ 142390 -138356 604007 2484026 4495023 5110357 4139697 3156593 3377355 3843878
6806C843878j039450k280058j182575J303586K334036Q96299j120203j689839
$$ 3843878 2804428 524370 -658205 645381 2979417 3875716 2755513 1065674
6798A065674j099855r67342j747857k235345j305042O93770K481691L217739K875152
$$ 1065674 -34181 -1001523 -2749380 -4984725 -6289767 -5595997 -3114306 103433 2978585
6789B978585J598635m67198k459335k821851j013579J287430J928268J065930
$$ 2978585 4577220 4110022 1650687 -1171164 -2184743 -897313 1030955 2096885
6781B096885P19239J444777J443234j92677j535070r54070k86479k049867m592451
$$ 2096885 2816124 4260901 5704135 5511458 3976388 3022318 2735839 685972 -3906479
6772c906479l605607J244989M747362K815123k041533m288256k523039k08969
$$ -3906479 -7512086 -6267097 -1519735 1295388 -746145 -5034401 -7557440 -7766409
6764g766409n2562o42251O46971L495204M890714K957799n99434k266428o70296
$$ -7766409 -7818971 -8461222 -7814251 -4319047 571667 3529466 2930032 663604 -6692
6755f692J896928K428065J008348K53678J092258J289164p74759k954110k128240
$$ -6692 1890236 4318301 5326649 5580327 6672585 7961749 7186990 4232880 2104640
6746B104640J153009L407188L069863J867575J234961K55685j791346l397518
$$ 2104640 3257649 6664837 9734700 11602275 12837236 13092921 11301575 7904057
6738G904057l098520j889991j395461j140045O8853J174898K5160k840726m314036
$$ 7904057 4805537 2915546 1520085 380040 448893 1623791 1648951 -1191775 -5505811
6729e505811l023652r84575q5219N79925K269051L630376K607294J37508o78824
$$ -5505811 -8529463 -9514038 -9599257 -9019332 -6750281 -3119905 -512611 -375103 -1053927
6720a053927J094228L049449K954093J464452M83872L46844j11421j440514k686397
$$ -1053927 40301 3089750 6043843 7508295 7992167 8339011 8227590 6787076 4100679
6711D100679k564671r77394P74065J342853R15826R26750J872706K354347J233828
$$ 4100679 1536008 558614 1332679 2675532 3591358 4518108 6390814 8745161 9978989
6702I978989l09203n46293j82802j228279l206058l337058r63186J179794J223783
$$ 9978989 9669786 9123493 8940691 7712412 4506354 1169296 206110 1385904 2609687
6693B609687P00519J048924O68706j732643l444645j161987L387995N163607K616163
$$ 2609687 3310206 4359130 5027836 3295193 -149452 -1311439 2076556 7240163 9856326
6684I856326r29134k613842l004307l140225k333790m01617R02491N03651k71792
$$ 9856326 8927192 6313350 3309043 168818 -2164972 -2566589 -1664098 -1160447 -1432239
6675a432239l00314p98021k830480m480079k914337J533077N338836N602037K643903
$$ -1432239 -1732553 -2530574 -5361054 -9841133 -12755470 -11222393 -5883557 -281520 2362383
6666B362383q36653k237309j053350Q39323J130083m86283k298744k782465j780882
$$ 2362383 1525730 -711579 -1764929 -925606 204477 -281806 -2580550 -5363015 -7143897
6657g143897J67728K074804K303898K80481j533040j9295L671101M643626J053160
$$ -7143897 -6976169 -4901365 -2597467 -2316986 -3850026 -3869321 -198220 4445406 5498566
6648E498566k820070k559113K74417J209641k48035q03363O35065J328992n64006
$$ 5498566 2678496 119383 393800 1603441 1355406 552043 1187108 2516100 1952094
6639A952094l042029l200489q77758J751747K757055J825848P0813j055808j181842
$$ 1952094 -1089935 -4290424 -5168182 -3416435 -659380 1166468 1237281 181473 -1000369
6630a000369j146708j273395n68694J288795K526458J634754o224l9883J246917
$$ -1000369 -2147077 -3420472 -3989166 -2700371 -173913 1460841 1454617 1414734 2661651
6621B661651J684795R22772O08935J148021J127506P9856r46716j780431l150412
$$ 2661651 4346446 5269218 5878153 7026174 8153680 8233536 7286820 5506389 2355977
6612B355977l883531j389293L799791P044002N099570K87354k756541k508084
$$ 2355977 -1527554 -2916847 882944 7926946 13026516 13313870 10557329 8049245
6604H049245q58663J05594n04171k695765n130546n429454k862061K44203J451172
$$ 8049245 7190582 7296176 6792005 4096240 -1034306 -6463760 -9325821 -9081618 -7630446
6595g630446J336155J795090K584665K042350L97998l61762K72516P82883M37175
$$ -7630446 -6294291 -4499201 -1914536 127814 525812 164050 436566 1219449 1656624
6586A656624J92396L28371l38181j821354j823177R71085M010523L553094l09997
$$ 1656624 1849020 2177391 1839210 17856 -1805321 -834236 3176287 6729381 6419384
6577F419384l478161l019657o49827J22332j012680j072679J426888L900547L281497
$$ 6419384 2941223 -78434 -728261 -605929 -1618609 -2691288 -1264400 2636147 5917644
6568E917644N14140r07876j87633j4872j597146k131220O55353L965581L265190
$$ 5917644 6431784 5523908 5336275 5321403 3724257 1593037 2248390 6213971 9479161
6559I479161r86374l632881k050649M80452O6877k166641k320821K62700K376822
$$ 9479161 8492787 4859906 2809257 3289709 3356586 1189945 -1130876 -868176 1508646
6550A508646J915860N39600O30355J809944J975947N69639q46320r46697k43029
$$ 1508646 3424506 3964106 4594461 6404405 8380352 8949991 8103671 7156974 6913945
6541F913945q3245q57997j630257j296109R1547J189783P69550o89488j350628
$$ 6913945 6830700 5972703 4342446 3046337 3137884 4327667 5097217 4407729 3057101
6532C057101l52526Q91777N71355r29940j653604j102175r74301k343650l681746
$$ 3057101 2704575 3596352 4167707 3237767 1584163 481988 -492313 -2835963 -6517709
6523f517709k855372o1923K513201L360882K815926J993489J606167J568605J048023
$$ -6517709 -9373081 -9435004 -6921803 -3560921 -744995 1248494 2854661 4423266 5471289
6514E471289n95368k345801k080094M06044K276380J259417r14686j091553K67515
$$ 5471289 4875921 2530120 450026 856070 3132450 4391867 3477181 2385628 2653143
6505B653143j53007k822222m121748j994031N94338J23523k192946k524629j27137
$$ 2653143 2500136 -322086 -4443834 -6437865 -5843527 -5720004 -7912950 -10437579 -10564716
6496a0564716K219404K673220K182271J921505J631046J064325Q20030Q83372
$$ -10564716 -8345312 -5672092 -3489821 -1568316 62730 1127055 1947085 2830457
6488B830457K35205j065674j125975J035597L279416K670301n69271l192898k980952
$$ 2830457 3065662 1999988 874013 1909610 5189026 7859327 7290056 4097158 1116206
6479A116206r80120P37990J834111K941870L464632K243886J15649n41221N54261
$$ 1116206 136086 874076 2708187 5650057 9114689 11358575 11474224 10933003 11487264
6470A1487264O35092j956896m616964l772859n3394K583114K290263R01378J7044
$$ 11487264 12122356 10165460 5548496 1775637 1722243 4305357 6595620 7496998 7514042
6461G514042j173370l089540l819037j982487O28824J459954O86513K29241N81687
$$ 7514042 6340672 3251132 -567905 -2550392 -1921568 -461614 224899 454140 1035827
6452A035827P96051P04412R89328J545130J640865J334615J099427N14541j023069
$$ 1035827 1831878 2536290 3525618 5070748 6711613 8046228 9145655 9660196 8637127
6443H637127k693713k992735j793859k63136Q58885J505548J446128P60326M74261
$$ 8637127 5943414 2950679 1156820 893684 1752569 3258117 4704245 5464571 5938832
6434E938832J032811R56807r24228k717995j578682J741352L312764J330348j670879
$$ 5938832 6971643 7928450 7004222 4286227 2707545 4448897 7761661 9092009 7421130
6425G421130k571449j212479O29270J513966O70899j698685l456695k191065R82922
$$ 7421130 4849681 3637202 4266472 5780438 6451337 4752652 1295957 -895108 87814
6416H7814J823670j150732l773578j750225L019747M842886J849982k097662k955397
$$ 87814 1911484 760752 -3012826 -4763051 -1743304 3099582 4949564 2851902 -103495
6407a03495q99405J413728K393937K045039P45589q97247j778133j158010L93039
$$ -103495 -1002900 410828 2804765 4849804 5595393 4698146 2920013 1762003 2155042
6398B155042J597867J808045J247477K24146j154948k358117k274529m72944J604859
$$ 2155042 3752909 5560954 6808431 7032577 5877629 3519512 1244983 772039 2376898
6389B376898J785838j28172j904638j935027j467457k235321l050443j351968
$$ 2376898 4162736 4034564 2129926 194899 -1272558 -3507879 -6558322 -7910290
6381g910290K186953L701556J529361j389532j941216q73755l69418k65647M58862
$$ -7910290 -5723337 -2021781 -492420 -1881952 -3823168 -4696923 -5066341 -5331988 -4873126
6372d873126O65381r25666k230186l25762L264452M086501J580271j05470R61352
$$ -4873126 -4207745 -5133411 -7363597 -7689359 -4424907 -338406 1241865 1136395 2097747
6363B097747J443960j161848l698611k231851J411329K357899J17763j250538
$$ 2097747 3541707 2379859 -1318752 -3550603 -2139274 218625 336388 -914150
6355i14150J92535J820500J216667m01801r00739l93976k39K85616P25570O28122
$$ -914150 -721615 1098885 2315552 1913751 1013012 619036 618797 904413 1629983 2258105
6345B258105k68727o61115L61815J449406Q52963q03110j414004l59049J178183
$$ 2258105 1989378 1328263 1690078 3139484 3992447 3189337 1775333 1416284 2594467
6336B594467K262279K702287J906584n97330l346758l771399j584006M14616Q663
$$ 2594467 4856746 7559033 9465617 8868287 5521529 1750130 166124 580740 589403
6327E89403j365769o86216K349437M756023M067698J373716k78304O0926R7538
$$ 589403 -776366 -1462582 886855 5642878 9710576 11084292 10805988 10866914 10964452
6318A0964452k135239m684096l707538P54287L693294J599259k313600k520095
$$ 10964452 8829213 4145117 437579 1191866 4885160 6484419 4170819 1650724
6310A650724O72052J808364q61881k369292R17860M872887L495804j790487m001684
$$ 1650724 2322776 4131140 3269259 899967 1817827 6690714 10186518 8396031 4394347
6301D394347p18027K965161K339167q03467k163102j422233j443143k883304l143757
$$ 4394347 3676320 6641481 8980648 8177181 6014079 4591846 3148703 265399 -2878358
6292b878358o91792K172088K073064r67601l193548j606446K012231K953310k99372
$$ -2878358 -3570150 -1398062 675002 -292599 -3486147 -5092593 -3080362 -127052 -426424
6283d26424l626523k523910J710989L766895J760686m80660N48695K945149K617618
$$ -426424 -4052947 -6576857 -4865868 -1098973 661713 181053 729748 3674897 6292515
6274F292515n47733k701781j503669J114088J998231O06447j148731j718082j355506
$$ 6292515 5744782 3043001 1539332 2653420 4651651 5258098 4109367 2391285 1035779
6265A035779r57831n57585L13205J221723J061112K0131r5279J395030K346280
$$ 1035779 77948 -479637 -166432 1055291 2116403 2136534 2041255 3436285 5782565
6256E782565O55401k251101l227483k047018j275438j640984j016993J230342
$$ 5782565 6437966 4186865 959382 -1087636 -2363074 -4004058 -5021051 -3790709
6248c790709K550228J567698O78818J817142K775276R86494j632061j507683P16455
$$ -3790709 -1240481 327217 1006035 2823177 5598453 6584947 4952886 3445203 4161658
6239D161658J359983j94517q99978N21879J653651O18119j277421k199134k120948
$$ 4161658 5521641 5327124 4427146 4949025 6602676 7220795 5943374 3744240 1623292
6230A623292j458849j23400J009727L67644j437167j666681L14590J643872M28960
$$ 1623292 164443 41043 1050770 1418414 -18753 -1685434 -1370844 273028 701988
6221G01988j200792p33824O06413K48865j167339r19879J124042K199744Q81719
$$ 701988 -498804 -1232628 -626215 -377350 -1544689 -2464568 -1340526 859218 1740937
6212A740937j090374j591210o43374L14864J77111j158136k703952k911605j305112
$$ 1740937 650563 -940647 -1584021 -1269157 -1092046 -2250182 -4954134 -7865739 -9170851
6203i170851O50961J407207J498459K350784L470333K923637O88427p13578K38848
$$ -9170851 -8519890 -7112683 -5614224 -3263440 206893 3130530 3818957 3105379 3344227
6194C344227J722694J067383j609557l662480l210100r44340J170097K006352
$$ 3344227 5066921 6134304 4524747 862267 -2347833 -3292173 -2122076 -115724
6186a15724J854050J464063J059293M55193j76618l60804k58798o60292j508413
$$ -115724 1738326 3202389 4261682 4716875 4540257 4179453 3920655 3260363 1751950
6177A751950j457196J21124J719302J721630Q82530Q28776R24505o25414k755234
$$ 1751950 294754 415878 2135180 3856810 4739340 5568116 6492621 5867207 3111973
6168C111973k055466J686087L884916J303094l028012l970342j219782J358230
$$ 3111973 1056507 2742594 6627510 7930604 4902592 932250 -287532 1070698
6160A070698J808574J492523J017384q64492l606999m161938j571301J051106
$$ 1070698 2879272 4371795 5389179 4524687 917688 -3244250 -4815551 -3764445
6152c764445J097088K4885L0913R4459j494362k997337j522870J802804K998065
$$ -3764445 -2667357 -2642472 -2611559 -2517100 -4011462 -7008799 -8531669 -6728865 -3730800
6143c730800J231886k33348N21454J493795Q00233j75142L38774J227617N38412
$$ -3730800 -2498914 -2732262 -2210808 -717013 83220 -91922 246852 1474469 2012881
6134B012881j126665j732197j031553l49069l1830O88942J826590K608100K963122
$$ 2012881 886216 -845981 -1877534 -2226603 -2258433 -1569491 257099 2865199 5828321
6125E828321L237104K741163N05815k538263m019152l146273j711515j529272
$$ 5828321 9065425 11806588 12312403 9774140 5754988 2608715 897200 -632072
6117f32072k161359j860278J22016K750860M193452L394530J222415n3752Q06067
$$ -632072 -2793431 -4653709 -4531693 -1780833 2412619 5807149 7029564 6975812 7781879
6108G781879K304343J944578m84379k679086k986323k312696k286463k805651
$$ 7781879 10086222 12030800 11546421 8867335 5881012 3568316 1281853 -1523798
6100a523798k395977l07514K507471M090092K878862p99276m311423m781412k147836
$$ -1523798 -3919775 -4227289 -1719818 2370274 5249136 4449860 138437 -4642975 -6790811
6091f790811P54441J720468J590497K211580L320334L201773J756057P97205J096643
$$ -6790811 -6036370 -4315902 -2725405 -513825 2806509 6008282 7764339 8561544 9658187
6082I658187J032909q91691l525418m347014k630056r2452J418278J724459J603116
$$ 9658187 10691096 9799405 6273987 1926973 -703083 -795535 622743 2347202 3950318
6073C950318J354043Q39072L45457L99724P55470M90469n44830j171848m70205
$$ 3950318 5304361 6143433 6488890 6888614 7644084 8134553 7589723 6417875 5947670
6064E947670O42201M50283j045182j855956p80068N71258k72619k985283m245307
$$ 5947670 6589871 7040154 5994972 4139016 3358948 3930206 3657587 672304 -3573003
6055c573003j873838J940769K979083K58896k714986k543163j58984J027411J06080
$$ -3573003 -5446841 -3506072 -526989 -268093 -2983079 -5526242 -5685226 -4657815 -4551735
6046d551735m87903R33634K762448K676947R60619l19339k88294K27412M47480
$$ -4551735 -5039638 -4106004 -1343556 1333391 2294010 1974671 1686377 1913789 2361269
6037B361269K65086m85849j847389k953650k809094j802552j147139q58675K67887
$$ 2361269 2626355 2140506 293117 -2660533 -5469627 -7272179 -8419318 -9277993 -9010106
6028i010106K444057M061888L672838J768963k6287q27796j032832j442943k126750
$$ -9010106 -6566049 -2504161 1168677 2937640 2911353 2083557 1050725 -392218 -2518968
6019b518968j976939K46976L878686N995565M315373J55941k817974k719991j005962
$$ -2518968 -4495907 -4248931 -370245 5625320 9940693 10096634 7278660 4558669 3552707
6010C552707j5208m95962j737965k579420j880637N28462K916539L105279J298212
$$ 3552707 3537499 3041537 1303572 -1275848 -3156485 -2628023 288516 3393795 4692007
6001D692007p1962K25023P49412J15412q12523q06804o28349j664973l333705
$$ 4692007 4620045 4845068 5594480 5709892 4897369 4090565 3462216 1797243 -1536462
5992a536462l682321k046018L26430J898641K018988R81443j19987j14385R24535
$$ -1536462 -5218783 -7264801 -6938371 -5039730 -3020742 -2039299 -2159286 -2273671 -1349136
5983a349136J736757J738097J700943K007679J819934R61067P58135J483880R11685
$$ -1349136 387621 2125718 3826661 5834340 7654274 8615341 9373476 10857356 11769041
5974A1769041k336581n623256n264339j666777J407660K117592K017690K408676
$$ 11769041 9432460 3809204 -1455135 -3121912 -1714252 403340 2421030 4829706
5966D829706K468758J660416J056093J106819N26451j284785k781251k601619
$$ 4829706 7298464 8958880 10014973 11121792 11648243 10363458 7582207 4980588
5958D980588j553551r44248o38142j49558L1795k26960L02641K010842K744031
$$ 4980588 3427037 2482789 1844647 1695089 1726884 1499924 1802565 3813407 6557438
5949F557438O11433k523733k936124o3986K830994L118528J529314p3876j282001
$$ 6557438 7168871 4645138 1709014 1645028 4476022 7594550 9123864 9049988 7767987
5940G767987k298028k455392j308711j1342R7822m99049n01557p8094k79703o47942
$$ 7767987 5469959 3014567 1705856 1694514 1792336 1293287 791730 713636 433933 -214009
5930b14009K89237K008924K036848q1090j406241L240J651851L17033k489014
$$ -214009 75228 2084152 4121000 4039910 2633669 2636909 4288760 4605793 2116779
5921B116779k436011P71966K568488M53876k157238j271963J636853K205141j13307
$$ 2116779 -319232 452734 3021222 3475098 1317860 45897 1682750 3887891 3774584
5912C774584j649987l39452J571748J362639l33553j025548k8313J086444J113838
$$ 3774584 2124597 1785145 3356893 4719532 4385979 3360431 3332118 4418562 5532400
5903E532400P88167J341832K307293J818600o25778k792134k358374k81172L78221
$$ 5532400 6320567 7662399 9969692 11788292 11162514 8370380 6012006 5730834 6109055
5894F109055j125621k373585j908957j437075k377095k927966j090087J499236
$$ 6109055 4983434 2609849 700892 -736183 -3113278 -6041244 -7131331 -5632095
5886e632095J834252K74980k21401J152090K265846J767258O29267m7245j64995
$$ -5632095 -3797843 -3522863 -3744264 -2592174 -326328 1440930 2070197 2022952 1857957
5877A857957L76729J299322Q80549j859997m253655k684242J713734L807697J578705
$$ 1857957 2234686 3534008 4414557 2554560 -1699095 -4383337 -2669603 1138094 2716799
5868B716799j383111j711796o49681o25378j157353q92734o47998j316412j194553
$$ 2716799 1333688 -378108 -1027789 -1653167 -2810520 -3703254 -4351252 -5667664 -6862217
5859f862217J347011M377838M806854K893580J309440Q16676j6589j484982k185690
$$ -6862217 -5515206 -1137368 3669486 6563066 7872506 8689182 8672593 7187611 5001921
5850E001921j674688j067945q27061j17013J333487K461226K308244J124545K1767
$$ 5001921 3327233 2259288 1432227 1315214 2648701 5109927 7418171 8542716 8564483
5841H564483J59614J599844K391746K63655l730862n249295k183905J901627K465738
$$ 8564483 8724097 10323941 12715687 12979342 9248480 3999185 1815280 3716907 6182645
5832F182645K63126m65655J234135K149174N08820j672396k509794k655454k549817
$$ 6182645 6445771 5980116 7214251 9363425 9872245 8199849 5690055 3034601 484784
5823D84784q99930K175125L681571J935470l91449k53843R02951k99851l118993
$$ 484784 -415146 1759979 5441550 7377020 6985571 6731728 7634679 7334828 4215835
5814D215835l227704N85611M087872L466268N22973m39037J048598J555521n73691
$$ 4215835 988131 1573742 5661614 9127882 9650855 9211818 10260416 11815937 11242246
5805A1242246k812701k582833r57102l54114p06916n72313n67001k292755m283508
$$ 11242246 8429545 5846712 4889610 4535496 3828580 3256267 2689266 396511 -3886997
5796c886997k876028J967506N297203L597544l83154j768934r1906J382528J085033
$$ -3886997 -6763025 -4795519 501684 4099228 3716074 1947140 1855234 3237762 4322795
5787D322795L99764L32260K88843N2447O3491l17506k107980m132524l886322
$$ 4322795 4722559 5054819 5343662 5396109 5459600 5142094 3034114 -1098410 -4984732
5778d984732j323298R11012J519116J936517K788332K082040j189681m214346
$$ -4984732 -6308030 -5397018 -3877902 -1941385 846947 2928987 1739306 -2475040
5770b475040l671884l03447K307498K513944J740263J408782J303916J221201
$$ -2475040 -6146924 -6450371 -4142873 -1628929 111334 1520116 2824032 4045233
5762D045233J827703K789948J955333j717118n417651n017651m61732L649779
$$ 4045233 5872936 8662884 10618217 8901099 3483448 -1534203 -1995935 1653844
5754A653844L858078K011034J676296K438589J115607k329375m275938l250121
$$ 1653844 5511922 7522956 9199252 11637841 12753448 10424073 6148135 2898014
5746B898014j954820k056243j316925J465920K900760L03552k914686j949100
$$ 2898014 943194 -1113049 -2429974 -964054 1936706 2240258 -674428 -2623528
5738b623528J877004L530401K315700J702173K134733L77059l616173n363794
$$ -2623528 -746524 2783877 5099577 6801750 8936483 9313542 5697369 333575
5730C33575k916020K13214J103381J298816K307805K216861j50178k066514j293939
$$ 333575 -2582445 -2369231 -1265850 32966 2340771 4557632 4407454 2340940 1047001
5721A047001J19006j91812p20977M80935J564869J76680j806829j201137R42805
$$ 1047001 1166007 974195 253218 734153 2299022 2475702 668873 -532264 410541
5712D10541J093194r01587j858287l76741J633745K038951L62411k527289m332728
$$ 410541 1503735 602148 -1256139 -1632880 865 2039816 2402227 -125062 -4457790
5703d457790k544025J854914M132108K119309l3697J781521M593735K980581j631719
$$ -4457790 -7001815 -5146901 -1014793 1104516 1070819 2852340 7446075 10426656 8794937
5694H794937k923897j59906M44284l980172p906390n556531J008655N432175N037746
$$ 8794937 5871040 5711134 6155418 2175246 -5731144 -11287675 -10279020 -4846845 190901
5685A90901J939891j069301k560023k138674o11646N48603J129353K054730K788196
$$ 190901 2130792 1061491 -1498532 -3637206 -4248852 -3700249 -2570896 -516166 2272030
5676B272030J427763j617710l077950j597469l7331q16958j912002m22057K333713
$$ 2272030 3699793 2082083 -995867 -2593336 -2630667 -3447625 -5359627 -5781684 -3447971
5667c447971K807895P30309r95723j090125j019612j373101n36622K052645M006332
$$ -3447971 -640076 90233 -905490 -1995615 -3015227 -4388328 -4924950 -2872305 1134027
5658A134027K979906N3859j480807j20777K286958K958072J329558o44592j087905
$$ 1134027 4113933 4167792 2686985 2566208 4853166 7811238 9140796 8496204 7408299
5649G408299l33376K6027m25714o19921n9165K58059m04863j044438l19948J222937
$$ 7408299 7074923 7100950 6675236 6055315 5996150 6254209 5849346 4804908 4484960 5707897
5639E707897J604396Q2753j662997j561320J65580J214815K58199j201163j035656
$$ 5707897 7312293 7395046 5732049 4170729 4336309 5551124 5809323 4608160 3572504
5630C572504J70935j21369k263690l394891j641266R31344J419246J84480m97884
$$ 3572504 3743439 3622070 1358380 -2036511 -3677777 -2746433 -1327187 -1142707 -1640591
5621a640591k31456j25599P2450J301925K491954J855939L44334L76966J516472
$$ -1640591 -1872047 -1997646 -1925196 -623271 1868683 3724622 4068956 4445922 5962394
5612E962394J147778o62218j140270L7018O5695j565029j717711O09046J907808
$$ 5962394 7110172 6447954 5307684 5344702 5410397 3845368 2127657 2736703 4644511
5603D644511J20060j583255k78156J649578R35428p35231k229J968896J680337
$$ 4644511 4764571 3181316 2903160 4552738 5488166 4752935 4750706 6719602 8399939
5594H399939l02513m47176J301591J367369j286011l544135l206743j570557k33578
$$ 8399939 8097426 7650250 8951841 10319210 9033199 5489064 2282321 711764 478186
5585D78186R45935J733274Q05429j468476k366300m54002K242694K986966J527530
$$ 478186 1424121 3157395 3962824 2494348 128048 -325954 1916740 4903706 6431236
5576F431236m69230j674416j826794j258610l96958O58920J868109K289908P27231
$$ 6431236 5962006 4287590 2460796 1202186 805228 1464148 3332257 5622165 6349396
5567F349396j760019k020547O61380K518305O19014k101053j152721K014630K019219
$$ 6349396 4589377 2568830 3230210 5748515 6367529 4266476 3113755 5128385 7147604
5558G147604j650242l655838j413395J076994J37013k014101j767986J412L49928
$$ 7147604 5497362 1841524 428129 1505123 1642136 -371965 -2139951 -2138539 -1788611
5549a788611n72073o16458K95414P68754R82644J933320K932362K726331J879543
$$ -1788611 -2360684 -2977142 -2681728 -1912974 -930330 1002990 3935352 6661683 8541226
5540H541226J374789K47287k438987m522333l026664J060557L538348K440293
$$ 8541226 9916015 10163302 7724315 3201982 175318 1235875 4774223 7214516
5532G214516j94004k035530k915413k973845j331102J866329M102269L000768
$$ 7214516 7020512 4984982 2069569 -904276 -2235378 -369049 3733220 6733988
5524F733988p22875m036820m758350l145907q59960Q21000J764712K400419K708393
$$ 6733988 6011113 1974293 -2784057 -5929964 -6789924 -5968924 -4204212 -1803793 904600
5515I04600K184775R12406J2823M08448J498341J760926N95528r24357j199703
$$ 904600 3089375 4001781 4014604 4423052 5921393 7682319 8277847 7353490 6153787
5506F153787Q2103J238183R4982l173941n228694k953456K333084N655936L895096
$$ 6153787 6235890 7474073 7569055 4395114 -833580 -3787036 -1453952 4201984 8097080
5497H097080q61807m036064l215275M77785M018933M592167J667895j969744k720047
$$ 8097080 7235273 3199209 -16066 461719 4480652 9072819 10740714 8770970 6050923
5488F050923n13219J145576K71259j048041p11076j83248j294199k203044l61764
$$ 6050923 5537704 6683280 6954539 5906498 5195422 5012174 3717975 1514931 1153167
5479A153167K411666K256022k78704q17624J705884L203998Q92866k621416l664561
$$ 1153167 3564833 5820855 5542151 4724527 6430411 9634409 10527275 7905859 4241298
5470D241298k394618j077106m00308o2236o14760j994706k122272K38224K681904
$$ 4241298 1846680 769574 369266 307030 -307730 -2302436 -4424708 -4186484 -1504580
5461a504580K054553r32895k856549k622347k244168k638180j897648J124718
$$ -1504580 549973 -382922 -3239471 -5861818 -8105986 -10744166 -12641814 -11517096
5453a1517096M086897L925115J014318j246918n22993K158425M060404L578105
$$ -11517096 -7430199 -3505084 -2490766 -3737684 -4260677 -2102252 1958152 5536257
5445E536257J246444j223169k385127j943197p89747k13942p41967j641959j748025
$$ 5536257 6782701 5559532 3174405 1231208 441461 227519 -514448 -2156407 -3904432
5436c904432p80460M15480R50151Q00936N10692M24153M77856L76794j83482j010877
$$ -3904432 -4684892 -4269412 -3319261 -2518325 -2007633 -1583480 -1105624 -728830 -912312 -1923189
5426a923189j135959J01645J583739J341975n65666j741790r75780j42571q79760
$$ -1923189 -3059148 -2957503 -1373764 -31789 -597455 -2339245 -3315025 -3457596 -4337356
5417d337356j475664J31189K009906Q50396j851211r92054M013851P180837M311835
$$ -4337356 -5813020 -5681831 -3671925 -2821529 -4672740 -5664794 -1650943 5529894 9841729
5408I841729q36020k177697K25343J517793k96450k581788l008514k042350o73159
$$ 9841729 9005709 6828012 7053355 8571148 8274698 5692910 2684396 642046 -31113
5399c1113O05851M97930j778700l605718j247821M112728O510037L010186k187813
$$ -31113 574738 1072668 -706032 -4311750 -5559571 -1446843 5063194 8073380 5885567
5390E885567l726863j891535m27505k92675M96061K160865K383961L66642j524469
$$ 5885567 2158704 267169 -160336 -453011 43050 2203915 4587876 4954518 3430049
5381C430049j017257J278328L102210L033798J209497j194516k729569k774094
$$ 3430049 2412792 3691120 6793330 9827128 11036625 9842109 7112540 4338446
5373D338446j987784j102643J05050J622607K018420L02880j758890j544991M84411
$$ 4338446 2350662 1248019 1353069 2975676 4994096 5296976 3538086 1993095 2477506
5364B477506J383450M31185K38552K115429L327118J105737k765434m001412j359219
$$ 2477506 3860956 4292141 4530693 6646122 9973240 11078977 8313543 4312131 2952912
5355B952912K202606L403575J758657r37153k632857k499450j389091p04712m39729
$$ 2952912 5155518 8559093 10317750 9380597 6747740 4248290 2859199 2154487 1714758
5346A714758P02119K700850L398035J568816q72368j562178j001812r34964r66624
$$ 1714758 2416877 5117727 8515762 10084578 9212210 7650032 6648220 5713256 4746632
5337D746632K46340J529265M62959k120958k545411K83047L212140L560577K288151
$$ 4746632 4992972 6522237 6985196 4864238 2318827 2601874 5814014 9374591 11662742
5328A1662742J100436m57307k927250m548180l513028j015397K36131n28748j951109
$$ 11662742 12763178 12305871 9378621 4830441 1317413 302016 538147 9399 -1941710
5319a941710k730649k384915q43953J173189K221093J819846J220909J536915
$$ -1941710 -4672359 -7057274 -7901227 -6728038 -4506945 -2687099 -1466190 70725
5311G0725K234516K358163J884997R90610m35700j641280j249056L34434Q80258
$$ 70725 2305241 4663404 6548401 7539011 7103311 5462031 4212975 4547409 5427667
5302E427667j37052m64409J009341K107369J168956J4281M84011R83202l12368
$$ 5427667 5290615 4826206 5835547 7942916 9111872 9126153 9610164 10593366 10280998
5293A0280998j634667p73273N51771k93805j843221j270346K1073j006185k568613
$$ 10280998 8646331 7873058 8424829 8131024 6287803 5017457 5038530 4032345 1463732
5284A463732m71109L852132M510262P25246j660107K74042K162183R5931l407829
$$ 1463732 992623 4844755 9355017 10080263 8420156 8694198 10856381 10952312 7544483
5275G544483m556280m017168l718443k681575j52585J276973p2445j262981M76025
$$ 7544483 2988203 -1028965 -4747408 -7428983 -7581568 -6304595 -6377040 -7640021 -7163996
5266g163996K747270K217793N17337R60773K264550R96692j804535k165217j18231
$$ -7163996 -4416726 -2198933 -1681596 -720823 1543727 2540419 735884 -1429333 -1547564
5257a547564N24906j038316j452542O91531K486289J612389l96233j205701q22679
$$ -1547564 -1022658 -2060974 -3513516 -2821985 -335696 1276693 880460 -325241 -1147920
5248a147920l66616k21231m39038r66977r18216N43298K491445L255921K846105
$$ -1147920 -1514536 -1735767 -2174805 -3141782 -4059998 -3516700 -1025255 2230666 5076771
5239E076771K336852J504607m18783k292077k295289j222293j427933k650502
$$ 5076771 7413623 8918230 8499447 6207370 3912081 2689788 1261855 -1388647
5231a388647k193848N18896K902032L265831K717921K246061J059978j015454
$$ -1388647 -3582495 -3063599 -161567 3104264 5822185 8068246 9128224 8112770
5223H112770k334531j948006r66165l75903J39251L40519r05873k902037k780751
$$ 8112770 5778239 3830233 2864068 2488165 2627416 2967935 2062062 -839975 -3620726
5214c620726L81995L419205K980726j61308k529152k277168m82539Q23905N20618
$$ -3620726 -3238731 180474 3161200 2999892 470740 -1806428 -2288967 -1465062 -944444
5205i44444r93312k178411j931986q98907k20110N52895K382015L959981K782076
$$ -944444 -1937756 -4116167 -6048153 -6947060 -7167170 -6614275 -4232260 -272279 2509797
5196B509797o23062k519001j083604J114383J228268j133m68411l43870r13720
$$ 2509797 1886735 -632266 -1715870 -601487 626781 625648 157237 -186633 -1100353
5187a100353j458631p7341L004712N191074M557945J776081r57117k089247j929916
$$ -1100353 -2558984 -2636325 368387 5559461 10117406 11893487 10936370 8847123 6917207
5178F917207j953701k635750k553408p18143J123974P01580q57215l37081K178215
$$ 6917207 4963506 2327756 -225652 -943795 180179 881759 24544 -312537 1865678
5169A865678K773130k52409l266900k411188R88742K748723J510550n81136j449357
$$ 1865678 4638808 4386399 1119499 -1291689 -302947 2445776 3956326 3375190 1925833
5160A925833q27500O26074J816874J455552n33540k413818k587626j364500k1102
$$ 1925833 1098333 1724407 3541281 4996833 4463293 2049475 -538151 -1902651 -1923753
5151a923753O92420M22024q30897j833034r61541J286404K581466K240135J977395
$$ -1923753 -1231333 -809309 -1640206 -3473240 -4434781 -3148377 -566911 1673224 3650619
5142C650619K368983J633079n62245j339502J046908L977046M167187K107131
$$ 3650619 6019602 7652681 7090436 5750934 6797842 10774888 14942075 17049206
5134A7049206K43488p85752j434019j264359n26263j227725l653722m421408j330835
$$ 17049206 17292694 16506942 15072923 13808564 13282301 12054576 8400854 3979446 2648611
5125B648611K457174K798476N96434o24949p33583j911725l563484l326904j793062
$$ 2648611 5105785 7904261 8500695 7875746 7142163 5230438 1666954 -1659950 -3453012
5116c453012j271563j050667J041677L466199K870328M42211N18679L029722L467961
$$ -3453012 -4724575 -5775242 -4733565 -1267366 1602962 2045173 2563852 5593574 9061535
5107I061535Q77416m87354J134833J909949o31665l236650k591197m69639N5566
$$ 9061535 9938951 9451597 10586430 12496379 11864714 8628064 6036867 5567228 5622794
5098E622794o27470r10712j210543j866934j292729P97087J744794M86278J17648
$$ 5622794 4995324 4084612 2874069 1007135 -285594 511493 2256287 2742565 2860213
5089B860213K618448M630846K481678j675468l072477j266534M61395P06541N88068
$$ 2860213 5478661 10109507 12591185 10915717 7843240 6576706 7038101 7744642 8332710
5080H332710K13182j256431k851919k898607k114114k099475j719438J127038
$$ 8332710 8545892 7289461 4437542 1538935 -575179 -2674654 -4394092 -3267054
5072c267054M785230N103786J548819j855984k312023j375207j324912j722158
$$ -3267054 1518176 6621962 8170781 6314797 4002774 2627567 1302655 -419503
5064d19503j119809L86187J912422L115940L442241J895198j058402k985747k408925
$$ -419503 -1539312 -1153125 759297 3875237 7317478 9212676 8154274 5168527 2759602
5055B759602r47068r63061k055454j735607O77285K658993J661302j425903l201211
$$ 2759602 1812534 849473 -1205981 -2941588 -2264303 394690 2055992 630089 -2571122
5046b571122j923557N09705J297691L02146m10250J14633O71667J46413j025736
$$ -2571122 -4494679 -3984974 -2687283 -2385137 -2795387 -2680754 -2009087 -1862674 -2888410
5037b888410k039641k605426k141212j2430K621964L282083J671485N79311J708976
$$ -2888410 -4928051 -7533477 -9674689 -9687119 -7065155 -3783072 -2111587 -1532276 176700
5028A76700K826720J284264j615398k604603j337141j22657K86572J173674K346944
$$ 176700 3003420 4287684 2672286 67683 -1269458 -1392115 -1105543 68131 2415075
5019B415075J732658q33011k576053j823054m40079o80985j808770j687839l7357
$$ 2415075 4147733 3314722 738669 -1084385 -1524464 -2205449 -4014219 -5702058 -5739415
5010e739415J827282L200039L957028L322641Q70272j651590j714036N25067K092693
$$ -5739415 -3912133 -712094 3244934 6567575 7437847 5786257 4072221 4597288 6689981
5001F689981J208358l38143k7071J582132J709723n98500l289906m302543l824180
$$ 6689981 7898339 7560196 7533125 9115257 10824980 10226480 6936574 2634031 -1190149
4992a190149k801246r76844K045555M906065N524542L708723J199179o95468j999664
$$ -1190149 -3991395 -4968239 -2922684 1983381 7507923 11216646 12415825 11720357 9720693
4983I720693k690974k151234m93327R51272J207300P88004O72539R37866R47146
$$ 9720693 7029719 4878485 4385158 5336430 6543730 7331734 8004273 8942139 9889285
4974I889285L23128o55478j264251r44204j60305l01046j900925l351885k556431
$$ 9889285 10212413 9556935 8292684 7348480 7188175 6887129 4986204 1634319 -922112
4965i22112K71324K644059K653176P34546j339362k147894j359155K04023J277040
$$ -922112 -650788 1993271 4646447 5380993 4041631 1893737 534582 738605 2015645
4956B015645J608616K156932L124238K999016Q73283j653211k698406k805012
$$ 2015645 3624261 5781193 8905431 11904447 12777730 11124519 8426113 5621101
4948E621101l171312k733896m1056L160981L747460J957211P28299Q51874P09992
$$ 5621101 2449789 -284107 -325163 2835818 6583278 8540489 9268788 10120662 10830654
4939A0830654M35910J792921L689368K686686j023158k970352j317951K84253
$$ 10830654 11266564 13059485 16748853 19435539 18412381 15442029 14124078 14408331
4931A4408331j110476l216268k918368j175254l70037j40884Q87383J915811J599820
$$ 14408331 13297855 10081587 7163219 5987965 5617928 5477044 6364427 8280238 9880058
4922I880058P91679J085135K245074K817831J741958j296756m928297n710963
$$ 9880058 10671737 11756872 14001946 16819777 18561735 17264979 12336682 6625719
4914F625719k024126K100284J559506j811662j649154K459662M157680J286654
$$ 6625719 4601593 6701877 8261383 6449721 4800567 7260229 11417909 12704563
4906A2704563m76488K062126L862410P41481l286436l098772k46191J673072K985047
$$ 12704563 12228075 14290201 18152611 18894092 15607656 12508884 12262693 13935765 16920812
4897A6920812M026405J919604l200032n424961k061007J625554J853599K296229
$$ 16920812 20947217 22866821 19666789 14241828 12180821 13806375 15659974 17956203
4889A7956203M981533M885914M47106j135839K976122M649682L82638k05274P232648
$$ 17956203 22937736 27823650 28270756 27134917 30111039 34760721 35143359 34938085 42170733
4880D2170733J0692094L721953N87790J0517939J7153363J0184552J5180571N1638574
$$ 42170733 52862827 56584780 57172570 67690509 84843872 95028424 110208995 161847569
4872A61847569P7437868L0180938p3306966j35921445j00029389j9348759J9976166
$$ 161847569 239285437 269466375 196159409 60237964 -39791425 -59140184 -39164018
4865c9164018P016273p517916R27967J0181130N054355n8406M506232O970320
$$ -39164018 -32147745 -39665661 -38737694 -28556564 -23502209 -23560615 -19054383 -12084063
4857a2084063O36415l427141O39306K855744j801896l881296J186311M064798
$$ -12084063 -11447648 -14874789 -14235483 -11379739 -13181635 -17062931 -15876620 -11811822
4849a1811822n1928k251439K502180N479809P29321l899771j507045J952001n9703
$$ -11811822 -11863750 -14115189 -11613009 -6133200 -5403879 -9303650 -10810695 -8858694 -8918397
4840h918397k883000o76496K649902J747347l81077N85349K017033Q02652o8753
$$ -8918397 -11801397 -12477893 -9827991 -8080644 -8461721 -7876372 -5859339 -5056687 -5125440
4831e125440J588773J860578r97850j521444K824736N190693O31528m591504l301185
$$ -5125440 -3536667 -1676089 -2673939 -4195383 -1370647 3820046 4451574 -139930 -3441115
4822c441115Q58382Q31283j869910k014083j218359l699556o396669l444674K860171
$$ -3441115 -2582733 -1751450 -3621360 -5635443 -6853802 -10553358 -16950027 -20394701 -17534530
4813a7534530N099376K483698Q22277K256570L149222J617871O0184N8374L75675
$$ -17534530 -12435154 -9951456 -9129179 -6872609 -3723387 -2105516 -2045332 -1986958 -1611283
4804a611283P7327n38615j392732j755021Q2571L123277K868296j912790n361119
$$ -1611283 -1533956 -2072571 -3465303 -5220324 -5137753 -2014476 853820 -1058970 -6420089
4795f420089k358559L348232M407732K64876l535597m013591k776936j189878
$$ -6420089 -8778648 -5430416 -1022684 -757808 -4293405 -8306996 -11083932 -12273810
4787a2273810P00041J583377L82424p46923N85487K523701J927105r2692l67551
$$ -12273810 -11573769 -9990392 -9607968 -10354891 -9769404 -7245703 -5318598 -5411290 -5778841
4778e778841N14491k91524k204437k258916n53108L90403M88481J345767J945171
$$ -5778841 -5264350 -5555874 -7760311 -10019227 -10572335 -10181932 -9693451 -8347684 -6402513
4769f402513K99924j712692n65363K670784L686564J942537Q10189J043750j03294
$$ -6402513 -6102589 -7815281 -8380644 -5709860 -2023296 -80759 729430 1773180 1669886
4760A669886k862636l746657j577644L23194l52885j497645n73746J473038K180119
$$ 1669886 -1192750 -4939407 -6517051 -6193857 -6546742 -8044387 -8618133 -7145095 -4964976
4751d964976R74171p35788j168956M93166K890121L207430Q20129j229176n88724
$$ -4964976 -3990805 -4726593 -5895549 -5402383 -2512262 695168 1515297 286121 -302603
4742c02603P12635j9681j254849k38843J365865l660l112926l308016L0631K866950
$$ -302603 410032 390351 -864498 -1103341 262524 258864 -2854062 -6162078 -6131447 -3264497
4732c264497L143234K632309K083750J00234k452886k328760N79040K452773J496438
$$ -3264497 -121263 2511046 4594796 4695030 2242144 -86616 492424 2945197 4441635
4723D441635M9845k94301r22684k323535k752892k162792k687468l778023j970710
$$ 4441635 4491480 4197179 3274495 950960 -1801932 -3964724 -6652192 -10430215 -12400925
4714a2400925K557326M468317J043146l317050l524703m64773K030697K809935
$$ -12400925 -9843599 -5375282 -4332136 -7649186 -11173889 -11638662 -9607965 -6798030
4706f798030K459145M90751k545185l238648K35886M159384L690332m53999l272360
$$ -6798030 -4338885 -3848134 -6393319 -9631967 -9396081 -5236697 -1546365 -2000364 -5272724
4697e272724k090605J236610L605063L379771Q16375j898060j996198O34618K879750
$$ -5272724 -7363329 -6126719 -2521656 858115 1674490 -223570 -2219768 -1585150 1294600
4688A294600K636520J655412K131409K710256P85911k823124m669067l408609
$$ 1294600 3931120 5586532 7717941 10428197 11214108 8390984 3721917 313308
4680C13308r86094N34862Q94250M97456m73603j427012j315959K02170K134531
$$ 313308 -672786 -137924 756326 1253782 780179 -646833 -1962792 -1760622 373909
4671C73909K900942J751358k84270j255695p73444p44549k288334l257950j365079
$$ 373909 3274851 5026209 4741939 3486244 2712800 1968251 -320083 -3578033 -4943112
4662d943112J387769J102040j586839j993471J024561K930076R72215j126257
$$ -4943112 -3555343 -2453303 -4040142 -6033613 -5009052 -2078976 -1106761 -2233018
4654b233018N90184L494969K388179k303792n087645k958340J648947M859740
$$ -2233018 -1642834 1852135 4240314 1936522 -3151123 -6109463 -4460516 399224
4646C99224M933269K272274j139491k534702j048232P79758K61795j590727j879536
$$ 399224 5332493 7604767 6465276 3930574 2882342 3662100 3923895 2333168 453632
4637D53632m51974K53039m88261o95119O65687J823820R89045r70929j771474
$$ 453632 1658 254697 -233564 -928683 -262996 1560824 2549869 1578940 -192534
4628a92534n16559J568694K635457J975290M53634p60867j652464k889404m156492
$$ -192534 -709093 859601 3495058 5470348 5923982 5163115 3510651 621247 -3535245
4619c535245m247848k889812r81238J050219L236018M303530K500061j111926
$$ -3535245 -7783093 -10672905 -11654143 -10603924 -7367906 -3064376 -564315 -1676241
4611a676241k952075j687520J14355M79918R32253K809568M049252K697206P68640
$$ -1676241 -4628316 -6315836 -6201481 -5721563 -4789310 -1979742 2069510 4766716 5535356
4602E535356J022545K132054Q93102k394490m516786m098360k300934m5146J936037
$$ 5535356 6557901 8689955 9583057 7188567 2671781 -1426579 -3727513 -3772659 -1836622
4593a836622J604516j898802n254164m452446n61612J958783J860748J576466
$$ -1836622 -232106 -2130908 -7385072 -11837518 -12399130 -10440347 -8579599 -7003133
4585g003133J744582M75652j655581j319326J562057K635177k7121k608617j662670
$$ -7003133 -5258551 -4782899 -6438480 -7757806 -6195749 -3560572 -3587693 -6196310 -7858980
4576g858980Q13738J540249J241549K022098K723969J172747j247811j584368
$$ -7858980 -7045242 -5504993 -4263444 -2241346 482623 1655370 407559 -1176809
4568a176809l40525l10875j400060q81276J483132K801770J958031J142426J411780
$$ -1176809 -1517334 -1828209 -3228269 -4109545 -2626413 175357 2133388 3275814 4687594
4559D687594O08054k284989m170191k275612Q97700P86789k314758l565594q99550
$$ 4687594 5295648 3010659 -1159532 -3435144 -2537444 -1750655 -4065413 -7631007 -8530557
4550h530557J891553R42150k005494k347336Q92392M307638N055086L727277K252995
$$ -8530557 -6639004 -5696854 -7702348 -10049684 -9157292 -4849654 205432 3932709 6185704
4541F185704J358746P24658q7581j442289l070660l581564j983049L81548J187449
$$ 6185704 7544450 8269108 8181527 6739238 3668578 87014 -1896035 -1514487 -327038
4532c27038L66830n0129O78930J207709Q78731N36045J21631j387333k864330
$$ -327038 39792 -10337 668593 1876302 2755033 3291078 3412709 2025376 -838954
4523h38954j538926J902193K733755q50046m173308k846500O25603J330209j55294
$$ -838954 -2377880 -475687 2258068 1408022 -2765286 -5611786 -4986183 -3655974 -3811268
4514c811268L34260K861904L433549R86950j228040j418723j310573j789323j257003
$$ -3811268 -3477008 -615104 2818445 3805395 2577355 1158632 -151941 -1941264 -3198267
4505c198267N07433J162536p1787r06019j4225R74734Q64275P44085J054680L53777
$$ -3198267 -2690834 -1528298 -1600085 -2506104 -2520329 -1545595 -681320 62765 1117445 1471222
4495A471222j413791j971135p76826m10158j879688k322913K8473K271067J457438
$$ 1471222 57431 -1913704 -2690530 -3100688 -4980376 -7303289 -7274816 -5003749 -3546311
4486c546311m93915k98205J080112O52308p66481K64220L611422N160167K901022
$$ -3546311 -4040226 -4338431 -3258319 -2606011 -3372492 -3108272 503150 5663317 8564339
4477H564339n20373k252874k835771l776030m200062k231442J500553L921149
$$ 8564339 8043966 5791092 2955321 -820709 -5020771 -7252213 -5751660 -1830511
4469a830511L258752J408041J554629L724090M179991L61388m810793n920368
$$ -1830511 1428241 2836282 4390911 8115001 12294992 12656380 7845587 1925219
4461A925219k109364J733066J580525r73632k304766k168736k604907l468332
$$ 1925219 -184145 1548921 3129446 2155814 -148952 -2317688 -4922595 -8390927
4453h390927k631064O8953K307837K730198K282810J904527J289961L93595K5357
$$ -8390927 -11021991 -10953038 -8645201 -5915003 -3632193 -1727666 -437705 -44110 -18753
4444a8753K85235J49685p55416j488954j421507j027228n10595P56519K561072
$$ -18753 266482 416167 -339249 -1828203 -3249710 -4276938 -4787533 -4031014 -1469942
4435a469942L083407J106607j897823l175707j762046Q52025K760729L277894
$$ -1469942 1613465 2720072 822249 -2353458 -4115504 -3263479 -502750 2775144
4427B775144K625630J178488m42206j296416j011974m86205q50648j731978j507137
$$ 2775144 5400774 6579262 6137056 4840640 3828666 3342461 2491813 759835 -747302
4418g47302L45771K155290K117047O28551n04910n52788k66616k80644n61504
$$ -747302 -401531 1753759 3870806 4499357 3994447 3441659 3175043 2894399 2332895
4409B332895j151592j888980j634732L60054K385104J784846j092920k823456
$$ 2332895 1181303 -707677 -2342409 -1982355 402749 2187595 1094675 -1728781
4401a728781j575159N83086J285574J256355K143020L191583K658393R94571o8003
$$ -1728781 -3303940 -2720854 -1435280 -178925 1964095 5155678 7814071 8808642 8740639
4392H740639n19826j470797k394545j854622n32556n58019j859732k184209j033958
$$ 8740639 8220813 6750016 4355471 2500849 1968293 1410274 -449458 -2633667 -3667625
4383c667625l99329p62211K09030L208886M737253J850139k810792m151938j539107
$$ -3667625 -4066954 -4829165 -4620135 -1411249 3326004 5176143 2365351 -1786587 -3325694
4374c325694R55519P73490l34257k81588J24493m12990r14756j24301P62818K8434
$$ -3325694 -2370175 -1596685 -1930942 -2212530 -2088037 -2501027 -3415783 -3540084 -2777266 -2748832
4364b748832j267779p54777J225883K003452Q51878o4975N00481R37188k89446
$$ -2748832 -4016611 -4771388 -3545505 -1542053 -690175 -755150 -254669 682519 393073
4355C93073k169159k973100k536196j382099M73537K397878K754186J259755j03636
$$ 393073 -1776086 -4749186 -7285382 -8667481 -8193944 -5796066 -3041880 -1782125 -1885761
4346a885761j21320j99143j378050j967594o46054O02813j09369o17030J757769
$$ -1885761 -2007081 -2206224 -3584274 -5551868 -6197922 -5595109 -5704478 -6321508 -4563739
4337d563739M617898L421482r66731l099226j374641M3251j112747j428944J665856
$$ -4563739 54159 3475641 2508910 -590316 -1964957 -1921706 -3034453 -4463397 -2797541
4328b797541M749795L701517K66350j121364l78124q94131l048655l347821j83938
$$ -2797541 1952254 5653771 5920121 4798757 4420633 3526502 477847 -2869974 -3053912
4319c053912L385535L773010J277613r67759j028905R0021K45606j166456k628928
$$ -3053912 331623 4104633 5382246 4414487 3385582 3475603 3721209 2554753 -74175
4310g4175k470528q16227R31275J878658J897580P75977j329581k947281k509216
$$ -74175 -2544703 -3360930 -2429655 -550997 1346583 2122560 792979 -2154302 -4663518
4301d663518m29213J529241K568170K909371K331278Q31174j02935M78369O12595
$$ -4663518 -5092731 -3563490 -995320 1914051 4245329 5076503 4973568 5451937 6064532
4292F064532j695822m191841l101410L80334J291308j106786k035965P17845L048831
$$ 6064532 4368710 176869 -2924541 -2544207 -1252899 -2359685 -4395650 -3677805 -628974
4283f28974J412358j675970k331295j015227K6843R86995K326357K076550o43318
$$ -628974 783384 -892586 -3223881 -4239108 -4212265 -3225270 -898913 1177637 534319
4274E34319k657572j318639R33359O03910j184129j226632K69837J028251J104898
$$ 534319 -2123253 -3441892 -2508533 -1904623 -3088752 -4315384 -4045547 -3017296 -1912398
4265a912398J715730J912920N15802q98076p98091q24887k126081j895715J578884
$$ -1912398 -196668 1716252 2232054 1333978 535887 -289000 -2415081 -4310796 -2731912
4256b731912L913278P07492m292840m061307O35970K510357o80011l463015k121131
$$ -2731912 1181366 1888858 -2403982 -6465289 -5829319 -3318962 -3998973 -7461988 -9583119
4247i583119L80292O81251O982M49174J309296J571064J925168K298154J021554
$$ -9583119 -9202827 -8521576 -8514594 -8065420 -6756124 -5185060 -3259892 -961738 59816
4238E9816j747072l126363j726591J47403M901j569393k371620j384835N42209
$$ 59816 -1687256 -4813619 -6540210 -6392807 -6387906 -7957299 -10328919 -11713754 -11171545
4229a1171545J438252m7705k329604j766129K269997N421956M075020M38105j367269
$$ -11171545 -9733293 -9780998 -12110602 -13876731 -11606734 -6184778 -2109758 -1671653 -3038922
4220c038922j262163j161464l08223K131991K944960n03818m156003k562866J903262
$$ -3038922 -4301085 -5462549 -5770772 -3638781 -693821 -1197639 -5353642 -7916508 -6013246
4211f013246K498353r89781k765659j333863p59173j851122q69896K169285K476730
$$ -6013246 -3514893 -4504674 -7270333 -8604196 -9363369 -11214491 -12084387 -9915102 -7438372
4202g438372o54616k065126K46523J983883N67736j014512n46458J27695J0554
$$ -7438372 -8092988 -10158114 -9911591 -7927708 -7359972 -8374484 -8920942 -8793247 -8782693
4193h782693M35492M25588k325604n144791l025428J878417K466247q55078l37001
$$ -8782693 -8347201 -7921613 -10247217 -15392008 -18417436 -16539019 -14072772 -14927850 -15264851
4184a5264851M828286N965791L7241m480852j837604K167358J657032K14039J989994
$$ -15264851 -10436565 -4470774 -4433533 -8914385 -10751989 -8584631 -6927599 -6713560 -4723566
4175d723566L278615N26618k210056j215183j35095k180542l724557k176265j456762
$$ -4723566 -1444951 -918333 -3128389 -4343572 -4478667 -6659209 -10383766 -12560031 -14016793
4166a4016793l390021l120679P01536J648516k134435k949245J983712L917727
$$ -14016793 -17406814 -20527493 -19825957 -18177441 -20311876 -23261121 -21277409 -17359682
4158a7359682j416018n099481j663378N10050l982354o550080k467434j771046
$$ -17359682 -18775700 -23875181 -25538559 -25028509 -29010863 -35560943 -38028377 -39799423
4150c9799423q326419q489416K141915M170300j1155574j9906148q678235j0092125
$$ -39799423 -48125842 -56615258 -54473343 -50303043 -61458617 -81364765 -90043000 -100135125
4142a00135125m8815907p6230838k3046537Q6910915J44583765R5095247P434904
$$ -100135125 -148951032 -225181870 -248228407 -161317492 -16733727 78361520 85796424
4135H5796424k6178038n247196R376061l631164j3898768n590412K097778k282343
$$ 85796424 59618386 54371190 63747251 60116087 46217319 40626907 42724685 40442342
4127D0442342n444623k14341K197686k723521m231198R44308J977474m209724
$$ 40442342 34997719 34783378 36981064 34257543 30026345 30970653 32948127 28738403
4119B8738403o668906j527588J111511k928006m312568J177445M306631k68149
$$ 28738403 22069497 20541909 21653420 18725414 14412846 15590291 19896922 19628773
4111A9628773m481835k077895J290003N55814K81901L596124M591058k73548m395168
$$ 19628773 15146938 13069043 14359046 14914860 15196761 18792885 23383943 23110395 18715227
4102A8715227k609397l40874l128363o249637l248144K843904N000473K834662
$$ 18715227 16105830 15764956 12636593 6386956 3138812 5982716 10983189 13817851
4094A3817851N32079o20472j347770p07029J283885J657112n02221j663953j62044
$$ 13817851 14349930 13729458 12381688 11674659 12958544 14615656 14113435 12449482 12287438
4085A2287438L95852k136632l939544j818471J077312P87657j111689j348640
$$ 12287438 12683290 10546658 6607114 4788643 5865955 6653612 5541923 4193283
4077D193283n89032o01798k0110K391122L954456K093428j034177j955989j013768
$$ 4193283 3604251 3002453 2982343 5373465 9327921 11421349 10387172 8431183 7417415
4068G417415m87612m85619o7762J89598k96828m94103J56168O69497R58612J967042
$$ 7417415 6929803 6444184 6376422 6566020 6269192 5775089 5931257 6600754 7559366 9526408
4058I526408K371115m04365m630294n032887r91616J758234R8354j901286n83373
$$ 9526408 11897523 11493158 6862864 1829977 838361 2596595 2694949 793663 210290
4049B10290J481897J409132J429159L344397L518480o20946m376168k710191J102026
$$ 210290 1692187 3101319 4530478 7874875 11393355 10772409 6396241 3686050 4788076
4040D788076P68152k779718l759323j355093K62164o8031L40757J757249J509794
$$ 4788076 5556228 2776510 -982813 -2337906 -2075742 -2143773 -1803016 -45767 1464027
4031A464027n85552j989757k203017k492811j737057J833258N462353M455234
$$ 1464027 878475 -1111282 -3314299 -5807110 -7544167 -5710909 -248556 4206678
4023D206678j54264k445589m70234J605974J041955K75944J399441K295513Q71833
$$ 4206678 4052414 1606825 1136591 2742565 3784520 4060464 5459905 7755418 8627251
4014H627251j163697j427509l88496N23539J390736K309571K045903J90593j433926
$$ 8627251 7463554 6036045 5647549 6171088 7561824 9871395 11917298 12107891 10673965
4005A0673965j125573O68035K569300L545835K451603j171359n037344n539604
$$ 10673965 9548392 10216427 12785727 16331562 18783165 17611806 12574462 7034858
3997G034858k391306N82378M43678j488389k512128k262821j849577j443279p26964
$$ 7034858 4643552 5225930 5669608 4181219 1669091 -593730 -2443307 -3886586 -4613550
3988d613550k16399l15403k19328P17122J583256J281912L40418J0369L55976
$$ -4613550 -4829949 -5145352 -5364680 -4647558 -3064302 -1782390 -1441972 -1431603 -1075627
3979a075627N58819N59506J062206J998816K083634L91583j964790k428818R9410
$$ -1075627 -516808 42698 1104904 3103720 5187354 5578937 3614147 1185329 1284739
3970A284739L235716L285359j47336l285289k944127m71507Q09875M73812P47254
$$ 1284739 4520455 7805814 7658478 4373189 1429062 957555 1767430 2241242 2988496
3961B988496K376824L636253L249990J705503l03546k259633k766461q62409J506944
$$ 2988496 5365320 9001573 12251563 13957066 13653520 11393887 8627426 7765017 9271961
3952I271961J268911j126957j936871K48063K378920J802722L6674l17967L24409
$$ 9271961 10540872 9413915 7477044 7725107 10104027 11906749 11943423 11625456 11949865
3943A1949865n2314j646241l170713l883962l251185n04750L226531M394988J381044
$$ 11949865 11897551 10251310 7080597 3196635 -54550 -559300 2667231 7062219 8443263
3934H443263k422318k928529j123549q84741k308288j732567J603831L656386
$$ 8443263 6020945 3092416 1968867 1084126 -1224162 -2956729 -1352898 2303488
3926B303488J784044j161783j312901P86375K005985J492372N97230m47321k474212
$$ 2303488 4087532 2925749 1612848 2399223 4405208 5897580 6494810 6047489 3573277
3917C573277m633845m717817k350012M37490J928868K065071J243568L0010j1631
$$ 3573277 -1060568 -5778385 -8128397 -7690907 -5762039 -3696968 -2453400 -2423390 -2435021
3908b435021K175547M495725L474493m25489k355818L35669M013639L783422J44644
$$ -2435021 -259474 4236251 7710744 7285255 4929437 5265106 9278745 13062167 13206811
3899A3206811k558640k501452j524542r64752k87036J67666j196314m059094n633839
$$ 13206811 10648171 8146719 6622177 5657425 5370389 5538055 4341741 282647 -5351192
3890e351192m251489j159055J712879L297683K610466l82015k650660n62964M431017
$$ -5351192 -9602681 -10761736 -9048857 -5751174 -3140708 -3522723 -6173383 -6736347 -2305330
3881b305330O436680L117113j014321j665407p40189j617230k614936l56342L226630
$$ -2305330 4131350 7248463 6234142 4568735 3828546 2211316 -403620 -759962 2466668
3872B466668L259850r965j527552K76216J327091q63061l156129k165579O88190
$$ 2466668 5726518 5716553 4189001 4465217 5792308 4929247 1773118 -392461 295729
3863B95729K169530J801253O91728j191831l456750l407433O51166N503350N940934
$$ 295729 2465259 4266512 4958240 3766409 309659 -3097774 -2446608 3056742 8997676
3854H997676J440076k978921l071051k50999R26696j329958m204796m027156n66734
$$ 8997676 10437752 7458831 4387780 4136781 5063477 3733519 -471277 -4498433 -5065167
3845e065167L107115M407212L580122K121334M62432j508431k840475k405078
$$ -5065167 -1958052 2449160 6029282 8150616 8613048 7104617 4264142 1859064
3837A859064r59397l57422p15326l09653J383686K493418J414388q48166j976264
$$ 1859064 899667 542245 -173081 -482734 900952 3394370 4808758 3960592 1984328
3828A984328r81366J175361K785456K718684J270318q2005m41820p42273k100741
$$ 1984328 1002962 2178323 4963779 7682463 8952781 8870776 8428956 7686683 5585942
3819E585942l413674k522197J90974J664663M02771j307031q30812R20316J004272
$$ 5585942 2172268 -349929 -158955 1505708 1908479 601448 -229364 690952 1695224
3810A695224j106319k723746j682886P32862J469524l25209k103279j140473J823549
$$ 1695224 588905 -2134841 -3817727 -3084865 -1615341 -1940550 -4043829 -5184302 -3360753
3801c360753L509971K553008J090182J140487J637124R01191p017P80089K134485
$$ -3360753 149218 2702226 3792408 4932895 6570019 7471210 7464193 8244282 10378767
3792A0378767J470655o85373j354959j77828L0284j780828l307901l183328k868736
$$ 10378767 11849422 11164049 9809090 9631262 9661546 7880718 4572817 1389489 -1479247
3783a479247k800517q01122L308972N469174L044633n31143o34119J607784J634338
$$ -1479247 -4279764 -5080886 -1771914 3697260 6741893 6210750 5576631 7184415 8818753
3774H818753r36558j824840R60705M056346L728971P31357j401775q73472J071445
$$ 8818753 7882195 6057355 7018060 11074406 14803377 15534734 14132959 13259487 14330932
3765A4330932K205573J406392r12974l538782n240383n025452k581023O33581
$$ 14330932 16536505 17942897 17029923 13491141 8250758 3225306 644283 1277864
3757A277864J687632n18401k801750j185477L232289N227892K909294K76184O00058
$$ 1277864 2965496 2447095 -354655 -1540132 1692157 6920049 9829343 10105527 10705585
3748A0705585J470575l79770l030928k525174N03667K119812J481870J186815
$$ 10705585 12176160 11796390 8765462 6240288 6743955 8863767 10345637 11532452
3740A1532452J916305J373370j233851l619967l937332k732959j096700L28787
$$ 11532452 13448757 14822127 13588276 9968309 6030977 3298018 2201318 2530105
3732B530105N50201p50728j712309o65829P50309J60860r37123O35441L715758
$$ 2530105 3080306 2329578 617269 -48560 701749 862609 -74514 560927 4276685
3723D276685M018879J327349j08771Q61248L24406l137499m963028k026796J820329
$$ 4276685 8295564 9622913 9514142 10375390 10699796 7562297 2599269 572473 2392802
3714B392802J891961k00026m42018L70270j034186l493313k897350N29308K119474
$$ 2392802 4284763 4084737 3642719 4012989 2978803 -514510 -3411860 -2882552 -763078
3705g63078m292k514512k401642o71617O35652J535232K645668L366275L076642
$$ -763078 -767370 -3281882 -5683524 -6355141 -5719489 -4184257 -1538589 1827686 4904328
3696D904328K265132J335684j09915j956514l010063k501830j009589N23248J580422
$$ 4904328 7169460 8505144 8395229 6438715 3428652 926822 -82767 440481 2020903
3687B020903J785481J110000M53748P04640J198366N07238j222107k229645j604324
$$ 2020903 3806384 4916384 5370132 6074772 7273138 7780376 6558269 4328624 2724300
3678B724300l55576J82604l01523j457472k631187k792271j482379J52183P00338
$$ 2724300 2368724 2551328 2249805 792333 -1838854 -4631125 -6113504 -5961321 -5260983
3669e260983O50249J392682K280414J214449j387996k105946N09918L066272J839964
$$ -5260983 -4610734 -3218052 -937638 276811 -1111185 -3217131 -2707213 359059 2199023
3660B199023j659796k621410L44232L479493L186703L48798j818931k111609j638817
$$ 2199023 539227 -2082183 -1737951 1741542 4928245 5277043 3458112 1346503 -292314
3651b92314j000847N17093K855526M216867L176252P06418j009136j263962j276272
$$ -292314 -1293161 -776068 2079458 6296325 9472577 10178995 9169859 7905897 6629625
3642F629625k164303l478761l830242k268713Q58908L665025L711239N62296k758384
$$ 6629625 4465322 986561 -2843681 -5112394 -4253486 -588461 3122778 3685074 926690
3633I26690k575014P97127L064116J486968j515961j878497N86863K351822J064200
$$ 926690 -1648324 -851197 2212919 3699887 2183926 305429 892292 3244114 4308314
3624D308314j914748l756210l184369j080270O76705Q42314K7851p5102P50131
$$ 4308314 2393566 -1362644 -4547013 -5627283 -4950578 -4108264 -4080413 -4155515 -3405384
3615c405384O53729j164305k337739m74255K779596L516446Q70777k176612l067396
$$ -3405384 -2751655 -3915960 -6253699 -6727954 -3948358 -431912 438865 -1737747 -4805143
3606d805143j990194n805K199390L414346K716006J598556K249159L373634J483389
$$ -4805143 -6795337 -6801142 -4601752 -1187406 1528600 3127156 5376315 8749949 10233338
3597A0233338k837575m431048j317167J682537L85976j998043k81403L862369
$$ 10233338 7395763 2964715 1647548 3330085 3716061 1718018 1436615 5298984
3589E298984M309697N8755l679181l763839k671370k703178k058943Q83935L625501
$$ 5298984 9608681 9667436 5988255 2224416 -446954 -3150132 -5209075 -4325140 -699639
3580f99639L092513M33722p32605P76449K956229L608219K206398l16318k259837
$$ -699639 2392874 2826596 2093991 2870440 5826669 9434888 11641286 11324968 9065131
3571I065131k466069j723758j669966j900314k51580L172516M852059K554635
$$ 9065131 6599062 4875304 3205338 1305024 1053444 4225960 9078019 11632654
3563A1632654j096942k168419p08744K55727l34936p79600k17533J06102n07662
$$ 11632654 10535712 8367293 7658549 7914276 7579340 6799740 6582207 6688309 6180647
3554F180647r02503k03241O88746O31639j14329n59136l32840J76342L86494O0845
$$ 6180647 5278144 5074903 5763649 6395288 6280959 5721823 5388983 5565325 5951819 6012664
3544F012664k37507L81623J527270J282237j117676l304930k496096L65328J644092
$$ 6012664 5775157 6156780 7684050 8966287 7848611 4543681 2047585 2412913 4057005
3535D057005J98749j209832m62567P25329o9104j775487j280041J778951M053319
$$ 4057005 4255754 3045922 2583355 3308684 3239580 1464093 184052 1963003 6016322
3526F016322K595083j569698m627652m143400j462159K26072l4949J38515K701990
$$ 6016322 8611405 7041707 2414055 -1729345 -3191504 -2965432 -3000381 -2861866 -159876
3517a59876N560485M894944P48929k504497k016383l4345n2797j887362k908133
$$ -159876 5400609 10295553 11044482 8539985 6523602 6489257 6436460 4549098 1640965
3508A640965k235837r64327L87005J666445J376666j483581m329668l374099O45450
$$ 1640965 -594872 -1559199 -1172194 494251 1870917 387336 -3942332 -7316431 -6670981
3499f670981K856742J344575k7319K060870M877928L841094k93037k531032q54895
$$ -6670981 -3814239 -2469664 -2496983 -436113 4441815 8282909 7989872 5458840 4603945
3490D603945J675097K032287P88018k68516r35432j559856j623311j027298r12987
$$ 4603945 6279042 8311329 9099347 8830831 7895399 6335543 4712232 3684934 2771947
3481B771947j606332j499816K50294J600373M20003j903329k282932n88614L97306
$$ 2771947 1165615 -334201 -83907 1516466 1936469 33140 -2249792 -2838406 -2441100
3472b441100m33886r93337K20239J611152J257282n0974m96364l38496j115038
$$ -2441100 -2874986 -3868323 -3648084 -2036932 -779650 -830624 -1326988 -1665484 -2780522
3463b780522k657497l096214j595892P10083K515868L559759L920876L446600
$$ -2780522 -5438019 -8534233 -10130125 -9420042 -6904174 -3344415 576461 4023061
3455D023061K256642R26075q1465n72085l32998N87497J447086J371153K46700
$$ 4023061 6279703 7205778 7124313 6552228 6219230 6806727 8253813 9624966 9871666
3446I871666j376953k791619l100761j702390L30972O35295j240016k316531M6121
$$ 9871666 8494713 5703094 2602333 899943 1230915 1866210 626194 -1690337 -1644216
3437a644216L917599M960440K280768p98035j734005j360397r33214J30054K147366
$$ -1644216 2273383 7233823 9514591 8716556 6982551 5622154 4688940 4818994 6966360
3428F966360L558228L152398J745916J66710k129527m830185n651668l592882
$$ 6966360 10524588 13676986 15422902 15589612 13460085 8629900 2978232 -614650
3420f14650j080326m78850n19850J069158L199365K912529J69749k027157j902206
$$ -614650 -1694976 -2173826 -2693676 -1624518 1574847 4487376 4657125 2629968 727762
3411G27762n85738K86708L36800r8375m14988O9971R75215Q08147n40609q97933
$$ 727762 142024 428732 765532 667157 252169 322140 1297355 2105502 1564893 666960
3401F66960O91853J694913K0062k029530j296314Q50506J074799J88978J293452
$$ 666960 1358813 3053726 3073788 1044258 -252056 598450 1673249 1862227 3155679
3392C155679K926323N49994m798320o231585j383269L445031K774803l14708l36264
$$ 3155679 6082002 6631996 1833676 -4397909 -5781178 -2336147 438656 123948 -212316
3383b12316J815703J724310n98671j626130j051694j795489m084629m706302k319703
$$ -212316 1603387 3327697 2729026 1102896 51202 -1744287 -5828916 -10535218 -12854921
3374a2854921O79749K054638K111529J814115J403105J257107J760167K200895
$$ -12854921 -12175172 -10120534 -8009005 -6194890 -4791785 -3534678 -1774511 426384
3366D26384J746150J033053Q00408k2832k315363l976799k314610J445560L321481
$$ 426384 2172534 3205587 4005995 3983163 1667800 -2308999 -4623609 -3178049 143432
3357A43432J911531n91872k274216k882241j699645J842843N104886M084107n79465
$$ 143432 2054963 1463091 -811125 -3693366 -5393011 -3550168 1554718 5638825 5059360
3348E059360l525425k096947K40095m6358j243193k54556J814351J986462Q73501
$$ 5059360 1533935 -563012 -322917 -369275 -1612468 -1867024 -52673 1933789 2807290
3339B807290J402602L317894L229175M0607l326053m187053l138076k037995j398894
$$ 2807290 4209892 7527786 10756961 10797568 7471515 3284462 146386 -1891609 -3290503
3330c290503q50466l39263K34300J209679K113026J669634j99661j544636p44907
$$ -3290503 -4140969 -4480232 -4245932 -3036253 -923227 746407 546746 -997890 -1742797
3321a742797J059486J253390p39179k507385j629453J262857L179093K277130
$$ -1742797 -683311 570079 -169100 -2676485 -4305938 -3043081 136012 2413142
3313B413142q7558j040339N64162K941464L216076K61390l987104n879210l292942
$$ 2413142 2325584 1285245 1849407 4790871 8006947 8268337 4281233 -1597977 -4890919
3304d890919J937029N331925M239317O13652j476159o52561P34065L12839j157936
$$ -4890919 -2953890 2378035 6617352 7231004 5754845 5102284 5836349 6149188 4991252
3295D991252j227042O39515K186636J149548j931209m226724l773641j447212
$$ 4991252 3764210 4403725 6590361 7739909 5808700 1581976 -2191665 -3638877
3287c638877N99454J721905K769544L591183K585982m25522k828849k418370n51733
$$ -3638877 -3039423 -1317518 1452026 5043209 7629191 7203669 4374820 1956450 1404717
3278A404717o8801j180596j827589j363477j114070j469910j267750l30971J51961
$$ 1404717 1335916 155320 -1672269 -3035746 -4149816 -5619726 -6887476 -7218447 -7066486
3269g066486K56964J380708K873421J938544j474903k999768K50653M771372M984130
$$ -7066486 -6809522 -5428814 -2555393 -616849 -2091752 -5091520 -4840867 -69495 4914635
3260D914635O81589l373593m157555k923429j403047N19053K488768K621779O41846
$$ 4914635 5596224 2222631 -1934924 -4858353 -6261400 -5742347 -3253579 -631800 10046
3251A0046n50682J241385L844812L435624o4282k874182k445340k36091J139436
$$ 10046 -540636 700749 4545561 7981185 7916903 5042721 2597381 2361290 3500726
3242C500726J333568J472642J551517O51197q14927j081948N01017K493343L204670
$$ 3500726 4834294 6306936 7858453 8509650 7694723 6612775 7113792 9607135 12811805
3233A2811805K194556k80852l598802n950206n164933j618710J417274J818911
$$ 12811805 15006361 14725509 11126707 5176501 11568 -1607142 -189868 1629043
3225A629043J229419J840399K592447J286475j184216k085610j302668r41723
$$ 1629043 2858462 4698861 7291308 8577783 7393567 5307957 4005289 3063566
3217C063566j134003k28688J037056N0138k473113k592302J65675J212217j556538
$$ 3063566 1929563 1700875 2737931 2788069 314956 -2277346 -2111671 -899454 -2455992
3208b455992l546024n64700M086916M482752J003414r73730M24263J850131J096033
$$ -2455992 -6002016 -6566716 -2479800 2002952 3006366 2032636 2456899 4307030 5403063
3199E403063Q4412P26767J852605J598875Q361j830737l099042l131736j895225
$$ 5403063 5487475 6214242 8066847 9665722 9674083 7843346 4744304 1612568 -282657
3190b82657p60179r63166j498866n83279J190927J603239N06377J38169J501707
$$ -282657 -1042836 -2006002 -3504868 -4088147 -2897220 -1293981 -787604 -649435 852272
3181H52272K847120K266089p0265k510717l257272j467943J379014K148815J1330
$$ 852272 3699392 5965481 5895216 3384499 127227 -1340716 38298 2187113 2198443
3172B198443j734672m07534J433638k55k822908j921711K220804L345364p62776
$$ 2198443 463771 56237 1489875 1489620 -1333288 -3254999 -1034195 2311169 1548393
3163A548393m369870k461172J969623L088431N51657j538138j019889J042099
$$ 1548393 -2821477 -5282649 -3313026 -224595 327062 -1211076 -2230965 -1188866
3155a188866L233770M236248K273696k341565n666722m454182o74176J302510
$$ -1188866 2044904 6281152 8554848 6213283 546561 -3907621 -4581797 -3279287
3147c279287M94428r04951j897009l027561l348364j023407L068172N721782N647011
$$ -3279287 -2784859 -3689810 -5586819 -8614380 -11962744 -12986151 -9917979 -4196197 1450814
3138A450814M502067L626493K551088J033166q7303o39824j550245k974633l757847
$$ 1450814 5952881 9579374 12130462 13163628 13076325 12436501 10886256 7911623 4153776
3129D153776l050284j023441J829372M560200N455843L694186P91530j399207
$$ 4153776 1103492 80051 1909423 6469623 11925466 15619652 16411182 15011975
3121A5011975l197280n385031o259213l645405P34549K590264J022761l50103
$$ 15011975 11814695 6429664 170451 -3474954 -2740405 -150141 872620 522517
3113E22517J021815L248241L433018J516720q02705k481136k996723k004192m18416
$$ 522517 1544332 4792573 8225591 9742311 8939606 6458470 3461747 1457555 1039139
3104A039139J61417p167Q33500K361223K013277l98332j421757O30926K514193
$$ 1039139 1200556 1193389 2026889 4388112 6401389 6003057 4581300 5212226 7726419
3095G726419J154844j323895j340868J93021J10883r34550J71535K592747K137436
$$ 7726419 8881263 7557368 6216500 6409521 6520404 5585854 5757389 8350136 10487572
3086A0487572j383777l018207n69464J649914k8737k369554n53610L573037M032845
$$ 10487572 9103795 6085588 5516124 7166038 7137301 4767747 4214137 7787174 11820019
3077A1820019k3090l332450l030393k489308m538255n838929k167572L847317
$$ 11820019 11796929 8464479 5434086 2944778 -1593477 -7432406 -9599978 -5752661
3069e752661N444356J256076k893160k422471L27167R60892k56868l7403J941319
$$ -5752661 -308305 947771 -1945389 -4367860 -4040693 -3079801 -3336669 -3374072 -1432753
3060a432753K682040P32700k118397l948794m401056l138925J59435L554751L799252
$$ -1432753 1249287 1981987 -136410 -4085204 -8486260 -11625185 -11465750 -7910999 -4111747
3051d111747R01366j160714k375J767551J058525n47562M52601L443420M405277
$$ -4111747 -3210381 -4371095 -4373470 -2605919 -1547394 -2094956 -1642355 1801065 6206342
3042F206342K050490o65668j486018j637800k497167k706885p32510J911514K383984
$$ 6206342 8256832 7591164 6105146 4467346 1970179 -736706 -1469216 442298 2826282
3033B826282L21291k084832l104921k784915j656879Q9672J924968K750051J947567
$$ 2826282 3147573 1062741 -2042180 -4827095 -6483974 -6394302 -4469334 -1719283 228284
3024B28284J85561j103464r12666N09292J790013J687338N00840j48954O70288
$$ 228284 413845 -689619 -1602285 -1092993 697020 2384358 2885198 2736244 3406532
3015C406532J868469J632714j78905j643761q92940J773527M059856L866915J315133
$$ 3406532 5275001 6907715 6728810 5085049 4192109 5965636 10025492 13892407 15207540
3006A5207540j419894k377811j727604j065253j134086j179037o45897k71844
$$ 15207540 13787646 11409835 9682231 8616978 7482892 6303855 5657958 5386114
2998E386114p02006j054707j75543J201531J095880p93011k232734j258139J126076
$$ 5386114 4684108 3629401 3453858 4655389 5751269 4958258 2725524 1467385 2593461
2989B593461K054076K67422k442109l350052j670848J059093K970601L452676
$$ 2593461 4647537 4914959 2472850 -877202 -2548050 -1488957 1481644 4934320
2981D934320K749262J024243j242336k559016j695831J69991K65222j942149l338690
$$ 4934320 7683582 8707825 7465489 4906473 3210642 3380633 3645855 1703706 -1634984
2972a634984j225280K488293L470658Q24017j873234j641142M20715J710176J706520
$$ -1634984 -2860264 -371971 3098687 3922704 2049470 408328 829043 2539219 4245739
2963D245739J285032M90819p84773j344034l50429M48711j257633m459838n511763
$$ 4245739 5530771 6021590 5236817 3892783 3542354 3991065 2733432 -1726406 -7238169
2954g238169k875448J070249L325582L254014J810388J9337r00507L6376J839504
$$ -7238169 -10113617 -9043368 -5717786 -2463772 -653384 -634047 -1534554 -1498178 341326
2945C41326J994307j16304j946405j284986P20629J672764J339788Q72748P8313
$$ 341326 2335633 2219329 272924 -1012062 -291433 1381331 2721119 3593867 3672180
2936C672180j898161l952870l841619j576266L86663O06869J87770M49546J093217
$$ 3672180 1774019 -2178851 -6020470 -7596736 -7210073 -6603204 -6415434 -5965888 -4872671
2927d872671J353959J235357Q03323k49858j519146j687435k75173J466890K126035
$$ -4872671 -3518712 -2283355 -1480032 -1729890 -3249036 -4936471 -5211644 -3744754 -1618719
2918a618719J642709P49838m1679l77239n5240L84400R4364o87221q46549k56649
$$ -1618719 23990 773828 732149 354910 299670 684070 778434 91213 -755336 -1011985
2908a011985N6593m6332N27312J723877J717628j23855j681374j112448M18466
$$ -1011985 -955392 -1001724 -474412 1249465 2967093 2843238 1161864 49416 467882
2899D67882R04331N90236O94957P51263r9082n90186P68547K286018J063339k059275
$$ 467882 1372213 1962449 2657406 3408669 3309587 2719401 3487948 5773966 6837305 4778030
2889D778030l197043j222879Q49186R91574Q65694J947491K601892J283943m05173
$$ 4778030 1580987 358108 1207294 2198868 3064562 5012053 7613945 8897888 8492715
2880H492715n18574r3264q55602j803585j194808j34361p68461k204625j841035
$$ 8492715 7974141 7880877 7025275 5221690 4026882 3892521 3124060 919435 -921600
2871i21600j0619M19450j059141j790156n33216O09789p6790j291231j275421
$$ -921600 -932219 -512769 -1571910 -3362066 -3895282 -3285493 -3362283 -4653514 -5928935
2862e928935n39060m38432r48471j265326j104628m29335N76705P45187q63137
$$ -5928935 -6467995 -6906427 -7854898 -9120224 -10224852 -10654187 -10077482 -9332295 -10195432
2853a0195432k585724j657462J240355K210620J88848j081330O35995J980859
$$ -10195432 -12781156 -14438618 -13198263 -10987643 -10798795 -11880125 -11244130 -9263271
2845i263271o9328k106953N32328N270107N440537Q64619j625997J112807M060665
$$ -9263271 -9332599 -11439552 -10907224 -5637117 -196580 668039 -957958 154849 4215514
2836D215514K526462r89976k100917j634727k696503m265276l010680M96016K389365
$$ 4215514 6741976 5752000 3651083 2016356 -680147 -4945423 -7956103 -7460087 -5070722
2827e070722J510050M30628O63747P32782n53860k099127k489299j592793J63551
$$ -5070722 -3560672 -3130044 -2466297 -1733515 -2287375 -4386502 -6875801 -8468594 -8305043
2818h305043J992451K225168n5200k735948k437338J069913M401865M869403L090315
$$ -8305043 -6312592 -4087424 -4142624 -6878572 -9315910 -8245997 -3844132 1025271 4115586
2809D115586R54419p13108j792788k244856k549688l018035k442859L59148L501791
$$ 4115586 5070005 4356897 2564109 319253 -2230435 -5248470 -7691329 -7332181 -3830390
2800c830390L442313K44181j740155N822K511974K143464J44777K6240J525839
$$ -3830390 -388077 -143896 -1884051 -1878229 633745 2777209 2921986 2948226 4474065
2791D474065J277973j218367k401415q2925L235651L943269J840782o70906k274643
$$ 4474065 5752038 4533671 2132256 2049331 5284982 9228251 11069033 10398127 8123484
2782H123484l525299m595539m296045j930645J073047K492575J977555J288644
$$ 8123484 4598185 2646 -4293399 -6224044 -5150997 -2658422 -680867 607777
2774F07777J634049J984610R70521o87926j334694j227736j952987l133290k462301
$$ 607777 2241826 4226436 5196957 4509031 3174337 1946601 -6386 -3139676 -5601977
2765e601977K66541J984786P61918j140189p92519R99027J505059N91479L35128
$$ -5601977 -5335436 -3350650 -2588732 -3728921 -4521440 -3522413 -2017354 -1425875 -1090747
2756a090747J171518J619457J342259J321733J102062r28098m113197n437500
$$ -1090747 80771 1700228 3042487 4364220 5466282 4538184 424987 -5012513
2748e012513l645815p62408J258250K557149L086547J516110j726662l215292
$$ -5012513 -8658328 -9420736 -8162486 -5605337 -2518790 -1002680 -2729342 -5944634
2740e944634q65342K671579L629684K307994J692325K394200K380804J053206
$$ -5944634 -6809976 -4138397 -508713 1799281 3491606 5885806 8266610 9319816
2732I319816P3871K1708m79283j653488j758726n84891p33266l391207n402970
$$ 9319816 9393687 9415395 8936112 7282624 5523898 4939007 4205741 814534 -4588436
2723d588436l362840J047761L023356J249872p23659k6426J718001J435585r32199
$$ -4588436 -7951276 -6903515 -3880159 -2630287 -3353946 -3380372 -1662371 -226786 -1158985
2714a158985k892249k779472p98434K129362M556363M441079J214231k367457
$$ -1158985 -4051234 -6830706 -7629140 -5499778 -943415 3497664 4711895 2344438
2706B344438k741374j13067J662156K49537k327226k961189j478760P3519M76495
$$ 2344438 -396936 -510003 1152153 1401690 -925536 -3886725 -5365485 -5291966 -4815471
2697d815471j1546q11790j209626l92067J247958J913868R08582k4370M62675
$$ -4815471 -4827017 -5638807 -6848433 -7240500 -5992542 -4078674 -3170092 -3194462 -2731787
2688b731787P83885r24588l130901k973285r73860o6626l05344J316652N086194
$$ -2731787 -1947902 -2872490 -6003391 -8976676 -9950536 -10017162 -10322506 -9005854 -3919660
2679c919660O810339L752643j129282l363357k603718j365248m86527R07033K398269
$$ -3919660 2890679 6643322 5514040 2150683 -453035 -1818283 -2304810 -1397777 1000492
2670A000492K520715J443768P39315P88007O51322J17971k58679p04657j644386
$$ 1000492 3521207 4964975 5704290 6492297 7143619 7261590 7002911 6298254 4653868
2661D653868k091541r95021K50360o31509k836606l127041q64440Q62800L28987
$$ 4653868 2562327 1567306 1817666 1186157 -1650449 -4777490 -5641930 -4779130 -4450143
2652d450143P5173K443715N000974L778952m56515k933436j657813J66675m88202
$$ -4450143 -4374970 -1931255 3069719 6848671 6392156 3458720 1800907 1967582 1479380
2643A479380j939678j008223J392187J287119k049744m195804j456817L680445
$$ 1479380 -460298 -1468521 -76334 1210785 -838959 -5034763 -6491580 -2811135
2635b811135N419703J987314k540513l806026k005718j10278N50400Q76826J357941
$$ -2811135 2608568 4595882 2055369 -1750657 -3756375 -3866653 -3316253 -2439427 -1081486
2626a081486J237619L50234r5180P67060K054502K099361K48700k604823m785185
$$ -1081486 156133 506367 411187 1178247 3232749 5332110 5580810 2975987 -1809198
2617a809198m963167l061240k61277K173124M007326N587318O576367N966436
$$ -1809198 -6772365 -9833605 -10094882 -7921758 -3914432 1672886 8249253 14215689
2609A4215689L490075L50251j819093k426443k165246j975731j933795j280648
$$ 14215689 17705764 18056015 16236922 13810479 11645233 9669502 7735707 6455059
2601F455059L24687J895186K104025J042382j9942p09425j970998l888056m780167
$$ 6455059 6779746 8674932 10778957 11821339 11801397 11091972 9120974 5232918 452751
2592D52751l703739k252723k073449j995683n1732K613434K841881L86602j285590
$$ 452751 -3250988 -5503711 -7577160 -9572843 -9624575 -7011141 -4169260 -3782658 -5068248
2583e068248J68680K976696M192653L245052J144610j580504m168186m583064
$$ -5068248 -4899568 -1922872 2269781 5514833 6659443 5078939 910753 -3672311
2575c672311j632036K604069M501995K886514q7108j735021j321105m6051L28762
$$ -3672311 -5304347 -2700278 1801717 4688231 4601123 2866102 1544997 1498946 1827708
2566A827708r64516k761606k990705j226859N93432Q03314K54658O53290J659047
$$ 1827708 863192 -1898414 -4889119 -6115978 -5522546 -4719232 -4464574 -3811284 -2152237
2557b152237J477264o0962r01786M69691L029528M417112L315687M36082k252678
$$ -2152237 -674973 -735935 -1637721 -1168030 1861498 6278610 9594297 10030379 7777701
2548G777701l253430k916608k787742l297552l029106j027526J354702K285887
$$ 7777701 4524271 1607663 -1180079 -4477631 -7506737 -8534263 -7179561 -4893674
2540d893674K085451K220168K460032J287601j063725k324220j346143M43579
$$ -4893674 -2808223 -588055 1871977 3159578 2095853 -228367 -1574510 -1130931
2532a130931J326107J251301Q87522M18856N4498J87996K97780p78988k727597
$$ -1130931 195176 1446477 2333999 2752855 2807353 2995349 3293129 2514141 -213456
2523b13456l551247k369332p10214K7916N21395J506494J786848L32769j196106
$$ -213456 -3764703 -6134035 -6844249 -6816333 -6294938 -4788444 -3001596 -2668827 -3864933
2514c864933n20812J652880K652985J841576R42079O55666j28819j364576j040859
$$ -3864933 -4385745 -2732865 -79880 1761696 2703775 3359441 3230622 1866046 825187
2505H25187J403099L326743K380499l4944q56004L08074J143203L36322r86372
$$ 825187 2228286 5555029 7935528 7900584 7044580 7352654 8495857 8832179 7845807
2496G845807j678394k279477l319625l528603j431345J878672L394425J991982
$$ 7845807 6167413 3887936 568311 -2960292 -4391637 -2512965 881460 2873442
2488B873442K6684M5473J103784K78150k543994l890301j609537J756353K471154
$$ 2873442 2900126 2945599 4049383 4327533 1783539 -2106762 -3716299 -1959946 511208
2479E11208P96777j1520R70581J254881n20124k136894j306146P98479J392567
$$ 511208 1307985 1296465 2267046 3521927 3001803 864909 -441237 357242 1749809
2470A749809j95723k427624l795707l474430j149561J862639K659900K22281k222807
$$ 1749809 1554086 -873538 -4669245 -8143675 -9293236 -7430597 -4770697 -4548416 -6771223
2461f771223r05896L136569N298789L676686R41248l02984o25921j143186j071010
$$ -6771223 -7677119 -4540550 758239 4434925 5376173 5073189 4447268 3304082 2233072
2452B233072Q9122O10789o99840j834701m25806K176262K541544O5348k505552
$$ 2233072 2322194 2932983 2233143 398442 -27364 2148898 4690442 4755790 2250238
2443B250238l021484j798462K35391K548992L927954L001666N69215p98120k14831
$$ 2250238 -771246 -2569708 -2334317 214675 4142629 7144295 7713510 6915390 6700559
2434F700559N57586L32678K89554J275011J670935o3311k511118l251351k468603
$$ 6700559 7258145 7590823 7880377 9155388 10826323 10763012 8251894 5000543 2531940
2425B531940k216200k786210k287657J69836K990872M182940L341430J218225
$$ 2531940 315740 -2470470 -4758127 -4588291 -1597419 2585521 5926951 7145176
2417G145176j240227k972646l144207j954565l45055J169978K468125K840280
$$ 7145176 5904949 2932303 -211904 -2166469 -2511524 -1341546 1126579 3966859
2409C966859J518589o60864j712343j139418o27913j393163k340854j917626m41247
$$ 3966859 5485448 4824584 3112241 1972823 1344910 -48253 -2389107 -4306733 -4747980
2400d747980P50229J377276J922269K084298J240524L7688j56289O68589J109605
$$ -4747980 -3997751 -2620475 -698206 1386092 2626616 2664304 2508015 3176604 4286209
2391D286209M32640o55256j379527j595246r36036J063611L374878L616185R02426
$$ 4286209 4718849 4063593 2684066 1088820 152784 1216395 4591273 8207458 9109884
2382I109884k619056m235236l669606k423591j206085K61408J544200J646938
$$ 9109884 6490828 2255592 -1414014 -3837605 -5043690 -4782282 -3238082 -1591144
2374a591144Q76122O58279J152247R15537l37212o17218J248004L060551J978036
$$ -1591144 -715022 -56743 1095504 2011041 1673829 1056611 2304615 5365166 7343202
2365G343202j059674k166392J04074K630100J997727j017068k867888j909750
$$ 7343202 6283528 4117136 4221210 6851310 8849037 7831969 4964081 3054331
2357C054331K55760J556964J580903P83931n69257j867083j954883o48145M84098
$$ 3054331 3310091 4867055 6447958 7231889 6662632 4795549 2840666 2192521 2676619
2348B676619J33677o33831R9207J704474J185117k423197n610689m199847J170771
$$ 2676619 2810296 2176465 2275672 3980146 5165263 2742066 -2868623 -7068470 -5897699
2339e897699N453543N197066K133717o0887o36312j481636l119768l637333j917693
$$ -5897699 -444156 4752910 6886627 6825740 6189428 4707792 1588024 -2049309 -3967002
2330c967002L27883R55400K62676q171N55585J007790J178192J866936K847712
$$ -3967002 -3639119 -2683719 -2421043 -2429214 -1873629 -865839 312353 2179289 5027001
2321E027001K576609N92497j311556j366523j54402N78461O18270J273109K896564
$$ 5027001 7603610 8196107 6884551 5518028 5363626 5942087 6560357 7833466 10730030
2312A0730030L946846K979210N58457j507845k283053k323351k370939k172529
$$ 10730030 14676876 17656086 18214543 16706698 14423645 12100294 9729355 7556826
2304G556826j035266O82502J355249q2080k397646l065321j259817R91370J241066
$$ 7556826 6521560 7204062 8559311 8477231 6079585 3014264 1754447 2745817 3986883
2295C986883n09833k219651k504640j821787j241573j256270j804897k281537
$$ 3986883 3477050 1257399 -1247241 -3069028 -4310601 -5566871 -7371768 -9653305
2287i653305j399745J590254N117255O141989L660093J62690j407948r63235k25965
$$ -9653305 -11053050 -9462796 -4345541 1796448 5456541 5619231 4211283 3248048 3022083
2278C022083L19785J312604K027481O77088k370190m101428k783060m37174J96461
$$ 3022083 3341868 4654472 6681953 7359041 4988851 887423 -1895637 -2332811 -2136350
2269b136350m35503M3996J813899K572681J346968R0265O04844J805036J453723
$$ -2136350 -2571853 -2527857 -713958 1858723 3205691 3295956 3900800 5705836 7159559
2260G159559n96266k406358k568583j475130k56571M01478M39716K95189N31779
$$ 7159559 6563293 4156935 1588352 113222 -143349 258129 697845 993034 1524813
2251A524813R71066N67023j047553k477133k294933j368481j658946k794889k173023
$$ 1524813 2495879 3062902 2015349 -461784 -2756717 -4125198 -5784144 -8579033 -10752056
2242a0752056P55499K767971J316017j278582q60447K321475L670891P81266l179322
$$ -10752056 -9996557 -7228586 -5912569 -7191151 -8051598 -5730123 -2059232 -1277966 -4457288
$$ [...]
##END NTUPLES=NMR SPECTRUM
##END=
