##TITLE=31Pdec_DE-100k_TFA
 CDCl3, 64 sc
 7.7.2025
##JCAMPDX= 6.0         $$ Bruker NMR JCAMP-DX V2.0
##DATA TYPE= NMR SPECTRUM
##DATA CLASS= NTUPLES
##ORIGIN= UXNMR, Bruker Analytische Messtechnik GmbH
##OWNER= root
$$ XWIN-NMR		Version 3.5
$$ Mon Jul  7 16:28:57 2025 Russian Standard Time (UT+4h)  she@DPX200
##.OBSERVE FREQUENCY= 81.013821
##.OBSERVE NUCLEUS= ^31P
##.ACQUISITION MODE= SIMULTANEOUS
##.ACQUISITION SCHEME= undefined
##.AVERAGES= 64
##.DIGITISER RES= 17
##SPECTROMETER/DATA SYSTEM= spect
##.PULSE SEQUENCE= zgpg30
##.SOLVENT NAME= CDCl3
##.SHIFT REFERENCE= (INTERNAL, CDCl3, 0, 198.062)
##AUDIT TRAIL= $$ (NUMBER, WHEN, WHO, WHERE, WHAT)
$$ ##TITLE= Audit trail, XWIN-NMR		Version 3.5
$$ ##JCAMPDX= 5.01
$$ ##ORIGIN= Bruker BioSpin GmbH
$$ ##OWNER= she
$$ F:/spectra/data/she/nmr/P31/2/pdata/1/auditp.txt
$$ ##AUDIT TRAIL=  $$ (NUMBER, WHEN, WHO, WHERE, WHAT)
(   1,<2025-07-07 16:27:33.15 +0400>,<she>,<DPX200>,
      <created by zg, POWCHK disabled, PULCHK disabled
       configuration hash MD5:
       00 E9 B6 7A A2 85 ED C7 34 08 36 98 17 FE 4E 26
       data hash MD5: 32K
       F1 D8 82 C4 62 D9 A6 62 A6 C0 A7 E4 EB 6E 59 D2>)
(   2,<2025-07-07 16:27:35.53 +0400>,<she>,<DPX200>,
      <Start of raw data processing
       efp BC_mod = 2 LB = 1.5 FT_mod = 6 PKNL = 1 PHC0 = 1512.108 PHC1 = -214.1061 SI = 64K 
       data hash MD5: 64K
       E0 34 A5 7B E2 B8 FD F8 AC 39 C5 10 2E FB 61 FC>)
(   3,<2025-07-07 16:27:54.65 +0400>,<she>,<DPX200>,
      <pk PHC0 = -6.494944 PHC1 = 0 
       data hash MD5: 64K
       98 D9 F9 40 A8 CC CE 14 DC 0E CB BD EE D6 8B 2A>)
(   4,<2025-07-07 16:28:16.54 +0400>,<she>,<DPX200>,
      <pk PHC0 = 262.46 PHC1 = -735.4003 
       data hash MD5: 64K
       66 6A 7F 92 6C 64 BD E4 AB 7A EF 33 72 9B C8 4E>)
(   5,<2025-07-07 16:28:23.87 +0400>,<she>,<DPX200>,
      <abs ABSG = 5 
       data hash MD5: 64K
       F0 93 9C 3A E2 6B 0E 2F B4 2E 8D 4D 9A 8E FA 2F>)
$$ ##END=
$$ 
$$ hash MD5
$$ 24 4D EE D3 94 16 2A 6C 29 05 D4 24 D9 C8 A6 BB
##$RELAX= 
##$RELAX= 
##$RELAX= 
##$RELAX= 
##$RELAX= 
##$RELAX= 
##$RELAX= 
##$RELAX= 
$$ Bruker specific parameters
$$ --------------------------
##$DU= <F:/spectra>
##$EXPNO= 2
##$NAME= <P31>
##$PROCNO= 1
##$TYPE= <nmr>
##$USER= <she>
##$AMP= (0..31)
100 100 100 100 100 100 100 100 100 100 100 100 100 100 100 100 100 100 
100 100 100 100 100 100 100 100 100 100 100 100 100 100 
##$AQSEQ= 0
##$AQ_mod= 1
##$AUNM= <au_zg>
##$AUTOPOS= <>
##$BF1= 81.014009
##$BF2= 200.13
##$BF3= 200.13
##$BF4= 200.13
##$BF5= 200.13
##$BF6= 200.13
##$BF7= 200.13
##$BF8= 200.13
##$BYTORDA= 1
##$CFDGTYP= 0
##$CFRGTYP= 5
##$CHEMSTR= <none>
##$CNST= (0..31)
1 1 145 1 1 1 1 1 1 1 1 1 1 1 1 1 1 1 1 1 1 1 1 1 1 1 1 1 1 1 1 1 
##$CPDPRG= <waltz16>
##$CPDPRG1= <>
##$CPDPRG2= <waltz16>
##$CPDPRG3= <>
##$CPDPRG4= <mlev>
##$CPDPRG5= <mlev>
##$CPDPRG6= <mlev>
##$CPDPRG7= <mlev>
##$CPDPRG8= <mlev>
##$CPDPRGB= <>
##$CPDPRGT= <>
##$D= (0..31)
0 1 0 0 0 0 0 0 0 0.06 0 0.03 2e-05 3e-06 0 0 0.0002 0 0 0 0 0 0 0 0 0 
$$ [...]
##$SUBNAM3= <"">
##$SUBNAM4= <"">
##$SUBNAM5= <"">
##$SUBNAM6= <"">
##$SUBNAM7= <"">
##$SUBNAM8= <"">
##$SUBNAM9= <"">
##$SW= 400.765351723535
##$SWIBOX= (0..15)
0 1 3 0 0 0 0 0 0 0 0 0 0 0 0 0 
##$SW_h= 32467.5324675325
##$TD= 32768
##$TD0= 1
##$TE= 0
##$TE2= 300
##$TE3= 300
##$TEG= 300
##$TL= (0..7)
0 120 53 12 22 120 120 120 
##$TP= (0..7)
150 150 150 150 150 150 150 150 
##$TP07= 0
##$TPNAME0= <>
##$TPNAME1= <>
##$TPNAME2= <>
##$TPNAME3= <>
##$TPNAME4= <>
##$TPNAME5= <>
##$TPNAME6= <>
##$TPNAME7= <>
##$TPOAL= (0..7)
0.5 0.5 0.5 0.5 0.5 0.5 0.5 0.5 
##$TPOFFS= (0..7)
0 0 0 0 0 0 0 0 
##$TUNHIN= 0
##$TUNHOUT= 0
##$TUNXOUT= 0
##$USERA1= <user>
##$USERA2= <user>
##$USERA3= <user>
##$USERA4= <user>
##$USERA5= <user>
##$V9= 5
##$VALIST= <valist>
##$VCLIST= <CCCCCCCCCCCCCCC>
##$VD= 0
##$VDLIST= <DDDDDDDDDDDDDDD>
##$VPLIST= <PPPPPPPPPPPPPPP>
##$VTLIST= <TTTTTTTTTTTTTTT>
##$WBST= 1024
##$WBSW= 4
##$XGAIN= (0..3)
0 0 0 0 
##$XL= 0
##$YL= 0
##$YMAX_a= 9067
##$YMIN_a= -9480
##$ZGOPTNS= <>
##$ZL1= 120
##$ZL2= 120
##$ZL3= 120
##$ZL4= 120
##$ABSF1= 198.0616
##$ABSF2= -202.7028
##$ABSG= 5
##$ABSL= 3
##$ALPHA= 0
##$AQORDER= 0
##$ASSFAC= 0
##$ASSFACI= 0
##$ASSFACX= 0
##$ASSWID= 0
##$AUNMP= <proc_1d>
##$AZFE= 0.1
##$AZFW= 0.5
##$BCFW= 0
##$BC_mod= 2
##$BYTORDP= 0
##$COROFFS= 0
##$CY= -3
##$DATMOD= 1
##$DC= 0
##$DFILT= <>
##$DTYPP= 0
##$F1P= 0
##$F2P= 0
##$FCOR= 1
##$FTSIZE= 65536
##$FT_mod= 6
##$GAMMA= 0
##$GB= 0
##$INTBC= 1
##$INTSCL= 9.790993e-09
##$ISEN= 30
##$LB= 1.5
##$LEV0= 0
##$LPBIN= 0
##$MAXI= 10000
##$MC2= 0
##$MEAN= 0
##$ME_mod= 0
##$MI= 50
##$NCOEF= 0
##$NC_proc= -8
##$NLEV= 6
##$NOISF1= 182.463
##$NOISF2= 159.3651
##$NSP= 0
##$NTH_PI= 0
##$NZP= 0
##$OFFSET= 198.0616
##$PC= 4
##$PHC0= 1768.073
##$PHC1= -949.5064
##$PH_mod= 1
##$PKNL= yes
##$PPARMOD= 0
##$PSCAL= 0
##$PSIGN= 0
##$REVERSE= no
##$SF= 81.0140089999434
##$SI= 65536
##$SIGF1= 159.3651
##$SIGF2= -187.1042
##$SINO= 113.3802
##$SIOLD= 16384
##$SREGLST= <1H.CDCl3>
##$SSB= 0
##$STSI= 65536
##$STSR= 0
##$SW_p= 32467.5324675325
##$SYMM= 0
##$S_DEV= 0
##$TDeff= 32768
##$TDoff= 0
##$TI= <>
##$TILT= no
##$TM1= 0
##$TM2= 0
##$TOPLEV= 0
##$USERP1= <user>
##$USERP2= <user>
##$USERP3= <user>
##$USERP4= <user>
##$USERP5= <user>
##$WDW= 1
##$XDIM= 65536
##$YMAX_p= 292580852
##$YMIN_p= -231655825
$$ End of Bruker specific parameters
$$ ---------------------------------
##NTUPLES= NMR SPECTRUM
##VAR_NAME=  FREQUENCY,     SPECTRUM/REAL,   SPECTRUM/IMAG
##SYMBOL=    X,             R,               I
##VAR_TYPE=  INDEPENDENT,   DEPENDENT,       DEPENDENT
##VAR_FORM=  AFFN,          ASDF,            ASDF
##VAR_DIM=   65536,         65536,           65536
##UNITS=     HZ,            ARBITRARY UNITS, ARBITRARY UNITS
##FACTOR=    0.49542278885378, 1,            1
##FIRST=     16045.7642231865, 0,            0
##LAST=      -16421.768244346, 0,            0
##MIN=       -16421.768244346, -231655825,   0
##MAX=       16045.7642231865, 292580852,    0
$$ Real data points
##PAGE= N=1
##DATA TABLE= (X++(R..R)), XYDATA
$$ [...]
44820A349814j140337j844411p36214P45674Q20723k33022r27394p92617m41714
44811c199498j39812K82810M35200l43171j588160j695429K27952L006371M301659
44802A287922K828785l82400k942666l404083k500163j890470k016988j881908
44794a0901971q10576M99523R33113J96276j173019k311801k287627o41286J894283
44785a4603085L783251M061872K896892J038639l59296J69642K796950M936500
44777D721365L568138m61728k884393j805130l17106j391824k998346j591257
44769c160281J607649K099010q13752k926220j750470l6452q89333k840881k463341
44760a1174071L85888K727130K591958O11600j703928l172302k891375p90822
$$ plain form
44820 1349814 209477 -1634934 -2371148 -1625474 -804751 -1037773 -1965167 -2757784 -3199498
44811 -3199498 -3339310 -3056500 -2621300 -2964471 -4552631 -6248060 -6020108 -3013737 1287922
44802 1287922 4116707 3734307 791641 -2612442 -5112605 -7003075 -9020063 -10901971
44794 -10901971 -11712547 -11213024 -10279911 -10083635 -11256654 -13568455 -15856082 -16497368 -14603085
44785 -14603085 -10819834 -6757962 -3861070 -2822431 -3181727 -3012085 -215135 4721365
44777 4721365 8289503 7827775 4943382 3138252 2821146 1429322 -1569024 -3160281
44769 -3160281 -1552632 546378 -267374 -3193594 -4944064 -4980516 -5869849 -8710730 -11174071
44760 -11174071 -10788183 -8061053 -5469095 -4857495 -6561423 -9733725 -12625100 -13415922
44752a3415922J856037L573316L976049L259055J517572l33871l95338J695606
44744A732504L245950J676347j594775k809354r44172J421975K176777J782508
44736F687760Q80948j183750m046004n134111k985636j8748L53987j659451k822058
44727i927063j552686L48024Q53177M28768N69995J048342J76853k404685m461394
44718a4920669l412589M17727L635399L379131N91634j197674j71898J865342
44710i813597K158704L87716j364202j203509P93127K817271K785029K39115k694228
44701e894574l118056p24057J698087J804443M13777l62594j08213M99859J742429
44692d048899L764650M409351J363539l397807m531418L9281N851928O991201
$$ plain form
44752 -13415922 -11559885 -7986569 -4010520 -751465 766107 432236 36898 1732504
44744 1732504 4978454 6654801 5060026 2250672 1306500 2728475 4905252 6687760
44736 6687760 7568708 6384958 2338954 -2795157 -5780793 -5799541 -5445554 -7105005 -9927063
44727 -9927063 -11479749 -11131725 -10278548 -9849780 -9279785 -8231443 -8054590 -10459275 -14920669
44718 -14920669 -18333258 -17915531 -14280132 -10901001 -10309367 -11507041 -11678939 -9813597
44710 -9813597 -7654893 -7267177 -8631379 -9834888 -9041761 -6224490 -3439461 -3200346 -5894574
44701 -5894574 -9012630 -9736687 -8038600 -6234157 -5820380 -6182974 -6291187 -5791328 -4048899
44692 -4048899 -284249 4125102 5488641 2090834 -2440584 -2401303 3450625 10441826
44684A0441826K800266k185210l813423k039125L95549J380098J162010J193457
44676I335448J691566J080810j478356l987016l793066j433619m2831q51550j829335
44667a307949j403114p28449r39169q40243O65529K103529J655841M7394j002871
44658a749502j437610j689448q03872J530333K929467J501523n25900K4011J879695
44649A658697J325985j273654j815300O05118K168803Q94392k02899J350565L258286
44640G969993K739006J258214J376370J824314k25408l854102n380518l728538
44632A979331j246735M07397J874724L404331L486125J114760k376910m561910
44624D081113m079703j445579J433276K642736J838331K26218j134001j987880
$$ plain form
44684 10441826 13242092 11056882 7243459 5204334 5599883 6979981 8141991 9335448
44676 9335448 11027014 12107824 10629468 6642452 2849386 1415767 1372936 521386 -1307949
44667 -1307949 -2711063 -3439512 -4378681 -5218924 -4553395 -2449866 -794025 -746631 -1749502
44658 -1749502 -3187112 -4876560 -5680432 -4150099 -1220632 280891 -245009 -220998 1658697
44649 1658697 2984682 1711028 -104272 500846 2669649 3564041 3361142 4711707 7969993
44640 7969993 10708999 11967213 13343583 15167897 14942489 11088387 5707869 1979331
44632 1979331 732596 1139993 3014717 6419048 9905173 11019933 8643023 4081113
44624 4081113 1410 -1444169 -10893 2631843 4470174 4696392 3562391 1574511
44616A574511j796902p001J870391R97241k362723l824747p76842L213065L200447
44607B087440l2888j793717r58325p58410k328692k613137N5627K836599K995705
44598e09798J890903J700394J292014j383098m841857n469473k587807P07432
44590i201290J678553P72531P4313M89685J081713O27943n99409r54685L15273
44581e715373J609995J004823q25486j593762r96645p97094j123486J77214L320877
44572d938937M951821K945267P6496k7938J596629J286310j152853k321164q67700
44563A547931N56228l10090k147540k534375j249873K64292R81155O05372p28994
44554c015894j957946j549709M53129J940187J319106l47932q03704O16796K632343
$$ plain form
44616 1574511 -222391 -229392 1640999 2638240 275517 -3549230 -4326072 -1113007 2087440
44607 2087440 2054552 260835 -697490 -1455900 -3784592 -6397729 -6342102 -3505503 -509798
44598 -509798 1381105 3081499 4373513 2990415 -1851442 -7320915 -9908722 -9201290
44590 -9201290 -7522737 -6750206 -6675893 -6186208 -5104495 -4476552 -5075961 -6030646 -5715373
44581 -5715373 -4105378 -3100555 -3926041 -5519803 -6516448 -7313542 -8437028 -8259814 -4938937
44572 -4938937 12884 2958151 3034647 3006709 4603338 5889648 4736795 2415631 1547931
44563 1547931 2104159 1794069 -353471 -2887846 -4137719 -3873427 -2892272 -2286900 -3015894
44554 -3015894 -4973840 -6523549 -6070420 -4130233 -2811127 -3159059 -3962763 -3345967 -713624
44545g13624L728471L239016J341608r59657k232841j974203j301929j442247
44537c15406j897704j250163L60795R80026m23566k139620j697495R31805L283283
44528b168045L396324J707211k05016j475058j874161j111475M39018J074412
44520b16790m26083k481665k099798R52969L253453K139994n52963r50007J604261
44511A223371L834052L002600J32033j913402k066055j558583j528304j529381
44503d03669o42936R05235J997293K144650J856357J388107J79962j758411k881255
44494B785333j851569K80433J210831M74528l52160n31712j100063k392409k936902
44485d413690j972689r29906q83866o30519P80088J682868N01055j011718l23241
$$ plain form
44545 -713624 3014847 6253863 7595471 6635814 4402973 2428770 1126841 -315406
44537 -315406 -2213110 -3463273 -3102478 -2122452 -2546018 -4685638 -6383133 -5451328 -2168045
44528 -2168045 1228279 2935490 2730474 1255416 -618745 -1730220 -1291202 -216790
44520 -216790 -642873 -3124538 -5224336 -4271367 -1017914 1122080 569117 -380890 1223371
44511 1223371 5057423 8060023 8192056 6278654 4212599 2654016 1125712 -403669
44503 -403669 -1046605 -141370 1855923 4000573 5856930 7245037 7424999 5666588 2785333
44494 2785333 933764 1214197 2425028 2899556 2547396 2015684 915621 -1476788 -4413690
44485 -4413690 -6386379 -7316285 -8200151 -8830670 -8050582 -6367714 -5866659 -6878377 -7201618
44476g201618J472478J370402k76938k37058J926560K950804J519203N34654J856586
44467C915073K693509J60517l633019m539771k364918l64281r6625l41107m65858
44458e036480j253261k170563j127233K033443M363547L481431O29498j172458
44450b52076o60383J091562K445903K402650Q87149j028368j685037n22741J101395
44441C780054J401830J21112j494803k190724j581303m1532J473893J776562M80525
44432C725614j282071j891533j101496k30300l31178r02899q76882k55295P460
44423c138580n06381j088432q20066M99051K280794L395335K684029K04093k036759
44414A473084j863931J62434J039976o88826k759726k399801l69912K71330j286707
$$ plain form
44476 -7201618 -5729140 -4358738 -4635676 -4872734 -2946174 4630 1523833 2058487 3915073
44467 3915073 6608582 6769099 3136080 -1403691 -3768609 -4132890 -4229515 -4570622 -5036480
44458 -5036480 -6289741 -8460304 -9587537 -7554094 -3190547 290884 920382 -252076
44450 -252076 -912459 179103 2625006 5027656 5914805 4886437 3201400 2678659 3780054
44441 3780054 5181884 5302996 3808193 1617469 36166 -5366 1468527 3245089 3725614
44432 3725614 2443543 552010 -549486 -779786 -1110964 -2013863 -2890745 -3146040 -3138580
44423 -3138580 -3644961 -4733393 -5553459 -5054408 -2773614 621721 3305750 3509843 1473084
44414 1473084 -390847 -228413 811563 122737 -2636989 -5036790 -5406702 -5135372 -6422079
44405f422079k657481j887848J15656J326943J073229J58199j75139R27432K860689
44396d680399L342837R41412k286714k903308r58747N4053j186707j569051J319702
44387g926922M931992N370240K770134q0119k392642m874641o030649l419295
44379a1651902J482999L817698J627878j757349k672857j336315K42236J592659
44371h654953K990054L563452K454526N15914r18106j794259k423622k165534
44363f432528p33514L67603l25913j682960j201617J466490L935382M094173K258730
44354A745846N5713j572802k572843k743869j491848J121188L538433L748690
44346A828508J563007q67045j632977j466859k226405l597114l379649j136313
$$ plain form
44405 -6422079 -9079560 -10967408 -10851752 -9524809 -8451580 -8293381 -8468520 -7541088 -4680399
44396 -4680399 -1337562 -396150 -2682864 -5586172 -6544919 -6490866 -7677573 -9246624 -7926922
44387 -7926922 -2994930 2375310 5145444 5065325 2672683 -2201958 -8232607 -11651902
44379 -11651902 -10168903 -6351205 -4723327 -6480676 -9153533 -10489848 -10247612 -8654953
44371 -8654953 -5664899 -2101447 353079 868993 -49113 -1843372 -4266994 -6432528
44363 -6432528 -7166042 -6798439 -7124352 -8807312 -10008929 -8542439 -4607057 -512884 1745846
44354 1745846 1801559 228757 -2344086 -5087955 -6579803 -5458615 -1920182 1828508
44346 1828508 3391515 2524470 891493 -575366 -2801771 -6398885 -9778534 -10914847
44338a0914847Q27426R86061Q25094K027589L384529K622995L9793j914233j974008
44329d089601r54008J99591J206771J477050L21875j590793k557953j930713o51782
44320h569563L75798J141110J613246J335516K96677q74067j851540k774704l350844
44311a2658371k895504j461013R1444J253795K069006K246653J464152O43524
44303i246314J296132L127842L923687K587642P37218K11135M56294j30623j355687
44294A607326j478607J25887K055294K541789R95966j814774m074386l786315
44286c827820o61309K904818L952031K132704l16449j688158k376492l008684
44278b889359k781720r20734J371881K068686R96987j36222l12860k56775n68338
$$ plain form
44338 -10914847 -10087421 -9101360 -8276266 -6248677 -2864148 -241153 -201360 -2115593 -4089601
44329 -4089601 -5043609 -4844018 -3637247 -2160197 -1838322 -3429115 -5987068 -7917781 -8569563
44320 -8569563 -8193765 -7052655 -5439409 -4103893 -3807216 -4681283 -6532823 -9307527 -12658371
44311 -12658371 -15553875 -17014888 -16923444 -15669649 -13600643 -11353990 -9889838 -9246314
44303 -9246314 -7950182 -4822340 -898653 1688989 2426207 2637342 3093636 2963013 1607326
44294 1607326 128719 254606 2309900 4851689 5847655 4032881 -41505 -3827820
44286 -3827820 -4489129 -1584311 2367720 4500424 4183975 2495817 119325 -2889359
44278 -2889359 -5671079 -6591813 -5219932 -3151246 -2154259 -2290481 -2603341 -2860116 -3428454
44269c428454l89200R78347K258234J651153k79274r79556M07370J419243l48919
44260A288944l320751l392842N66714M556030L998260n99262m256369l641557
44252d800833p50365L83306q93337j633037R051K191674K329180P16589m60205
44243b907977n47453p32827j349941j140754L93051J853825J985203J262716N55661
44234f28496k47166j128657r61846Q04821K600893K512487P52766j176937k785727
44225b57862m172751m251359j849317J678877L353198K270507K88258j096238
44217d036687k160955k862471j988911M80470K483207K714125K314291K336820
44209g20111J752367j20779j322273N8655K443882K849652J400384P61017J534915
$$ plain form
44269 -3428454 -3817654 -2839307 -581073 1070080 790806 -188750 218620 1637863 1288944
44260 1288944 -2031807 -5424649 -4857935 -301905 3696355 3097093 -1159276 -4800833
44252 -4800833 -5551198 -5167892 -6061229 -7694266 -7685215 -5493541 -3164361 -2447772 -2907977
44243 -2907977 -3455430 -4188257 -5538198 -6678952 -6285901 -4432076 -2446873 -1184157 -628496
44234 -628496 -875662 -2004319 -2966165 -2161344 439549 2952036 3704802 2527865 -257862
44225 -257862 -4430613 -8681972 -10531289 -8852412 -5499214 -3228707 -2940449 -4036687
44217 -4036687 -6197642 -9060113 -11049024 -10568554 -8085347 -5371222 -3056931 -720111
44209 -720111 1032256 911477 -410796 -352141 2091741 4941393 6341777 7102794 8637709
44200H637709J420625o95252k805019l056404k516391l028663m027520l385691
44192i456606o53714K150467K866567J347284o90586j394235l46441J263544J880686
44183c033034Q54490j416284l869332m939025l383460j9364K254628J650631j665
44174a1902415K38141K045676K462537Q19203l5205J589447L310629K445429K76991
44165A250433j46219J156546J519076J05681j141323j104965j177585k504050
44157b042406l805171l199048o94916K196837M133117M300800K341589r03625
44149B327177l407928l836819k891299j972199j229188L3438J610337K343467
44141g023014J737640O35923K08955R43545K513341L907680L822687J816285q50935
$$ plain form
44200 8637709 10058334 9363082 6558063 3501659 985268 -2043395 -6070915 -9456606
44192 -9456606 -10110320 -7959853 -5093286 -3746002 -4436588 -5830823 -6177264 -4913720 -3033034
44183 -3033034 -2178544 -3594828 -7464160 -12403185 -15786645 -15806009 -13551381 -11900750 -11902415
44174 -11902415 -11664274 -9618598 -7156061 -6336858 -6372063 -4782616 -1471987 973442 1250433
44165 1250433 1104214 2260760 3779836 3885517 2744194 1639229 461644 -2042406
44157 -2042406 -5847577 -9046625 -9741541 -7544704 -3411587 889213 3230802 2327177
44149 2327177 -1080751 -4917570 -7808869 -9781068 -11010256 -10976818 -9366481 -7023014
44141 -7023014 -5285374 -4649451 -4440496 -3496951 -983610 2924070 6746757 8563042 7712107
44132G712107k319679k164377j538287j293629j091708p35094j077552k605843
44124e114062m040716l667051j636349L13796J225116J701292K321078K662487
44116f234409K280673J412693K21066j389862k586494j784625P92602K231895
44108e056461M67680k376323k533376N8259J739962P21441l59404J121273L461322
44099b755627L272650P74603n36431R22822K702784J874725j345374m328309m961547
44090d379704l144808n18239O74408n47549k637486l041559j290531O33567J377069
44081a2874832J965268L456487M558300L423771P34182j164742j687773k255976
44073c845315l078130k215932J081767M162873L882748O43165k219455k532766
$$ plain form
44132 7712107 5392428 3228051 1689764 396135 -695573 -1430667 -2508219 -5114062
44124 -5114062 -9154778 -12821829 -14458178 -14144382 -12919266 -11217974 -8896896 -6234409
44116 -6234409 -3953736 -2541043 -2319977 -3709839 -6296333 -8080958 -7288356 -5056461
44108 -5056461 -4588781 -6965104 -9498480 -9440221 -7700259 -6978818 -7338222 -6216949 -2755627
44099 -2755627 517023 1291626 755195 1678017 4380801 6255526 4910152 581843 -4379704
44090 -4379704 -7524512 -8042751 -7368343 -7915892 -10553378 -13594937 -14885468 -14251901 -12874832
44081 -12874832 -10909564 -7453077 -2894777 528994 1263176 98434 -1589339 -3845315
44073 -3845315 -6923445 -9139377 -8057610 -3894737 -11989 631176 -1588279 -4121045
44065d121045j154173K8489K87172q5518p02501j077587n12321J184930L140977
44056c011577M034737L154871Q41740j674491k890126k202932o99987j19361q33933
44047c401059j636831j682141j476364j428987p98957Q10043K104010J764779
44039e745507N84086K39965O46034M68542k14191n0835R01963J097864L35961
44030a736118O3584L36676n20233k146226j461770K126191M234300J544780k467248
44021b6064k155409J827323L669661J251016j533872j785303j459461k356443
44013b568552k375116n063J657504m11315l466158k629027J570080M028833K735069
44004a463745R35120J224590J740699j06638l226368m360298k328460R61484K855022
$$ plain form
44065 -4121045 -5275218 -5246729 -4959557 -5045075 -5747576 -6825163 -7337484 -6152554 -3011577
44056 -3011577 1023160 4178031 5019771 3345280 455154 -1747778 -2447765 -2567126 -3401059
44047 -3401059 -5037890 -6720031 -8196395 -9625382 -10424339 -9614296 -7510286 -5745507
44039 -5745507 -5161421 -4921456 -4275422 -3806880 -4021071 -4071906 -3169943 -2072079 -1736118
44030 -1736118 -1672534 -1335858 -1856091 -4002317 -5464087 -3337896 896404 2441184 -26064
44021 -26064 -2181473 -354150 3315511 4566527 3032655 1247352 -212109 -2568552
44013 -2568552 -4943668 -4948731 -3291227 -3702542 -7168700 -9797727 -8227647 -4198814 -1463745
44004 -1463745 -528625 695965 2436664 2330026 -896342 -5256640 -7585100 -6623616 -3768594
43995c768594K256213K41322j082517p97393j03318k94014n70831N27021K146376
43986a445735J889377m02627k074637j501615k50553l64897j443556j739790o88781
43977h022814R03565K071692K199691J436472J154013K549361M305839L553363
43969A0151182j3204l074944k976768r92171K12408K29022L6465n09658j774097
43960A288235k386445q69710J673889K886530K334343J159532l37712k192849
43952C555813k902259j111946J382327J461074p12687k042845j376138o46230
43944b392891q57593n62359P08609J069514q6987l59086J667210L517784K381814
43935E086015o77072k571539k473435j815085j476988j332298j452646j674338
$$ plain form
43995 -3768594 -1512381 -1271059 -2353576 -3150969 -3254287 -3548301 -4119132 -3592111 -1445735
43986 -1445735 443642 41015 -2033622 -3535237 -3785790 -4150687 -5594243 -7334033 -8022814
43977 -8022814 -7119249 -5047557 -2847866 -1411394 -257381 2291980 6597819 10151182
43969 10151182 10137978 7063034 4086266 3094095 3306503 3535525 3571990 3062332 1288235
43960 1288235 -1098210 -1967920 -294031 2592499 4926842 6086374 5748662 3555813
43952 3555813 653554 -458392 923935 2385009 1672322 -370523 -1746661 -2392891
43944 -2392891 -3250484 -3812843 -3104234 -2034720 -2121707 -2480793 -813583 2704201 5086015
43935 5086015 4408943 1837404 -636031 -2451116 -3928104 -5260402 -6713048 -8387386
43927h387386j048285M22684Q39386p97623k321586j294221J145908J953291O41633
43918h846199o73227q58527n11739K38418J617248K262411O48578j559326r88303
43909h670666K172496L901193K316945L52008P55825J866832J008907o83720k54395
43900B765425J894283K391178N3461k483945k704790j292012l70769m84978n69861
43891h02008K7304P03795O04199k92936j348332k237916l224304m144265l700543
43882a4415006q49690L042780M729085K609558j027305k309681m3641L203463
43874e060437M260291K789201J120070J047502J711373J280845M0614J25541J878084
43865I193084K575430L49736k447106k357737j25818L65027j841727l373914j880056
$$ plain form
43927 -8387386 -9435671 -9012987 -8173601 -8971224 -11292810 -12587031 -11441123 -9487832 -8846199
43918 -8846199 -9519426 -10377953 -10889692 -10651274 -9034026 -6771615 -6123037 -7682363 -8670666
43909 -8670666 -6498170 -2596977 -280032 71976 827801 2694633 3703540 3019820 2765425
43900 2765425 4659708 7050886 7104347 4620402 1915612 623600 252831 -232147 -802008
43891 -802008 -774704 -70909 533290 240354 -1107978 -3345894 -6570198 -10714463 -14415006
43882 -14415006 -15264696 -12221916 -7492831 -4883273 -5910578 -8220259 -8263900 -5060437
43874 -5060437 -800146 1989055 3109125 4156627 5868000 7148845 7189459 7315000 9193084
43865 9193084 11768514 12118250 9671144 7313407 7187589 7552616 5710889 2336975 456919
43856D56919P09397J687501J152450K72747r51478j948400o37503K903373M642464
43847H287470J923058j863055j905613Q32716J689709k693p07727L79469P9140
43838H712474k257316k764884K63318K898913J833203l39085J76198K082452J727598
43829A2332871o10555j771623j287437j369897k295173k174518j046544j084237
43821F92887k432845k606015p51011Q62358O07292k58844k40188K79840P74228
43812c072298J768926K948257K652386P95135l37122M682q16402m187395o544572
43803f788403m081791O80010J618900k076070m452104j401222L569374M766156
43795h165150K275234Q29081K336287L604498J797694j248617j924258p3012R78851
$$ plain form
43856 456919 1166316 2853817 4006267 4279014 3327536 1379136 741633 3645006 8287470
43847 8287470 10210528 8347473 6441860 7274576 8964285 8961592 8253865 8633334 8712474
43838 8712474 6455158 3690274 3953592 6852505 8685708 8346623 8522821 10605273 12332871
43829 12332871 11722316 9950693 8663256 7293359 4998186 2823668 1777124 692887
43821 692887 -1739958 -4345973 -5096984 -4234626 -3627334 -3886178 -4126366 -3846526 -3072298
43812 -3072298 -1303372 1644885 4297271 5092406 4755284 4759966 3943564 -243831 -6788403
43803 -6788403 -10870194 -10190184 -8571284 -10647354 -15099458 -16500680 -12931306 -8165150
43795 -8165150 -5889916 -5060835 -2724548 879950 2677644 1429027 -495231 -568243 410608
43786D10608q20591l448723l489289n09237K494713K895758J415150N61808J037818
43777E48015J230460J69295q57744n29121K17336k74125j505662j483140R7844
43768b386842J438176J584993J582946J915785J045476j892817m698745m555875
43760e966903j859937N30141J199045J104215R75108L07502p23621p29049O26821
43751d536678J766076J628513J211992J523537J672859M90189j338455k364019
43743E4014k487102k391278j931832q09437J54617L42345R75609L107247M726408
43734A740591K789540j833499m517249k868874K37944J089874M1236k19547O52697
43725b887287O37199p42250j333920L89853K997028L855953K111993p63664k745793
$$ plain form
43786 410608 -409983 -3858706 -7347995 -7857232 -5362519 -2466761 -1051611 -489803 548015
43777 548015 1778475 1947770 1090026 560905 778241 504116 -1001546 -2484686 -2386842
43768 -2386842 -948666 636327 2219273 4135058 5180534 3287717 -1411028 -5966903
43760 -5966903 -7826840 -7296699 -6097654 -4993439 -4018331 -3710829 -4434450 -5163499 -4536678
43751 -4536678 -2770602 -1142089 69903 1593440 3266299 3756488 2418033 54014
43743 54014 -2433088 -4824366 -6756198 -7565635 -7411018 -7068673 -6093064 -2985817 1740591
43734 1740591 4530131 2696632 -1820617 -4689491 -4451547 -3361673 -3320437 -3539984 -2887287
43725 -2887287 -2250088 -2992338 -4326258 -3936405 -939377 2916576 5028569 4264905 1519112
43716A519112l097439k683478k556511k349445q30485J631992K480600J37131
43708e748523l246562m077210j882820N16108J299321J600512K479925K585098
43700f474151O92940j334967o94159K072245L422012J495820j630908k875535
43692e326703j658646K82103J316176J184307N41303N1127k78711j050452k383058
43683g322554l116382k124597l44639K9386j172904j384995R27086L410806K803013
43674h295780j47016j292556J189906M114693L506841k06589k965803k250123
43666f346427L33003J744220J302400Q26975J597076K434856J428402j065620
43658B254885k394416r77523J402280J781818j72161k037357k129084j301050
$$ plain form
43716 1519112 -1578327 -4261805 -6818316 -9167761 -9998246 -8366254 -5885654 -5748523
43708 -5748523 -8995085 -13072295 -14955115 -14439007 -13139686 -11539174 -9059249 -6474151
43700 -6474151 -5781211 -7116178 -7810337 -5738092 -2316080 -820260 -2451168 -5326703
43692 -5326703 -6985349 -6703246 -5387070 -4202763 -3661460 -3610333 -3889044 -4939496 -7322554
43683 -7322554 -10438936 -12563533 -12908172 -12878786 -14051690 -15436685 -14509599 -11098793 -8295780
43674 -8295780 -8442796 -9735352 -8545446 -4430753 -923912 -1130501 -4096304 -6346427
43666 -6346427 -6013424 -4269204 -2966804 -2139829 -542753 1892103 3320505 2254885
43658 2254885 -139531 -1117054 285226 2067044 1894883 -142474 -2271558 -3572608
43650c572608p62280J8896J827819L443065K808227O6415k332847k659037j567078
43641b729428m71883K93874J016391J461725J174355K45295j012253k526164l790145
43632f338233l464234r27235K126968L158306J993724J031700J656363K117616
43624A354975L85185k244794k658552n96224Q11271j97603j274173K90699L029243
43615a099973L096995k26436l518683l754939j483785J031501K543285K602666
43607h09369O64217k765107n219908m364627p12739K835970L817559J879213j453039
43598f127830l578011k320579J762244M986445M057570l4939l019509k305540
43590f580149M35550J930973J128634m47945j160168q70752k60053M74247J599404
$$ plain form
43650 -3572608 -4334888 -4315992 -2488173 954892 3763119 3829534 1496687 -1162350 -2729428
43641 -2729428 -3201311 -2907437 -1891046 -429321 745034 990329 -21924 -2548088 -6338233
43632 -6338233 -9802467 -10729702 -8602734 -5444428 -3450704 -2419004 -762641 1354975
43624 1354975 1740160 -504634 -3163186 -3759410 -2948139 -3145742 -4419915 -4129216 -1099973
43615 -1099973 1997022 1770586 -1748097 -5503036 -6986821 -5955320 -3412035 -809369
43607 -809369 -145152 -2910259 -8130167 -12494794 -13207533 -10371563 -6554004 -4674791 -6127830
43598 -6127830 -9705841 -12026420 -10264176 -5277731 -1220161 -1255100 -4274609 -6580149
43590 -6580149 -6144599 -4213626 -3084992 -3532937 -4693105 -5563857 -5823910 -5349663 -3750259
43581c750259K725862K556610M79251k013307k652114j204056L25907O24399O30251
43572b277456J330206J671054K27514k257419l744071l444680j893250M67657
43564i920445K785534K948124j25280l797830m116022r84017J744060J667656
43556i798220N38996P94084K162790L079546L100043K343281N51718j645611k300194
43547a173567o57136J384339J815413J001821J84800p41789k124666k827042j755707
43538d893534N7944R29771J035504J513994K151196K030657J465332J088198L6103
43529E415165k470670m585821l753702q63431M46256j132160k958372k557558
43521a2460293p93571J80975N7924N1648Q18350J913709K492916J889216L31767
$$ plain form
43581 -3750259 -1024397 1532213 2011464 -1843 -2653957 -3858013 -3532106 -2907707 -2277456
43572 -2277456 -947250 723804 951318 -1306101 -5050172 -8494852 -10388102 -9920445
43564 -9920445 -7134911 -4186787 -4312067 -8109897 -12225919 -13209936 -11465876 -9798220
43556 -9798220 -9259224 -8465140 -6302350 -3222804 -122761 2220520 2772238 1126627 -1173567
43547 -1173567 -1830703 -446364 1369049 2370870 2555670 1813881 -310785 -3137827 -4893534
43538 -4893534 -4835590 -3905819 -2870315 -1356321 794875 2825532 4290864 5379062 5415165
43529 5415165 2944495 -1641326 -5395028 -6258459 -5812203 -6944363 -9902735 -12460293
43521 -12460293 -13253864 -13072889 -13014965 -12963317 -12144967 -10231258 -7738342 -5849126 -5517359
43512e517359o27610M55023K728162L568363J815015p16552j593206n62185P62538
43503C12189J152377Q06616N09710M90757L50714M502J55651J041932J089494
43494E913942j445481n161812o136597l119579K93917O56048p10645r18491o85102
43485a1313800k098314l242019n08684M353638N400009J441401j895656p90072
43477h653497J628561J391712k62593m69589K23822L84656J122650K672477J581970
43468c79831l570821p304004m184946K066054L250008j066279l258071M50906
43460a3996984N022380N120590K193437L20716J49053J73124J74726L43928r1879
43451e90909r96532p88117M65270M72810j084226j324889P64371J802321o34556
$$ plain form
43512 -5517359 -6144969 -5689946 -2961784 606579 2421594 1705042 111836 -450349 312189
43503 312189 1464566 2271182 2780892 3271649 3622363 3626865 3782516 4824448 5913942
43494 5913942 4468461 -693351 -6829948 -9949527 -9655610 -8999562 -9710207 -10628698 -11313800
43485 -11313800 -13412114 -16654133 -17162817 -12809179 -7409170 -5967769 -7863425 -8653497
43477 -8653497 -7024936 -5633224 -5895817 -6365406 -6141584 -5756928 -4634278 -1961801 -379831
43468 -379831 -3950652 -11254656 -15439602 -13373548 -10123540 -11189819 -14447890 -13996984
43460 -13996984 -8974604 -3854014 -1660577 -1339861 -1190808 -1017684 -842958 -499030 -590909
43451 -590909 -1587441 -2375558 -1910288 -1437478 -2521704 -3846593 -3082222 -1279901 -1914457
43442a914457l659205l438612q49012Q25121J048572J007039K8266k519190l806152
43433a3277630r18347L582540M417924J331441q49877J64427J514572R61185K73919
43424b799846J048172J486259j27326k122133k200011p97673O38939K137300L498400
43415G62081K691424j006547m252682l383212L04465K315805J277025N6873N60079
43406f74689Q96152r83938l506564l485768o78058J758158J314864q53799j708118
43397g921760l71646Q70108o6087j995251k153195k27564J334734J068364K28410
43388i233887R2670j3283n39726K5580K425383M157643K673652l14546j005879
43379a732393Q38199K003284J297468R08200J690417J307232j162377k636764
$$ plain form
43442 -1914457 -5573662 -9012274 -9861286 -9036165 -7987593 -6980554 -6952288 -9471478 -13277630
43433 -13277630 -14195977 -10613437 -6195513 -4864072 -5713949 -5549522 -4034950 -3073765 -2799846
43424 -2799846 -1751674 -265415 -392741 -2514874 -4714885 -5512558 -4873619 -2736319 762081
43415 762081 3453505 2446958 -1805724 -5188936 -4884471 -2568666 -1291641 -1234768 -674689
43406 -674689 221463 -762475 -4269039 -7754807 -8432865 -6674707 -5359843 -6213642 -7921760
43397 -7921760 -8293406 -7423298 -7489385 -9484636 -11637831 -11865395 -10530661 -9462297 -9233887
43388 -9233887 -9141217 -9154500 -9694226 -9668646 -7243263 -3085620 -411968 -726514 -1732393
43379 -1732393 -894194 1109090 2406558 3314758 5005175 6312407 5150030 2513266
43371B513266q42867J447922N02678k357301k800468j93156J928759J710058J078093
43362B986984J352004P53175j895652m160840l224403r1540J978419J977146J610138
43353A285431J933069J980448Q85461o18973j476226j772359k169744k659438
43345b612331k584066j582247o0915J188442J662445J434501P79627l15369j859391
43336c949304l124829l001460j498841j26722l5714m29609J71804J598380K275050
43327h121245J633832P58472L24184m81450k023459k622987n98219K725074L982047
43318d423751J990046p01037j312653m60880p79217k713438l663393j609897K067191
43309a1607029M376856M223861K886038J685686P38165j2006k7032Q81882J760009
$$ plain form
43371 2513266 1670399 3118321 3620999 1263698 -1536770 -1729926 198833 1908891 2986984
43362 2986984 4338988 5092163 3196511 -964329 -4188732 -4280272 -2301853 -324707 1285431
43353 1285431 3218500 5198948 6084409 5465436 3989210 2216851 47107 -2612331
43345 -2612331 -5196397 -6778644 -6839559 -5651117 -3988672 -2554171 -1774544 -2089913 -3949304
43336 -3949304 -7074133 -10075593 -11574434 -11701156 -11736870 -12166479 -11994675 -10396295 -8121245
43327 -8121245 -6487413 -5728941 -5404757 -5886207 -7909666 -10532653 -11130872 -8405798 -4423751
43318 -4423751 -2433705 -3134742 -4447395 -4908275 -5687492 -8400930 -12064323 -13674220 -11607029
43309 -11607029 -7230173 -3006312 -120274 1565412 2303577 2291571 2264539 3146421 4906430
43300D906430J396885m24251k913018m912683n268656l487188p33660O85351j23561
43291a0874351j268986n51464J190984J017483j668213l631349j982449J664408
43283a6103937L159736J353529n70385K53408K480505K889638J261957N18630
43275d756919K016552L232699J523366j633761k469268k58115J812864J425023
43267H92441J07578J6960O5445k082763n303960n527792j372800L431297M573846
43258e199748K154439n34501j680066k107895k394839j398876J587673M944054
43250d629759O214334M733214J883295o64931k110743k389421j888915j289001
43242a41927j013334q43016n00904k74415l62697o4612J209783K359306J648107
$$ plain form
43300 4906430 6303315 5879064 2966046 -1946637 -7215293 -10702481 -11436141 -10750790 -10874351
43291 -10874351 -12143337 -12694801 -11503817 -10486334 -12154547 -15785896 -17768345 -16103937
43283 -16103937 -12944201 -11590672 -12161057 -11907649 -9427144 -6537506 -5275549 -4756919
43275 -4756919 -2740367 492332 2015698 381937 -2087331 -2345446 -532582 892441
43267 892441 1000019 1016979 1082424 -1000339 -6304299 -11832091 -13204891 -9773594 -5199748
43258 -5199748 -3045309 -3579810 -5259876 -7367771 -9762610 -11161486 -9573813 -4629759
43250 -4629759 1584575 6317789 8201084 7536153 5425410 3035989 1147074 -141927
43242 -141927 -1155261 -1998277 -2499181 -2773596 -3136293 -3200905 -1991122 368184 2016291
43233B016291l96933j074099N15115J558912m94314l679394l972905j146252J146029
43224e527550J198621J459413L516658M490528J379822l454183m875844j967625
43216c780160J239437J843671J244232J462122J660672K03730k170718l420531
43208a717545l038529j940292o12161Q16813J541194J040581N61003J715730L740164
43199B106958L986776J432002j880421l363826k531362o37329R71344J409490
43191A493632M28517q98899o71618J416495K951578J606771j431947k641345p60263
43182A492921J687364K005306N66106o97544j309498j938296k277027j491998
43174a962666k78125j55188p33820l0571K040784K835765O37236k890823n121676
$$ plain form
43233 2016291 1619358 545259 1060374 2619286 2124972 -1554422 -5527327 -6673579 -5527550
43224 -5527550 -4328929 -2869516 647142 5137670 6517492 3063309 -1812535 -3780160
43216 -3780160 -2540723 -697052 547180 2009302 3669974 3873704 1702986 -1717545
43208 -1717545 -4756074 -6696366 -7308527 -6491714 -4950520 -3909939 -3348936 -1633206 2106958
43199 2106958 6093734 7525736 5645315 2281489 -249873 -887202 84142 1493632
43191 1493632 1922149 1023250 351632 1768127 4719705 6326476 4894529 2253184 1492921
43182 1492921 3180285 5185591 5751697 5054153 3744655 1806359 -470668 -1962666
43174 -1962666 -2240791 -2395979 -3129799 -3160370 -1119586 1716179 2353415 -537408 -5659084
43165e659084n425812m331922j794972J651646L699001K695986K50227q80428
43157i795358m85513p9811M79660K385669M387238L511360j49672k636846j354968
43148c738241J569009K618321J323423k32935n37842K98281J278745J160806l94833
43139C344734j702385q25962J025281L81556l130863n218598k719746J693988
43131g151995L346398J919189P45937J269098J797724J180496K26476p06044k436174
43122A91105m508757m539834j278375L154632N120506K967126j439943m162263
43114d495803k754059Q08855J829094j294719m495443l284283J013371L229693
43106i443294J557054p94439j001715O9263P45013J204026J735371J341114Q074
$$ plain form
43165 -5659084 -11084896 -15416818 -17211790 -15560144 -11861143 -9165157 -8914930 -9795358
43157 -9795358 -10280871 -10360682 -9881022 -7495353 -3108115 403245 253573 -2383273 -3738241
43148 -3738241 -2169232 449089 1772512 1539577 1001735 1300016 2578761 3739567 3344734
43139 3344734 1642349 816387 1841668 2223224 -907639 -6126237 -8845983 -7151995
43131 -7151995 -3805597 -1886408 -1140471 128627 1926351 3106847 3333323 2627279 191105
43122 191105 -4317652 -8857486 -10135861 -6981229 -1860723 1106403 -333540 -4495803
43114 -4495803 -7249862 -6441007 -4611913 -5906632 -10402075 -13686358 -12672987 -9443294
43106 -9443294 -7886240 -8680679 -9682394 -9613131 -8868118 -7664092 -5928721 -4587607 -4579533
43097d579533j04104K107870M290696L744805J361895R3644O28489J053459K65162
43088H862383o91374q46395q83269j771348l087649l620383l073608k284861j739741
43079i136245p30680J228540K683198J550392j478529k804953n61710K454679
43071f795308K626624O21271k96154K66306p0950j357062q44884J630412K394653
43062a825092j04325k335362j297229Q25900R27608K91592J466494K799585J124455
43053A873626j929447j742851J726088L461437J045442k002722j972838P4457
43045E33192J124592O65870k3219n86955j289975j708103j585293j577199j709631
43036f156721o94218J759216L621650L204467J572051M82073m94977k498887m305637
$$ plain form
43097 -4579533 -4683637 -2575767 1714929 5459734 6821629 6915273 7543762 8597221 8862383
43088 8862383 8171009 7324614 6441345 4669997 1582348 -2038035 -5111643 -7396504 -9136245
43079 -9136245 -9866925 -8638385 -5955187 -4404795 -5883324 -8688277 -9249987 -6795308
43071 -6795308 -4168684 -3547413 -3843567 -3577261 -3648211 -5005273 -5850157 -4219745 -1825092
43062 -1825092 -1929417 -4264779 -5562008 -4736108 -3808500 -3516908 -2050414 749171 1873626
43053 1873626 -55821 -1798672 -72584 3388853 4434295 2431573 458735 533192
43045 533192 1657784 2323654 2300435 1713480 423505 -1284598 -2869891 -4447090 -6156721
43036 -6156721 -6850939 -5091723 -1470073 1734394 3306445 3788518 3293541 794654 -3510983
43027c510983l594721q58545Q47506L69037p0758J214791K620671K203813J166560
43018C87371J634563K320986L5442m376694n551226j024704M133318L556931j537377
43009d21390m016336q29082L356645L534776Q46537p90443o97439n01633n4236
43000D27399J432734J949026r68507n103440n371095j052297L085413L756782
42992a843985K969635L208066L010407L36307k824342k951708m17711J130054
42984B616723J26748j264081q84855O25881J390307Q11496k83298r55299r42767
42975A240855o55337p33246j404711k253419k682873k374826j317831J35002J277791
42966h768595J727069J884250J900191P22014k210811m613818l114661J942864
$$ plain form
43027 -3510983 -7105704 -7964249 -7116743 -6747706 -6818464 -5603673 -2983002 -779189 387371
43018 387371 2021934 4342920 4378362 1668 -5549558 -6574262 -2440944 1115987 -421390
43009 -421390 -4437726 -5266808 -1910163 1624613 2471150 1680707 983268 481635 427399
43000 427399 1860133 3809159 2840652 -2262788 -7633883 -8686180 -5600767 -1843985
42992 -1843985 1125650 4333716 7344123 7680430 4856088 1904380 1486669 2616723
42984 2616723 2743471 1479390 594535 1220416 2610723 3422219 3138921 2183622 1240855
42975 1240855 585518 -147728 -1552439 -3805858 -6488731 -8863557 -10181388 -10046386 -8768595
42966 -8768595 -7041526 -5157276 -3257085 -2535071 -4745882 -9359700 -12474361 -10531497
42958a0531497N808154M865704R62006j463680q91138N60989N64123j320219l943772
42949e389330n069755k658087K271320N174457K880691j851525l443246o73217
42941h758692K369290K558735J450388J551088K077281P44716k218600m335283
42933d561077m174706k338409K14726K880870M624494M276945K086494j47423
42925B861914j002374q18478p83094j248424j581242j428477j321738j636347
42917f958260j555265l8484K235662L141028J895667L72278M92320J385201Q68056
42908A838203r25695j662507o26489O667j330382k937394k328151R2751J719768
42899f153229J243470l91039j980595l058976k960442q69154K544146M943850
$$ plain form
42958 -10531497 -4723343 142361 1104367 -359313 -1250451 -689462 -125339 -1445558 -5389330
42949 -5389330 -10459085 -13117172 -10845852 -5671395 -2790704 -4642229 -8085475 -8758692
42941 -8758692 -6389402 -3830667 -2380279 -829191 1248090 1992806 -225794 -4561077
42933 -4561077 -8735783 -11074192 -10859466 -7978596 -3354102 922843 3009337 2861914
42925 2861914 1859540 1041062 257968 -990456 -2571698 -4000175 -5321913 -6958260
42917 -6958260 -8513525 -8552009 -6316347 -3175319 -1279652 -907374 -415054 970147 1838203
42908 1838203 912508 -749999 -1376488 -1369821 -2700203 -5637597 -7965748 -7872997 -6153229
42899 -6153229 -4909759 -5300798 -7281393 -10340369 -13300811 -14169965 -11625819 -6681969
42891f681969M623470K131556q60976l270769m529927l972337j576398J180388
42883a2956962K432715J857854O97776N7682P3638N84356J488218K258815K154247
42874a351661J266974M67734J9687o62049j437288j007822R61127K558996J950497
42865B766195J08750m39181R25713K405509K411663R74727j191153l072134k938481
42856A951608R1896L675597L878060J25098l725278m398764k968581k077950j833747
42847e282061q10133P43718J455766J425823J670119J852783J065997P4288K12933
42838B409233P48760K5937j395071j664018j140972j626488k387653q55441K321744
42829c563969L166203O21877j299787J69126K106856R77818j267629l61689L217830
$$ plain form
42891 -6681969 -2058499 73057 -787919 -4058688 -8588615 -12560952 -14137350 -12956962
42883 -12956962 -10524247 -8666393 -7968617 -7910935 -7837297 -7252941 -5764723 -3505908 -1351661
42874 -1351661 -84687 383047 402734 -259315 -1696603 -2704425 -1743298 815698 2766195
42865 2766195 2874945 2435764 3361477 5766986 8178649 9153376 7962223 4890089 1951608
42856 1951608 2043504 5719101 9597161 9722259 5996981 1598217 -1370364 -3448314 -5282061
42847 -5282061 -6092194 -5348476 -3892710 -2466887 -796768 1056015 2122012 2196300 2409233
42838 2409233 3157993 3183930 1788859 124841 -1016131 -2642619 -5030272 -5885713 -3563969
42829 -3563969 -397766 224111 -1075676 -906550 1200306 2178124 910495 548806 3766636
42820C766636M866456K626236p91956k617723k941706k637665j692407n41903
42812C5968m36326j446830k145497j941711j701646j500557r6790K390529L551666
42803c291194J891334q13673j882830j014352K71758J133158J673524J692023
42795c40252Q97441j01120l92315k2274L41324M76198M31566N5892k86739M79084
42785A538805K275112K894287P47373k318481l286022k447836k671534m154829
42777g423125l525537M27139L662945K389896j015113j409022J357873K567970
42769b966974L07436j743368n42941J666163J649437N51086J287202L139371L304995
42760F652407K339372L244825N493589N032867J216767j208936O69095L100238
$$ plain form
42820 3766636 8633092 11259328 10467372 7849649 4907943 2270278 577871 35968
42812 35968 -400358 -1847188 -3992685 -5934396 -7636042 -9136599 -9233389 -6842860 -3291194
42803 -3291194 -1399860 -2213533 -4096363 -5110715 -4838957 -3705799 -2032275 -340252
42795 -340252 557189 456069 63754 41480 382804 859002 1290568 1346460 1059721 1538805
42785 1538805 3813917 6708204 7455577 5137096 1851074 -596762 -3268296 -7423125
42777 -7423125 -10948662 -10521523 -6858578 -4468682 -5483795 -6892817 -5534944 -2966974
42769 -2966974 -2659538 -4402906 -4945847 -3279684 -1630247 -1079161 208041 3347412 6652407
42760 6652407 8991779 12236604 17730193 22763060 23979827 22770891 23439986 26540224
42752B6540224J442093k761715m646970l390314j958762j108251J049570L712499
42744A8878374L059767j345394m473528k515290J988501M323285L769278K600803
42736B6285796J624524L00281n27248K36764J139357J07458j527020o35163K323461
42727B9328210L427116J211876j475235k570977l661443n762087o188110k922414
42719A1386936Q84789P83659k422188m064234k527979o06013j64378K65250J700066
42710E235908K335268O85325j764824k806462k132748l58926K081931L595082
42702F870554J869387k164689l669817j07747M402614M479624J100575n12588
42694A2267913P57146Q46134k132973m634318l356556J60435K903870M745245
$$ plain form
42752 26540224 27982317 25220602 20573632 17183318 15224556 14116305 15165875 18878374
42744 18878374 21938141 20592747 16119219 13603929 15592430 19915715 23684993 26285796
42736 26285796 27910320 28210601 27683353 27920117 29059474 29166932 27639912 27004749 29328210
42727 29328210 32755326 33967202 32491967 29920990 26259547 20497460 14309350 11386936
42719 11386936 12271725 13055384 10633196 6568962 4040983 3434970 3270592 3535842 5235908
42710 5235908 7571176 8256501 6491677 3685215 1552467 1193541 3275472 6870554
42702 6870554 8739941 6575252 2905435 2797688 7200302 11679926 12780501 12267913
42694 12267913 13025059 13871193 11738220 7103902 3747346 3907781 6811651 11556896
42686A1556896O678987P643938O288652L965260K994723L314318L389985L038729
42678D8871488K681349J149752k638517o560871p055904m016034j097016p60234
42670C0574013j481407o04911K046356M325017M200651J509697j711484k585537
42662C6272395k05098L133221M781571N289192P253604J0975546J3596138J2909761
42654I4006330R862882O500038L305219l22317m244196p297051q305658p210287
42646H6294960n775959o517023r551676j1366140q831611l799567r63967j486936
42638C8002081k157514j211662r68033l053648m813666l316234j84879P21925
42630B3018370j340876l856035m877220m395970l048649j875701k264637l877577
$$ plain form
42686 11556896 18235883 25879821 32168473 36133733 39128456 42442774 45832759 48871488
42678 48871488 51552837 52702589 50064072 43503201 36447297 32431263 31334247 30574013
42670 30574013 29092606 28487695 30534051 34859068 39059719 40569416 38857932 36272395
42662 36272395 36067297 39200518 43982089 49271281 56524885 67500431 81096569 94006330
42654 94006330 103869212 110369250 113674469 113352152 109107956 101810905 93505247 86294960
42646 86294960 80519001 74001978 64450302 53084162 44252551 40452984 39489017 38002081
42638 38002081 35844567 34632905 33664872 30611224 25797558 22481324 22296445 23018370
42630 23018370 21677494 17821459 12944239 8548269 5499620 3623919 1359282 -2518295
42622b518295l876640n38826L700894N305109M263419K845624J330055j373458
42614I137882l846063l091766N54192L186846K522652P1796k217598l968411m379512
42605b029982j977999K207034M512715L381976J395816J026989J335452P27414
42597A0579415j950K35761L01775r36262k008519j167123N47259J198329J148574
42588I897259J621684J810036N40168o03741O86857L158790L405928J346986O02502
42579B2466469K765215M623011K600188k336350n874901n207238j522191J623231
42571A9137434J833283J85068j13015K226697M868990N242369M138256L926344
42563D1445426M559356M246321L277220L648667M837820L720819k36611l212769
$$ plain form
42622 -2518295 -6394935 -6933761 -3232867 2072242 6335661 9181285 10511340 9137882
42614 9137882 5291819 2200053 2754245 5941091 8463743 8535539 6317941 2349530 -2029982
42605 -2029982 -4007981 -1800947 2711768 6093744 7489560 8516549 9852001 10579415
42597 10579415 10577465 10813226 11115001 10178739 8170220 7003097 7550356 8748685 9897259
42588 9897259 11518943 13328979 13869147 13265406 13952263 17111053 20516981 21863967 22466469
42579 22466469 25231684 29854695 32454883 30118533 24243632 19036394 17514203 19137434
42571 19137434 20970717 21155785 21042770 23269467 28138457 33380826 37519082 41445426
42563 41445426 46004782 50251103 53528323 57176990 62014810 65735629 65499018 62286249
42555F2286249k365557j11284o99990m503369q057935q439097n536130j059634
42547C1513253K787624M342858L718104K548209J764931P04962r41108k090308
42539D4348525k322394k962781m447851m655710k141273P54206Q16480j331344
42531B8057858k494376j995824k089967l467201l900311k175509k77350j94484
42523A1462836r36195m59944J134097K085016J585161M15473m24517o25658n17430
42514A3718839q09164j969934l457809m086352l381656j923960k87246J415527
42506g81755K804166L205734K713381K146188J546787k3371k527070m044186k886037
42497B153837J80432K790588L461178K382923L98326j713234l136039l176832
$$ plain form
42555 62286249 59920692 59809408 59109418 54606049 46548114 38109017 32572887 31513253
42547 31513253 34300877 38643735 42361839 44910048 46674979 47379941 46438833 44348525
42539 44348525 42026131 39063350 34615499 29959789 27818516 28572722 29389202 28057858
42531 28057858 25563482 23567658 21477691 18010490 14110179 11934670 11657320 11462836
42523 11462836 10526641 10066697 11200794 13285810 14870971 15286444 14861927 14236269 13718839
42514 13718839 12909675 10939741 7481932 3395580 13924 -1910036 -2197282 -781755
42506 -781755 2022411 5228145 7941526 10087714 11634501 11611130 9084060 5039874 2153837
42497 2153837 2334269 5124857 8586035 10968958 11367284 9654050 6518011 3341179
42489C341179j837965J1241J142226Q20202n01711j458973j213012m21546j90127
42480c08486m69292n01454m61649j107434j791437p05960K183658M144738K853170
42471C835854n46589k750800j903382J011607L522272L489430N16515l300771
42463C874136m741322k716490L85463J586548Q29415L93324J452550K806736K989135
42454F859495K169109J433769J099062N02165p29450j816744j699375o77880l42253
42445F797898j303766j990142r55812N51967L33659j105757j339872k99353l39154
42436C49668j351253J08868M684976P245891L759230j968058l147977K84082K100843
42427A2066270o20852l759207l035605J09335J748781J104924L78802J130894
$$ plain form
42489 3341179 1503214 1514455 2656681 3476883 2975172 1516199 303187 -118359 -308486
42480 -308486 -777778 -1279232 -1740881 -2848315 -4639752 -5345712 -3162054 982684 3835854
42471 3835854 3289265 538465 -1364917 -353310 3168962 6658392 7174907 3874136
42463 3874136 -867186 -3583676 -3198213 -1611665 -782250 -388926 1063624 3870360 6859495
42454 6859495 9028604 10462373 11561435 12063600 11334150 9517406 7818031 7140151 6797898
42445 6797898 5494132 3503990 2548178 3100145 3433804 2328047 988175 688822 349668
42436 349668 -1001585 -892717 3792259 11038150 14797380 12829322 9681345 9965427 12066270
42427 12066270 11445418 7686211 4650606 4759941 6508722 7613646 7992448 9123342
42419I123342K949462M292136L381610j85137l877889m233624j292997J174782
42411A1331685Q94259m1896R19332K648521K505478P11817j63065R46195K569989
42402B2322315K921541J443107j143004k959756k220710K72596J297322m42475
42394B1490936j789091P09523N537327Q079208P041152N797207P170238R887430
42386F3923930J1223737J0796206J0233180J0509677J1028747J0677549Q813652
42379A37206678N461040J088699l642247p683012r321681p335380l122760k47706
42371A12403631l55494q08802J532079N298789O382970M485340M397391R524034
42363A42859938J7008728K1265496K0170600J5443879Q714683M07393p932273
$$ plain form
42419 9123342 12072804 16364940 19746550 19561413 15683524 11449900 10156903 11331685
42411 11331685 12225944 12184048 13103380 15751901 18257379 18969196 18806131 19752326 22322315
42402 22322315 25243856 26686963 25543959 22584203 20363493 20636089 21933411 21490936
42394 21490936 19701845 20411368 25948695 34027903 41069055 46866262 54036500 63923930
42386 63923930 75147667 85943873 96177053 106686730 117715477 128393026 137206678
42379 137206678 142667718 143756417 140114170 132431158 123109477 115774097 112651337 112403631
42371 112403631 112048137 111239335 112771414 118070203 124453173 128938513 133335904 142859938
42363 142859938 159868666 181134162 201304762 216748641 225463324 225870717 217938444
42356B17938444j3407105j4881588j4327791j3923068j3311342j1075355p709975
42349A29302220n266027m387582l510541j320439J522286L794720N497556P158652
42341A32790845Q454848Q964770R565335J1396952J3682146J4178858J1802289
42334B10836043P341686J739168m460750r816222j2387434j2278685j1844527
42327A69129279j2315645j2070917r514073n802347l059842j453427J73047K172567
42319A27258642M500500P910480J2618044J6845845J8873492J9583235K0705704
42312B28295942K1449336J9433113J4347233P991054J064174p110192j5522248
42305B69948412k1149670k2591933k1679556k0555601j9267077j7220198j4993502
$$ plain form
42356 217938444 204531339 189649751 175321960 161398892 148087550 137012195 129302220
42349 129302220 124036193 119648611 116138070 114817631 116339917 120134637 125632193 132790845
42341 132790845 141245693 150210463 159775798 171172750 184854896 199033754 210836043
42334 210836043 218177729 219916897 215456147 205639925 193252491 180973806 169129279
42327 169129279 156813634 144742717 135228644 129426297 126366455 124913028 125086075 127258642
42319 127258642 131759142 139669622 152287666 169133511 188007003 207590238 228295942
42312 228295942 249745278 269178391 283525624 291516678 292580852 285470660 269948412
42305 269948412 248798742 226206809 204527253 183971652 164704575 147484377 132490875
42298A32490875j3350402j1901389j0051701q340387p805913q535182r374572
42291F3131329q790410o176334k800979q38587p64411q79637m73428j492645m872776
42282C6042122p325074n343399r97698O35616q25272r66099J498884K289020j063599
42273B3944501m623623m005791o68623J381940J629028J805468J568691k00731
42265B0830860j800871p22374J968461L090254K200698J407994J187686n6420
42257B8106288k700443n270564o615992o026559k322115L934383Q445347P231790
42249B4782135K137272j435884j733566j525390k210431j942525l22825n0619
42241A7698167k076196l325470j559102J103092J964676J737761J972431J565533
$$ plain form
42298 132490875 119140473 107239084 97187383 88846996 81041083 72505901 63131329
42291 63131329 54340919 48164585 45363606 44525019 43760608 42880971 42407543 40914898 36042122
42282 36042122 28717048 23373649 22375951 23011567 22186295 21220196 22719080 25008100 23944501
42273 23944501 19320878 15315087 14646464 16028404 17657432 19462900 21031591 20830860
42265 20830860 19029989 18307615 20276076 23366330 25567028 26975022 28162708 28106288
42257 28106288 25405845 20135281 13519289 7492730 5170615 9104998 17550345 24782135
42249 24782135 26919407 25483523 23749957 22224567 20014136 18071611 17748786 17698167
42241 17698167 15621971 12296501 10737399 11840491 13805167 15542928 17515359 19080892
42233A9080892p37222k645975j008478K881974M293373J410883k144834j875663
42225A9254950K237118N757352M616475l20975l689741j387494M314516P086873
42217C7869074M184960m77967j791653O12271L727875O030251Q056344R642259
42209F7853414R910390R712384J1200021J4574019J7405585J7612882J5380065
42202A63648760J1854515P673445L280626p20834m087878o826814q421395q236505
42194A58163920o673364m716184k422485P03076L903857N556366N689256O189550
42186A66393992P716453Q308215O326004L034146M12518k227708o950969j2973611
42178A70039040j6447361j5267750j2071415j0998521j2663511j3948766j2302786
$$ plain form
42233 19080892 18343670 15697695 14689217 17571191 21864564 23275447 21130613 19254950
42225 19254950 21492068 27249420 31865895 31544920 27855179 26467685 30782201 37869074
42217 37869074 42054034 41576067 39784414 40396685 44124560 50154811 58211155 67853414
42209 67853414 77763804 87476188 98676209 113250228 130655813 148268695 163648760
42202 163648760 175503275 183176720 186457346 185736512 181648634 174821820 166400425 158163920
42194 158163920 151490556 146774372 144351887 145054963 148958820 154515186 160204442 166393992
42186 166393992 174110445 182418660 188744664 191778810 192191328 189963620 183012651 170039040
42178 170039040 153591679 138323929 126252514 115253993 102590482 88641716 76338930
42171G6338930q675591n968056n689831o742519p006629n630879l777322l138112
42163B9709991l765464l920931k497583p92049p13822j770715j607772L52176
42155A4993831J848942J199249k31530m97747k39308j150486k515510k052477
42147A1354964J08870J070787p59941l601385n037775m739725l562704j955643
42139g122552m67664n7174n23846j67979J643038L153467K978154K472304L311994
42130E219742M245227K914568k101j451141o34087m204j113139k279219j629981
42121E265665r0773M21028K7709J34998Q22657J014684N65217K16838j69742j388177
42111F820104k885286k932846j237995L93814P30606P53219J544071K151420J183626
$$ plain form
42171 76338930 67663339 61695283 56005452 49262933 42256304 36625425 32848103 29709991
42163 29709991 25944527 22023596 19526013 18733964 18020142 16249427 14641655 14993831
42155 14993831 16842773 18042022 17810492 17312745 17073437 15922951 13407441 11354964
42147 11354964 11463834 12534621 11774680 8173295 3135520 -1604205 -5166909 -7122552
42139 -7122552 -7590216 -7647390 -8171236 -8339215 -6696177 -3542710 -564556 1907748 5219742
42130 5219742 9464969 12379537 12377436 10926295 10292208 10288004 9174865 6895646 5265665
42121 5265665 5174892 5595920 5623629 5758627 6581284 7595968 8161185 8378023 8208281 6820104
42111 6820104 3934818 1001972 -236023 157791 888397 1641616 3185687 5337107 6520733
42102F520733o66025j606689j452210j237241p19209J146556L197254K472928
42094G656097j294525m240620l198370J46262K021468J620948P79723O5094j507031
42085B049046l243741k607213R45471M441147M794382K035599j586412m066686
42077B761593m457750k827812m35559J074410J292892J049458Q03437L49158L1063
42068c59110M60271R03892K6457j433612j120732J050071K034593N7072k530823
42059i11921k632121o16896R19763R13955J50231p66501j468118r56011J035891
42050d331728K643101K041805L43639J41049J688574K767351K121497Q57287K84029
42041H556604K30510r7276r19287j839984k168742j437393k42899J31395l08571
$$ plain form
42102 6520733 5854708 4248019 2795809 1558568 839359 1985915 5183169 7656097
42094 7656097 6361572 2120952 -1077418 -931156 1090312 2711260 3490983 3556077 2049046
42085 2049046 -1194695 -3801908 -2856437 1584710 6379092 8414691 6828279 2761593
42077 2761593 -1696157 -4523969 -4959528 -3885118 -2592226 -1542768 -739331 -390173 -359110
42068 -359110 101161 1005053 1031510 -402102 -1522834 -472763 1561830 1618902 -911921
42059 -911921 -3544042 -4160938 -3241175 -2327220 -2176989 -2943490 -4411608 -5367619 -4331728
42050 -4331728 -1688627 353178 696817 837866 2526440 5293791 7415288 8272575 8556604
42041 8556604 8787114 8689838 7770551 5930567 3761825 2324432 2081533 2212928 1904357
42032A904357Q8738J810882K617282P33236j850667j872029L64817J557945M19469
42023E774030q89818n25180O81928J282756J171389O50543l34014j168336p09906
42014E933392O75352J008140m43292j831704j262967P28777K211608K208574J138332
42005A0366212j66550j118651j636340k072431k446137k086037q24953J94558
41997B09671J95948L07509J574965K450735R00769j613321j517821J409794L443183
41988G361432K590748J348603K119852L130788J470898k105955m243679l547204
41980H125483j603027j25144Q20730J801841K557372J880626j020424m670257
41972G767200n662314k461424J826864K882831Q49582n83323m78679j640023m403350
$$ plain form
42032 1904357 1993095 3803977 6421259 7154495 5303828 3431799 3796616 5354561 5774030
42023 5774030 4884212 4359032 5040960 6323716 7495105 8145648 7811634 6643298 5933392
42014 5933392 6608744 7616884 7173592 5341888 4078921 4807698 7019306 9227880 10366212
42005 10366212 10199662 9081011 7444671 5372240 2926103 840066 15113 209671
41997 209671 405619 713128 2288093 4738828 5639597 4026276 2508455 3918249 7361432
41988 7361432 9952180 11300783 13420635 16551423 18022321 15916366 11672687 8125483
41980 8125483 6522456 6397312 7218042 9019883 11577255 13457881 12437457 7767200
41972 7767200 2104886 -356538 1470326 4353157 5202739 4619416 4140737 2500714 -1902636
41963a902636m512899Q9688M859634M858403J678262k19495q17294k834717n005171
41954c806225l287667J702753M411838K342108p69553j190870N6363P79715J702514
41945A940976L870079N129269K915169j088616k603060o54173J155910j80343
41937A0485211k903860k946187M73550L536425K565988j249543l371857j732281
41929D857446Q90140Q55345j749720l716364k695336N98600L276126K676247r28806
41920D063678l689090k179183J605156K262132j040198k751746M14671L685402
41912B370822J664892k433049j464886M080111O642431L317053m99359m83843
41904A3194172O58325o70816l046959l879760m075774m877540m370136j280607
$$ plain form
41963 -1902636 -6415535 -6325847 -1466213 3392190 5070452 4850957 4033663 1198946 -3806225
41954 -3806225 -7093892 -5391139 -979301 1362807 593254 -597616 -541253 238462 1940976
41945 1940976 5811055 10940324 13855493 12766877 10163817 9509644 10665554 10485211
41937 10485211 7581351 4635164 5108714 8645139 11211127 9961584 6589727 4857446
41929 4857446 5747586 6602931 4853211 1136847 -1558489 -959889 2316237 4992484 4063678
41920 4063678 374588 -1804595 -199439 2062693 1022495 -1729251 -1314580 2370822
41912 2370822 4035714 1602665 137779 4217890 10860321 14177374 13678015 13194172
41904 13194172 13852497 13181681 10134722 6254962 2179188 -2698352 -7068488 -8349095
41896h349095J482144J320098N86351K251853M037318J986108k347825l696092
41888b729140r31137J939033K188346J093202J86087q09049j639060r08983J201651
41879d09050K577271K218226J068927l80495k409066l778497k407633R32785K727296
41870A39764J569821k0852J23647O65390l55222k045032k281103r59408N40739
41861b622256J736695K782180K880197J149727j304015k072645l81625J882742
41853D051000K360054O96324j380467k050643j212347k33281J5929K50063J306390
41844C803022K254536J275314j563419l697634k807004N15052L277387K996578
41836F053832M4718k714299k928775j459502j153637k681336l343033j154072
$$ plain form
41896 -8349095 -6866951 -5546853 -4960502 -2708649 1328669 3314777 966952 -2729140
41888 -2729140 -3660277 -1721244 467102 1560304 1746391 937342 -701718 -1610701 -409050
41879 -409050 2168221 4386447 5455374 5074879 2665813 -1112684 -3520317 -2587532 139764
41870 139764 1709585 1688733 1812380 2477770 2122548 77516 -2203587 -3162995 -2622256
41861 -2622256 -885561 1896619 4776816 5926543 4622528 2549883 2168258 4051000
41853 4051000 6411054 7107378 5726911 3676268 2463921 2230640 2246569 2496632 3803022
41844 3803022 6057558 7332872 5769453 2071819 -735185 -220133 3057254 6053832
41836 6053832 6098550 3384251 455476 -1004026 -2157663 -4838999 -8182032 -9336104
41828i336104J915549K939519K444111K761668L329683J560641j988781l628459
41820b173k305118j028377j178714N4594L921995O033510K159619m658829p389626
41811d393119m085208N74953K324003J800358J509390J884658J938223J575320
41803C128578J508384J753105J300665p73801l914676n842147m600691j213646
41795h654229J068416Q48247Q2177M26123N55071p66474j503373M71404K967657
41786d504981K279237p46675j835952p9560J053001j10874j046303j62067K76577
41777d877597j306503k334084k23484L064567L866478J976490k9901q16392q20562
41768a500988l00782N09118N46876n23824j254372q54838q36870k025393k218347
$$ plain form
41828 -9336104 -7420555 -4481036 -2036925 724743 4054426 5615067 3626286 -2173
41820 -2173 -2307291 -3335668 -4514382 -4459788 -537793 5495717 7655336 2996507 -4393119
41811 -4393119 -8478327 -7903374 -5579371 -3779013 -2269623 -384965 1553258 3128578
41803 3128578 4636962 6390067 7690732 6916931 3002255 -2839892 -7440583 -8654229
41795 -8654229 -7585813 -6737566 -6655389 -6229266 -5674195 -6440669 -7944042 -7472638 -4504981
41786 -4504981 -2225744 -2972419 -4808371 -4887931 -3834930 -3945804 -4992107 -5154174 -4877597
41777 -4877597 -6184100 -8518184 -8741668 -5677101 -1810623 165867 135966 -680426 -1500988
41768 -1500988 -1801770 -1292652 -745776 -1269600 -2523972 -3378810 -4215680 -6241073 -8459420
41759h459420K64104K912251K484989K71618k03366P08965k87808k963405l114549
41750h386621O89835M474006M455891J595578r46105j619302l72268K074927L417122
41741E383063J393285k303023l060732M5080K328883M43982k510070k062587P71360
41732D29241J789980L46772o69862j66137L01277L79406J320103K403826J037519
41723G172125k627161m662576k518506J395240K966854J335041j048720j990729
41715B1568j581671j196072j634775k358528k267085j096777L69192J559044K618184
41706e566920L221076K309246Q0050j319395p47032k43999k074159m827808n137096
41697a4306037k474895O14897K579036M029478M938081M025717J644102K46119
$$ plain form
41759 -8459420 -8195316 -5283065 -2798076 -2526458 -2729824 -2020859 -2308667 -5272072 -8386621
41750 -8386621 -7696786 -3222780 1233111 2828689 1882584 263282 -108986 1965941 5383063
41741 5383063 6776348 4473325 1412593 1457673 3786556 4230538 1720468 -342119 429241
41732 429241 2219221 2565993 1896131 1729994 2031271 2410677 3730780 6134606 7172125
41723 7172125 4544964 -117612 -2636118 -1240878 1725976 3061017 2012297 21568
41715 21568 -1560103 -2756175 -4390950 -6749478 -9016563 -10113340 -9744148 -8185104 -5566920
41706 -5566920 -2345844 -36598 43452 -1275943 -2022975 -2266974 -4341133 -9168941 -14306037
41697 -14306037 -16780932 -16166035 -13586999 -9557521 -4619440 -593723 1050379 1296498
41689A296498R14835J967158J932085J348071O54505r35440l179533m147349l334072
41680c483242k778909l408314l072121l57335K403772K612640J432326J286849
41672e364334J524272J20777j973846k149528q35830q23837k159697j782952J232424
41663a2212551L858882L674577J973296Q87202L25221m76816q97108m32474j94895
41654c494666q53426q78963R73661K994725K787859J069155N41554J582509J812327
41645F534735k931k247138l231087l277000k990035j649102J014338L127168K896448
41636A75396J538034J702242L335956L509682P74673k527353l428119k079972
41628C000539p91980n15215j63059R90059J990653J557674l17399k359648l003505
$$ plain form
41689 1296498 2211333 4178491 6110576 7458647 8113152 7177712 3998179 -149170 -3483242
41680 -3483242 -6262151 -9670465 -12742586 -13099921 -10696149 -8083509 -6651183 -5364334
41672 -5364334 -3840062 -3719285 -5693131 -7842659 -8678489 -9502326 -11662023 -13444975 -12212551
41663 -12212551 -8353669 -4679092 -2705796 -1818594 -1493373 -1970189 -2867297 -3299771 -3494666
41654 -3494666 -4348092 -5227055 -4253394 -1258669 1529190 2598345 3139899 4722408 6534735
41645 6534735 6531804 4284666 1053579 -2223421 -5213456 -6862558 -5848220 -2721052 175396
41636 175396 1713430 3415672 6751628 10261310 11035983 8508630 5080511 3000539
41628 3000539 2208559 1693344 1530285 2520344 4510997 6068671 5751272 3391624 388119
41619C88119j631704M50424P56604j602005m314378m376367j909373J00463j50870
41610a2289087j262282j065910N69032K151933K492684J403857m64306j790243
41602a0254322j494348J1680J358581K095130K703804K740303J018447j730163
41594c550888k671373o58789J855152K346005J642765J701502J848296J60770
41586B673440k507222l128425j041443R85101O77766j195483k853146l753327
41578a0142739l737180j991655J423461M293003M357015K253205P61833J115521
41570a667536J565959K55395j773153j927947N7393J590683J062975N5857J51738
41561f28636l02770l292623o400813n096133J94625L701805K346693j04884O57427
$$ plain form
41619 388119 -1243585 -793161 -36557 -1638562 -5952940 -10329307 -12238680 -12138217 -12289087
41610 -12289087 -13551369 -14617279 -14048247 -11896314 -9403630 -7999773 -8464079 -10254322
41602 -10254322 -11748670 -11736990 -10378409 -8283279 -5579475 -2839172 -1820725 -3550888
41594 -3550888 -6222261 -6881050 -5025898 -2679893 -1037128 664374 2512670 2673440
41586 2673440 166218 -2962207 -4003650 -3018549 -2340783 -3536266 -6389412 -10142739
41578 -10142739 -13879919 -15871574 -14448113 -10155110 -5798095 -3544890 -2783057 -1667536
41570 -1667536 -101577 153818 -1619335 -3547282 -3489889 -1899206 -836231 -780374 -628636
41561 -628636 -931406 -4224029 -10624842 -15720975 -15526350 -11824545 -9477852 -9582736 -8925309
41552h925309L032984K928514M28936j248707j228222q78971J45007K912620N080095
41543B246947K851957k641707n669920l614504j23391Q33265N9876K66616J534314
41534d256547K229359K063041J758466J191509j43489j791983k757001k477396
41526d184041r40687J006323J483077m86791k871238k677825k12937J253202L71236
41517g259681o17302J97338J730802K267903J797818Q34905n34871j400841m83010
41508c466939J219584J146601n53672q53179R27399J655741q0087j219316L63871
41499h59997J859250L71699j995638j958101o71164j041671k179220j399903L84934
41490g489811L77713n71233O09543L166910L227150M07416j365750j61791J482066
$$ plain form
41552 -8925309 -5892325 -2963811 -2534875 -3783582 -5011804 -5890775 -5745768 -2833148 2246947
41543 2246947 5098904 2457197 -3212723 -6827227 -6950618 -6117353 -6057477 -5790861 -4256547
41534 -4256547 -2027188 35853 1794319 2985828 2842339 1050356 -1706645 -4184041
41526 -4184041 -5124728 -4118405 -2635328 -3122119 -5993357 -8671182 -8884119 -7630917 -7259681
41517 -7259681 -7876983 -7679645 -5948843 -3680940 -1883122 -1048217 -1583088 -2983929 -3466939
41508 -3466939 -2247355 -1100754 -1654426 -2507605 -1580206 75535 -4552 -1223868 -859997
41499 -859997 999253 1370952 -624686 -2582787 -3253951 -4295622 -6474842 -7874745 -7489811
41490 -7489811 -7112098 -7683331 -7073788 -3906878 -679728 -272312 -1638062 -1799853 -317787
41481c17787J307964L34533p9093l83369p34050j15593J117703R03950j080792
41472I53466k529585k166840j374579j027562J62649K517553L510719J161139
41464A206960k772146m928314m153951j778509M13102J326588J072037J109876
41456h504357K462801L611758K292643m65948j004801J504458L444264K061780
41448E402598p10253j794587j451282j585760j978609j287524j63942k53173j080862
41439d903394q24588M15195Q04673p2484p78563p15502q72522j552659j526106
41430a0025950j93008J177949J392219J198318J964439L223128K944667L78555
41422B060317k464233k972816j153990L86072j52415j555070j567987k1541J316982
$$ plain form
41481 -317787 990177 1324710 1245617 862248 128198 12605 1130308 2034258 953466
41472 953466 -1576119 -3742959 -5117538 -6145100 -5982451 -3464898 45821 1206960
41464 1206960 -1565186 -6493500 -10647451 -12425960 -12012858 -10686270 -9614233 -8504357
41456 -8504357 -6041556 -2429798 -137155 -603103 -1607904 -103446 3340818 5402598
41448 5402598 4692345 2897758 1446476 -139284 -2117893 -3405417 -3569359 -3822532 -4903394
41439 -4903394 -5727982 -5312787 -4508114 -4580598 -5359161 -6074663 -6947185 -8499844 -10025950
41430 -10025950 -10218958 -9041009 -7648790 -6450472 -4486033 -1262905 1681762 2060317
41422 2060317 -403916 -3376732 -4530722 -4144650 -4297065 -5852135 -7420122 -7441663 -6124681
41413f124681J325128M87538k94769l81195O99831K390572K603243M8689l207398
41404b453042l755858j382628Q44449J192989J137915J896227K126203P06349
41396C12604p32563j68777J680911K556843J665802j00781j680308k193951j174179
41387A65601K44361j36693k513622m175963l078930n63523J038347J562162J890578
41378e567682J709812P72713N88384K065449K933763O24831l237290m485454k189320
41369f784794L70680O69202q0834L49425J938456L021866K595719J049161m80916
41360B647965j024800o95380o40308j494669k419763k402925j584736l72756J410864
41351f576508L155648K923442L08322j815591j037551O11527k47874k433460j612224
$$ plain form
41413 -6124681 -4799553 -4312015 -4606784 -4987979 -4288148 -1897576 705667 754356 -2453042
41404 -2453042 -6208900 -7591528 -6747079 -5554090 -4416175 -2519948 -393745 312604
41396 312604 -419959 -588736 1092175 3649018 5314820 5214039 3533731 1339780 165601
41387 165601 409962 273269 -2240353 -6416316 -9495246 -10058769 -9020422 -7458260 -5567682
41378 -5567682 -3857870 -3085157 -2496773 -431324 2502439 3127270 -110020 -4595474 -6784794
41369 -6784794 -6414114 -5744912 -5825746 -5476321 -3537865 -515999 2079720 3128881 2647965
41360 2647965 1623165 927785 287477 -1207192 -3626955 -6029880 -7614616 -7987372 -6576508
41351 -6576508 -3420860 -497418 -189096 -2004687 -3042238 -2430711 -2678585 -5112045 -6724269
41342f724269K442263M579579J650627k830907l770782j203236R10278N58247
41334d388200n99373m80698R06892K102480J852703K22237j205695p64565J128894
41325a225325K193396J304136K9607J04083O45841m30181k861099l770456j311467
41316e321465K644818M313151K192140j267052k546397j110651M41670K26649
41308d27137o05555l36753L32918j85140j086363j62097K300369L455576K035715
41299E321533j34742j386882k275096l324284l320033j502072N92193J171175
41291d858208L91736q62763k437880l555709k254227J522374M186378K646019
41283e222280j146187k676915r61249R16841Q77954J94912M21861R34893N59906
$$ plain form
41342 -6724269 -4282006 297573 1948200 -882707 -4653489 -5856725 -4946447 -4388200
41334 -4388200 -4987573 -5468271 -4561379 -2458899 -606196 -383959 -1589654 -2354219 -1225325
41325 -1225325 968071 2272207 2301814 2405897 3051738 2621557 -239542 -4009998 -5321465
41316 -5321465 -2676647 1636504 3828644 2561592 15195 -1095456 -653786 -427137
41308 -427137 -1032692 -1369445 -1036527 -1221667 -2308030 -2470127 -169758 3285818 5321533
41299 5321533 5186791 3799909 1524813 -1799471 -5119504 -6621576 -6029383 -4858208
41291 -4858208 -4466472 -5329235 -7767115 -11322824 -13577051 -12054677 -7868299 -5222280
41283 -5222280 -6368467 -9045382 -10006631 -9089790 -8211836 -8016924 -7595063 -6660170 -6100264
41274f100264n42584j645131k386044k194956n39303J504493J784417J94021n54360
41265a0479711J343110L853562L628605L77296l034395m170425l032956r10819
41257a2425733J065545K140671K058480J327948O95330M64533Q70081K330770
41249a472375M186905M152271J019929k622609k989250n42810K35687k375742
41241d07994m180814j279467L424066L929388j49947l221340k029475L94576N41272
41232b979735j79282J237733L854244M276611J979831l82201j225007j453170
41224E129024j844053j798944r84467o5130M64227M76134o03490k937655m832684
41215f997038m262416j808848N2530O04757J456423L207217M134759L036242J079808
$$ plain form
41274 -6100264 -6642848 -8287979 -10674023 -12868979 -13408282 -11903789 -10119372 -9925351 -10479711
41265 -10479711 -9136601 -5283039 -1654434 -1277138 -4311533 -8481958 -11514914 -12425733
41257 -12425733 -11360188 -9219517 -7161037 -5833089 -5137759 -4673226 -3803145 -1472375
41249 -1472375 2714530 6866801 7886730 5264121 2274871 1732061 1967748 -407994
41241 -407994 -4588808 -5868275 -2444209 1485179 1335232 -1886108 -3915583 -3521007 -2979735
41232 -2979735 -3159017 -1921284 1932960 6209571 8189402 7807201 6582194 5129024
41224 5129024 3284971 1486027 501560 436430 900657 1376791 773301 -2164354 -6997038
41215 -6997038 -11259454 -13068302 -13015772 -12411015 -10954592 -7747375 -3612616 -576374 503434
41206E03434k12328p83464q63139j11694Q49059K25560k050270l247305j584476
41197g274623P75411Q35070n79646j48781K528610L899846J510505k303761l363243
41188d120612j069961R92361j6796k292811j868247J566010L636281J150099l184817
41179e208493m359569j955117l4674n80685j100602K73608J403806K34317j150993
41170a2478402R6330K542849K608306M36470k69223J905145L907283K681075p52449
41161F77384k839380j652952J324747K837838J085708k239700l684020k276430
41153f766805p04929j214362k239045j225758R38440J394241K13356K93896K407415
41144f903551L847257K751309O27269o24126j351960k204828k059227m5435K137101
$$ plain form
41206 503434 291106 -492358 -1355497 -1467191 -618132 -392572 -2442842 -5690147 -7274623
41197 -7274623 -6499212 -5664142 -6243788 -6392569 -3863959 35887 1546392 -757369 -4120612
41188 -4120612 -5190573 -4198212 -4215008 -6507819 -8376066 -6810056 -3173775 -2023676 -5208493
41179 -5208493 -9568062 -11523179 -11557853 -12138538 -13239140 -12965532 -11561726 -11327409 -12478402
41170 -12478402 -12382072 -9839223 -7230917 -6794447 -7063670 -5158525 -1251242 1429833 677384
41161 677384 -2161996 -3814948 -2490201 347637 1433345 -806355 -4490375 -6766805
41153 -6766805 -7471734 -8686096 -10925141 -12150899 -11212459 -9818218 -9604862 -9310966 -6903551
41144 -6903551 -3056294 -304985 322284 -301842 -1653802 -3858630 -5917857 -5963292 -3826191
41135c826191K199699N39873m40934K98480J442803J407165O4450j551522k319299
41126b185476j835385p25536m003J35401L82285R08539P66990o28359k120820
41117e306364j863805M22624K920553L502314J821318l43002q66849M25692J566370
41108B278851R46726n94244j154354o56908p22193j717769j949981n50855P02039
41099c418688p8068j866838k118792n29508N88138j85688j275558m20232J982232
41090g323002L091103J067211k611569m675276l490699m73391J781583K126247
41082a0507793J339490N73593R9994l79138q13721o88283J86573J071501R08280
41073h209504k89997j149610o59453K26894j89863j605078j635757R25422M066772
$$ plain form
41135 -3826191 -1626492 -1086619 -1527553 -1229073 213730 1620895 1685345 133823 -2185476
41126 -2185476 -4020861 -4746397 -4750400 -4614999 -4232714 -3324175 -2557185 -3185544 -5306364
41117 -5306364 -7170169 -6747545 -3826992 -324678 1496640 1153638 286789 712481 2278851
41108 2278851 3225577 2631333 1476979 820071 97878 -1619891 -3569872 -4120727 -3418688
41099 -3418688 -3496756 -5363594 -7482386 -8011894 -7423756 -7609444 -8885002 -9305234 -7323002
41090 -7323002 -4231899 -3164688 -5776257 -10451533 -13942232 -14415623 -12634040 -10507793
41082 -10507793 -9168303 -8594710 -8494716 -8873854 -9687575 -10375858 -10189285 -9117784 -8209504
41073 -8209504 -8499501 -9649111 -10308564 -10081670 -10271533 -11876611 -13512368 -12586946 -8520174
41064h520174M758230K388357q10675k085838m11929K599785L612008P57303l538068
41055a251001m732362j920615R99884J191996P39260K076923K961858M39878k581350
41046b075529n82417N312509P511060K634246l629404m854960k122112m26283
41038A767110r31454j223847o05917m62745o03728N58986K511801K838391J059520
41029D908117o17717p19886j96500j73111j65815N78974J442578J112289p22489
41020E446440k875638l720745k773498j167087r2656Q54355K502591L622758J919495
41011C716015j991193m258035k804119r8470Q86474P50096J115203P50063j975599
41002c909565m635535l262983J239010L590666J442862j748995k151785l51367
$$ plain form
41064 -8520174 -3761944 -1373587 -2184262 -4270100 -4682029 -2082244 1529764 2287067 -1251001
41055 -1251001 -5983363 -7903978 -6904094 -5712098 -4972838 -2895915 65943 505821 -2075529
41046 -2075529 -2657946 2654563 10165623 12799869 9170465 4315505 2193393 1767110
41038 1767110 835656 -388191 -994108 -1456853 -2060581 -1501595 1010206 3848597 4908117
41029 4908117 4290400 3570514 3374014 3200903 3035088 3614062 5056640 6168929 5446440
41020 5446440 2570802 -1149943 -3923441 -5090528 -5183184 -4328829 -1826238 1796520 3716015
41011 3716015 1724822 -2533213 -5337332 -5435802 -4549328 -3799232 -2684029 -1933966 -3909565
41002 -3909565 -8545100 -11808083 -10569073 -6978407 -5535545 -7284540 -9436325 -9787692
40994i787692P89866K38701r42859j379170j68696K272664L439214J099523k830436
40985g268885l604237r7560L149275K375666p191M35742L110680L556030M98242
40976B147762k491701k528857p75009P12142K049218L564212L520121M99641l475719
40967C221810m948451l486660j635550p08563N53565K547883K964687K82742l008026
40958d216563l313386r04356Q72332P99914R21705K113777K117496k95409k318890
40949d223380j036841J874942K620092R98991N1941O60736M44633j509413k616252
40940b734551j063481R63799N66630j529839k328512q17388J444725L014529L512315
40931A028227K439434n07283l734241m511116k286371K59642N19103p65870q07710
$$ plain form
40994 -9787692 -8997826 -8759125 -9701984 -11081154 -11249850 -8977186 -5537972 -4438449 -7268885
40985 -7268885 -10873122 -10970682 -7821407 -5445741 -5452932 -5017190 -1906510 1649520 2147762
40976 2147762 -343939 -2872796 -3647805 -2935663 -886445 2677767 6197888 6697529 3221810
40967 3221810 -1726641 -5213301 -6848851 -7557414 -7003849 -4455966 -1491279 -1208537 -4216563
40958 -4216563 -7529949 -8434305 -7561973 -6762059 -5840354 -3726577 -1609081 -1904490 -4223380
40949 -4223380 -5260221 -3385279 -765187 233804 285745 946481 1391114 -118299 -2734551
40940 -2734551 -3798032 -2834233 -2267603 -3797442 -6125954 -6943342 -5498617 -2484088 1028227
40931 1028227 3467661 2960378 -773863 -5284979 -7571350 -7311708 -6792605 -7558475 -8366185
40922h366185J218809K976037K022131j123688l755838m078421k516483l85883
40914a4009521J422264K384486K350230K065110K452562K848549J442408j632578
40906f76490l391270j806151R98561J579402O9496m68130R75594K092955J270581
40897F44548r4340k72851L18835N88448N42935K58011q55645k274491j963492
40888c108042L61483J592787o68219l914766l578825O92453M599823M967264L065357
40879D009315J554877Q01677k53076j407874j354020J47369J724563J922442M29752
40870G575025j981124l946642m116806k166392N60114K029389J524010K98731
40862b23695j10506J86823j55661j596919k907194k743544j215709N81920J828309
$$ plain form
40922 -8366185 -7147376 -4171339 -2149208 -3272896 -7028734 -11107155 -13623638 -14009521
40914 -14009521 -12587257 -10202771 -7852541 -5787431 -3334869 -486320 956088 -676490
40906 -676490 -4067760 -5873911 -4875350 -3295948 -3226452 -3694582 -2718988 -626033 644548
40897 644548 550208 277357 596192 1184640 1727575 1985586 1129941 -1144550 -3108042
40888 -3108042 -2746559 -1153772 -1821991 -5736757 -9315582 -8623129 -4023306 943958 4009315
40879 4009315 5564192 6365869 6112793 4704919 3350899 3498268 5222831 7145273 7575025
40870 7575025 5593901 1647259 -2469547 -4635939 -4075825 -2046436 -522426 -223695
40862 -223695 -334201 -147378 -303039 -1899958 -4807152 -7550696 -8766405 -8184485 -6356176
40853f356176K141358J325292p4506o50635K15113J043227o4033k698164m465468
40844i583992l869380j476687J564500M400092N792942M610257J690837m86999
40836B641570q56249r38333k072505l094574k142572M08340K300799K080236L47835
40827a325453j206433j305189j04600R15461P12503K43091J030653K357726J932479
40818C250238l12732j607092o37252P9047j995691n319071o256188l658015O89239
40809a5767517M740799P012134O065391J917283k612778m285914k879959o38576
40801f449137P46983Q16126n89028k513473k443665N03779L053499J635567k061113
40792g300462l027399r6794K719480K392307M75056m67357m03584k29411K97374
$$ plain form
40853 -6356176 -4214818 -2889526 -2964032 -3614667 -3399554 -2356327 -2420360 -5118524 -9583992
40844 -9583992 -13453372 -14930059 -13365559 -8965467 -3172525 1437732 3128569 2641570
40836 2641570 1785321 846988 -1225517 -4320091 -6462663 -6054323 -3753524 -1673288 -1325453
40827 -1325453 -2531886 -3837075 -3941675 -3026214 -2313711 -2070620 -1039967 1317759 3250238
40818 3250238 2937506 1330414 693162 772209 -1223482 -6542553 -12798741 -16456756 -15767517
40809 -15767517 -11026718 -4014584 2050807 3968090 1355312 -2930602 -5810561 -6449137
40801 -6449137 -5702154 -4886028 -5475056 -7988529 -10432194 -9928415 -6874916 -5239349 -7300462
40792 -7300462 -10327861 -10424655 -7705175 -5312868 -4837812 -5305169 -5708753 -5938164 -5640790
40783e640790J193105J293291K81810m96053m61182o55070j108102k56504J575446
40774d274049J367769j758457m105029k690419o0995j70129j812266o31222L486553
40765a0648244N771334L665817M27681J64130K277486K894561J76449l655791
40757A073423n090424l044556K16031J639327O82195n46140m32966K21688J33048
40748e148374k63787L4490O74677R49346J416400K454919K495701K73839k170249
40739G16962j812049N52604J237314n09278j319130O34104K426695R46353k230751
40730F42824l256081j367474R83761K130071K472748K300517J063066q88309k010626
40721B070497j713156j209356j476813j676380o02062J202492K009079J291740
$$ plain form
40783 -5640790 -4447685 -3154394 -2872584 -3368637 -3829819 -4484889 -5592991 -5849495 -4274049
40774 -4274049 -2906280 -4664737 -8769766 -11460185 -11521180 -11691309 -13503575 -14134797 -10648244
40765 -10648244 -4876910 -1211093 -783412 -619282 1658204 4552765 4729214 1073423
40757 1073423 -4017001 -7061557 -6845526 -5206199 -4524004 -5070144 -5503110 -5281422 -5148374
40748 -5148374 -5412161 -5377671 -4702994 -3753648 -2337248 117671 2613372 2887211 716962
40739 716962 -1095087 -542483 694831 185553 -1133577 -499473 1927222 2873575 642824
40730 642824 -2613257 -3980731 -2996970 -866899 1605849 3906366 4969432 4081123 2070497
40721 2070497 357341 -852015 -2328828 -4005208 -4607270 -3404778 -1395699 -103959
40713a03959L54737L00489M03379n95855k164063k329014n17729J385968J604293
40704a661754Q11412O66482J097545P83767l83700j352801j999828k855335k905441
40695g799653n30462K819187L135154l04871k688776n2867M486704M596210l98884
40686C261742m578898l496645O24935K973399K250425O66353N3880L78462J005237
40677C138890J362403P81032p95675k205503k264043j176363J60866J568124L067277
40668C637008L603612J938944j217324l442275l274118j605436k78484l68901
40660a006974j913916l965792m560782k157124K027326M394656K847124o60634
40652d996116k623199k093953q29264j58917K96673R67430J415547J447258J426175
$$ plain form
40713 -103959 250778 551267 954646 358791 -1805272 -4134286 -4652015 -3266047 -1661754
40704 -1661754 -850342 -183860 913685 1697452 1313752 -39049 -2038877 -4894212 -7799653
40695 -7799653 -8330115 -5510928 -2375774 -2680645 -5369421 -5422288 -935584 3660626 3261742
40686 3261742 -1317156 -4813801 -4188866 -1215467 1034958 1701311 1755191 2133653 3138890
40677 3138890 4501293 5282325 4486650 2281147 17104 -1159259 -998393 569731 3637008
40668 3637008 7240620 9179564 7962240 4519965 1245847 -359589 -638073 -1006974
40660 -1006974 -2920890 -6886682 -11447464 -13604588 -11577262 -7182606 -4335482 -4996116
40652 -4996116 -7619315 -9713268 -10542532 -10701449 -10404776 -9437346 -8021799 -6574541 -5148366
40643e148366J051206l73596j860021j088357J882706L388626P10642l784521
40635e221681n560786l773447j341931J9618J325534K771531K504147L20072p88978
40626i745921R62684K904821J756833j386892k918923j965262m75791Q40097K976435
40617g051919N249521N176431K477879L6381k77156J8294q80629k166420k339281
40608B43101j852170j919702k334624k250971j744322j025002M55271K557042
40600g871377L635946K808248J459244P99462k20574k418078l750900k001519
40592g559548J396668L234063L006770K392653J521847m90495k199821j333560
40584c1423N96191k35136l469138m367960j309785J432518N07142j629699j541719
$$ plain form
40643 -5148366 -4097160 -4470756 -6330777 -7419134 -5536428 -2147802 -1437160 -5221681
40635 -5221681 -10782467 -14555914 -15897845 -15878227 -14552693 -11781162 -9277015 -8956943 -9745921
40626 -9745921 -8783237 -5878416 -4121583 -5508475 -8427398 -10392660 -10868451 -10028354 -7051919
40617 -7051919 -1802398 3374033 5851912 5888293 5611137 5629431 4748802 2582382 243101
40608 243101 -1609069 -3528771 -5863395 -8114366 -9858688 -10883690 -10428419 -7871377
40600 -7871377 -4235431 -1427183 32061 831523 610949 -1807129 -5558029 -7559548
40592 -7559548 -6162880 -2928817 77953 2470606 3992453 3501958 1302137 -31423
40584 -31423 564768 329632 -3139506 -7507466 -8817251 -7384733 -6877591 -8507290 -10049009
40575a0049009j72209K42392P29962K753355M005143J758211j942669l127138
40567e801962j950448j185446o66286J377297L011466Q47270k923992k363805
40559i655906K638031N216705J822192k671484l077394j194911r22687j234111
40551i079565P68856L532411L360426P22263r63061j226391k156737l180050j494386
40542i716234K276160L806406J452472j234705q98700J102527J423434n63703
40534b352343k722698l169267j769318L24321J588234J294498J93516n74952r21984
40525h109993j150851p25492N00228P30660j430361l541831j605881L713497O704988
40516d915036M012597p33035k021581L94431K458418K129084J207071J281105
$$ plain form
40575 -10049009 -10221218 -9978826 -9248864 -6495509 -2490366 -732155 -2674824 -5801962
40567 -5801962 -7752410 -8937856 -9604142 -8226845 -5215379 -4368109 -7292101 -9655906
40559 -9655906 -7017875 -1801170 21022 -2650462 -5727856 -6922767 -7845454 -9079565
40551 -9079565 -8310709 -4778298 -1417872 -695609 -1658670 -2885061 -5041798 -8221848 -9716234
40542 -9716234 -7440074 -3633668 -2181196 -3415901 -4314601 -3212074 -1788640 -2352343
40534 -2352343 -5075041 -8244308 -10013626 -9689305 -8101071 -6806573 -6613057 -7188009 -8109993
40525 -8109993 -9260844 -9986336 -9486108 -8755448 -10185809 -13727640 -15333521 -11620024 -4915036
40516 -4915036 -902439 -1635474 -3657055 -3262624 -804206 1324878 2531949 3813054
40508C813054J169429o77685l380422m572976l220412o08490J092451Q31103n43077
40499f097025j355337r69137k53529o3085J8896P66954J763473J829438Q67312
40490c492040J77719N73726J010935j25082k625074m199283k984096K03869K752437
40481h706889L111034J900386L20830j149076j992946j229269R20081K211635
40473d614214J035813r98953j172580L71615J213660Q04865J005145K164279J998540
40464A808170l35453k205851j634532o75576j891837l749094l005122k43062Q93274
40455a1039083l98754q88623J258675L394812K423489p05849k631243j947595
40447a0534171J18207K136493L384953K979735L88058k889926l914879j501214
$$ plain form
40508 3813054 4982483 4304798 924376 -3648600 -6869012 -7477502 -6385051 -5553948 -6097025
40499 -6097025 -7452362 -8421499 -8675028 -8738113 -8719217 -7952263 -6188790 -4359352 -3492040
40490 -3492040 -3314321 -2740595 -1729660 -1854742 -4479816 -8679099 -11663195 -11459326 -8706889
40481 -8706889 -5595855 -3695469 -3374639 -4523715 -6516661 -7745930 -6825849 -4614214
40473 -4614214 -3578401 -4577354 -5749934 -5378319 -4164659 -3359794 -2354649 -190370 1808170
40464 1808170 1472717 -733134 -2367666 -3043242 -4935079 -8684173 -11689295 -11932357 -11039083
40455 -11039083 -11437837 -12326460 -11067785 -7672973 -5249484 -5955333 -8586576 -10534171
40447 -10534171 -10415964 -8279471 -4894518 -1914783 -1526725 -4416651 -8331530 -9832744
40439i832744K064450L332876J340786j642732k758512j329550R79555K148687
40431e697184J607552L74377j87190K91399J007331J169023J043843J229345J142663
40422A981159m18605k803931l337544r91743J368888O24953j944475k580452q68121
40413h969871J20699l63733O89860M074822N554159K279755j869401j810695P84011
40404D89606L61331l401836n249538k847320K46662J115175J403924K598531K493714
40395b789751l97947l065947k417157k27541K87074Q1790J917877M318653L023676
40386G30727j916495n262810l577510P56572L618098L852003K407893r8673k702968
40377b193163l224090p30903K255866K390508j33684j886461q18925J331077J816177
$$ plain form
40439 -9832744 -7768294 -4435418 -3094632 -4737364 -7495876 -8825426 -7845871 -5697184
40431 -5697184 -4089632 -3715255 -3902445 -3611046 -2603715 -1434692 -390849 838496 1981159
40422 1981159 1562554 -1241377 -4578921 -5570664 -4201776 -3576823 -5521298 -8101750 -8969871
40413 -8969871 -8849172 -9212905 -8523045 -4448223 1105936 3385691 1516290 -294405 489606
40404 489606 850937 -2550899 -7800437 -10647757 -10401095 -9285920 -7881996 -5283465 -2789751
40395 -2789751 -3187698 -6253645 -8670802 -8898343 -8611269 -8529479 -6611602 -2292949 730727
40386 730727 -1185768 -6448578 -10026088 -9269516 -5651418 -1799415 608478 509805 -2193163
40377 -2193163 -5417253 -6148156 -3892290 -1501782 -1635466 -3521927 -4340852 -3009775 -1193598
40368a193598M75405o77236n52018j9086J18740M30913J222489J081690j126288
40359b38989l579616l113057L69910L361347L292797J389317j16421j242573k785549
40350b662834l632226k291488k3351L41971j626339l488556l202940q23205K586013
40341a4822955N422268N424497J867343k149422k509592M80309K413598J101617
40333b772337p55998m53038O41373J35782j201835j252808l47727m3005L41318
40324e708275K476904N061809M597760L83161m099197n385046l407295k38236
40316f318415K291864K959423J236463j692116l339522k456535k81960J318275
40308f282523J791196J349764p7242k149543l402754k650765o24798R66044J655591
$$ plain form
40368 -1193598 -718193 -1395429 -1947447 -1966533 -1847793 -1416880 -194391 887299 -238989
40359 -238989 -3818605 -6931662 -6561752 -3200405 92392 1481709 1365288 122715 -2662834
40350 -2662834 -6295060 -8586548 -8609899 -8267928 -9894267 -13382823 -16585763 -17408968 -14822955
40341 -14822955 -9400687 -3976190 -2108847 -4258269 -6767861 -6287552 -3873954 -2772337
40333 -2772337 -3528335 -3981373 -3340000 -3204218 -4406053 -5658861 -6006588 -6049593 -5708275
40324 -5708275 -3231371 1830438 6428198 6811359 2712162 -2672884 -6080179 -6318415
40316 -6318415 -4026551 -1067128 169335 -1522781 -4862303 -7318838 -7600798 -6282523
40308 -6282523 -4491327 -3141563 -3218805 -5368348 -8771102 -11421867 -12046665 -11080621 -9425030
40299i425030K329735L321678L738318K990218J842100J233432Q50704j95313
40291F685842j715685k554466k310689j841479j757871j565946r78304r06082
40283f944680j897452k466867o74433K967358N868259O507677N397475L017147
40275A1774484p53317m516036n371074k712731J22987L0375j807366k271324j083817
40266f587819m40916r84007j293768j015036j306793j931931r53556J801111L639317
40257i073398K628295J93567j198219j110167n56507Q566O41350J048001J069850
40248f348662J091958J060589K35015j188972j525226J80100K477504L200458
40240h17236J904999k26327j798955j751088O0956J850650J177910j471760k342302
$$ plain form
40299 -9425030 -7095295 -3773617 -35299 2954919 4797019 6030451 6881155 6685842
40291 6685842 4970157 2415691 105002 -1736477 -3494348 -5060294 -6038598 -6944680
40283 -6944680 -8842132 -11308999 -11983432 -9016074 -3147815 3359862 8757337 11774484
40275 11774484 11021167 6505131 1134057 -1578674 -1455687 -1425312 -3232678 -5504002 -6587819
40266 -6587819 -7028735 -8012742 -9306510 -10321546 -11628339 -13560270 -14513826 -12712715 -9073398
40257 -9073398 -6445103 -6251536 -7449755 -8559922 -9116429 -9107863 -8466513 -7418512 -6348662
40248 -6348662 -5256704 -4196115 -3961100 -5150072 -6675298 -6495198 -4017694 -817236
40240 -817236 1087763 861436 -937519 -2688607 -2627651 -777001 400909 -1070851 -3413153
40231c413153M51071L413256K095764k381928m687797k676611K69521Q77141L28119
40222e724617J156240K708258K519379O50388l72782L63420Q63625l40851j682967
40213A40093j011210Q49561J108378p32842j898784m34908J692510J407652q38964
40204B81486j755852k21949J180541M14415q32229m394K118318K422298r3393
40195C509241k977827l389547j008416K156457L719898K601240l58396l226186
40187A026464m652284m510856l087337p77853J215028J530470P65404J230401
40179g260563L468714M883723L451549R11974O9317O06852L01442r37738j436154
40170D059116j382504k598112m648865m550777j144130K941709M596403L348489
$$ plain form
40231 -3413153 -2962082 451174 2546938 165010 -4522787 -7199398 -6929877 -6052736 -5724617
40222 -5724617 -4568377 -1860119 659260 1309648 936866 1300286 2163911 1823060 140093
40213 140093 -871117 -21556 1086822 353980 -1544804 -1979712 -287202 1120450 281486
40204 281486 -1474366 -1696315 -515774 -101359 -933588 -937982 1180336 3602634 3509241
40195 3509241 531414 -2858133 -3866549 -1710092 2009806 4611046 4252650 1026464
40187 1026464 -3625820 -8136676 -11224013 -12001866 -10786838 -9256368 -8490964 -7260563
40179 -7260563 -3791849 1091874 4543423 5455397 5524714 6131566 6433008 5495270 4059116
40170 4059116 2676612 78500 -4570365 -9121142 -10265272 -7323563 -2727160 621329
40162F21329O63931j635094j832546L72480K494620J704952q52428j077531J930098
40153B389811M033887K024795j744523l122368j917395r10750r80748m96423J234877
40144E11163K828753L053935K050921L35903j655399k996647k754891j298290
40136G5448j39466k92321j295063j795742r10294O86793J186854j09169j448832
40127d041792r36525L53187j83865k287836k851599r37418N44286l28576j283129
40118a1953267J39145K284970K152485K15823p77667j50753Q01534J827527L271909
40109b188294L748009J824929o02466k19832K541216L638003J062939k646404
40101G158100m136223k929073p58044O64335O65959K1346L93616K002456K619670
$$ plain form
40162 621329 1285260 -349834 -2182380 -1809900 684720 2389672 1537244 459713 2389811
40153 2389811 6423698 8448493 6703970 3581602 1664207 753457 -227291 -723714 511163
40144 511163 3339916 6393851 8444772 8780675 7125276 4128629 1373738 75448
40136 75448 -64018 -356339 -1651402 -3447144 -4357438 -3670645 -2483791 -2592960 -4041792
40127 -4041792 -4978317 -4625130 -4808995 -7096831 -9948430 -10885848 -10341562 -10670138 -11953267
40118 -11953267 -11814122 -9529152 -7376667 -7160844 -7938511 -8089264 -7287730 -5460203 -2188294
40109 -2188294 1559715 3384644 2782178 2562346 5103562 8741565 9804504 7158100
40101 7158100 3021877 92804 -665240 -905 665054 686400 1080016 3082472 5702142
40092E702142O83380j896403k577688k310644l336917m177830j439628L611801
40084e741787N350111J744994k616473l248370j302919j31033j52765L380L35179
40075e759683L75539Q63851J966986K111193Q79617N64212K349919L565490J621530
40066H538654j730791l208105k813254k477712k035709m09589R18355j40930j981523
40057e340604j305726J191317J628717n98885j747641J37199K372089K370705
40049a292829J287974R69911P31766m32873j321680q09141l05325j262950k209202
40040d644349j065900J146762J837568R18171L75618N37008j28689j681229k275592
40031d980632j447851r49144j443854j083557J204508L316337K749741J41833
$$ plain form
40092 5702142 6385522 4489119 1911431 -399213 -3736130 -7913960 -9353588 -5741787
40084 -5741787 -391676 1353318 -1263155 -4511525 -5814444 -5945477 -6098242 -6094862 -5759683
40075 -5759683 -5384144 -4520293 -2553307 -442114 437503 1001715 3351634 6917124 8538654
40066 8538654 6807863 3599758 786504 -1691208 -3726917 -4136506 -3218151 -3359081 -5340604
40057 -5340604 -6646330 -5455013 -3826296 -4425181 -6172822 -6035623 -3663534 -1292829
40049 -1292829 -4855 965056 1696822 1263949 -57731 -866872 -1172197 -2435147 -4644349
40040 -4644349 -5710249 -4563487 -2725919 -1807748 -1432130 -895122 -1023811 -2705040 -4980632
40031 -4980632 -6428483 -7377627 -8821481 -9905038 -8700530 -5384193 -2634452 -2492619
40023b492619j869024k059733j066574M27224J883046K136351O34267j036431
40015c443493r64569J74773K89415m44883J58585K219536L006559J124724j311246
40006H09401j983271j290416n16945L45358J192346P49384j059442k127983j632981
39997e514549j692787l093336k702910J234160M518430K613139j729877k262758
39989h630488J026127K464824L03753j294013m45763m01449k231473j900599J926082
39980i182999L833139J07251m453975l685185O55033K687412J716242J329767
39972f993315J987439J213746l49163M24666K977377L427307J099196o88327n61731
39963B537195o09304j474982j094178O65597R94254p68693j501391N20901K899205
$$ plain form
40023 -2492619 -4361643 -6421376 -7487950 -7060726 -5177680 -3041329 -2407062 -3443493
40015 -3443493 -4408062 -4233289 -3943874 -4388757 -4230172 -2010636 995923 2120647 809401
40006 809401 -1173870 -2464286 -2981231 -2635873 -1443527 -694143 -1753585 -3881568 -5514549
39997 -5514549 -7207336 -10300672 -13003582 -11769422 -7250992 -4637853 -6367730 -8630488
39989 -8630488 -7604361 -5139537 -4835784 -6129797 -6575560 -6977009 -9208482 -11109081 -9182999
39980 -9182999 -5349860 -5242609 -9696584 -13381769 -12726736 -10039324 -8323082 -6993315
39972 -6993315 -5005876 -3792130 -4141293 -3716627 -739250 2688057 3787253 3098926 2537195
39963 2537195 1927891 452909 -641269 24328 1018582 249889 -1251502 -730601 2168604
39954B168604L386753K978225K671895R77150k663606n183304l724047j0892J849319
39945B450097M69504j996937k831788j012325K125692L418689Q28633l250240
39937B01325l956997m12772K494325O02683l858508n593518l170794J82234J385149
39928a2126873L81892j123160j542029l07540J524161K032920R06640J59188J163383
39919h931418K360002J686900J7126j26045J375136J913892P1321k193151k106853
39910e933090L16802K200852J081221k300496m797310m378829k153448m04122
39902a6368420L36587R04381J158586K51528j038390p85353R16186J724341O18432
39893a2282122p63414j092414r43608m13750J732926M772267N007217P25765m312943
$$ plain form
39954 2168604 5555357 8533582 11205477 12182627 9519021 4335717 611670 600778 2450097
39945 2450097 2919601 922664 -1909124 -2921449 -795757 2622932 3451565 201325
39937 201325 -3755672 -4168444 -1674119 -1071436 -4929944 -10523462 -13694256 -13512022 -12126873
39928 -12126873 -11744981 -12868141 -14410170 -14717710 -13193549 -11160629 -10253989 -10094801 -8931418
39919 -8931418 -6571416 -4884516 -4867390 -4993435 -3618299 -1704407 -1633086 -3826237 -5933090
39910 -5933090 -5616288 -3415436 -2334215 -4634711 -9432021 -13810850 -15964298 -16368420
39902 -16368420 -16031833 -15127452 -13968866 -13717338 -14755728 -15541081 -14624895 -12900554 -12282122
39893 -12282122 -13045536 -14137950 -15081558 -15495308 -13762382 -8990115 -3982898 -3257133 -7570076
39884g570076n350403k655912o0297P72682J179871J825157J880273J527216J958285
39875f493204K757566K142318Q7782j319092r68666P5367O87804Q37075N02693
39866a690357l43112n34496J122317L160982K504366j009113l633634k547772
39858b970819M32942J611954K50227j216779q20172R08543K251096K241050J158015
39849C846057q5769q16326j087932j242748j061982K4930J653382K256243Q78673
39840D364528j177765j632589l04188K86073j651977m077196l380020K60449K301678
39831e011007j3176l352086k853764P40920K293394J4678k315521j600495L86526
39822a1710531R10151M87555N50036K48517j199491j788551O8677J950284R32458
$$ plain form
39884 -7570076 -12920479 -15576391 -15636688 -14864006 -13684135 -11858978 -9978705 -8451489 -6493204
39875 -6493204 -3735638 -1593320 -1505538 -2824630 -3793296 -3717929 -3030125 -2193050 -1690357
39866 -1690357 -2033469 -2567965 -1445648 1715334 4219700 3210587 -423047 -2970819
39858 -2970819 -2537877 -925923 -675696 -1892475 -2712647 -1804104 446992 2688042 3846057
39849 3846057 3760288 2943962 1856030 613282 -448700 -423770 1229612 3485855 4364528
39840 4364528 3186763 1554174 1249986 1536059 -115918 -4193114 -7573134 -7312685 -5011007
39831 -5011007 -5024183 -8376269 -11230033 -10489113 -8195719 -8181041 -10496562 -12097057 -11710531
39822 -11710531 -10800380 -10312825 -9762789 -9514272 -10713763 -12502314 -12433637 -10483353 -9550895
39813i550895j193779m68243K712003M064535J971790p23245j609446j383133
39805f180413j021624N0182J893401L111754K980273K169051R52760q25241j970334
39796A159809j072976M10970n03342l419562m401948j625288K114464L639539
39788c698334K923576J188066j183906l229500l074033q64316Q13254J046612
39780f078581J916527L869887L537612q85465n465531n532368k329285n51925
39772a1519129j076688o44439J957885L890041K969652P46733l61488l52004n83686
39763d973123j192615j053914L91765K228796K912646J863458J72178o82801p40126
39754a073736j188481k029353j732899R9864J553434J169581K30645N46752J398170
$$ plain form
39813 -9550895 -10744674 -11212917 -8500914 -4436379 -2464589 -3187834 -4797280 -6180413
39805 -6180413 -7202037 -7151855 -5258454 -2146700 833573 3002624 3955384 3130143 1159809
39796 1159809 86833 497803 -5539 -3425101 -7827049 -9452337 -7337873 -3698334
39788 -3698334 -774758 413308 -770598 -4000098 -7074131 -7938447 -7125193 -6078581
39780 -6078581 -4162054 -292167 3245445 2359980 -3105551 -8637919 -10967204 -11519129
39772 -11519129 -12595817 -13240256 -11282371 -7392330 -4422678 -3675945 -4037433 -4389437 -4973123
39763 -4973123 -6165738 -7219652 -6827887 -4599091 -1686445 177013 349191 -333610 -1073736
39754 -1073736 -2262217 -4291570 -6024469 -5924605 -4371171 -3201590 -2970945 -2424193 -1026023
$$ [...]
##END NTUPLES=NMR SPECTRUM
##END=
