##TITLE=31Pdec_DE-100_oil_d6TFA
 DMSO-d6, 64 sc
 3.7.2025
##JCAMPDX= 6.0         $$ Bruker NMR JCAMP-DX V2.0
##DATA TYPE= NMR SPECTRUM
##DATA CLASS= NTUPLES
##ORIGIN= UXNMR, Bruker Analytische Messtechnik GmbH
##OWNER= root
$$ XWIN-NMR		Version 3.5
$$ Thu Jul  3 15:32:28 2025 Russian Standard Time (UT+4h)  she@DPX200
##.OBSERVE FREQUENCY= 81.013821
##.OBSERVE NUCLEUS= ^31P
##.ACQUISITION MODE= SIMULTANEOUS
##.ACQUISITION SCHEME= undefined
##.AVERAGES= 64
##.DIGITISER RES= 17
##SPECTROMETER/DATA SYSTEM= spect
##.PULSE SEQUENCE= zgpg30
##.SOLVENT NAME= DMSO
##.SHIFT REFERENCE= (INTERNAL, DMSO, 0, 198.062)
##AUDIT TRAIL= $$ (NUMBER, WHEN, WHO, WHERE, WHAT)
$$ ##TITLE= Audit trail, XWIN-NMR		Version 3.5
$$ ##JCAMPDX= 5.01
$$ ##ORIGIN= Bruker BioSpin GmbH
$$ ##OWNER= she
$$ F:/spectra/data/she/nmr/P31/2/pdata/1/auditp.txt
$$ ##AUDIT TRAIL=  $$ (NUMBER, WHEN, WHO, WHERE, WHAT)
(   1,<2025-07-03 15:31:25.76 +0400>,<she>,<DPX200>,
      <created by zg, POWCHK disabled, PULCHK disabled
       configuration hash MD5:
       00 E9 B6 7A A2 85 ED C7 34 08 36 98 17 FE 4E 26
       data hash MD5: 32K
       37 E1 E4 16 FE 38 20 F8 03 A7 94 44 3F 96 2B DE>)
(   2,<2025-07-03 15:31:27.85 +0400>,<she>,<DPX200>,
      <Start of raw data processing
       efp BC_mod = 2 LB = 1.5 FT_mod = 6 PKNL = 1 PHC0 = 1317.363 PHC1 = 351.894 SI = 64K 
       data hash MD5: 64K
       A5 8D 58 28 44 65 AF 4F A3 3B D2 56 A6 AB 49 EF>)
(   3,<2025-07-03 15:31:46.23 +0400>,<she>,<DPX200>,
      <pk PHC0 = -43.25876 PHC1 = 0 
       data hash MD5: 64K
       2B 68 57 D3 9C 03 D4 B3 32 FA 01 F1 95 F8 87 E0>)
(   4,<2025-07-03 15:31:56.00 +0400>,<she>,<DPX200>,
      <abs ABSG = 5 
       data hash MD5: 64K
       C9 20 9A 1C 6E 72 61 9E E7 01 52 A8 6D 3E AF F2>)
$$ ##END=
$$ 
$$ hash MD5
$$ 8D 84 44 91 6A D0 24 47 9D 56 1A 5B 6F 8C 78 46
##$RELAX= 
##$RELAX= 
##$RELAX= 
##$RELAX= 
##$RELAX= 
##$RELAX= 
##$RELAX= 
##$RELAX= 
$$ Bruker specific parameters
$$ --------------------------
##$DU= <F:/spectra>
##$EXPNO= 2
##$NAME= <P31>
##$PROCNO= 1
##$TYPE= <nmr>
##$USER= <she>
##$AMP= (0..31)
100 100 100 100 100 100 100 100 100 100 100 100 100 100 100 100 100 100 
100 100 100 100 100 100 100 100 100 100 100 100 100 100 
##$AQSEQ= 0
##$AQ_mod= 1
##$AUNM= <au_zg>
##$AUTOPOS= <>
##$BF1= 81.014009
##$BF2= 200.13
##$BF3= 200.13
##$BF4= 200.13
##$BF5= 200.13
##$BF6= 200.13
##$BF7= 200.13
##$BF8= 200.13
##$BYTORDA= 1
##$CFDGTYP= 0
##$CFRGTYP= 5
##$CHEMSTR= <none>
##$CNST= (0..31)
1 1 145 1 1 1 1 1 1 1 1 1 1 1 1 1 1 1 1 1 1 1 1 1 1 1 1 1 1 1 1 1 
##$CPDPRG= <waltz16>
##$CPDPRG1= <>
##$CPDPRG2= <waltz16>
##$CPDPRG3= <>
##$CPDPRG4= <mlev>
##$CPDPRG5= <mlev>
##$CPDPRG6= <mlev>
##$CPDPRG7= <mlev>
##$CPDPRG8= <mlev>
##$CPDPRGB= <>
##$CPDPRGT= <>
##$D= (0..31)
0 1 0 0 0 0 0 0 0 0.06 0 0.03 2e-05 3e-06 0 0 0.0002 0 0 0 0 0 0 0 0 0 
0 0 0 0 0 0 
##$DATE= 1751542285
##$DBL= (0..7)
120 120 120 11 120 120 24 19 
##$DBP= (0..7)
150 150 150 150 150 150 150 150 
##$DBP07= 0
##$DBPNAM0= <>
##$DBPNAM1= <>
$$ [...]
##$SUBNAM3= <"">
##$SUBNAM4= <"">
##$SUBNAM5= <"">
##$SUBNAM6= <"">
##$SUBNAM7= <"">
##$SUBNAM8= <"">
##$SUBNAM9= <"">
##$SW= 400.765351723535
##$SWIBOX= (0..15)
0 1 3 0 0 0 0 0 0 0 0 0 0 0 0 0 
##$SW_h= 32467.5324675325
##$TD= 32768
##$TD0= 1
##$TE= 0
##$TE2= 300
##$TE3= 300
##$TEG= 300
##$TL= (0..7)
0 120 53 12 22 120 120 120 
##$TP= (0..7)
150 150 150 150 150 150 150 150 
##$TP07= 0
##$TPNAME0= <>
##$TPNAME1= <>
##$TPNAME2= <>
##$TPNAME3= <>
##$TPNAME4= <>
##$TPNAME5= <>
##$TPNAME6= <>
##$TPNAME7= <>
##$TPOAL= (0..7)
0.5 0.5 0.5 0.5 0.5 0.5 0.5 0.5 
##$TPOFFS= (0..7)
0 0 0 0 0 0 0 0 
##$TUNHIN= 0
##$TUNHOUT= 0
##$TUNXOUT= 0
##$USERA1= <user>
##$USERA2= <user>
##$USERA3= <user>
##$USERA4= <user>
##$USERA5= <user>
##$V9= 5
##$VALIST= <valist>
##$VCLIST= <CCCCCCCCCCCCCCC>
##$VD= 0
##$VDLIST= <DDDDDDDDDDDDDDD>
##$VPLIST= <PPPPPPPPPPPPPPP>
##$VTLIST= <TTTTTTTTTTTTTTT>
##$WBST= 1024
##$WBSW= 4
##$XGAIN= (0..3)
0 0 0 0 
##$XL= 0
##$YL= 0
##$YMAX_a= 9117
##$YMIN_a= -9588
##$ZGOPTNS= <>
##$ZL1= 120
##$ZL2= 120
##$ZL3= 120
##$ZL4= 120
##$ABSF1= 198.0616
##$ABSF2= -202.7028
##$ABSG= 5
##$ABSL= 3
##$ALPHA= 0
##$AQORDER= 0
##$ASSFAC= 0
##$ASSFACI= 0
##$ASSFACX= 0
##$ASSWID= 0
##$AUNMP= <proc_1d>
##$AZFE= 0.1
##$AZFW= 0.5
##$BCFW= 0
##$BC_mod= 2
##$BYTORDP= 0
##$COROFFS= 0
##$CY= -3
##$DATMOD= 1
##$DC= 0
##$DFILT= <>
##$DTYPP= 0
##$F1P= 0
##$F2P= 0
##$FCOR= 1
##$FTSIZE= 65536
##$FT_mod= 6
##$GAMMA= 0
##$GB= 0
##$INTBC= 1
##$INTSCL= 9.790993e-09
##$ISEN= 30
##$LB= 1.5
##$LEV0= 0
##$LPBIN= 0
##$MAXI= 10000
##$MC2= 0
##$MEAN= 0
##$ME_mod= 0
##$MI= 50
##$NCOEF= 0
##$NC_proc= -8
##$NLEV= 6
##$NOISF1= 182.463
##$NOISF2= 159.3651
##$NSP= 0
##$NTH_PI= 0
##$NZP= 0
##$OFFSET= 198.0616
##$PC= 4
##$PHC0= 1274.104
##$PHC1= 351.894
##$PH_mod= 1
##$PKNL= yes
##$PPARMOD= 0
##$PSCAL= 0
##$PSIGN= 0
##$REVERSE= no
##$SF= 81.0140089999434
##$SI= 65536
##$SIGF1= 159.3651
##$SIGF2= -187.1042
##$SINO= 113.3802
##$SIOLD= 16384
##$SREGLST= <1H.CDCl3>
##$SSB= 0
##$STSI= 65536
##$STSR= 0
##$SW_p= 32467.5324675325
##$SYMM= 0
##$S_DEV= 0
##$TDeff= 32768
##$TDoff= 0
##$TI= <>
##$TILT= no
##$TM1= 0
##$TM2= 0
##$TOPLEV= 0
##$USERP1= <user>
##$USERP2= <user>
##$USERP3= <user>
##$USERP4= <user>
##$USERP5= <user>
##$WDW= 1
##$XDIM= 65536
##$YMAX_p= 479696124
##$YMIN_p= -219230716
$$ End of Bruker specific parameters
$$ ---------------------------------
##NTUPLES= NMR SPECTRUM
##VAR_NAME=  FREQUENCY,     SPECTRUM/REAL,   SPECTRUM/IMAG
##SYMBOL=    X,             R,               I
##VAR_TYPE=  INDEPENDENT,   DEPENDENT,       DEPENDENT
##VAR_FORM=  AFFN,          ASDF,            ASDF
##VAR_DIM=   65536,         65536,           65536
##UNITS=     HZ,            ARBITRARY UNITS, ARBITRARY UNITS
##FACTOR=    0.49542278885378, 1,            1
##FIRST=     16045.7642231865, 0,            0
##LAST=      -16421.768244346, 0,            0
##MIN=       -16421.768244346, -219230716,   0
##MAX=       16045.7642231865, 479696124,    0
$$ Real data points
##PAGE= N=1
##DATA TABLE= (X++(R..R)), XYDATA
$$ [...]
45494 11245457 12216650 8233324 1558783 -3177030 -3753480 -2675343 -3380630 -5666232
45486 -5666232 -6888483 -6297394 -5349080 -4375546 -2179455 770947 1955213 809636 297694
45477 297694 2541488 5157735 4538228 1369802 -65895 2202557 5343442 5708143 3195957
45468 3195957 615653 269339 2484980 6433385 10672542 13082678 11909457 7679521
45460 7679521 3350895 1652495 2371300 2979223 2041055 1100309 2371135 5115702 5842349
45451 5842349 2676977 -1701439 -2825013 359688 4528161 6220504 5421836 4275786
45443 4275786 3897458 4084595 5179894 7874521 10904281 11107960 7107254 1622650 -1469123
45434 -1469123 -1646198 -1556684 -2633206 -3099568 -1195703 1493561 1891011 -61979 -894136
45425 -894136 1895855 6509785 9247886 9159517 8527306 8959129 9082752 7063418 3736811
45416 3736811 1419301 495377 -532435 -1667432 -682812 3148655 6791836 6881466 4031192
45407 4031192 1541737 734354 31169 -1698292 -3567201 -4787061 -5777882 -6271939 -4723067
45398 -4723067 -1079898 1876599 1820123 -46660 -1143272 -1326266 -2158674 -3282586 -2362713
45389 -2362713 1163970 4660104 5400003 3499357 1054996 -260883 -20312 1342785
45381 1342785 2800930 3283239 2599647 1403088 103738 -1389166 -2668090 -2639555 -967354
45372 -967354 1027523 1573510 172562 -2155690 -3747879 -3167653 -141827 3579485 4900544
45363 4900544 2024723 -3373301 -7175727 -6446927 -2148172 1757066 2024683 -904435
45355 -904435 -3668411 -3570619 -963134 1912860 3543535 4043069 4270563 4935306 5985717
45346 5985717 6040783 3221642 -2252719 -7047498 -7837721 -4969939 -1440583 1104620 3192848
45337 3192848 4779089 4563173 2675644 1417624 2128879 3502452 4215100 4920188 6033198
45328 6033198 5946060 3849181 2427927 4715976 9124542 10497974 6098505 -1590794
45320 -1590794 -7913108 -9952758 -7684993 -3491482 -883804 -1840534 -4750044 -6091860
45312 -6091860 -4261028 -675327 2494297 4097077 3797438 2060960 591519 1080470
45304 1080470 3132061 4781043 5089821 4662224 3712249 1714419 -721755 -1790302 -983300
45295 -983300 285433 1181021 2482328 4377778 5645199 6234575 8065407 11331056 12504359
45286 12504359 8820133 2909900 -344174 -528283 -1635295 -5383214 -8355526 -7081691
45278 -7081691 -2961978 49272 810970 1555077 3728404 5577424 4484800 476712
45270 476712 -3535087 -4764105 -3186252 -1023978 -81681 -226972 -434399 -398016 -530552
45261 -530552 -993395 -1492996 -1709373 -1341808 -199791 1094323 1162556 -325359 -1445213
45252 -1445213 3839 3440615 5762089 4763558 1114035 -3036391 -5851367 -5947728 -2706569
45243 -2706569 2280690 5382139 4147708 -109929 -4060501 -6116622 -7246411 -8528711
45235 -8528711 -9496537 -9179740 -7606653 -5700850 -4331564 -3836794 -3962942 -3984626 -3354017
45226 -3354017 -2469046 -2279827 -2818096 -2698775 -730205 2258948 4002192 3414868 2035036
45217 2035036 2310897 4717312 7282842 8059184 7222321 6173018 5395443 4443098 3647114
45208 3647114 4043717 5117299 4449516 1066144 -2137364 -1327971 3353227 7797159 8860372
45199 8860372 7298286 5364236 3673083 1772951 154283 -231101 275169 463870 202863
45190 202863 607158 2298622 4500753 5839223 5384430 3259446 871955 -113575 158980
45181 158980 -328729 -2306801 -3282137 -767495 3580752 5775413 5079111 4665815 6338666
45172 6338666 7912786 7193224 5492547 5066709 5517522 5220654 4350631 3796016 2669374
45163 2669374 -146239 -3052532 -3382371 -1484775 -371713 -1535950 -3675561 -5306908
45155 -5306908 -6029934 -5411673 -3402292 -1862362 -2824935 -5104746 -5612018 -4234006 -4009099
45146 -4009099 -5849423 -6915143 -5662477 -4683779 -6207595 -8118919 -7333297 -4432296
45138 -4432296 -1974999 -597222 111687 -833157 -3787834 -5880962 -4329905 -1040245
45130 -1040245 34779 -942614 -464925 1945820 2822750 636406 -1914208 -2681530 -3022910
45121 -3022910 -4264859 -4985617 -4088545 -3378363 -4511491 -6039158 -6114748 -5738550 -6369642
45112 -6369642 -6326038 -2957297 2716287 6811016 7641100 7153278 7383667 8070179 8109656
45103 8109656 7154788 5125214 1894548 -1745548 -4050488 -4013985 -2450381 -1081520 -1000094
45094 -1000094 -1894473 -2213722 -460737 2952587 5606526 5645322 3853919 2260278 1544104
45085 1544104 1152475 1002727 1097166 112722 -3073357 -6393190 -5911015 -1197898 2954612
45076 2954612 1903719 -3330338 -7645329 -7736776 -4539510 -709120 2039038 3005173 1951756
45067 1951756 -465139 -2511013 -2475241 -12181 3543714 5986251 5754685 3303095 832941
45058 832941 121723 832428 1511681 1707165 1955846 1960529 451611 -2544883 -4709366
45049 -4709366 -3864071 -632311 2465517 4040426 4785112 5749149 6998986 8030701 8266497
45040 8266497 6886563 3396068 -1114532 -4398009 -5491024 -5757060 -6614452 -7227455 -5831617
45031 -5831617 -2798439 -760400 -1495840 -3845084 -5093143 -3725189 -708589 1297064
45023 1297064 130950 -3547938 -6186984 -4688816 17294 3831441 4035906 1656545
45015 1656545 -1019892 -3453606 -6108757 -8127844 -7771932 -4947108 -1707888 -6438
45007 -6438 15280 -679444 -1434338 -2157415 -2810585 -3215490 -3275418 -3180758 -3331004 -3908633
44997 -3908633 -4469004 -4199164 -2748411 -654071 1042753 1394166 103020 -1811194 -2172435
44988 -2172435 378244 4447725 7088583 7079559 5611262 3603155 570219 -2916372 -4267675
44979 -4267675 -2564685 -1069881 -3038571 -6465154 -6595568 -3034626 -318002 -991467
44971 -991467 -2263336 -1195119 475498 -582813 -4086693 -7134324 -8602101 -9319158
44963 -9319158 -8998611 -6471750 -2900403 -1591262 -3722709 -6474163 -6486927 -3715840 -925868
44954 -925868 -406864 -1944108 -3395364 -2843764 -557241 1278327 1168541 -94240 -1380813
44945 -1380813 -3598059 -8043586 -12996964 -14708647 -12207520 -8493358 -6013388 -3712541
44937 -3712541 -373459 1717799 -516529 -5834638 -9375936 -8273355 -4078134 315170
44929 315170 3543032 5142973 4680236 2866884 1830824 2888452 5129831 7064346
44921 7064346 8302690 8633618 7085103 3595221 443788 23890 1714586 2761333
44913 2761333 1932259 510054 -217331 -556629 -1222298 -2269722 -3719409 -5688294 -7278493
44904 -7278493 -6893896 -4580651 -2658477 -2877476 -4128057 -4274606 -3242426 -2731804 -3547652
44895 -3547652 -4902414 -6120859 -7371281 -8468796 -8322916 -6181683 -2698980 612279
44887 612279 2564078 2931799 2410783 1826837 986287 -1182338 -4658153 -7289696 -7050228
44878 -7050228 -4834476 -3373171 -3552049 -3683178 -2604181 -1381841 -1137710 -1196085 -755400
44869 -755400 -718563 -2072569 -3619729 -3319329 -1357159 -100615 -1153727 -3811398 -6163238
44860 -6163238 -6460311 -3878368 468897 3580877 3430541 1751648 2128795 5165360 7614750
44851 7614750 6857562 4045146 1681679 217288 -1164652 -2147450 -2119554 -2398911 -4848368
44842 -4848368 -8310888 -9031172 -5463133 -701979 1039479 -968774 -3972605 -5130227
44834 -5130227 -3660871 -604139 1991751 2130408 -263770 -2509863 -1609164 2169331
44826 2169331 5349856 5355651 3381978 2415485 3477385 5063063 5633246 5108016 3951713
44817 3951713 2375230 1063619 1381966 3646844 5796383 5039245 861163 -4383153
44809 -4383153 -7795117 -8074571 -5545670 -1333784 2962048 5769955 6638303 6498646 6389860
44800 6389860 6478210 6785798 7932161 10073483 11792990 11472226 9502637 7701693 6684767
44791 6684767 5520997 4111549 3787005 4698754 4755831 2785228 971469 1927315 4587079
44782 4587079 5668360 4613089 4140115 5680222 7157799 6332553 3917659 1956938
44774 1956938 1114977 1186831 2508681 4926112 6748955 6817254 6576664 7939374 9841889
44765 9841889 9299112 5669287 1617625 -399505 -685752 -944306 -2046185 -3693572 -4982814
44756 -4982814 -4884456 -3257313 -1462318 -770568 -408944 1144404 3206428 3601263 2569315
44747 2569315 3118390 6241131 8484164 6456957 1792670 -942868 -43900 2228268
44739 2228268 3557925 3810496 3324792 1581932 -1430096 -4110254 -4550382 -2286757 1541951
44730 1541951 5029605 6472637 5550799 3850658 3446466 4736422 6247291 6466874 5105246
44721 5105246 2734593 230601 -1346107 -1311322 -101031 1215037 2278732 3700005
44713 3700005 6010369 8950247 11575292 12465652 10440734 6143472 2311516 1000048
44705 1000048 992623 -252689 -2510569 -3113673 -1541669 -675668 -2130616 -3186111 -877170
44696 -877170 2887010 3557098 517351 -1871346 -171496 3970716 6625873 6336413 4533093
44687 4533093 2782510 1564064 1159061 1961287 3741050 5736824 7655696 9589528
44679 9589528 10658649 8878778 3385350 -3679968 -8646848 -9879903 -9106749 -8950541
44671 -8950541 -9997904 -10934169 -10810324 -10055480 -9468901 -9312870 -9517054 -9833238 -9578923
44662 -9578923 -8170560 -6287956 -5637429 -7024310 -9307417 -10639794 -10015703 -7334485
44654 -7334485 -3122956 1008887 2726057 1044337 -2420968 -5168457 -6218383 -6107220
44646 -6107220 -5516466 -5085017 -5479915 -5955952 -3861218 2008775 7979409 8312248 2109750
44637 2109750 -5087472 -7674566 -5691694 -2877729 -1517104 -1499909 -2574580 -4476124
44629 -4476124 -5572320 -4319099 -2083408 -1984667 -4597829 -7145041 -7512740 -6717991 -6387988
44620 -6387988 -6093506 -4871714 -3593334 -3668882 -4469863 -4230470 -3028879 -2746835 -4005312
44611 -4005312 -5033331 -4074778 -1389490 1827811 5173182 8572364 10907194 10455916
44603 10455916 6863383 2020697 -1328101 -1756415 71372 2594774 4983332 7264902
44595 7264902 9141737 9709851 8889971 8215420 9065228 10560612 10492328 8253658 5620309
44586 5620309 4546490 5447583 7809404 10922446 13332957 13059506 9591052 4811517
44578 4811517 971744 -1332042 -2208714 -885381 3016637 7317595 8667341 6368085
44570 6368085 3022948 925533 -423751 -2318394 -4048064 -3751115 -1249092 1655838
44562 1655838 3551822 4606659 5162446 4533662 2052983 -1504469 -4538419 -6307324
44554 -6307324 -7113148 -7103862 -6051947 -4379472 -3058379 -1988360 42517 2680300 2851278
44545 2851278 -1573460 -7792921 -10451814 -8101757 -4556251 -3087148 -2284691 455462
44537 455462 4020756 5144117 3301520 827327 -1097782 -3240862 -5094070 -4253603
44529 -4253603 -174608 4016754 5001957 2816609 -359724 -3276872 -5859699 -7563863
44521 -7563863 -7322959 -4961404 -1627512 1149634 2504724 2763553 3106228 4111539 4704796
44512 4704796 3557396 1500628 1127995 3598918 7127958 9086443 8349595 5299110
44504 5299110 1172197 -2009339 -2676698 -1862003 -2497912 -5571243 -8643888 -9291473 -8116095
44495 -8116095 -6862477 -5506299 -3304293 -1191564 -755756 -1781782 -2926958 -3934014
44487 -3934014 -5102796 -5505573 -4005354 -1352017 897678 2741800 4732621 5660795
44479 5660795 4214853 2362742 3672043 8001814 10986365 9432484 4477494 -1058830
44471 -1058830 -5301492 -6448147 -2815186 4174726 9653010 10178738 7161233 3885512
44463 3885512 1417221 -611793 -1586252 -1028010 -423037 -1142030 -1869302 -886078 382965
44454 382965 -545729 -2283239 -550639 5361889 10552341 10404083 5955241 1647325 -171282
44445 -171282 -289034 383596 2121276 4644369 6238253 5583654 3424728 1558013 842589
44436 842589 1153063 2771195 6202171 10054056 10634228 5474823 -2976458 -8910964 -8984887
44427 -8984887 -5522393 -3453980 -5192263 -9200182 -12478290 -13305159 -12043573 -10206490
44419 -10206490 -8661306 -6630208 -3138501 596778 1740565 -566193 -3811858 -5431657
44411 -5431657 -5856268 -6596275 -6939851 -5135138 -2019422 -522807 -1357973 -1821426 268269
44402 268269 3548547 5215891 4579818 3159925 2190838 1286337 -748453 -4476140 -8988477
44393 -8988477 -12333183 -13256263 -12556925 -12099500 -12587388 -13095228 -12534687 -10466271 -6749077
44384 -6749077 -1987928 1589244 1539097 -1857118 -5574196 -7391169 -7844125 -7900835 -6723011
44375 -6723011 -3421228 417409 2063940 1040160 -349065 407209 3878878 8401880
44367 8401880 10911150 9090160 4027152 -333866 -1883057 -3045880 -6567905 -10152152
44359 -10152152 -8964629 -3168636 1296669 684348 -1860227 -2080768 -1456826 -4127031
44351 -4127031 -9143301 -10987938 -7923012 -5005980 -6848262 -10989099 -11429581 -6541097
44343 -6541097 -240284 3557529 4324730 2912941 -431750 -4668801 -6966244 -5274132
44335 -5274132 -1007892 2459967 3476686 2930025 1942495 563044 -959470 -1231668 800503
44326 800503 4014148 5741475 4309670 627552 -2670353 -3508042 -2060830 -417759
44318 -417759 -409269 -1723648 -2516660 -1868227 -868609 -848193 -1403238 -1263045 -699772 -1606315
44308 -1606315 -4768529 -8207742 -9075041 -6580125 -2358682 1416393 3432245 3430755 2374608
44299 2374608 2274999 4449212 7663869 9217961 8210040 6384256 5200193 3790812
44291 3790812 1177630 -1042221 -465389 2301238 3992036 3022267 1326865 1217465 2308045
44282 2308045 2646127 1418857 -729632 -3011553 -4893590 -5930319 -6249571 -6636565 -7441079
44273 -7441079 -8191481 -8811855 -9870990 -10720735 -9155410 -4754696 -1136686 -2325157 -7423482
44264 -7423482 -11464062 -11555110 -9645247 -8655291 -8424099 -7004351 -4279090 -2386873 -3024742
44255 -3024742 -5529614 -7551350 -7132283 -4358127 -1172078 671708 1231804 1491198 1568686
44246 1568686 1061986 621594 1345056 2614744 2514772 823894 -353079 313623 1468758
44237 1468758 1167454 -889458 -4187352 -8442046 -12321239 -13086716 -9699702 -5040623
44229 -5040623 -2871019 -3434851 -4088353 -3455651 -2622856 -2554539 -2694034 -2430542 -2087059
44220 -2087059 -1956346 -1727993 -1244420 -760894 -340721 47017 20450 -512603 -511076 908233
44210 908233 2582911 2379008 239223 -1468813 -980164 966144 2707868 3768727 4655307
44201 4655307 5448283 5292959 3090304 -1122958 -5133815 -5858671 -2897437 147807 -341199
44192 -341199 -3463495 -5392804 -4778691 -3667481 -3207824 -1962841 558254 2152619 1672967
44183 1672967 1648004 4547642 8496827 9535192 6876482 3314448 1245823 691187 706362
44174 706362 549546 -257161 -1210774 -625991 2118468 4808836 4866301 2978106 2019249
44165 2019249 2800083 3487510 3271831 3732726 5637268 6861494 5113462 1138351 -2391756
44156 -2391756 -4217377 -5305585 -6813755 -8387245 -8545921 -6419281 -3205750 -1709694
44148 -1709694 -3710225 -7766301 -10386955 -9442177 -5785928 -1831708 378607 -39972
44140 -39972 -2346330 -4129158 -3117905 365565 3774492 5430342 5982366 6473170 6657271
44131 6657271 6250961 6386369 8236159 10841928 11727917 9609428 5649262 2056299 -60945
44122 -60945 -1465818 -3540039 -6143712 -7174491 -5019719 -934382 2375517 4182797
44114 4182797 5839797 7480228 7246285 4839747 3255490 4881816 7642218 7374518
44106 7374518 2956073 -3096517 -8130733 -11124288 -11761654 -10469446 -9292787 -10220276
44098 -10220276 -12251238 -12230273 -9017041 -4840259 -2017313 -365881 1282729 2832080
44090 2832080 3381086 2730529 1502650 646184 1163100 3044225 4241399 2505071 -1132235
44081 -1132235 -2716289 -316806 3320460 4486093 2925044 675173 -1555983 -4111750
44073 -4111750 -5744705 -4536325 -1352512 546629 -195303 -1662112 -2150066 -2288177 -2492121
44064 -2492121 -1045596 3039168 7172190 7904902 5466343 2857018 957944 -2298844
44056 -2298844 -7349760 -10785317 -9730665 -6317373 -5104603 -7005102 -8564182 -7209312
44048 -7209312 -4359714 -2339134 -796538 1663338 3944770 3367669 -199106 -3632472
44040 -3632472 -4439416 -3258745 -1759453 -183907 1530617 1958216 -185570 -3303684
44032 -3303684 -4063730 -1459502 1977723 3384112 2496434 880924 -302002 -783244 -467227
44023 -467227 553449 1625482 2029498 1664867 749662 -719483 -2533868 -3666859 -2982884
44014 -2982884 -663498 1544194 1608026 -1313623 -6212693 -10623831 -12164233 -10443432
44006 -10443432 -7342937 -4925338 -3347457 -1315350 2007911 6459202 11594884 16429360
43998 16429360 18617912 15820428 8692516 1187618 -3091608 -3960597 -3512351 -3282866
43990 -3282866 -3602406 -4390309 -4971270 -4022692 -1421303 569237 -216079 -2730816 -4053301
43981 -4053301 -3330050 -2081653 -940763 964829 3043672 2977736 790852 55501 2768563
43972 2768563 5593174 4118909 -945781 -5013999 -5905364 -5565624 -5924582 -6347684 -5706934
43963 -5706934 -4319043 -2944243 -1759509 -1018950 -1265809 -2533649 -4528381 -7294109
43955 -7294109 -10215997 -11228377 -9367705 -7376568 -8678418 -12014059 -12654739 -9268076
43947 -9268076 -5647643 -4637550 -4583723 -3680851 -3441066 -4779627 -4658889 -811612 3247309
43938 3247309 2679443 -1283589 -3336449 -2125371 -1014644 -1248197 166032 4745162
43930 4745162 9541081 11723478 12193376 12443409 11263630 7331488 2612557 328771
43922 328771 940964 2363192 3066263 3121460 3088318 3467361 4538709 5508542 4587854 1068191
43912 1068191 -3269713 -5678057 -4931893 -2015476 901737 2121236 2060915 2957614 5479747
43903 5479747 6408098 2406659 -4102205 -6489814 -2390848 3055244 4366496 2486890
43895 2486890 1441172 1545973 222582 -2393474 -3335890 -1808881 -195486 152776 571495
43886 571495 1981490 3375560 4280554 5760123 7706664 7786884 4867844 1594353 1619204
43877 1619204 5229610 9116494 9841583 6608225 1295116 -3277052 -5295158 -4669495
43869 -4669495 -2044749 2116670 6713044 9282448 7963549 4057201 912962 169309
43861 169309 712919 1268013 1818097 2023163 649948 -2177021 -4156384 -3847794 -2976388
43852 -2976388 -3967163 -6438171 -8095511 -8253444 -8321181 -9057295 -9442672 -8667612 -7487795
43843 -7487795 -6740858 -5791825 -3693262 -1288567 -817442 -3269134 -7103609 -10040161 -11255101
43834 -11255101 -11063880 -9433301 -6526090 -4349493 -5364566 -8512307 -9043055 -4457491
43826 -4457491 1066060 996675 -5566951 -13137543 -16779613 -16589373 -14791667 -11916977 -7810703
43817 -7810703 -3871379 -1731457 -1021057 -472540 -192600 -997728 -2459451 -3493105 -4105618
43808 -4105618 -4635274 -3934764 -618591 3855173 5565479 2492643 -2752661 -5415387
43800 -5415387 -3235237 1719837 5216394 4551871 663267 -3000989 -3786409 -2067320
43792 -2067320 -253239 -50089 -1097344 -1934080 -1648550 -468807 930653 2290279 3476565
43783 3476565 3407887 559203 -4271704 -6823694 -3391569 4016424 9118791 8751242 6245790
43774 6245790 5986532 7298588 6443740 2790923 -503219 -1444393 -1493754 -2357103 -3173820
43765 -3173820 -2222346 149862 1637695 578971 -2000700 -2823225 569347 6503595
43757 6503595 9915641 7700005 2380430 -1189382 -1684874 -1512723 -2042316 -1966532 -775179
43748 -775179 -571708 -2916872 -6221958 -7951966 -7660425 -6298467 -4079676 -742226 3042984
43739 3042984 5842857 6346902 3629628 -1879248 -6937418 -7184001 -2047252 3649517
43731 3649517 4865262 1821583 -1391310 -2012589 -119170 3419417 7249348 8522552
43723 8522552 5169759 -339148 -2553139 606138 5448194 7433441 6065138 3595181
43715 3595181 1386319 -214336 -149689 2454524 6165308 8152323 7218559 4509432 1521803
43706 1521803 -1083831 -2938558 -3881366 -4513929 -5434795 -5871662 -4544760 -1977545 -241888
43697 -241888 -20347 246370 1547590 2610739 2347386 2124519 3567345 5468470 5388714
43688 5388714 3626309 2884013 4045190 5049322 4593962 4319945 5986175 8613161 10139784
43679 10139784 10350450 10431270 10798565 10950986 10480004 8928274 5953101 3052989 3387940
43670 3387940 7693984 11869185 11298068 6468001 1446029 -1999847 -4980813 -6875602
43662 -6875602 -5034561 -258158 1963590 -1717633 -7704084 -10181670 -7929228 -3671924
43654 -3671924 586639 3987638 4631694 1231368 -3659029 -5730666 -4209263 -2102954
43646 -2102954 -1502682 -1868485 -2843246 -5011006 -7078900 -5930161 -1149226 3425454 4560758
43637 4560758 3520779 3018222 2648520 141724 -4368031 -8312370 -10327610 -11254363 -11557720
43628 -11557720 -10198068 -6718902 -2711544 -348778 -509516 -2857716 -6645528 -10576447
43620 -10576447 -12596959 -10997014 -6048373 -242726 3435906 3728176 1754376 -433748
43612 -433748 -1702880 -2123205 -2039604 -1771575 -2035442 -3442769 -5257324 -5781123 -4542692
43603 -4542692 -3038773 -2572788 -2431640 -1201499 1073323 3236001 4682549 5347263 4790207
43594 4790207 2914528 1094859 808536 1326896 611934 -1388071 -2231793 -244736 3439071
43585 3439071 6715404 8661402 8972691 7023328 2976539 -1315567 -3944102 -4675865
43577 -4675865 -4050895 -2047995 810387 2275452 540542 -2880674 -4633404 -3840960
43569 -3840960 -2890083 -3744764 -5650549 -7101068 -7902486 -8106366 -6810050 -3735728 -691043
43560 -691043 358580 -208493 -858653 -1798726 -4484314 -8376742 -10512194 -9075437 -5648700
43551 -5648700 -2809240 -888073 1397321 4003478 5216843 4411615 3488952 4527878
43543 4527878 6876436 7965392 6952167 6136495 7961749 11592708 13760360 12531748
43535 12531748 8726426 3787361 -1642953 -6337029 -7985335 -6015271 -3337980 -2850271
43527 -2850271 -3223345 -1121595 2781823 3662979 -509666 -5275466 -5298645 -1329460 1305788
43518 1305788 -301474 -4198039 -7374330 -8828384 -8681134 -7230683 -5912519 -6881400
43510 -6881400 -10246671 -13334860 -13910984 -12657472 -11226175 -9446176 -6357328 -2951164
43502 -2951164 -1571238 -2611686 -3665978 -2416263 930253 4560332 7265793 8984063
43494 8984063 9863533 9725697 8485014 6722780 5626026 6071352 7500795 8023217 6246152
43485 6246152 2934287 218765 -798384 -827119 -636572 365714 2920903 5943790 7028337
43476 7028337 5100476 1704113 -765557 -1526386 -1630962 -2245710 -3528227 -5123126 -6830973
43467 -6830973 -8285451 -8582779 -7024680 -4057609 -780206 2361207 5492101 7826243
43459 7826243 7498437 3832725 -926193 -3421962 -2711882 -973416 -496408 -940508 -215330
43450 -215330 2461624 5212561 5384694 2554871 -603902 -770425 2577530 6549650 7991893
43441 7991893 6694184 4799811 3707280 2938317 1927793 1229220 1310672 1528478 1224282
43432 1224282 770014 572011 108308 -846931 -1008150 876601 3809309 5397005 4707314
43423 4707314 3004265 1925497 2183626 3651383 5203313 4785219 1394832 -3078445
43415 -3078445 -5748345 -6353090 -6902908 -7747461 -6833810 -3819981 -1980416 -3832373 -6897321
43406 -6897321 -6437394 -1421580 4500877 7402535 6528263 3846380 2009669 2493998 4166769
43397 4166769 3999833 669443 -3056540 -3261252 102513 2973288 1957683 -2313588
43389 -2313588 -6628050 -8293600 -6594128 -2836452 409281 1191686 -226997 -2176102
43381 -2176102 -3558803 -4063657 -3204635 -945408 1028988 606296 -2040997 -4603890 -5442335
43372 -5442335 -4695800 -2998107 -1115437 -558127 -2138330 -3946347 -3345342 -1070573 -418070
43363 -418070 -2021179 -2845529 -1359463 -92270 -1286598 -3442796 -4528136 -5405293 -7198485
43354 -7198485 -8219107 -6993990 -5862717 -7572952 -10137323 -9404623 -5657420 -3166335
43346 -3166335 -3437140 -3309661 -392234 3600504 6243277 7816050 9598635 11258027
43338 11258027 11805466 11616916 12058523 13921713 16708705 18584998 17363097 13066454
43330 13066454 9011306 8284038 9685646 9770131 8353454 8423048 10370855 10580053 7362176
43321 7362176 4294362 4843191 6823350 5679388 1141746 -3039410 -4716751 -5053917
43313 -5053917 -5090041 -4127901 -2073718 -591551 -906370 -2296146 -3462041 -3770725 -2664544
43304 -2664544 191588 3135234 2752656 -2189215 -7973654 -9186903 -4812046 602615
43296 602615 2349417 596032 -988933 -188937 2155822 4861621 8099551 11573178
43288 11573178 13161595 11167184 6909542 3541369 2804578 3938152 4953191 4011319
43280 4011319 680877 -2998890 -4044102 -2423017 -1593120 -3281664 -4079496 -408521
43272 -408521 5095382 6481613 2832723 -1016930 -2016650 -2030662 -2482596 -1212206 2823010
43263 2823010 6193869 5647090 2768945 875548 229477 -500070 -900757 -455933 -976939
43254 -976939 -3599087 -5458073 -3378155 741498 2351224 968771 372647 2631101
43246 2631101 5820724 7595956 7587256 6291884 4756349 5183696 8630524 12267834 12255882
43237 12255882 9215370 7324932 8050033 8760948 7950258 7284997 6992714 3688447 -4292394
43228 -4292394 -12639014 -15516647 -12442494 -7945759 -5840383 -6505961 -8748198 -11375253
43220 -11375253 -12821732 -11519086 -7643675 -3599929 -2031908 -3419341 -5813341 -7062878
43212 -7062878 -7185749 -7901189 -9636444 -10235938 -7670291 -2919006 1283050 3579161 4224460
43203 4224460 3350241 1278074 -222142 479640 2431023 3581917 4038943 5153692 6206262
43194 6206262 5416838 3757671 3798093 4812259 3504187 166646 -788249 2135449 5023329
43185 5023329 5369315 6184289 9815524 12552055 10181101 5119564 2657482 2966762 2518317
43176 2518317 1276982 2196864 4495768 3902152 83268 -2167054 -635841 860655
43168 860655 -874254 -3030581 -1309600 3673856 8019580 10178699 11543111 12838608
43160 12838608 13037581 11378997 8297077 4708732 1858603 1097422 2278377 3134308
43152 3134308 1794974 -749147 -2186047 -2154811 -2226605 -3022180 -3217095 -1588108 1429774
43143 1429774 4558254 6881552 7945734 7763127 7205731 7555548 9118852 10763612 11089023
43134 11089023 9615402 6883154 4179339 3158968 4554497 6857307 7500954 6016677
43126 6016677 4636846 4687421 4018274 117013 -5361862 -8062537 -6736463 -4493132 -3654503
43117 -3654503 -2666000 216132 3255801 3933516 2982125 2643974 2672323 1441609 -340377
43108 -340377 -820580 -1050846 -3716419 -8000402 -10011848 -8774274 -7398566 -7331426 -6168486
43099 -6168486 -3128748 -1893133 -4646008 -7254531 -4626720 1801230 6182130 6038554
43091 6038554 3868414 2251315 1338732 671928 46373 -1190917 -2973790 -3388365 -1470448
43082 -1470448 47011 -1825548 -5150815 -5311843 -2049451 69661 -1270863 -2760446
43074 -2760446 -557380 4649890 9319585 11034379 9299517 4903298 117523 -2488389
43066 -2488389 -2813610 -3116567 -4417242 -5213896 -4556069 -3712261 -3461915 -2449555 -143664
43057 -143664 982115 -1391315 -5838769 -9070712 -9975187 -9515810 -7924121 -4720954 -1057910
43048 -1057910 529508 -878664 -3451479 -4848468 -4504035 -3479774 -2962049 -3251662 -3852219
43039 -3852219 -4396845 -5340782 -7187947 -9012672 -8743672 -5558533 -1409226 499433 -1347298
43030 -1347298 -5371052 -8070926 -6826963 -2252475 2324164 4207348 3635473 2207362
43022 2207362 463834 -1264745 -1078835 2391238 6526506 6750073 2568087 -1612809
43014 -1612809 -2682981 -2509497 -3706634 -5034040 -3873634 -951256 730557 469759
43006 469759 331363 1535367 3040506 3811882 4409209 5814723 7843413 9033978 7782345
42997 7782345 4093249 465608 -138696 2222367 4454252 4585965 4024219 4432209 4586786
42988 4586786 2559042 -601841 -1940344 -447975 2418921 5226159 7240367 7366573
42980 7366573 5038503 2020970 921040 1738771 2033409 794757 22879 1675599 4690720
42971 4690720 6195303 5002647 3132644 3783991 7661895 11502430 11277718 7075480
42963 7075480 3144253 2281546 2282465 -248602 -4579513 -7178482 -7196053 -7373550 -9566921
42954 -9566921 -12273693 -13183127 -11866188 -9162608 -5762476 -2308417 344336 1698273
42946 1698273 1855732 1313083 1217383 3045052 6693721 9704067 10103722 9297629 10103264
42937 10103264 12497244 13623154 11737410 7798931 3354872 -537404 -2239544 -356860
42929 -356860 3526607 5521725 4080989 1961592 2397959 5102978 7235416 6777425 3791235
42920 3791235 -378954 -4025897 -6027295 -6489767 -5788957 -3261474 1598778 6827123
42912 6827123 9072008 7556078 5101261 4628585 6362505 8849557 10647858 10437565
42904 10437565 7773282 4752967 4820010 8661368 13065817 14877967 14217188 12803940
42896 12803940 11281565 9622439 8219274 6996696 5123356 2929939 2179983 3004563
42888 3004563 2825944 322006 -1713389 -72972 3936009 6127163 4993530 2834529
42880 2834529 1884585 2084761 2773838 4121764 6132266 7784470 7894213 6058629 2629649
42871 2629649 -1455892 -4761021 -5953225 -4632018 -1673153 1020562 1685907 653735
42863 653735 573334 3038445 5588722 4629616 1154681 116782 3294835 6545289 5968652
42854 5968652 3133897 1530533 1312440 1038827 1587501 4124765 6482090 6076629 4748133
42845 4748133 5952416 8317778 7066590 1507818 -3868113 -6034884 -6374574 -6330605 -5000160
42836 -5000160 -2533274 -1457932 -2524339 -2973654 -1099829 801086 217264 -1846833
42828 -1846833 -3026271 -2693068 -1012244 2093295 4973269 4450999 604629 -1581847
42820 -1581847 1765476 8366513 13590679 16374841 17869398 17164787 13137739 8754837
42812 8754837 8322882 10855775 10914406 6311138 577477 -2972322 -5288020 -8077334 -10076757
42803 -10076757 -9334346 -6655840 -4343043 -3189611 -2695765 -2802095 -3520268 -3924713 -3173807
42794 -3173807 -1746386 -427396 992075 2822305 4363305 5064776 5833338 7652812
42786 7652812 9652097 10146506 9070968 7770124 6776511 5585457 4573096 5235120 7968112
42777 7968112 11105672 12871741 13063492 12075764 9584242 5448964 1061088 -1667357
42769 -1667357 -2398504 -2313349 -2175439 -1634960 -439675 904566 1979974 2884027 3419372
42760 3419372 2933498 1558923 608988 991887 2187555 3651168 6057317 9667637 12348715
42751 12348715 11320613 6937720 2878928 2044707 3742055 5532739 6345563 6706145
42743 6706145 7109476 7610501 8485116 9999438 11555255 11869567 10082069 6493638 2682187
42734 2682187 1075221 3297851 7963784 10953542 9313059 4588047 936071 59136
42726 59136 -364057 -2767566 -5918211 -6488974 -3629476 -239194 552818 -1198084 -3170689
42717 -3170689 -4046328 -4332236 -4211757 -2560204 901456 3946353 4072914 1745645 -371299
42708 -371299 -1077119 -1478954 -2124159 -1780345 -44329 1227569 915724 1130831 4255327
42699 4255327 8720052 10511079 8417205 5001065 2317330 -348567 -3553260 -5345866
42691 -5345866 -3919321 -920127 208366 -1374296 -2969679 -1720770 2351407 6695966
42683 6695966 8627425 7305766 4093559 1171376 -402530 -1107592 -1566226 -1719361 -1831315
42674 -1831315 -3026504 -5563403 -7498136 -6779009 -4246633 -2616497 -2398372 -971839
42666 -971839 3363651 8289506 10104064 8400446 6230048 5930790 6631908 6269584 4524992
42657 4524992 2731221 1689800 819280 -513062 -1727307 -1706672 -547785 6198 -1638678
42648 -1638678 -4877854 -7284057 -7155118 -4974941 -1985907 1673930 6237964 10295301
42640 10295301 11216894 7996581 2430799 -3054371 -7571958 -11082804 -12900172 -12356489
42632 -12356489 -10318121 -8553219 -7762834 -7430654 -7352378 -7825132 -8275334 -7406737 -5380846
42623 -5380846 -4306879 -5298197 -6102963 -3387574 2788736 8328890 9457024 6741173
42615 6741173 3998728 3735757 4650156 3764317 207966 -3807823 -5507406 -4222882 -1383837
42606 -1383837 1318036 2997641 3254945 1921976 -436688 -2354708 -2475277 -896935
42598 -896935 641370 193442 -2447157 -5248238 -5874664 -4295743 -2839906 -3264664 -4550811
42589 -4550811 -4422867 -2418058 -319542 86876 -1536455 -4583007 -7913350 -9648740
42581 -9648740 -8259916 -4642746 -1829305 -1677018 -2804941 -2758011 -1289501 -222152 -574168
42572 -574168 -1304820 -1200927 -986706 -2671407 -6752018 -10677929 -10988050 -7264851 -3034194
42563 -3034194 -1845981 -3296355 -4298105 -3480165 -2186148 -1396445 -384377 938923
42555 938923 1092402 -170695 -638934 840767 1913936 306679 -2078026 -1838048 341833
42546 341833 356268 -3193214 -6859624 -7028655 -4066608 -827913 834676 991967 682027
42537 682027 952048 1738338 1454053 -938556 -3583537 -3514785 -983260 358454 -1755076
42528 -1755076 -5613414 -8638711 -10482392 -11527887 -10924688 -8478571 -6512388 -7039530
42520 -7039530 -8300360 -6951754 -3067363 -115782 23061 -721984 -120211 883501 -340870
42511 -340870 -4268205 -8230087 -9126433 -6567663 -3263012 -2222521 -3514612 -4288755 -2312993
42502 -2312993 1346840 3956349 4564876 4516645 4950614 5321014 4610261 2868170 1119880
42493 1119880 353280 719315 1285213 827931 -512398 -818591 1419995 5038754 7201646
42484 7201646 6499772 3975566 1293397 -733888 -1705747 -1182436 676810 2844560 4213684
42475 4213684 4163665 2566533 217875 -989400 229913 2551605 3212290 1424785 -970908
42466 -970908 -2616584 -4409726 -7220986 -9804882 -10575571 -9954657 -9186612 -8133879 -6310835
42457 -6310835 -5018353 -5890903 -7717952 -7345573 -4018892 -440677 1137417 1607585 2702430
42448 2702430 4055167 4181359 2902699 1032722 -1207418 -3467737 -3692275 355432
42440 355432 7594829 13394558 13725858 8779699 2133668 -2699830 -4391725 -3503237 -1316375
42431 -1316375 908801 2107443 1473233 -1069484 -4251813 -5953559 -5100879 -2872279
42423 -2872279 -1316063 -1054353 -1276112 -1652388 -2686356 -3816352 -2865970 1307062 6487220
42414 6487220 8860075 6998710 3198011 879736 1346667 3089994 3730451 2420749
42406 2420749 362375 -1060573 -2123076 -3810268 -5347484 -4491992 -1025231 1818963
42398 1818963 1000194 -2449247 -4978509 -5007108 -3760540 -2275055 -177183 2333374 3770538
42389 3770538 3584612 3236235 3999124 5192005 5609922 5348550 5118873 4900345 4308622
42380 4308622 3298277 1668706 -959146 -3823877 -5088088 -4361079 -3703257 -4634513 -5550253
42371 -5550253 -4055718 -775538 1496197 1952384 2699550 5406565 9122387 11950889
42363 11950889 13173216 12967958 11372092 8429920 4648149 754982 -2485296 -4086490
42355 -4086490 -3197618 70237 4529722 8517867 10384040 9249616 6244237 4157237
42347 4157237 4433315 5122484 3448226 -155455 -2609863 -2469778 -1204241 -79768 1450003
42338 1450003 3328760 3603401 1313303 -1401104 -2104697 -1431855 -1623900 -3033521 -4280465
42329 -4280465 -4869000 -5285855 -5111382 -3478150 -1252689 -396875 -922448 -693290 1192037
42320 1192037 2905860 2691414 1328191 578500 693133 972570 1675870 3538040 5783958
42311 5783958 6339536 4341058 1348762 -405636 -411822 -199295 -1530791 -4368275 -6568521
42302 -6568521 -5975225 -3151146 -1391031 -3085854 -6473108 -7390355 -4389326 -489608
42294 -489608 975939 640289 1488000 4001055 5374084 3679638 463812 -1710589 -2274895
42285 -2274895 -1817704 -110594 2851668 4982746 3840364 77985 -2958888 -3162518
42277 -3162518 -1308627 1143642 3555617 4995582 4163273 1667141 332183 1749772
42269 1749772 4173257 5252548 5139185 5255318 5797876 6567863 8561759 12006149 14056086
42260 14056086 11675838 6375454 2896334 3118796 4410263 4402313 3978731 4339822 4433428
42251 4433428 3345368 2472056 2858441 2744675 643466 -1128258 532779 4212444 5522493
42242 5522493 3572161 1934510 2630885 3166524 1262216 -1021164 -687578 1189362 1186210
42233 1186210 -1161400 -3102849 -3130192 -2462781 -2032726 -1188493 -237865 -1318637 -5040787
42224 -5040787 -8514104 -8831491 -6991870 -6148581 -6933007 -6821821 -3883797 789834 4445660
42215 4445660 4963709 1947966 -2835983 -6084630 -5681444 -3081751 -1539625 -1847897 -1586165
42206 -1586165 1041954 4599045 6507956 5957352 3589373 57923 -3469885 -4785583
42198 -4785583 -2668209 1141292 3621353 3673035 2311177 439141 -1727621 -3352085
42190 -3352085 -3063232 -742807 2073292 3883712 4390615 4062305 3610662 3821368 4776413
42181 4776413 5295107 4244966 2292951 1193432 1480213 2116974 2288376 2168160 2034054
42172 2034054 2110803 3177107 5618913 7854722 7572109 4715655 1273546 -2057637 -6431451
42163 -6431451 -11350708 -13547228 -11239296 -7217869 -5383159 -5903675 -6190022 -5198709 -4018474
42154 -4018474 -3139832 -2102401 -1556363 -2781492 -4856113 -4910850 -1914987 1997145 4745828
42145 4745828 6612487 8127322 7811151 4135244 -1338975 -4900596 -4710207 -2496233
42137 -2496233 -1124020 -1508639 -2281997 -1925097 -740849 -569515 -2496974 -5213194 -6374883
42128 -6374883 -5583997 -4943819 -6087476 -7662625 -6947059 -3520196 4448 1040815 -319992
42119 -319992 -2179451 -3300943 -3719392 -3487332 -2250752 -447654 132314 -2045217 -6346239
42110 -6346239 -10384811 -12315850 -12168130 -11005103 -9585653 -8229031 -7403349 -7678695 -8922978
42101 -8922978 -9819374 -8588963 -4619074 570067 4513937 6276490 7129728 8271635
42093 8271635 8808398 7238125 4264579 2349363 2540656 3618519 4653338 6272377
42085 6272377 8445765 9098484 6686496 2834788 565341 635147 1197194 525068 -1327828
42076 -1327828 -3114122 -3464389 -1916000 196067 779537 -122731 132767 2962517 5921930
42067 5921930 5964978 3748040 2019807 1184523 -41451 -489172 2553076 7862578 10072408
42058 10072408 6620193 1320738 -1122883 -994332 -1305633 -2381403 -2100601 -92536
42050 -92536 1562653 1462178 359939 -322782 148517 1508687 2229811 422982 -3596862
42041 -3596862 -6696515 -6456758 -4167218 -2474595 -1333575 1239819 5218668 8201569
42033 8201569 8927591 8522926 7834223 5951205 2370085 -1216650 -2560714 -1300260 1073013
42024 1073013 2939731 3631627 3347598 2529896 1287052 -441173 -2144271 -2941244 -2853291
42015 -2853291 -2727426 -2275652 87505 4030509 5864410 2940499 -1708838 -2352956 2019239
42006 2019239 6443747 6616136 3748130 1691164 1948005 3331831 4607332 5432774 5718285
41997 5718285 5648456 5759952 5997752 5323591 2968252 -587934 -4266007 -7112800 -8113566
41988 -8113566 -6506225 -2834580 1245831 4450685 6220826 6001955 4025829 2717116
41980 2717116 4878443 9810417 13499858 13509140 11395179 9393705 7467782 5200736 3806589
41971 3806589 3939957 3864960 2413267 1641278 3543752 5944430 5172023 1689739 -622874
41962 -622874 -348222 -62249 -1788667 -4259113 -5446957 -5027241 -3435613 -930250 1486461
41953 1486461 2422401 2324516 3369414 6244993 8946875 9621976 8642822 6934622 4412362
41944 4412362 1524590 417088 2576974 6385248 8685731 8127590 5777701 3260597
41936 3260597 1525067 726817 83148 -1672427 -4603582 -6664110 -5391135 -475303
41928 -475303 5624540 9307459 8314291 3788197 -18157 339834 3331554 3923771 98749
41919 98749 -4135688 -3954974 -102419 2502458 1523028 -396905 -35311 2403581 4666000
41910 4666000 5687600 5950662 5912261 5618949 5246275 4741235 3307292 449395 -2596871
41901 -2596871 -3689449 -2281054 -32137 1556539 2982334 5157072 7002593 6607993
41893 6607993 4715933 4727550 8138046 11956857 12563615 10642145 9803848 11254714 12906775
41884 12906775 13709559 15425778 18925892 21733197 21311141 18593142 15980858 13602947
41876 13602947 10150475 6233219 4110079 4477121 5923863 7387012 8843970 9584762
41868 9584762 8261775 5340241 3521866 4740478 7995736 10733915 11120291 8616799
41860 8616799 4011937 -266033 -1432033 714537 3072959 2674599 129121 -1481614
41852 -1481614 -503783 1817021 3434081 3582131 2497245 404456 -2258739 -4325264
41844 -4325264 -4873977 -4772553 -6092402 -9377301 -12403072 -12625579 -10136220 -6883851 -3684806
41835 -3684806 -122585 2720796 2309167 -1365569 -4419155 -3738363 -911265 976305
41827 976305 2433908 5926759 10343633 11426400 8077465 4278487 3435517 4211240 3741268
41818 3741268 1929215 228607 -1256471 -2630883 -2077748 1974276 7484603 10494922
41810 10494922 9894182 8062805 6888857 5551552 2775405 -596415 -2231533 -688174
41802 -688174 3200069 6787735 7624444 5683061 3404103 3124105 5103032 8438676 12461842
41793 12461842 16065601 17234171 15269317 12491754 11540078 11717804 10450944 7867863
41785 7867863 7007410 9125895 11516593 10943367 7085725 1677597 -3631701 -7397579
41777 -7397579 -8385465 -7025528 -5482248 -5047120 -4829152 -4029533 -3634942 -4257968 -4129012
41768 -4129012 -1530095 1968080 3200980 1782341 376093 712131 1662505 1702757 1208691
41759 1208691 1368930 2324524 3487289 4701188 5981494 6663161 5870187 3827023 2061903
41750 2061903 2075460 3984714 6611272 8823227 10475929 11803997 12380981 11613686 10241237
41741 10241237 10114565 11875666 13831744 13932209 12048632 9498564 7265936 5796040
41733 5796040 5657469 6939701 8463449 8901984 8261503 7088444 5042451 1978686 -261977
41724 -261977 540605 3598197 5573413 4839066 3267826 3239509 4827898 6640392 7524363
41715 7524363 6678322 4084528 1755193 2411073 5771975 8469737 9083899 10492824 14762910
41706 14762910 18335714 16066269 8697129 2309072 618649 1608793 2164850 2251804 3105425
41697 3105425 4442694 5468993 6392333 7011442 5697805 1804826 -2417524 -4366522
41689 -4366522 -4401955 -4662219 -5608190 -5938281 -5277160 -4562779 -3827769 -1909315 1112438
41680 1112438 3230385 3307585 2965246 4201402 6079452 5527362 1359571 -3979853 -7185242
41671 -7185242 -7442592 -6077700 -3749311 299426 6051766 11498303 14663341 15687500
41663 15687500 15594656 14048508 10230194 5335144 1794524 -168584 -2733494 -6378479
41655 -6378479 -8046793 -5188305 227131 4031221 5112361 5946662 8259883 10489187
41647 10489187 10000897 6219365 1018313 -2881298 -3609045 -1408346 1237167 1521961
41639 1521961 -1041714 -4127231 -4827826 -2215137 2006562 4959060 5018283 3186333 1634174
41630 1634174 757815 -1150315 -4657766 -7220460 -6112172 -2240236 989476 1988728
41622 1988728 2008641 2180314 1957930 818302 -692428 -2240981 -4089831 -5492567 -4677545
41613 -4677545 -1538912 1296853 1388930 -700301 -2566106 -2834138 -1844041 -499994 420629
41604 420629 459526 -183362 -955556 -1837660 -3086419 -4115463 -4035807 -3408417 -3615258 -4167720
41594 -4167720 -2981134 -168680 1149644 -474785 -1955303 -33695 3631016 4945008
41586 4945008 3572504 3072847 5284852 8103238 9325423 9594226 10307172 10963871 10147463
41577 10147463 7724930 4817651 2483875 1241847 1119107 1537730 1677254 1248305 552646
41568 552646 33691 319282 2018375 4486122 5674774 4680289 3490206 4158243 5107251
41559 5107251 3117480 -1174740 -3176068 -719835 2658664 2805038 718292 529745
41551 529745 3297000 5809251 5229281 2430573 320931 609285 2888261 5718370 7747098
41542 7747098 8257432 7434783 6328353 6201545 7334356 8351289 7463534 4814553 2662436
41533 2662436 2448533 2959636 2865664 3549534 6700290 10037465 9202464 4308911 683485
41524 683485 1501451 3371914 1867885 -1732223 -2817968 -411215 2256661 3125524 3368272
41515 3368272 4173883 4960906 5338676 5940602 6493647 5468561 2543995 -540389 -2273057
41506 -2273057 -2665848 -1794691 756118 4063532 5561278 3996539 1260710 9240
41498 9240 661267 1885047 2809216 3348771 3212793 2057379 318568 -1110563 -1808559
41489 -1808559 -1785721 -918859 908853 3372929 5880999 7938178 9136021 9224265 8405160
41480 8405160 7129299 5569953 3848361 2580020 2206212 1793354 -256065 -3917871
41472 -3917871 -7065502 -7742354 -5952285 -2852633 619721 3697726 5548294 6055071
41464 6055071 6157674 6734234 7698560 8479285 8562977 7435999 5168323 3187369 2915943
41455 2915943 3423098 2523797 810405 1847288 6674688 10804394 9495529 4153840
41447 4153840 259801 170327 1527749 2192232 2758053 3681021 3739757 2860343 3292245
41438 3292245 5938551 8081987 7120049 4519348 3389615 3627450 2542608 -279730
41430 -279730 -1918331 -506265 1858940 1995979 -95903 -1453822 -24387 3113670
41422 3113670 5507998 6197697 6027431 5555124 3916152 470784 -3270326 -4823058 -3882194
41413 -3882194 -2853380 -3578531 -4798167 -4078648 -1415892 711892 840007 580243 2515709
41404 2515709 6828864 10848493 11838400 9748623 7059925 6132147 7035069 8086785 8096863
41395 8096863 7487155 7256787 7471459 7023430 4635387 241294 -4193578 -5650387 -2859888
41386 -2859888 1992971 5454875 6511364 6662723 6574149 5117751 2475153 1438373 3701794
41377 3701794 7067300 8733577 9403227 11145188 12900168 12021057 9449128 8908220 10656922
41368 10656922 10574823 6813505 3006795 2557127 3745320 3771008 4094811 7302421 10978032
41359 10978032 9886296 3758985 -1755455 -2486138 -166228 1575535 2111134 2927547
41351 2927547 4563654 6567387 8790284 10829329 11320758 9437550 6482698 4822785
41343 4822785 5507256 7379312 8067278 5899339 1748310 -1230645 -970754 771539 859436
41334 859436 -473090 -41214 2872041 4846745 3511134 1303981 1767418 4603502 7106055
41325 7106055 8388570 9124287 8820161 6875772 5249014 6284806 8308277 7269790
41317 7269790 3081948 437100 2154912 5248672 5514740 3114221 1185624 1101153 1791924
41308 1791924 2432972 3143277 3555084 2946643 1862681 2055853 4616056 8923112 13082028
41299 13082028 14706626 12214121 6695416 1927164 1080230 3613276 6499133 7966812
41291 7966812 8563767 8981898 8875845 8243435 8198912 9371930 10676401 10744595 9906265
41282 9906265 9712017 10738852 11695275 10870114 8247959 6164371 7615539 13284116 20181545
41273 20181545 24068312 23618668 21456948 20708458 21682889 22887548 23881777 24941936 24516402
41264 24516402 20081468 12538878 6981051 6787846 8906144 8022249 4239059 2744601
41256 2744601 5732313 8941057 8132178 5273378 4911283 6915957 7039703 3652630 -375817
41247 -375817 -2686261 -4266202 -6133986 -6873344 -5600449 -4456651 -5380035 -6440949 -4487959
41238 -4487959 -303866 2076713 1050513 -460654 679712 3690394 5375039 4402847
41230 4402847 2643261 2645059 4787282 7024743 7095351 4952138 3088233 4310636 9014326
41221 9014326 14563034 17338017 15623190 10867491 6199203 3546092 2370738 1347862
41213 1347862 473256 557281 1318186 1667995 1811343 3088024 5200259 5646955 3124876
41204 3124876 -258917 -1753134 -1484696 -1395496 -1951256 -2232708 -2602789 -4673870 -8339720
41195 -8339720 -10911322 -9941147 -5617969 77351 5402323 9576420 12507826 14470394
41187 14470394 15746357 16529543 17331601 18784428 20347380 20055019 16696555 11596014
41179 11596014 7039438 3689575 946381 -1036755 -1580761 -1074449 -276937 1459385
41171 1459385 4958602 8564474 9412865 7540267 6019688 6449494 6975467 5681981 3356266
41162 3356266 1688225 1136459 1897785 4552358 8095610 9629964 7963071 5539035
41154 5539035 4923313 5489521 5751419 6676247 9668355 12958581 13432897 11167637 8823121
41145 8823121 7031858 3930325 -439059 -2722979 -613028 3836237 6802851 6983644
41137 6983644 5898728 5139343 4862513 4716355 5118492 7013742 10282408 12974836 13283566
41128 13283566 12277177 12889429 15522557 16936658 15106632 12694141 12927891 14218214
41120 14218214 12783012 9309603 8271872 10678237 12504297 11621493 11469791 15176498
41112 15176498 19940797 20813464 17451416 13597273 11668564 11240112 11562908 12194632 11836838
41103 11836838 9686556 7620227 8129215 10174786 9943266 6035700 1278774 -1254069
41095 -1254069 -1596508 -1254197 -306958 2308434 6677456 11227347 13769337 13070708 10271782
41086 10271782 8647991 10519855 14161732 15330396 12305718 7768079 5068564 4637971
41078 4637971 5388201 7630686 12131651 17187295 19381191 17635187 14570541 13216263
41070 13216263 13893931 15031227 15496868 14962989 13205473 10670451 9128435 10106835 12763775
41061 12763775 14747391 15142174 14986271 14710733 13084391 9678223 6533628 5743003 6710645
41052 6710645 7646645 8605024 10788284 13722371 15904751 17990037 22210902 28085011
41044 28085011 31845946 31573573 30178802 31372953 34989181 38581058 41664755 45600235
41036 45600235 50592807 55760317 61607179 69751635 80232046 91107472 100505759 107359980
41028 107359980 111044545 112819817 117014033 127552406 142753402 156058942 162479989
41021 162479989 162122842 157277961 149245284 139337152 130151690 123526568 118588445 113408745
41013 113408745 107508190 101801714 97636019 96934738 101396537 109754443 117040059 118326253
41005 118326253 112746288 103133629 92975318 84668241 79184789 75781977 72743774 69338177
40997 69338177 66111382 62874167 58368585 52974570 49498369 49445510 50383934 49062955
40989 49062955 45502335 41881864 39154003 37357427 37698956 41087789 45316206 46780425
40981 46780425 44959341 42856065 43306661 46987803 53397915 61398867 69425662 77505926
40973 77505926 87999543 101569931 113968312 120827831 124628997 131885766 143277808
40966 143277808 152006577 153435809 151160472 150915695 153179370 155367181 157334061 160138167
40958 160138167 161950119 159900891 154800863 150082170 146846497 143562557 140213755 139252033
40950 139252033 142173323 147841663 154439983 160777954 165548350 167598717 167522756 167358196
40942 167358196 168231271 169372207 169587342 168984662 169522723 174236380 184970772 200604497
40934 200604497 219281958 242642988 274311322 311979445 344541811 361277362 362270767
40927 362270767 356492658 352177758 353643789 364426434 385107995 406581796 412792747
40920 412792747 394851633 359379263 320417550 286508666 257982475 232489582 208515433
40913 208515433 185366903 163751438 145890565 132707757 121884595 110566355 98536455
40906 98536455 86971712 76157187 66750922 61032528 59700764 59076932 54944682 48123841
40898 48123841 42901301 40865834 39962533 39115862 39646490 41608470 42600561 41470690 39879530
40889 39879530 38654706 35769120 30141497 24775544 23290981 25083634 26877119 27988469
40881 27988469 30806076 36035346 40547034 41181640 38654684 36192131 35750696 37339250
40873 37339250 41004061 47048746 54216475 60009098 63811213 67824479 73569581 79375553
40865 79375553 83476659 87979448 96721149 110007067 124953818 141009997 161463966
40858 161463966 189045566 224139854 268037175 321901189 378833268 422801444 442882998
40851 442882998 446685826 452475524 467467086 479696124 472497578 441684794 396764967
40844 396764967 350769089 312309385 283234435 259189510 233877603 205743077 179242212
40837 179242212 158043177 139963922 121311108 103038005 88533376 77569738 67173109
40830 67173109 57294210 50622350 46897280 42405095 36136407 31855978 32122992 34219107
40822 34219107 34569591 33787658 34112964 34575332 32630507 29048156 27106801 27375219 27105568
40813 27105568 25129552 23707540 24327482 24936688 23373232 20941767 19943625 19506613 17019501
40804 17019501 12860752 10345042 10637374 10727961 7771322 3240178 1056377 3007755
40796 3007755 7636188 12502055 15669812 15656004 12109518 6931980 3265981 2674428 3930311
40787 3930311 4784660 4332249 3573664 4241707 7136830 11170919 14126906 14703194 13498503
40778 13498503 11712790 9730202 7747145 6752523 7374583 8325601 7728547 5863352 4906404
40769 4906404 5859681 7488606 8687698 10143327 12825441 16230687 19094900 20858858
40761 20858858 21642241 21626493 21108217 20399517 19302828 17599608 16223195 16588145 18342310
40752 18342310 19302129 18290277 16510197 15337396 14511836 13699902 14025266 16231543 18641263
40743 18641263 18911604 16970477 14474956 12290971 10476706 9924304 11569373 14098333
40735 14098333 14746756 12740329 10005433 8006423 5856691 2576572 -391453 -534478
40727 -534478 2366272 5439636 5477513 2083225 -2026789 -3811693 -2923430 -1661819 -1928725
40718 -1928725 -2969302 -2642256 -208494 3028490 5416470 6311238 5898233 4550573 2573655
40709 2573655 308946 -1447002 -1315123 1459251 5431053 7798681 7540085 6609596 7235155
40700 7235155 9316437 11508117 13328769 14627259 14404477 12232941 9808670 8909154
40692 8909154 8625822 6894152 4033576 2208423 1826776 1238538 -56277 -707746 -280415
40683 -280415 80021 326690 2108200 5714792 8918547 10049711 10076109 10520959 11434739
40674 11434739 12533753 14093693 15321738 14026107 9643965 4842349 2465227 2438552
40666 2438552 3069611 3562482 3623700 2494186 436105 -338338 1719907 5226350 8054761
40657 8054761 10340878 13173705 15635381 15614583 12810199 8802094 4867141 1653637
40649 1653637 19124 -86629 -774829 -3836142 -7695450 -9058987 -7233629 -4539637
40641 -4539637 -2722309 -1301583 541820 2672038 4794955 6701809 7670350 7286121
40633 7286121 6611038 6806951 7122908 6240505 4888506 4644217 4836766 3703744 2250647
40624 2250647 3311413 6399169 7376587 4548518 1445078 1502328 3126775 2641149 -349484
40615 -349484 -3383468 -5090442 -5769237 -5182792 -2684763 738721 2811728 2468771 650324
40606 650324 -1114496 -1746111 -753251 1399271 3337541 4048405 3711036 2859051 1698908
40597 1698908 758536 818804 1420040 1012619 -436103 -854276 506408 1015375 -1980750
40588 -1980750 -7376638 -12005785 -14537641 -15286699 -13767171 -9602271 -4967081 -2787569
40580 -2787569 -2703034 -1900633 8833 157784 -2875190 -6383439 -6681351 -2857961 3328570
40571 3328570 9150495 11760156 9621202 4367745 -261677 -2100381 -1821113 -624905
40563 -624905 941203 1495193 -930303 -5839664 -9896851 -10983589 -10372073 -9614328 -8071169
40554 -8071169 -5494707 -4266875 -6216310 -9247758 -10113235 -8930619 -7940364 -7217975 -5030176
40545 -5030176 -1614804 833003 1671817 2181148 2595309 1937191 864265 1396766 3324413
40536 3324413 4063558 2869127 2062734 3004790 3980985 3555610 2907899 2855547 1592775
40527 1592775 -1845371 -4355866 -2397470 2674225 6348132 7250356 8229982 11087695
40519 11087695 13490794 12295474 7691049 2582248 -846154 -2616231 -3619715 -3967051
40511 -3967051 -3073960 -1263329 -581549 -2786434 -6358539 -7232444 -3626808 1388904 3743081
40502 3743081 3263005 2510800 2103890 410020 -2490638 -4118894 -3608732 -3124183 -3802532
40493 -3802532 -3276812 493078 5272371 7228624 6044572 4462635 3657394 2212889
40485 2212889 -319525 -1928597 -1239070 192763 123207 -1412272 -2896175 -3948286 -5367937
40476 -5367937 -6970971 -7103284 -4723014 -939487 2049056 2965968 2031788 149331 -1778586
40467 -1778586 -2890519 -2451608 -342938 2503837 4291878 3392405 -112450 -3740482
40459 -3740482 -4314058 -1159987 2893155 4584512 3682861 2143473 635478 -1674896
40451 -1674896 -3817826 -2631826 2670919 8139501 9751976 8446247 7576359 7140402
40443 7140402 4480636 -36082 -2520974 -1352839 662930 1283307 2066189 4485200
40435 4485200 6373501 5278803 2748223 2031651 3373328 4664104 5244579 5987201 6811027
40426 6811027 7096301 7497614 8424951 7932615 4439654 507773 117044 2736751 4133815
40417 4133815 2918662 1843781 2043704 822195 -2951583 -5615310 -3800473 586429
40409 586429 3670165 5260439 7695706 10852613 12022934 10188819 7381840 5735263
40401 5735263 5343647 5100772 4092492 2324148 1233319 2820260 6954610 10369098
40393 10369098 9884326 5978763 1673941 -1396560 -4126668 -7608363 -11228488 -12960095
40385 -12960095 -10721759 -4289659 3158533 6761250 4888258 1272814 588348 3148161
40377 3148161 5893555 7030609 6845965 5105087 1253139 -2905319 -4261539 -2819701
40369 -2819701 -1997318 -3580381 -5294961 -4705617 -2740182 -1450366 -585232 1239309 3450477
40360 3450477 4025241 2549575 948498 1225716 3486855 6015099 6792239 5445714 3961672
40351 3961672 4636389 7111658 8539035 6892507 2846398 -1638357 -4732214 -4600766
40343 -4600766 -510517 4839365 6754236 4173181 1545369 2837655 5899811 5807839
40335 5807839 2152046 -646216 323368 3367928 5613345 6211427 5291377 2629458 -1102568
40326 -1102568 -3756397 -3877742 -2164522 204896 3211066 6729508 8857583 7109743
40318 7109743 1120516 -6540353 -12079462 -13009293 -9826974 -5511367 -2719363 -1415011
40310 -1415011 43532 1895433 2536629 1137596 -899117 -1559324 -17217 3374105
40302 3374105 7309732 9498822 8350122 5308230 3483493 3221202 1563674 -2492576
40294 -2492576 -5143487 -2960506 1282798 1669120 -2902524 -7569355 -8363658 -6601118
40286 -6601118 -5412534 -5078767 -3806747 -1120996 1636897 3212777 3327279 2391561 1490548
40277 1490548 1933547 3764561 5322333 5180344 3916266 3155182 3599300 4943071 6936909
40268 6936909 9188503 10324707 8934632 5726102 3629777 4910377 8421864 10318891
40260 10318891 7743464 1718430 -3839459 -5919327 -4679800 -1798288 2171168 7392733
40252 7392733 12466881 14803250 13710929 11204901 8968570 6465058 3279124 1229154
40244 1229154 1943354 3748003 3587620 1339859 -498577 -1216472 -2964400 -6679652 -9706856
40235 -9706856 -9180384 -5882922 -2817329 -1238050 -190640 724755 455689 -1318765 -2895708
40226 -2895708 -2417126 -157529 1920810 2443685 1675058 510455 -666041 -1803076 -2600040
40217 -2600040 -2906281 -3435587 -5139295 -7715842 -9603136 -9768625 -8613543 -6657163 -3479308
40208 -3479308 1036278 5403820 7914786 8773590 9424656 10144124 9874728 8278602 6240724
40199 6240724 4184522 1622154 -1094930 -2148368 -270692 3599123 7308365 9325038
40191 9325038 9302866 7886152 6372451 5686136 5500580 5207213 5346966 6573597 7652929
40182 7652929 6748069 4670523 4184347 5673881 6573726 6059773 6772343 9894967 12037677
40173 12037677 10126716 6503426 5350965 6239525 5541677 2866831 1392572 2154760
40165 2154760 2611115 1448258 674511 1800771 3547444 4720253 6136106 8166941
40157 8166941 9311337 8830585 8076174 7553185 5453295 1138010 -2523133 -2787873 -1031444
40148 -1031444 -652639 -2591458 -5236622 -7302475 -8369938 -7768499 -5414832 -3010020
40140 -3010020 -2162279 -1853969 302505 4878511 10468704 15908985 20608021 23265380
40132 23265380 22522157 18953364 14752802 11438747 9150545 7786070 7242342 6681502
40124 6681502 4939492 1638995 -2879347 -8010365 -12352303 -14003021 -12920493 -11746724
40116 -11746724 -12444225 -13419033 -12211776 -9605523 -8014299 -6855417 -3443602 1452608
40108 1452608 3072298 -891713 -6607644 -8896194 -7336806 -5568336 -6320545 -9178377
40100 -9178377 -12088361 -13295170 -12404379 -10616972 -9357274 -8409913 -6693846 -4921591
40092 -4921591 -5183976 -7118150 -7194649 -3577551 765323 2271531 2032779 3614783 6852303
40083 6852303 7557538 3612828 -1887612 -4644646 -3835217 -1427357 1092703 3239056
40075 3239056 3878034 1514937 -3282648 -7305917 -7774304 -5535849 -4038843 -4994763 -6297461
40066 -6297461 -5020232 -1315967 2132576 3690957 3689545 2102040 -1922375 -7409536 -11049007
40057 -11049007 -10965937 -9007164 -7572564 -6281806 -4093994 -2704529 -4470828 -7917349
40049 -7917349 -8880157 -6188390 -3005281 -2007218 -2289037 -2059134 -1458852 -983139 449463
40040 449463 3539575 6291402 6046743 3129794 477435 -51666 673092 1029724 804425
40031 804425 1014525 2430594 4646487 6336605 6467806 5435835 4756926 5524361 7568702
40022 7568702 10083599 12248192 13089867 11851811 9101047 6576344 5297881 4630674
40014 4630674 3717590 2755141 2128182 1490919 739997 708686 1558529 1574098 -761327 -4249100
40004 -4249100 -6281049 -6112461 -5094087 -4229199 -3598438 -3880155 -5922920 -8408790 -8318189
39995 -8318189 -4674512 53378 3199553 4721414 5784141 6530355 6792517 7325752 8475560
39986 8475560 8886458 7393583 5104914 3683832 2639165 612045 -1451822 -1153778
39978 -1153778 1425315 3338915 2830488 1362875 776063 717803 195094 -309580 -7759
39969 -7759 290838 -789958 -3128287 -5562652 -7597308 -9140908 -9285125 -7103998 -3437332
39960 -3437332 -364841 1058193 1348977 1163257 742119 696150 1815433 3857048 5795404
39951 5795404 7410629 9201061 10523994 9640015 6424175 3331515 2308417 2072607
39943 2072607 149841 -3347794 -6026192 -6936447 -7786972 -9967197 -12282422 -12764272 -11429554
39934 -11429554 -9946215 -9396630 -9660893 -10411631 -11305818 -11490162 -10371907 -8799656 -7922152
39925 -7922152 -6808298 -3228178 2386783 5888581 4166854 -446309 -2740869 -794869
39917 -794869 2701010 4660715 4347514 1957081 -2181402 -5805833 -5264497 -163311 4763462
39908 4763462 5054032 2175078 996060 2879030 4582495 3667504 1599406 791086 1350006
39899 1350006 1982394 2114715 1895583 1542145 1613372 2724216 4450463 5837193 7234767
39890 7234767 9823137 12879269 13697058 11220054 7747863 5867029 5678720 6335915 7969845
39881 7969845 10069179 10126089 6709154 2524981 1491191 3476647 4715806 3043973
39873 3043973 -42186 -2481472 -4013013 -4937627 -4960387 -4187840 -3509495 -3294360 -3188007
39864 -3188007 -3423356 -4468096 -5118849 -3275668 566714 2912752 1680454 -1000958
39856 -1000958 -2014133 -1446014 -1549551 -2911539 -3963465 -3624466 -2325894 -713544 813325
39847 813325 1470667 868067 475519 2405167 6141038 8040781 5052911 -1956181 -9223043
39838 -9223043 -13554982 -14146313 -11981492 -8767476 -6284069 -5594979 -6284825 -6779378 -5829169
39829 -5829169 -3727689 -1966892 -1690291 -2583491 -3336911 -3061185 -2048647 -1219536 -1129626
39820 -1129626 -1557356 -1728294 -870001 1002216 2622490 2330348 -58948 -2535443 -2680444
39811 -2680444 -126499 3259537 5548865 6435122 6632743 6384824 5240137 3022120 289868
39802 289868 -2301668 -4537918 -6135587 -6104579 -3474832 1021473 4643956 4892887 2143065
39793 2143065 -583071 -721501 1419763 3565201 4092218 3091756 1395508 -255755
39785 -255755 -1022755 -242602 1350605 1609372 -677337 -3898639 -5358944 -4663558 -3784811
39776 -3784811 -3598879 -2487420 310196 1930407 -875906 -6454106 -9248118 -6698864
39768 -6698864 -2409591 -917106 -1646794 -604196 3222923 6241551 5270487 1701312
39760 1701312 -532596 292034 2328310 3003505 2031456 1260994 1944775 2825821 1542111
39751 1542111 -2236763 -6100057 -7687947 -7099435 -5840708 -4697839 -3926384 -4261860 -5753848
39742 -5753848 -6399221 -4313802 -1043482 -175023 -2270209 -3703639 -1561706 2515196
39734 2515196 4858317 4384448 2952792 2325252 2568978 2921661 2808346 2159114 1453231
39725 1453231 1053633 206716 -2261828 -5747973 -7701558 -6516379 -3290900 191753
39717 191753 3625970 6970446 8754166 7638698 4598741 1551322 -1224979 -4174557
39709 -4174557 -5972600 -4764651 -1731224 -620478 -3104101 -6764286 -8349229 -7070886
39701 -7070886 -4032800 -499129 2112485 2307146 143612 -2221685 -2797605 -1737056
39693 -1737056 -235833 1370990 3201853 4472552 4042981 1962543 -719723 -3456583
39685 -3456583 -6400459 -9124011 -10210613 -8602185 -4945530 -1253097 768190 1072582
39677 1072582 998296 1582505 2321982 1928813 130748 -1859954 -2636943 -1689295 822165
39668 822165 4452407 8184232 10545339 10848381 10083769 9962913 11095804 12468474 12659375
39659 12659375 11269958 9194766 7827193 8193405 10608322 14515793 18195319 19159243
39651 19159243 16049635 10477921 6007392 4706541 5440778 5932348 5245581 3436949
39643 3436949 353230 -3539827 -6370862 -7024689 -7206037 -8930731 -10656274 -8979212
39635 -8979212 -4213989 -866603 -1529302 -3483216 -3058033 -450349 2056094 3972417
39627 3972417 5659800 5593545 2363211 -1476807 -1374274 3156118 7621544 8343196 6304772
39618 6304772 4285855 2988656 1752474 903749 1115507 1665365 1475091 1224877 2458052
39609 2458052 4830460 6147798 5418688 4256773 4545419 5922075 6550819 5591805 3757570
39600 3757570 1795491 -270358 -2138525 -2660714 -1212821 863666 1246219 -765478
39592 -765478 -3250158 -3583172 -1107330 2256543 3929403 3191809 1817105 1943418 3283309
39583 3283309 3188684 89279 -3861328 -4728084 -1154947 4333963 8290692 9366877 8306591
39574 8306591 6357828 4365804 2567615 756772 -833267 -1030852 673785 2227504
39566 2227504 679885 -3713013 -7095307 -6855005 -4984393 -5043513 -7446508 -9771512 -10457135
39557 -10457135 -9832817 -8206136 -5413802 -2279069 -433306 -341358 -1023727 -1833081 -2932487
39548 -2932487 -3840342 -3164356 -413774 3047733 5371070 5772751 4594518 2708355 1014009
39539 1014009 -182641 -1242394 -2098252 -1714746 322011 2388190 2534621 1194695 474326
39530 474326 937666 954963 -621933 -2950652 -4740816 -5648896 -5649017 -4574743 -2970187
39521 -2970187 -2184967 -3042268 -5246922 -8045814 -10283853 -10236087 -7379010 -4327946 -4678588
39512 -4678588 -8325713 -11091855 -9788812 -5507663 -997669 2791554 6022706 8019015
39504 8019015 8100777 7029594 5875774 4600670 3176381 2660416 3488277 4106321 3215019
39495 3215019 2178027 3156963 5772548 7666421 7688719 6540056 4793307 2322267 -435126
39486 -435126 -2363224 -2937542 -2592203 -2160377 -2718559 -5013747 -7984632 -9113837 -7576296
39477 -7576296 -5486443 -4336397 -2216840 2691177 7612360 7924421 3759077 -7750
39469 -7750 -488920 334042 275006 610250 3090958 6262875 7310079 5798008 3375621
39460 3375621 964315 -1790076 -4921107 -7499546 -8368445 -6915772 -3656684 -233186
39452 -233186 2064596 3699768 5541242 6544358 4971204 1894004 636808 1964252
39444 1964252 2803704 1200345 -438384 711831 3285038 3909720 2109492 -296
39436 -296 -1555043 -3357633 -5249723 -6084566 -5998492 -6009493 -5611847 -3508553 -721502 -155133
39426 -155133 -2559341 -5389300 -6337479 -5745349 -4761915 -3357141 -1345747 390059 939995
39417 939995 348283 -1260582 -4098138 -7375872 -9035400 -7964847 -5399546 -3230915
39409 -3230915 -2061333 -1671638 -1899194 -1921984 -226696 3085810 5209343 3784724 348968
39400 348968 -1415645 -500511 477359 -762980 -3369517 -5260620 -6015389 -6497715 -6682063
39391 -6682063 -5473589 -2551103 773441 2804886 2995369 2117966 1399984 1566697 2232681
39382 2232681 2037024 -134586 -3708904 -6580256 -7113727 -5645624 -3563562 -1523801
39374 -1523801 423354 1429939 307175 -2232932 -3557850 -2473170 -1134928 -1965518
39366 -1965518 -3842858 -3636915 -1048875 704375 -523399 -2956820 -3762450 -2750333
39358 -2750333 -1614510 -1035878 -556510 -471366 -1727565 -4051442 -5898893 -6414244 -5945750
39349 -5945750 -4393044 -770852 4557878 8475050 7684742 2752343 -1703939 -1573629
39341 -1573629 2560052 6501331 7213082 5249172 2429087 -899985 -4688022 -6735398
39333 -6735398 -4364636 1172575 4695149 2984732 -1210312 -2836818 -742289 1871834
39325 1871834 2189444 537635 -1338391 -2406924 -2336682 -1250025 -226755 -726173 -2931452
39316 -2931452 -5734507 -8520260 -11469851 -13772383 -13472023 -10211081 -6508974 -4707578
39308 -4707578 -3735629 -744192 4546981 8990784 9637317 6740366 2732198 -520086
39300 -520086 -2586517 -3443431 -2837190 -864958 1536320 3241948 3931685 3959816 3230062
39291 3230062 904963 -3160997 -7096947 -8094718 -5145890 -252555 3372832 4131971
39283 4131971 3078983 2455888 3248197 4121892 3095942 358022 -1484755 -676947 1215791
39274 1215791 1588452 770730 1528542 4631767 7395543 7460703 5700599 3893031 1623477
39265 1623477 -2188498 -6026192 -6806436 -4044970 -756425 241420 -691312 -1300451 -503242
39256 -503242 603090 343871 -1371210 -2633118 -1667188 691814 1729660 410232 -1292877
39247 -1292877 -1545809 -1380919 -2536620 -4153685 -4156828 -3015377 -3254629 -5388646 -7112466
39238 -7112466 -6852021 -5554051 -4415977 -3349734 -2508612 -2887943 -4222504 -4407280 -2282591
39229 -2282591 827392 3363383 5246764 6256144 5166182 2305734 720745 2436354
39221 2436354 5210760 5395419 2763325 216678 -190817 1357048 4065159 7181141
39213 7181141 9603387 10823955 11629383 12253756 11165485 7787125 4769962 4603985 5281940
39204 5281940 2882600 -2306082 -6101928 -6550127 -5541480 -4091209 -725023 3995257
39196 3995257 5914440 2872269 -1843109 -4563699 -6379285 -9601291 -12009036 -9358596
39188 -9358596 -2424282 3009810 3321694 614111 -1306344 -1237799 5312 1536794 2188945
39179 2188945 462559 -3538648 -7351246 -8830822 -8797916 -9663587 -11834560 -12843110 -10424550
39170 -10424550 -5731705 -2696916 -3963401 -7868332 -10082817 -8182544 -3911112 -941537
39162 -941537 -1390534 -4748638 -8924826 -11515737 -11113328 -8509132 -6121590 -5587040 -6555930
39153 -6555930 -8077181 -9673789 -10373953 -8694289 -5167911 -3049597 -4325774 -6558147
39145 -6558147 -6310950 -4426619 -4630347 -7491706 -9436832 -8173305 -5632635 -4313071
39137 -4313071 -3649069 -1729353 1597274 5029815 7493046 8075540 5937542 1693194
39129 1693194 -2515922 -5375351 -7203715 -7625091 -4950424 395472 4275912 3231011
39121 3231011 -1225307 -5154412 -7307389 -8797460 -9322499 -7609651 -5129188 -5350830
39113 -5350830 -8666302 -11502059 -11550826 -10684224 -11102885 -11614432 -10151970 -7765815 -7215570
39104 -7215570 -8727131 -9876896 -9342155 -8403934 -8498736 -9111159 -8642914 -6212679 -2269060
39095 -2269060 1643410 3637850 3098493 1756614 2015970 3787669 4181485 1178167 -3414738
39086 -3414738 -6018206 -5844291 -5782269 -8295685 -11817663 -12500267 -8992895 -3953003 -496030
39077 -496030 1458708 4099859 7673679 9289525 6474792 894527 -2789925 -1883724
39069 -1883724 1403359 2547205 -212381 -4221222 -5875856 -4688810 -3009378 -2387214
39061 -2387214 -1909010 -549806 535895 -388350 -2633141 -3641859 -2573545 -1382504
39053 -1382504 -1549336 -1497477 1051677 5085940 6777177 4177391 -237949 -2590204 -2073362
39044 -2073362 -1264543 -2506915 -5273041 -7251627 -6996079 -4910973 -2274793 -128579
39036 -128579 997255 1019100 299783 -559045 -1120128 -1203631 -671780 472642 1706298
39027 1706298 2278694 2340167 3349261 6518431 10737954 12850230 10702313 5714829 1711875
39018 1711875 1047643 2478163 3193100 2269676 1242838 1578796 2825826 3615474 3409614
39009 3409614 2533068 1360687 429325 647003 2254783 4116076 5239764 6417033 8787936
39000 8787936 11281557 11566712 9541982 7572949 6848940 6074218 4701809 4509479 6013598
38991 6013598 6170587 2709263 -1454411 -1995388 10838 -386745 -3892416 -5339651 -1595723
38982 -1595723 3437977 4462117 1887807 -108851 -30162 386884 514502 1543585 3133503
38973 3133503 3170128 1495526 723334 2309335 4483460 5340877 5548043 6309186 6715325
38964 6715325 5254243 2598782 683150 -250505 -1616260 -3847948 -5748573 -6485788
38956 -6485788 -6431741 -5687147 -3464376 274051 3812366 5235051 4221893 1754961 -956864
38947 -956864 -2590875 -2043932 -18827 612473 -2234235 -6844777 -9378364 -8582661 -7034029
38938 -7034029 -7203565 -8147104 -7296886 -4183211 -890744 387077 -1082789 -4727823 -8905681
38929 -8905681 -11419253 -11320005 -10101007 -9832467 -10338262 -9666708 -7220622 -4681290 -3516864
38920 -3516864 -3248630 -2841983 -2312139 -2013382 -1547415 -469384 721728 1207933 834680
38911 834680 -181082 -1737668 -3323338 -3790699 -2517095 -292157 1547070 2354039 2243904
38902 2243904 1768025 1832386 2844160 3550073 2128426 -932828 -2726738 -1790805 -425484
38893 -425484 -1661103 -5341610 -8810829 -10040499 -8358391 -3832064 1650542 4258303
38885 4258303 2221111 -1063223 -1117671 1326488 1890752 -193912 -1134423 466354 835227
38876 835227 -2475511 -5928752 -5471930 -3058884 -3205867 -5487863 -5599579 -2892491 -1562431
38867 -1562431 -3725904 -6094622 -5495640 -3870745 -4798965 -7528161 -7993341 -4944915 -1816317
38858 -1816317 -1915958 -4128668 -4854946 -2986669 -1130774 -1876005 -4387467 -5702853 -4629708
38849 -4629708 -2939397 -2606484 -3114514 -2183930 1451985 6472080 9717103 8527923 3383839
38840 3383839 -1549038 -1888599 2200288 5998373 5847136 3225918 1889863 2666118 3367941
38831 3367941 2718937 1495894 38378 -2412700 -5243720 -5902005 -3107410 1102021
38823 1102021 3722712 3831514 2378084 451468 -1066611 -1423144 -901883 -874706 -1830509
38814 -1830509 -2288981 -736090 2371562 5608161 8320510 9928564 8889899 4664319
38806 4664319 13833 -1326586 464083 1159382 -1813909 -5556609 -5158886 200449
38798 200449 6265030 8333973 5552290 859154 -1952540 -945511 2857887 6187310
38790 6187310 5974629 2130941 -2078623 -3110665 -737969 2029189 2750398 2287972 2902241
38781 2902241 4495229 4479477 1540842 -2170864 -3602119 -2415301 -827343 -596895 -1572059
38772 -1572059 -2856884 -3902100 -4289503 -3729272 -2739214 -2405294 -3016863 -3682050 -3672410
38763 -3672410 -3396659 -3557251 -3953687 -3636329 -1896762 1039716 3723447 3920320 553756
38754 553756 -4241371 -6245935 -3465227 1489863 4476782 4487905 3766003 3926808 4169662
38745 4169662 3718622 3937699 6559646 10815130 13757503 13245786 9815822 5837331 3431730
38736 3431730 2978393 3167720 2658551 1712817 1511069 1792548 594563 -2734424 -5634310
38727 -5634310 -5176602 -2058083 272514 320432 242852 2325053 5654122 7370732 5952663
38718 5952663 2262836 -1593188 -3518912 -2608819 -186958 1130292 313280 -1056208
38710 -1056208 -1486475 -1915169 -3821962 -6237758 -6817748 -5352833 -3940081 -3668369 -3353087
38701 -3353087 -2013353 -506224 267252 1088189 3093594 5850817 7907273 8462100 7553517
38692 7553517 5359873 2348431 -344550 -1574819 -1095068 538320 2541139 4160983
38684 4160983 4972596 5124584 4662094 2739014 -1286513 -5934845 -8480678 -8325368 -7773366
38675 -7773366 -8599686 -9774576 -9905677 -9773752 -10227112 -9411416 -5206219 490997 3280082
38666 3280082 2036684 -33124 -587267 -1006167 -2645963 -3498305 -1374699 1594651 988277
38657 988277 -3813630 -8371559 -8511405 -4889188 -1407205 -556917 -1564560 -2487721 -2814062
38648 -2814062 -3544791 -5201013 -6528727 -5706414 -2657082 568640 1995392 1688608 1012714
38639 1012714 519415 -439488 -2038176 -3025652 -2243539 -631541 -556187 -2667954 -4320985
38630 -4320985 -2345698 2788594 7089302 7860455 6839844 7142299 8369710 7103802
38622 7103802 2035725 -3888710 -7202135 -7689400 -7098492 -5814075 -2847190 1583336
38614 1583336 5420341 6862542 5908157 3768617 1756647 788856 926483 1030568 -365349
38605 -365349 -3261785 -5538347 -4568440 281279 6732536 11410884 12892417 12727118 12976271
38596 12976271 13252210 11451741 7343761 3637451 2641847 3399143 3464785 2285981 1106628
38587 1106628 413247 -447308 -1322131 -900391 1336467 4228625 6262514 6566841 4646406
38578 4646406 820803 -2696419 -2957079 430056 4334139 5408739 3500672 1054194
38570 1054194 217418 1553388 4617342 8339325 11115340 11703161 10171198 7512996
38562 7512996 4701736 2663488 2460300 4319930 6673932 7344333 5974278 4467401
38554 4467401 4651779 6140048 7007332 6216781 4748913 4250492 5021294 5788818 5425450
38545 5425450 4350403 3901726 4727744 6279902 7494183 7284372 4805639 416994 -3607107
38536 -3607107 -4599528 -2176900 1581697 4881038 7750300 10205880 10592307 7487104
38528 7487104 2469595 -796069 -220982 3058707 6365288 7612418 6141641 3027056
38520 3027056 740620 1195123 3685268 5593338 5164831 2653558 -988944 -4974504
38512 -4974504 -8075295 -8950304 -7823223 -6350623 -5009942 -2267137 2366345 6080656
38504 6080656 5712253 2203574 -106130 1298259 4437122 5771370 4251877 1786605
38496 1786605 861198 2423493 5269149 6920528 5869513 3435859 2578293 4383613
38488 4383613 6746328 7222252 6001586 4838842 4102067 2762203 924972 242393 1320392
38479 1320392 2511489 2257008 1226352 893597 1112804 678222 -390822 -924882 -842323
38470 -842323 -1481128 -3175658 -4088119 -2563755 328427 1899903 1137724 -207882 124088
38461 124088 2348415 4523524 4509901 1874968 -1799532 -4294675 -4571332 -3402151 -2405385
38452 -2405385 -2657542 -4052089 -5452776 -5445384 -3672934 -1669244 -1465144 -2837344 -3045761
38443 -3045761 -417382 2816083 3052474 224794 -2065863 -1641359 -564403 -1562395 -3746268
38434 -3746268 -4171724 -2407974 -737467 -1736 1830276 5986019 10228159 11696761
38426 11696761 10812144 10179915 10527653 10186307 8511772 7267106 7664325 8116129 6628169
38417 6628169 4123853 3327213 4773731 5959950 4791634 2220384 669030 1075770
38409 1075770 2515662 3824554 4300312 3277838 535241 -2631692 -4025807 -3024322
38401 -3024322 -1631502 -2045296 -3632441 -3693347 -1426406 414001 -994623 -4439824 -5951584
38392 -5951584 -3963738 -969147 680136 2274885 6104423 10982133 13212602 11556546
38384 11556546 8502761 6362777 4689571 2361466 -146626 -1827062 -2548746 -2170453
38376 -2170453 -100054 3002387 5089025 5761714 7231522 10431660 12764651 12383837
38368 12383837 12030321 14706749 17650799 15694758 9770782 6394109 8033803 9686430
38360 9686430 7113271 3193349 2598038 4440690 4641236 2616795 938301 240609 -824398
38351 -824398 -1576318 65497 2896447 2581838 -2565179 -9177190 -13187016 -13919003 -12948093
38342 -12948093 -11411074 -9684855 -7882956 -5668663 -2953173 -1065569 -1441317 -2968628
38334 -2968628 -2893887 -919292 -22281 -2201525 -5639228 -7428070 -7134541 -6030776 -4411697
38325 -4411697 -1605335 2120590 5130147 5654492 3058229 -1281065 -4234956 -3520107
38317 -3520107 -340413 2203463 3419759 5232549 7525078 6666178 803276 -6243561
38309 -6243561 -9394182 -8628332 -7700075 -8124173 -8188375 -7281331 -7244851 -8824270 -10015517
38300 -10015517 -9152639 -7296346 -6376917 -6766140 -7677562 -8416378 -8348573 -7005148 -5022431
38291 -5022431 -3808692 -3691219 -3564047 -2803302 -2191042 -2391693 -2835036 -2757917 -2182369
38282 -2182369 -1332367 -299284 261445 -467181 -1740400 -1444149 1093747 3851408 4639652
38273 4639652 3578758 2071210 774002 -52274 434055 2434436 4160942 3631037 1473239
38264 1473239 216172 846610 1686027 988359 -644447 -1003770 1309128 5574533 9557524
38255 9557524 11199635 10065131 7299361 4238158 1425309 -1016292 -2881872 -4164120
38247 -4164120 -5034226 -5077584 -3517303 -791551 1362637 2381460 3961868 7093901 9458725
38238 9458725 8217798 4555633 2502325 3211513 3446871 634489 -3379425 -5180203
38230 -5180203 -4064757 -1509949 1655633 5015764 6771016 5080236 1087805 -1723425
38222 -1723425 -1579696 -157301 -59529 -2078712 -5145098 -7434922 -7236644 -4290209 -726833
38213 -726833 801685 341293 278840 1214261 431416 -3955499 -9255808 -10991885 -8455523
38204 -8455523 -5051253 -3485474 -3066577 -2050766 -406595 693390 610089 -412420 -1555810
38195 -1555810 -1621926 -157202 1275782 560702 -1652124 -2019511 909757 4064680 3626720
38186 3626720 -26100 -3296955 -4230439 -3977646 -3959255 -4096589 -3905170 -3071961 -751111
38177 -751111 3415967 7199526 7261752 3757814 1044084 2230694 5193759 6148882 5418387
38168 5418387 6718243 11286964 15627000 15726877 11538644 6310482 2816080 1321591
38160 1321591 502656 -801968 -2745340 -4597336 -5246952 -3828288 -564617 2652708
38152 2652708 3302042 936790 -1547274 -910734 2061039 3050331 -195583 -4678082 -5959665
38143 -5959665 -3466514 -87635 2040464 2795985 2001749 -826701 -4379740 -5879408
38135 -5879408 -4474015 -2391775 -1864737 -2669835 -3572966 -4321896 -4887099 -4302056 -1920747
38126 -1920747 1083675 2859493 2856043 1671833 -145204 -1979011 -2740441 -1989759 -907140
38117 -907140 -941729 -2038414 -3204401 -3877586 -3381367 -268051 5499396 10363615 10053200
38108 10053200 5117300 981056 1341414 3775476 3602976 178425 -3076060 -3815588
38100 -3815588 -3174146 -2990677 -3138276 -2625773 -1701170 -1543749 -2687758 -4730667 -6930543
38091 -6930543 -8187950 -7144211 -3564907 605781 2818404 2744193 2577177 4236809 7132676
38082 7132676 9104044 8738935 6143008 2154249 -2217454 -5789819 -7543549 -7212856
38074 -7212856 -5282414 -2498010 383247 2694372 4180243 5014199 5173565 4290656 2703714
38065 2703714 2025656 3535335 6173193 7327295 5804649 3013684 973503 252772
38057 252772 330546 835630 1512100 1732643 1094190 160832 -198678 28360 174881 -9963
38047 -9963 -102255 292398 1103162 1943248 2348975 2166783 2029381 2950240 4987743 6906673
38037 6906673 7706803 7655482 6968414 4586567 -59932 -4762001 -6273889 -4543180 -3024255
38028 -3024255 -4032591 -5888966 -5974163 -4616645 -3884417 -4009428 -3728321 -3582525 -5869423
38019 -5869423 -10698439 -14587899 -14320866 -10561585 -6401042 -3745635 -2527059 -2190332
38011 -2190332 -2183253 -1705671 -690529 -612185 -2710312 -5697691 -6870309 -5406968 -2960310
38002 -2960310 -953210 1010526 3767260 7245176 10883779 13887860 14827833 12861643
37994 12861643 9822075 8887549 10208755 10134433 6229892 770870 -2721701 -4152903
37986 -4152903 -5422879 -6398878 -5841978 -5069995 -6645020 -9638052 -10180326 -7232185 -3998391
37977 -3998391 -2627409 -1396706 1055221 2447760 575662 -2655060 -4100346 -3996130
37969 -3996130 -4254934 -3954263 -579714 4840115 7782592 5958010 1948275 -629918
37961 -629918 -982717 -208891 1091466 2724618 3873403 3599016 1815302 -733760 -2757893
37952 -2757893 -2749398 -405513 2099577 1887339 -1065025 -3759826 -4267879 -4130556 -5347516
37943 -5347516 -6676841 -5176001 -800898 2820235 2654824 -256009 -2391517 -1851034
37935 -1851034 92727 1090255 338060 -1099191 -1848245 -1427093 -85861 1768932 3673291
37926 3673291 5133399 5986670 6398343 6121165 4242191 410201 -3826143 -5692316 -3566410
37917 -3566410 1447981 6352612 8670315 8356627 7481374 7757118 8490750 7688661 5155900
37908 5155900 3232329 3860613 6170949 7979627 8552051 8555843 8250339 7373486 6238371
37899 6238371 5350458 4423958 3307415 3166704 4794356 6382177 5447530 2765168 1600547
37890 1600547 2757184 3470783 2238183 1526880 3569663 6128969 5424762 1723014 -1076189
37881 -1076189 -758049 1140162 2416777 2567201 1528876 -1334567 -5489515 -8110999
37873 -8110999 -6592315 -1774165 2637694 3908864 2720631 1765586 2727459 5019071
37865 5019071 6845004 6728727 4248456 305100 -3023756 -3853555 -2470121 -1303895
37857 -1303895 -2147766 -4029452 -4781750 -4012330 -3155306 -3021958 -2897626 -2005451 -324836
37848 -324836 2149075 5441065 8640695 10328277 10224047 9131930 7312029 4635085
37840 4635085 2368476 2563375 5005336 6852908 6217857 4213946 2585972 1369868
37832 1369868 27401 -1122057 -1847378 -2400505 -1861429 1438245 6317369 8411853 5816927
37823 5816927 2464279 2895829 5937617 7085944 5351724 3631729 3286073 2689007 1155644
37814 1155644 243334 374867 -378201 -2936408 -5277918 -4951331 -1537624 3781997 8876454
37805 8876454 10726792 7628504 2065966 -1130766 -335101 1426643 1112351 -855339
37797 -855339 -2528231 -3101104 -2404221 -183207 2756001 4799468 5980093 7904566 10291645
37788 10291645 10317475 6771931 2081635 -1419221 -4258546 -6822214 -6790371 -2667126 2590024
37779 2590024 4886724 4198268 3259791 2765405 1457497 -299572 -980033 -1383703 -3816763
37770 -3816763 -7711338 -9558137 -7587941 -3357597 1583736 7035219 11323391 10968901
37762 10968901 5330677 -1131954 -3592687 -2038439 160349 934731 489301 -894880
37754 -894880 -3298850 -5815695 -6897984 -6063468 -3898832 -882259 2176467 3137803 316558
37745 316558 -4434401 -6620938 -4119997 334560 2850704 3003926 3030405 3646828 3274465
37736 3274465 1372028 -109360 317805 1316810 952676 -240149 -414637 382155 459800
37727 459800 -455841 -758449 297611 1581052 2265007 2934737 3809752 3898786 2916085
37718 2916085 2116420 2034605 1259477 -1129950 -3705669 -4882705 -5180405 -5374893 -4198883
37709 -4198883 -436777 3996665 5957851 5398239 4982206 5677196 5597698 3566643 1258758
37700 1258758 980846 3119352 6276697 8324780 7230535 2823732 -1961733 -3631575
37692 -3631575 -2313775 -1368021 -2481367 -3632817 -2818094 -1204271 -902396 -1660274 -1818827
37683 -1818827 -1188413 -978544 -1691724 -2774972 -3826277 -4841407 -5775597 -6840418 -8494439
37674 -8494439 -10224849 -10363722 -8299440 -5862530 -5097831 -5510645 -5085125 -3381754 -1947662
37665 -1947662 -1997165 -3269744 -4989490 -6390785 -6362305 -4296463 -1760791 -1887931 -6156050
37656 -6156050 -12357011 -16327837 -15462501 -10540631 -4722461 -918926 360025 828528
37648 828528 2046769 3566120 3879438 2726226 1499263 1411404 2189241 2832828 2945344
37639 2945344 2936887 3370066 4375760 5348165 5070838 2660727 -1223793 -4453744 -5266721
37630 -5266721 -4134044 -3459673 -5100739 -8243582 -10142825 -9165955 -6641470 -5144704
37622 -5144704 -5355225 -5590696 -4407015 -2400806 -887344 48920 1099325 2048017 1877646
37613 1877646 450168 -1012972 -1280886 -104193 2271740 5602927 9062322 10858704
37605 10858704 9509838 5711957 2268556 1496544 2818362 3632591 2769427 2191658 4449604
37596 4449604 9121350 13076782 14046246 12449240 9627149 6136941 2614191 514776
37588 514776 346753 272776 -1680459 -4556241 -5411381 -3220600 -186790 1085944 337486
37579 337486 -816945 -904492 363023 2066286 2514984 510319 -3179927 -6125861 -6543806
37570 -6543806 -4962645 -3291933 -2690098 -2756436 -2474543 -1441923 -158124 655811 852798
37561 852798 866286 1051804 1448132 2205380 3489790 4613865 4266708 2540794 1822695
37552 1822695 4151139 8099963 10026243 8494416 5687588 3961804 2922530 1153466
37544 1153466 -761509 -960812 580596 1762684 1497822 1398119 3300548 6231314 7401725
37535 7401725 6061116 4742130 5850348 8201594 8534183 6019621 3254953 2359747
37527 2359747 2301978 1553883 1351059 3605673 6605582 6150533 1402036 -3359158 -4056009
37518 -4056009 -1502974 780863 1275211 852927 117670 -1059514 -2037605 -1771356 -526165
37509 -526165 577694 1450125 2606585 3096863 997314 -3679151 -8343122 -10549269 -9880287
37500 -9880287 -7012706 -2912020 429360 566611 -2664302 -6290997 -7295386 -5519433
37492 -5519433 -2652564 141631 2206948 2455069 481221 -1977792 -2484723 -632106
37484 -632106 1886179 3454344 3554917 2333959 720665 356181 1616425 2254740 106236
37475 106236 -3236701 -3954586 -1270175 1581085 2276139 2323638 3567264 4548758 2828027
37466 2828027 -877294 -3488625 -3496790 -1894299 -119695 723271 -538598 -3893778 -6980022
37457 -6980022 -7506402 -6386806 -6006932 -5929853 -3560759 694191 2523615 -564784 -5502369
37448 -5502369 -7568732 -5735928 -2046720 2186561 6783919 10498042 11270578 8659363
37440 8659363 4233452 -181753 -3161887 -3280858 -151805 4092709 6121989 4628479
37432 4628479 1258317 -1463867 -1994391 -78993 3044949 4825481 3611740 1025098
37424 1025098 415601 2415285 3760112 1536526 -2906179 -5771544 -5622576 -4661066 -5345511
37415 -5345511 -7289725 -8178140 -6851110 -4459391 -2743887 -2268280 -2897498 -5062698 -9127394
37406 -9127394 -13640688 -15872049 -14747421 -11934543 -9171052 -5955499 -1259832 3809093
37398 3809093 7106064 8505006 9682757 11068434 11222842 9509951 7282846 5736163
37390 5736163 4361167 2346905 -55476 -2419761 -4882190 -6995466 -7274429 -5138841
37382 -5138841 -2212588 -446439 159287 797866 1695676 2000256 1215563 -441078 -2598066
37373 -2598066 -4517728 -4840709 -2811083 446569 2927408 3856765 3921406 3770297 3445653
37364 3445653 3154719 3323739 3623095 3030450 1423433 360724 1557772 4858731 8282563
37355 8282563 10030758 9957091 8894660 7157171 4587167 1929468 673688 660843 -728734
37346 -728734 -5123183 -9718973 -9851422 -5117973 -257381 900021 -403854 -1287260 -1940724
37337 -1940724 -4072700 -6719916 -7231191 -5562458 -4012356 -2904551 -263634 3675405
37329 3675405 5498190 3764302 1667701 2082463 2913927 756618 -2947053 -3606691 -616951
37320 -616951 1576675 269865 -1609791 -355437 2950312 4572967 3711233 2621626
37312 2621626 2233250 1188522 -670288 -1231190 396483 2142193 2382770 2723426 5161705
37303 5161705 8258753 8796898 6309498 3396290 2013934 1900669 2386766 3116900 2812241
37294 2812241 11289 -4242880 -6829460 -6491498 -5074507 -4033972 -2422895 204968
37286 204968 1680380 319996 -2049060 -2758872 -2209308 -2354978 -2942890 -2589540 -2508490
37277 -2508490 -5289820 -9940458 -11823371 -8537484 -2984185 596918 1211816 497767
37269 497767 -180684 -315633 477145 2067678 3483727 3968027 3600599 2462737 484306
37260 484306 -1393182 -1557133 -86558 850562 33684 -995076 -502715 593605 229756
37251 229756 -1567720 -2843075 -2489906 -1170576 124087 866322 623069 -590285 -1616914
37242 -1616914 -1077730 972346 3269744 5038846 6418705 7395177 7502894 6693823 5594899
37233 5594899 4860925 4948789 6162472 7915483 8388078 6390511 3494488 2643023 4237164
37224 4237164 5249105 3136336 -747600 -2984407 -2426717 -1153376 -1417600 -3166547
37216 -3166547 -4836610 -5325914 -4468583 -2421629 354396 2653661 2972950 854250 -2435959
37207 -2435959 -4828515 -5091820 -3657192 -2071427 -1745676 -3051390 -5307563 -7353845
37199 -7353845 -8063635 -6745539 -3849823 -1456167 -2043396 -5762956 -9460119 -9696151 -6627419
37190 -6627419 -3528272 -2461119 -2217096 -1094401 394793 1086674 1648502 3279751 5016928
37181 5016928 4834755 3049297 2210502 3568446 5913838 8128475 10465833 12668180
37173 12668180 13239755 11791552 10097628 9520979 9264273 8591195 8774120 10758223 12419667
37164 12419667 10621047 5307033 -529707 -4375287 -5637123 -4186383 -110962 4742590
37156 4742590 7400176 7110902 6541932 8441961 12169919 14722008 14457874 12468171 10516981
37147 10516981 9131746 8305394 8835309 11370866 14278031 14283067 10273103 5184151 2666029
37138 2666029 2892996 3515631 3742496 4666811 5837200 5056651 2611152 2219360 5628005
37129 5628005 9200600 8746133 5391852 3267504 3145198 2410443 538735 210057 2361580
37120 2361580 3965188 2392724 -679441 -1561269 948855 4826846 7395287 7521120
37112 7521120 6101345 5046072 5177670 5207333 3754098 1778745 1195729 1475613 139847
37103 139847 -3033262 -4879205 -2961968 1233605 4330270 4579272 2524269 20245
37095 20245 -509663 2172548 6026606 7372543 5744818 4927467 7774697 12403901 15411383
37086 15411383 16370811 16504630 15142685 11094882 6357756 4614269 6043353 6932636
37078 6932636 4997660 2188178 1252380 2055949 2774996 2831678 2859232 2799157 1755527
37069 1755527 -363580 -2086484 -1586691 1449000 5180192 7115977 6523987 4924836
37061 4924836 3848987 2932970 1114528 -1139603 -2283400 -2049113 -1853878 -2802597 -4570533
37052 -4570533 -6351949 -7628772 -7806922 -6399770 -3998463 -1959697 -710751 599145
37044 599145 2348636 3461842 2838562 865380 -1224764 -2762454 -3643524 -3533541 -2045542
37035 -2045542 355060 2282484 2508692 1066595 -651961 -1007678 325914 1915426
37027 1915426 2081005 899801 260000 1780256 5064904 8251759 10035489 10835515 11852305
37018 11852305 13078476 12775959 9587560 4893413 1806958 1382947 1114009 -1768401
37010 -1768401 -6549356 -9975134 -10145001 -7755236 -3969221 727850 5117299 6767921
37002 6767921 4454084 211407 -2312602 -1506352 801933 1550058 -284884 -2718736
36994 -2718736 -3059609 -965926 1290818 1564983 -119836 -2567233 -5092240 -7205399
36986 -7205399 -7865562 -6603441 -4623216 -3338354 -2668635 -2362584 -3812240 -8175075 -13452989
36977 -13452989 -16181636 -15755550 -14339914 -12775588 -9912589 -6236205 -4290638 -4248541
36969 -4248541 -2772048 1713531 5984782 6767107 5454592 5101051 5458970 4612075 3347873
36960 3347873 3759229 4770771 3277243 -671121 -3685864 -4041337 -3245193 -2399803 -699567
36951 -699567 1649758 2564203 1570130 1128777 2711983 4091380 2530886 -1305160 -4650712
36942 -4650712 -6309894 -7011404 -7112627 -5889825 -2885695 1135463 4378215 4842601 1852341
36933 1852341 -2751389 -5886553 -6153748 -4613616 -2695340 -894449 302726 300003 -60678
36924 -60678 1048639 3330354 3846598 1160069 -2048693 -2478993 -551798 1018702 1445105
36915 1445105 1961243 2758466 2810304 2407689 2981681 4179367 3763963 1105577 -1513665
36906 -1513665 -2044857 -1218635 -826917 -1067274 -984587 -479458 -401728 -983543 -1213004 128642
36896 128642 3071810 5995247 6752388 4862621 2434798 2065156 3857373 5506471 5340451
36887 5340451 4021487 2939426 2378573 2155648 2812450 4702780 6476528 6131198 3847145
36878 3847145 2446959 4078993 7105842 7633974 4368788 628595 356384 2940642
36870 2940642 3891115 732361 -3919244 -6140880 -5529379 -4385745 -3633285 -2141272 465655
36861 465655 2926257 4395535 5152398 5008171 3265916 818507 25888 1509938 3041907
36852 3041907 2753111 1637339 1632087 2992887 4962656 7218646 8897492 7942267 3752280
36843 3752280 -692722 -1779963 357822 2590924 3096221 2336920 409066 -3193854
36835 -3193854 -6683984 -6309766 -1438269 3240208 3077011 -548166 -2324061 -302222
36827 -302222 1959988 1040696 -1374470 -1078815 2703389 6504402 7531717 6910890 7084458
36818 7084458 8066816 8254783 7709725 7987926 8774400 7360807 2564069 -2789161 -4806762
36809 -4806762 -2762163 882442 3548755 4269572 3338588 1823773 1002451 1211555 1765044
36800 1765044 2529151 4180131 6002523 5504170 2087235 -943093 -665975 1067133 986968
36791 986968 455556 3355567 8366452 8976503 2750992 -4540247 -6849130 -5423911 -4734161
36782 -4734161 -4798795 -2723193 572331 1019958 -1739275 -3609647 -2861240 -2768373 -5704600
36773 -5704600 -8962929 -9237528 -7832496 -7821793 -8278958 -5485463 733652 5749096 5969366
36764 5969366 3026852 748433 159510 -546358 -2397229 -4289267 -5028594 -4809271 -4239062
36755 -4239062 -3363545 -2354837 -1990946 -2568535 -3305024 -3779945 -4943104 -7323357 -9128824
36746 -9128824 -8046018 -4631205 -1920617 -1577813 -2442469 -3191479 -4048990 -4872016 -3990666
36737 -3990666 -899038 1673757 747808 -2781288 -5149057 -4295402 -1498541 1074164
36729 1074164 2404396 2345061 1244280 100806 -309440 -445814 -869446 -628949 1288222
36720 1288222 3199989 1959769 -2466675 -5990608 -5233725 -1675506 401876 -1156141
36712 -1156141 -4854899 -7961915 -8990459 -8263667 -7227911 -7154642 -7895655 -8071221 -6723199
36703 -6723199 -4279408 -1691915 545100 2056333 2157937 654446 -1321966 -2053130
36695 -2053130 -931952 726369 618056 -2367733 -6439942 -7971832 -5240858 -663105
36687 -663105 1864650 1330218 -271920 -1662235 -3724340 -6940144 -9917527 -11593286
36679 -11593286 -12783176 -14126566 -14312371 -11938206 -7637564 -2937096 1358343 4170228
36671 4170228 3698440 398455 -1359572 2219592 8959150 12816643 11142768 7015942
36663 7015942 4351816 3641671 3165194 1766009 -649185 -3267819 -4075734 -1455116 2855102
36654 2855102 4427562 1185087 -3938510 -6843584 -7102189 -7086771 -7615230 -6904135 -3688248
36645 -3688248 508563 2660737 938732 -3824955 -8604064 -10340203 -8447889 -5110672
36637 -5110672 -2752634 -1823810 -1574661 -1893855 -3051357 -4345267 -4694131 -4416028 -4783554
36628 -4783554 -5652123 -5210205 -2729897 -52502 791908 359793 814470 2825680 4987809
36619 4987809 6154034 6703834 7057993 6501648 4644990 3003432 3512598 5784660 7443299
36610 7443299 7376939 7119834 8343914 10358758 11213479 10281009 8455809 6497784 4602479
36601 4602479 3184946 2610541 2308477 1539465 883366 1421098 2527657 2363324 837314
36592 837314 -32447 482251 265294 -2290362 -5310189 -5944691 -4429595 -3132800 -2458963
36583 -2458963 -665298 2286504 3798562 2585912 918249 1135068 1941333 569000
36575 569000 -2514542 -3776088 -1478255 1998062 3405899 2331562 549036 -718745
36567 -718745 -1207613 -326795 2307658 5090715 5358586 2956142 1129967 2445804 5086222
36558 5086222 5069134 1489988 -2508514 -3949284 -3139494 -2092228 -1834869 -2412205 -3944324
36549 -3944324 -6093035 -7445586 -6973659 -5556919 -4784287 -4765543 -4308890 -2644114 282558
36540 282558 4423639 8900059 11407753 10528869 8384711 8623695 11559141 13741928 12938564
36531 12938564 10859238 9676493 8553839 5908030 2999835 2241866 2959665 1910419
36523 1910419 -2059039 -6472413 -8614943 -8207234 -6327548 -3975851 -2507381 -3312226
36515 -3312226 -5715681 -6818765 -4849810 -1456629 584241 691869 147230 -238416 -242899
36506 -242899 1032463 4270479 7972131 9496515 8312870 6322503 4542756 1618106
36498 1618106 -3155223 -7160469 -6915708 -2535943 2204048 4273525 4137778 3647353 2884996
36489 2884996 619812 -2803968 -4879881 -3846364 -1106638 276709 -834021 -2476074
36481 -2476074 -2012880 984319 4417978 5615253 3494326 -481028 -3258254 -2880659
36473 -2880659 -596499 483923 -849494 -2679829 -3208769 -3660201 -6204551 -10023832
36465 -10023832 -11771722 -9786820 -5675600 -1626540 1438054 2504639 85818 -5043938
36457 -5043938 -8841246 -8037565 -4017948 -688188 323243 75368 -900845 -3128872 -5659332
36448 -5659332 -6206482 -4643246 -3644311 -4573454 -5252961 -3707709 -1902170 -3000121 -6162150
36439 -6162150 -7166532 -4074227 560930 3686788 5289392 6625510 7335443 6707350
36431 6707350 6373798 8680720 12402041 13053031 8709244 3211604 1579684 3833205
36423 3833205 5955955 6147484 6823010 9761803 12416451 11253563 6928523 3542731
36415 3542731 3466020 5248397 6499060 6537883 5715834 4128171 2108284 711749 591900
36406 591900 1158820 1638805 2171354 3061810 3819070 4073448 4842638 7398293 10764374
36397 10764374 11671818 7836200 737385 -5682161 -9006766 -10332590 -12095420 -14748902
36389 -14748902 -16488180 -15894103 -13515008 -10453750 -6711099 -2039500 2381541 4551237
36381 4551237 3798709 1300601 -1399157 -3429629 -4413027 -4440454 -4254442 -4442654 -4506289
36372 -4506289 -3752983 -2887103 -3376396 -5325056 -7454561 -9177853 -10972389 -12573513 -12899556
36363 -12899556 -12367797 -13010999 -15062090 -15566561 -12258491 -7191912 -4389102 -5010006 -7025290
36354 -7025290 -8816372 -10605927 -12421654 -12960550 -11190954 -7784739 -4542547 -3231675
36346 -3231675 -4714002 -7826939 -9162748 -5676712 1655471 7736308 7831149 2099794
36338 2099794 -4505863 -6792753 -3999787 -138704 568639 -1615826 -2763833 -598146
36330 -598146 3012956 5642748 7907870 11281611 14217116 13677404 9873979 6266617
36322 6266617 4679938 3369230 608179 -2536334 -4213908 -4362551 -3894078 -3032647 -1764457
36313 -1764457 -521692 694732 2524913 4627136 5375061 4326288 3464161 4514732
36305 4514732 6275070 6245942 4130751 2237580 2826626 6020208 9750778 11050472 8332330
36296 8332330 3329744 -101295 32831 2015972 3216505 3228391 3059862 2808638 1969341
36287 1969341 897226 9888 -1558406 -4409220 -6680590 -5776761 -2218046 420858
36279 420858 -276164 -3224122 -5962951 -7223699 -6769513 -4528339 -1197456 1238383 830154
36270 830154 -2564972 -7143849 -10517481 -11281464 -9893320 -8167499 -7521559 -7799257 -8102175
36261 -8102175 -8178926 -8180206 -7517732 -5058450 -437329 5402466 10605785 12941115 11071736
36252 11071736 6352641 2145658 -130930 -2848587 -7925333 -12328271 -11352273 -5861439
36244 -5861439 -2055790 -3159713 -5465008 -4618588 -1932211 -1134212 -1916407 -1165039 889026
36235 889026 556584 -3022539 -5690154 -3952885 174172 2144941 804755 -925009
36227 -925009 -441976 1476386 2157343 383366 -2298398 -3388506 -2275332 -922011 -1477096
36218 -1477096 -3688100 -5396194 -5202356 -3589207 -1608139 153905 1099238 654243 -479897
36209 -479897 -484107 1036198 1798618 -370596 -4284468 -6746944 -6841645 -6737568 -7758002
36200 -7758002 -7899406 -4975485 -824998 107213 -3513373 -7698146 -7703401 -3606511 -11848
36191 -11848 -687227 -4721996 -8023132 -7590028 -3918709 87784 1875084 1077834 -721501
36182 -721501 -1621635 -812932 1177967 3058965 3503478 1945200 -795761 -2918307 -3192532
$$ [...]
##END NTUPLES=NMR SPECTRUM
##END=
