##TITLE=31Pdec_DE-100_oil
 CDCl3, 64 sc
 3.7.2025
##JCAMPDX= 6.0         $$ Bruker NMR JCAMP-DX V2.0
##DATA TYPE= NMR SPECTRUM
##DATA CLASS= NTUPLES
##ORIGIN= UXNMR, Bruker Analytische Messtechnik GmbH
##OWNER= root
$$ XWIN-NMR		Version 3.5
$$ Thu Jul  3 14:10:09 2025 Russian Standard Time (UT+4h)  she@DPX200
##.OBSERVE FREQUENCY= 81.013821
##.OBSERVE NUCLEUS= ^31P
##.ACQUISITION MODE= SIMULTANEOUS
##.ACQUISITION SCHEME= undefined
##.AVERAGES= 64
##.DIGITISER RES= 17
##SPECTROMETER/DATA SYSTEM= spect
##.PULSE SEQUENCE= zgpg30
##.SOLVENT NAME= DMSO
##.SHIFT REFERENCE= (INTERNAL, DMSO, 0, 198.062)
##AUDIT TRAIL= $$ (NUMBER, WHEN, WHO, WHERE, WHAT)
$$ ##TITLE= Audit trail, XWIN-NMR		Version 3.5
$$ ##JCAMPDX= 5.01
$$ ##ORIGIN= Bruker BioSpin GmbH
$$ ##OWNER= she
$$ F:/spectra/data/she/nmr/P31/2/pdata/1/auditp.txt
$$ ##AUDIT TRAIL=  $$ (NUMBER, WHEN, WHO, WHERE, WHAT)
(   1,<2025-07-03 14:09:10.54 +0400>,<she>,<DPX200>,
      <created by zg, POWCHK disabled, PULCHK disabled
       configuration hash MD5:
       00 E9 B6 7A A2 85 ED C7 34 08 36 98 17 FE 4E 26
       data hash MD5: 32K
       4D 1E FF CB CA 81 BB AD AE B0 70 B6 CD C6 A3 F1>)
(   2,<2025-07-03 14:09:13.15 +0400>,<she>,<DPX200>,
      <Start of raw data processing
       efp BC_mod = 2 LB = 1.5 FT_mod = 6 PKNL = 1 PHC0 = 1304.987 PHC1 = 351.894 SI = 64K 
       data hash MD5: 64K
       27 74 F2 4F 85 37 A8 47 3D FC 15 92 8C BB 27 69>)
(   3,<2025-07-03 14:09:31.35 +0400>,<she>,<DPX200>,
      <pk PHC0 = 12.37597 PHC1 = 0 
       data hash MD5: 64K
       7B F6 69 E1 3C 02 E2 6F 39 99 B4 B3 BF EF 87 FB>)
(   4,<2025-07-03 14:09:35.42 +0400>,<she>,<DPX200>,
      <abs ABSG = 5 
       data hash MD5: 64K
       E2 8D 2C 55 E0 6C C5 3E B0 DA 7C 15 F0 DE D9 BD>)
$$ ##END=
$$ 
$$ hash MD5
$$ 35 E2 E2 BA 32 90 A8 CE 6A 54 FD 33 92 EA 6A 7D
##$RELAX= 
##$RELAX= 
##$RELAX= 
##$RELAX= 
##$RELAX= 
##$RELAX= 
##$RELAX= 
##$RELAX= 
$$ Bruker specific parameters
$$ --------------------------
##$DU= <F:/spectra>
##$EXPNO= 2
##$NAME= <P31>
##$PROCNO= 1
##$TYPE= <nmr>
##$USER= <she>
##$AMP= (0..31)
100 100 100 100 100 100 100 100 100 100 100 100 100 100 100 100 100 100 
100 100 100 100 100 100 100 100 100 100 100 100 100 100 
##$AQSEQ= 0
##$AQ_mod= 1
##$AUNM= <au_zg>
##$AUTOPOS= <>
##$BF1= 81.014009
##$BF2= 200.13
##$BF3= 200.13
##$BF4= 200.13
##$BF5= 200.13
##$BF6= 200.13
##$BF7= 200.13
##$BF8= 200.13
##$BYTORDA= 1
##$CFDGTYP= 0
##$CFRGTYP= 5
##$CHEMSTR= <none>
##$CNST= (0..31)
1 1 145 1 1 1 1 1 1 1 1 1 1 1 1 1 1 1 1 1 1 1 1 1 1 1 1 1 1 1 1 1 
##$CPDPRG= <waltz16>
##$CPDPRG1= <>
##$CPDPRG2= <waltz16>
##$CPDPRG3= <>
##$CPDPRG4= <mlev>
##$CPDPRG5= <mlev>
##$CPDPRG6= <mlev>
##$CPDPRG7= <mlev>
##$CPDPRG8= <mlev>
##$CPDPRGB= <>
##$CPDPRGT= <>
##$D= (0..31)
0 1 0 0 0 0 0 0 0 0.06 0 0.03 2e-05 3e-06 0 0 0.0002 0 0 0 0 0 0 0 0 0 
0 0 0 0 0 0 
##$DATE= 1751537349
##$DBL= (0..7)
120 120 120 11 120 120 24 19 
##$DBP= (0..7)
150 150 150 150 150 150 150 150 
##$DBP07= 0
##$DBPNAM0= <>
##$DBPNAM1= <>
##$DBPNAM2= <>
$$ [...]
##$SUBNAM3= <"">
##$SUBNAM4= <"">
##$SUBNAM5= <"">
##$SUBNAM6= <"">
##$SUBNAM7= <"">
##$SUBNAM8= <"">
##$SUBNAM9= <"">
##$SW= 400.765351723535
##$SWIBOX= (0..15)
0 1 3 0 0 0 0 0 0 0 0 0 0 0 0 0 
##$SW_h= 32467.5324675325
##$TD= 32768
##$TD0= 1
##$TE= 0
##$TE2= 300
##$TE3= 300
##$TEG= 300
##$TL= (0..7)
0 120 53 12 22 120 120 120 
##$TP= (0..7)
150 150 150 150 150 150 150 150 
##$TP07= 0
##$TPNAME0= <>
##$TPNAME1= <>
##$TPNAME2= <>
##$TPNAME3= <>
##$TPNAME4= <>
##$TPNAME5= <>
##$TPNAME6= <>
##$TPNAME7= <>
##$TPOAL= (0..7)
0.5 0.5 0.5 0.5 0.5 0.5 0.5 0.5 
##$TPOFFS= (0..7)
0 0 0 0 0 0 0 0 
##$TUNHIN= 0
##$TUNHOUT= 0
##$TUNXOUT= 0
##$USERA1= <user>
##$USERA2= <user>
##$USERA3= <user>
##$USERA4= <user>
##$USERA5= <user>
##$V9= 5
##$VALIST= <valist>
##$VCLIST= <CCCCCCCCCCCCCCC>
##$VD= 0
##$VDLIST= <DDDDDDDDDDDDDDD>
##$VPLIST= <PPPPPPPPPPPPPPP>
##$VTLIST= <TTTTTTTTTTTTTTT>
##$WBST= 1024
##$WBSW= 4
##$XGAIN= (0..3)
0 0 0 0 
##$XL= 0
##$YL= 0
##$YMAX_a= 4998
##$YMIN_a= -9453
##$ZGOPTNS= <>
##$ZL1= 120
##$ZL2= 120
##$ZL3= 120
##$ZL4= 120
##$ABSF1= 198.0616
##$ABSF2= -202.7028
##$ABSG= 5
##$ABSL= 3
##$ALPHA= 0
##$AQORDER= 0
##$ASSFAC= 0
##$ASSFACI= 0
##$ASSFACX= 0
##$ASSWID= 0
##$AUNMP= <proc_1d>
##$AZFE= 0.1
##$AZFW= 0.5
##$BCFW= 0
##$BC_mod= 2
##$BYTORDP= 0
##$COROFFS= 0
##$CY= -3
##$DATMOD= 1
##$DC= 0
##$DFILT= <>
##$DTYPP= 0
##$F1P= 0
##$F2P= 0
##$FCOR= 1
##$FTSIZE= 65536
##$FT_mod= 6
##$GAMMA= 0
##$GB= 0
##$INTBC= 1
##$INTSCL= 9.790993e-09
##$ISEN= 30
##$LB= 1.5
##$LEV0= 0
##$LPBIN= 0
##$MAXI= 10000
##$MC2= 0
##$MEAN= 0
##$ME_mod= 0
##$MI= 50
##$NCOEF= 0
##$NC_proc= -9
##$NLEV= 6
##$NOISF1= 182.463
##$NOISF2= 159.3651
##$NSP= 0
##$NTH_PI= 0
##$NZP= 0
##$OFFSET= 198.0616
##$PC= 4
##$PHC0= 1317.363
##$PHC1= 351.894
##$PH_mod= 1
##$PKNL= yes
##$PPARMOD= 0
##$PSCAL= 0
##$PSIGN= 0
##$REVERSE= no
##$SF= 81.0140089999434
##$SI= 65536
##$SIGF1= 159.3651
##$SIGF2= -187.1042
##$SINO= 113.3802
##$SIOLD= 16384
##$SREGLST= <1H.CDCl3>
##$SSB= 0
##$STSI= 65536
##$STSR= 0
##$SW_p= 32467.5324675325
##$SYMM= 0
##$S_DEV= 0
##$TDeff= 32768
##$TDoff= 0
##$TI= <>
##$TILT= no
##$TM1= 0
##$TM2= 0
##$TOPLEV= 0
##$USERP1= <user>
##$USERP2= <user>
##$USERP3= <user>
##$USERP4= <user>
##$USERP5= <user>
##$WDW= 1
##$XDIM= 65536
##$YMAX_p= 488245294
##$YMIN_p= -131860060
$$ End of Bruker specific parameters
$$ ---------------------------------
##NTUPLES= NMR SPECTRUM
##VAR_NAME=  FREQUENCY,     SPECTRUM/REAL,   SPECTRUM/IMAG
##SYMBOL=    X,             R,               I
##VAR_TYPE=  INDEPENDENT,   DEPENDENT,       DEPENDENT
##VAR_FORM=  AFFN,          ASDF,            ASDF
##VAR_DIM=   65536,         65536,           65536
##UNITS=     HZ,            ARBITRARY UNITS, ARBITRARY UNITS
##FACTOR=    0.49542278885378, 1,            1
##FIRST=     16045.7642231865, 0,            0
##LAST=      -16421.768244346, 0,            0
##MIN=       -16421.768244346, -131860060,   0
##MAX=       16045.7642231865, 488245294,    0
$$ Real data points
##PAGE= N=1
##DATA TABLE= (X++(R..R)), XYDATA
$$ [...]
##PAGE= N=2
##DATA TABLE= (X++(I..I)), XYDATA
7381a3191698k341112m9658J31042o90779n87765M65052N49825j206852k356900
7372a9278845L93736O282534J0378076R399237N300286J560890j401007m593448
7364H041459o590875m825543J42297M475041M883292J101830m206608o783447
7356c762554m271479R5709M20072l299811l895991K323513Q719598P560647J533272
7347E422976j159584L21772l388l536226n514971m494209m133060m661213j836648
7338a9594551L640407M953086M89051k714302q53164L75139l324788o538349l642454
7329b7209925J349793K585616L015680P781122J2505900Q870048j265859p784222
7321a51847o940863m177719k735766M94184O208775Q974057N661913N57769j572679
$$ y = [-13191698, -15532810, -15582468, -15451426, -16142205, -16729970, -16264918, -15715093, -16921945, -19278845, -18885109, -12602575, -2224499, 7174738, 12475024, 14035914, 12634907, 8041459, 1450584, -3374959, -3232662, 1242379, 6125671, 7227501, 3020893, -3762554, -8034033, -7938324, -7518252, -10818063, -14714054, -12390541, -3670943, 3889704, 5422976, 4263392, 4585164, 4581776, 1045550, -4469421, -8963630, -13096690, -17757903, -19594551, -15954144, -11001058, -10512007, -13226309, -14079473, -13704334, -17029122, -23567471, -27209925, -25860132, -23274516, -20258836, -12477714, 28186, 8898234, 7632375, -151847, -7092710, -11270429, -14006195, -13512011, -7303236, 1670821, 7332734, 7890503, 6317824]
7312F317824j980352m090466p589779r432276p547142j797671N489546R220991
7304a1409325O001475k85747k211150Q93557K085393j928829n322498k777954
7296a4955078J572974O58846m374057o084260j608816M532344P731606P985455
7288d540986P027969N240467K513524o80481l761621n750205n003424j437307
7280f392064J852400J812218n37421k059239k428899l620386n199277m344135
7272b0916803q23743K206799L230026M044925N098207L605527j150748m743989
7264i449799l434502N8323O93044j340521j671049J145341M201529N266361M689880
7255A58607K471073j764845n291073l886908J287200L280632j188578o059998
$$ y = [6317824, 4337472, 247006, -7342773, -16775049, -24322191, -26119862, -20630316, -11409325, -5407850, -5693597, -7904747, -7011190, -4925797, -6854626, -12177124, -14955078, -13382104, -12723258, -17097315, -23181575, -24790391, -20258047, -12526441, -4540986, 2486983, 7727450, 10240974, 9560493, 5798872, 48667, -4954757, -6392064, -4539664, -2727446, -3264867, -5324106, -7753005, -11373391, -16572668, -20916803, -21740546, -19533747, -16303721, -12258796, -7160589, -3555062, -4705810, -9449799, -12884301, -12825978, -12132934, -13473455, -15144504, -13999163, -9797634, -4531273, 158607, 2629680, 864835, -4426238, -8313146, -7025946, -3745314, -4933892, -10993890]
7247a0993890l774398M255830R653951P839491K174819j996115l023883k156069
7239A979736p54364K71369M24578M0553m65191j605269l529133m476056k874149
7230a0987926m54361m20720k539294l061555r6335L742274M936383K832353j092723
7221g141904n227867p788166o925459k570220K886172O569012O988903M340050
7213h869479P35166l73022K392145N650506M891190O76390k183475j694171o98071
7204E27179j091089q40965J284184K686651J465778k34748n71223j500069m169858
7195b444160n034908j399071K812665K506116j84943P29753N154275P093875M197462
7186A3431064L79997j584898l531621o372708p202653m578734j608271q22114
$$ y = [-10993890, -14768288, -10512458, -858507, 6980984, 9155803, 7159688, 4135805, 1979736, 1225372, 1496741, 1921319, 1961872, 1496681, -108588, -3637721, -8113777, -10987926, -11442287, -11863007, -14402301, -17463856, -17560191, -13817917, -8881534, -6049181, -7141904, -12369771, -20157937, -27083396, -29653616, -26767444, -20198432, -13209529, -8869479, -8134313, -8507335, -6115190, -464684, 4426506, 5102896, 2919421, 1225250, 527179, -563910, -1404875, -120691, 2565960, 4031738, 3796990, 3225767, 1725698, -2444160, -7479068, -8878139, -6065474, -3559358, -3744301, -3014548, 2139727, 9233602, 13431064, 13811061, 12226163, 8694542, 2321834, -4880819, -9459553, -11067824, -11889938]
7178a1889938m26541J290354K193641O56929l15347K107886M821363L073624j570594
7169e8623l323709j457823j365893n298224p881858m048929K867824N334571J588215
7160a3644449l008630l650111r05932K231084M087238M038741K102999M53364
7152h295696K009008N479235N392694k4830m832281l595425l0871j200166n559839
7143a0658171m919326J805346N687956J330853m861121m736045J08345L001496
7135a3240667K930551L446249M491753K812845j076082k866894q89502K423147
7127a968600M602174M410539Q97936m210054n627271j393025K079993j626622
7119b834930q043350p290203Q67873O350889L578377j881947l349109j428985
$$ y = [-11889938, -12316479, -11026125, -8832484, -8175555, -8490902, -6383016, -1561653, 1511971, -58623, -3382332, -4840155, -6206048, -11504272, -19386130, -23435059, -20567235, -15232664, -13644449, -16653079, -20303190, -21209122, -18978038, -14890800, -10852059, -8749060, -8295696, -6286688, -807453, 4585241, 4560411, -271870, -3867295, -3898166, -5098332, -10658171, -15577497, -13772151, -8084195, -6753342, -11614463, -16350508, -16242163, -13240667, -10310116, -6863867, -2372114, 440731, -635351, -3502245, -4391747, -1968600, 2633574, 7044113, 7942049, 3731995, -1895276, -3288301, -1208308, -2834930, -10878280, -18168483, -17300610, -10949721, -7371344, -9253291, -12602400, -14031385]
7111a4031385N51158K072539K868986J276225j512025j484289J106536J138050
7103h014205k137130k671844J747092M402293O08616l795719j800816L544106
7095h117607N139048L564082M097324O101262M549580j69446k687757j877870
7087A0598616j849390m116903n719127n031774l317535q83940K472916M000320
7079c846817J023148l400522m057693j759596j195471j792232J184670O439599
7071g404914O463775n38033o811026o279863k337966p66177j446887j294986J92682
7062b0223395K432642N782576Q379588O140691j90011l350105O08020N979698
7054E559704N873309J836148q41497k450387o088469r202176o361751Q73228M877654
$$ y = [-14031385, -13480227, -11407688, -8538702, -7262477, -8774502, -10258791, -9152255, -8014205, -10151335, -12823179, -11076087, -6673794, -6065178, -9860897, -11661713, -8117607, -2978559, 585523, 4682847, 10784109, 15333689, 15164243, 12476486, 10598616, 8749226, 4632323, -1086804, -6118578, -9436113, -10320053, -7847137, -3846817, -2823669, -6224191, -10281884, -12041480, -13236951, -15029183, -13844513, -7404914, -941139, -1479172, -8290198, -14570061, -16908027, -17674204, -19121091, -20416077, -20223395, -17790753, -12008177, -3628589, 2512102, 2322091, -1028014, -419994, 5559704, 11433013, 13269161, 12427664, 9977277, 3888808, -5313368, -11675119, -10801891, -5924237]
7045e924237K959340L24776J012218K435940J106172j760444l202987k921670
7037e970892k022747p41443J12864j485988n263248o937247k970400M348089Q983182
7028a1947830P602618K381158j841686j968643J017261L203428J968939p03378
7020b88133o68596K364881L927907J486544p73235K679759R882458J2279580N440931
7011C6332096m745800r114542o109854k233537k583554n073751n166725k574291
7003a269958k58816P54465J567982J556962j066828m500934l961535J087565M799783
6994a291314L160460K13338J479218M453582J985853o041326j1243452q117321
6986a5400962r75686K922821K143924k17790k155905k835878m09552N309325R822223
$$ y = [-5924237, -2964897, -2640121, -1627903, 808037, 1914209, 153765, -3049222, -5970892, -7993639, -8735082, -8622218, -10108206, -15371454, -22308701, -25279101, -20931012, -11947830, -4345212, -1964054, -3805740, -5774383, -4757122, -1553694, 415245, -288133, -956729, 1408152, 5336059, 6822603, 6049368, 8729127, 18611585, 30891165, 36332096, 31586296, 22471754, 16361900, 14128363, 11544809, 6471058, 1304333, -1269958, -1528774, -774309, 793673, 2350635, 1283807, -3217127, -7178662, -6091097, -1291314, 1869146, 2082484, 3561702, 8015284, 10001137, 3959811, -7283641, -15400962, -16376648, -13453827, -11309903, -11527693, -13683598, -16519476, -16929028, -11619703, -1797480]
6977a797480Q382385K669431j274540j348266j167666l185357m653676k381230
6969d756399J954390L938646K011410j309509k860978j982191p38749j669056
6961e412436m723613o562027m170529J051438M660914M554956K732543J521928
6953f346826P80293l34394j477097k238520k812028k512422k52394K501542K535658
6944a0156188J44894k96683K611423M018148L74167l967076l141275M89758j99466
6935a0122298n427316p681212l086695L246331N254234L479850J761382J106088
6927a1469636K47917r31097j427826m48315K559777O526294P219308J507281o123762
6918b340059p066631o84423L481033o40826o257607l891722M318756Q007793L185244
$$ y = [-1797480, 6584905, 9254336, 7979796, 6631530, 5463864, 2278507, -2375169, -4756399, -2802009, 1136637, 3148047, 1838538, -1022440, -3004631, -3743380, -5412436, -10136049, -16698076, -20868605, -19817167, -15156253, -10601297, -7868754, -6346826, -5566533, -5900927, -7378024, -9616544, -12428572, -14940994, -15193388, -12691846, -10156188, -10011294, -10307977, -7696554, -3678406, -3304239, -7271315, -10412590, -9922832, -10122298, -15549614, -23230826, -26317521, -23071190, -17816956, -14337106, -12575724, -11469636, -11221719, -12152816, -13580642, -14028957, -11469180, -4942886, 2276422, 3783703, -2340059, -9406690, -10091113, -6610080, -7250906, -13508513, -17400235, -13081479, -5073686, -1888442]
6909a888442m099671p212889n115026J04323N187486N478052o40194o766455m603289
6900a9556105L987013P904453J867907o186867o309113P13545O525560O690506
6892d363101L598169N69086j501615k307645j280215Q34273K060803J393595l01297
6883a297947j421322r51036O73701J562190L21499j708094j781262L06975J628842
6874b666454K12003k362564l406044k158983N43366L479122M858197L243865J8891
6865A761399j217456R04979L776718M695189M011652K977666J322529r80933k361081
6856A4890662k538758l931964p107271p709076k188972N371964P205998K106300
6848F098883l222990l644171j527199j217825j958177k05664L422446M235713
$$ y = [-1888442, -5988113, -13201002, -18316028, -18211705, -13024219, -7546167, -8186361, -14952816, -19556105, -15569092, -7664639, -5796732, -11983599, -18292712, -17579167, -11053607, -4363101, -764932, -195846, -1697461, -4005106, -5285321, -4451048, -2390245, -996650, -1297947, -2719269, -3670305, -2996604, -1434414, -1112915, -2821009, -4602271, -4295296, -2666454, -2454451, -4817015, -8223059, -10382042, -9838676, -6359554, -1501357, 1742508, 1761399, 543943, 1448922, 5225640, 9920829, 13932481, 16910147, 18232676, 17251743, 14890662, 12351904, 8419940, 1312669, -6396407, -8585379, -3213415, 3992583, 6098883, 2875893, -768278, -2295477, -3513302, -5471479, -5677143, -2254697, 1981016]
6840A981016O10846k960162j927374J881052K953777j0377k695409k026869l63334
6831b556834o78095j286687P47844L624244L239034L01077m98452J698050K675164
6822G265345O64053p92106L77786Q30720k098649n498115n993920n079268m883392
6813a5207546l191358J781611N545139K880977l216815m963061r31463K824801
6805a4477715K486149Q29455J079930K220861K164833J058023l03502j855191
6797f797157l002693l074851l277254m870840n780777l077649J601819L849237
6789b4430165L394120L783420N219613M227855J345462J705684N439652N253508
6781E939149j860604p688369m156719L959056N652735l74571m806038j733764
$$ y = [1981016, 2591862, -368300, -2295674, -414622, 2539155, 2528778, -166631, -2193500, -2556834, -3234929, -4521616, -3773772, -149528, 3089506, 3390583, 2892131, 4590181, 7265345, 7929398, 7137292, 7515078, 8345798, 6247149, 749034, -5244886, -10324154, -15207546, -18398904, -16617293, -11072154, -8191177, -11407992, -16371053, -17302516, -14477715, -11991566, -11162111, -10082181, -7861320, -5696487, -4638464, -4941966, -6797157, -9799850, -12874701, -16151955, -21022795, -26803572, -29881221, -28279402, -24430165, -21036045, -17252625, -12033012, -7805157, -6459695, -4754011, 685641, 5939149, 4078545, -3609824, -7766543, -3807487, 1845248, 1470677, -3335361, -5069125]
6773e069125M266765O195118L430653J43444p28934N60117K026617J714383l88480
6764A2150558j760169l48304K192098K447142j27743l110304m997499o070579
6756C75200n821785l252020l2358N01250j457137j709182J598876M687099L561394
6747a548663l06906k665651k521211k154966k561921k334798o54668J567230L499355
6738i682199M793831M244213Q26368l441422m445895r62131L545023N336289M404632
6729D618709K647312O28646j426980j758375M27187K208315O72713j768979o89914
6720E558634K088983j49415p614299j0790938l408102O885598P792483q16007
6712d53063p163762l872294L733631O930113M299578K40777j760895q43124K189957
$$ y = [-5069125, -802360, 5392758, 8823411, 8966855, 8237921, 8798038, 10824655, 12539038, 12150558, 10390389, 10042085, 12234183, 14681325, 14553582, 11443278, 6445779, 375200, -5446585, -8698605, -8730963, -8229713, -9686850, -11396032, -9797156, -5110057, -1548663, -1855569, -4521220, -7042431, -9197397, -11759318, -14094116, -14748784, -13181554, -9682199, -4888368, -644155, 182213, -3259209, -7705104, -8667235, -5122212, 214077, 4618709, 7266021, 7894667, 6467687, 4709312, 5136499, 7344814, 8017527, 6248548, 5558634, 7647617, 7498202, -116097, -10907035, -14315137, -7429539, 362944, -453063, -7616825, -11489119, -7755488, -825375, 3474203, 3714980, 1954085, 1110961, 3300918]
6703C300918M262423J884222l483933n386650p87903M877203M589927j326412
6695G929795o858786q104579n485968p32256L918938N312002K505597q89631j177165
6686c582053K60891N4185j044182J02649K878377L915345L210598L547334M265853
6677A3608997J766397l246577n269849k393962N78307k24530k234764j573297
6669A010722Q45481J672445n837l041071o053499o434858j566864N918790Q295134
6660F40443K092373o351588q920029n796127k694667j377468R14687M429565N785896
6651a1276915L728030N26202k495908n678446p093472l602870K823594N364238
6643a7705547J453583l029141j844584L275394O179265N100026L401427L112199
$$ y = [3300918, 7563341, 9447563, 5963630, 576980, -210923, 4666280, 9256207, 7929795, 1071009, -7033570, -12519538, -13251794, -9332856, -4020854, -1515257, -2404888, -3582053, -3321162, -3266977, -4311159, -4208510, -1330133, 2585212, 5795810, 9343144, 13608997, 15375394, 12128817, 6858968, 4465006, 5043313, 4818783, 2584019, 1010722, 1856203, 3528648, 3522811, 481740, -5571759, -12006617, -13573481, -7654691, 640443, 2732816, -3618772, -12538801, -18334928, -21029595, -22407063, -21492376, -17062811, -11276915, -7548885, -7022683, -9518591, -15197037, -22290509, -25893379, -23069785, -17705547, -16251964, -19281105, -21125689, -17850295, -11671030, -6571004, -3169577, -57378]
6635e7378K307142q42098m865113o884618n588403j509161L885819Q338809R380365
6626D165364O298878J322274k223503l133621k963539l197428k949831q14803
6618c496209J824168J846829p47740j872005Q64340L903315K370039k734934n836485
6609c878682m545373j826268k22184J359896L540026L724321M79763k873191k599097
6600f840789J19444J725181J781331J946850J573424q56517l161008j774016J469327
6591d016773O30598m936777q149471m002714L089231N805135L901431K727184
6583d952156M335583N651517M588367K589878O86740k099706n177070n648819
6575b5666l179967j670616l374506m747529j593125M258104P341254N935437K958084
$$ y = [-57378, 2249764, 1407666, -3457447, -10342065, -15930468, -17439629, -13553810, -5215001, 4165364, 10464242, 11786516, 9563013, 6429392, 3465853, 268425, -2681406, -3496209, -1672041, 174788, -572952, -2444957, -1580617, 2322698, 4692737, 1957803, -3878682, -8424055, -10250323, -10472507, -9112611, -5572585, -1848264, -1368501, -4241692, -6840789, -6721345, -4996164, -3214833, -1267983, 305441, -551076, -3712084, -5486100, -4016773, -3386175, -8322952, -16472423, -20475137, -17385906, -11580771, -7679340, -4952156, -616573, 5034944, 9623311, 12213189, 12899929, 10800223, 5623153, -25666, -3205633, -4876249, -8250755, -12998284, -14591409, -10333305, -2992051, 2943386, 5901470]
6566E901470M94810k122546m724520n162390k894869j28124J834414L824275N067608
6557B090128K506783l474973o833262l514692J946472K575269p12962j141759
6549f558996K557908M047108J06133l548116j142841L879671M044546r10337m014197
6540a539121j315332L285399M159358P81004l018516l854647j380946K214024
6532f68777M218780L727998K066772L41664k145249n489479p058574m803088j395383
6523a1205336j141778l246362k625093K135831O459421O893064N649821N436270
6515H355838M510024Q93441k447603j749623Q19205j041m378114p273628n839865
6506g111366j905211K518050O821555Q734667N613262J62120j073107K608710
$$ y = [5901470, 6396280, 4273734, -450786, -5613176, -8508045, -8636169, -6801755, -2977480, 2090128, 4596911, 1121938, -5711324, -9226016, -7279544, -4704275, -5417237, -6558996, -4001088, 46020, 152153, -3395963, -4538804, -659133, 3385413, 2475076, -1539121, -2854453, 430946, 4590304, 5371308, 2352792, -1501855, -2882801, -668777, 3550003, 7278001, 9344773, 9686437, 7541188, 2051709, -5006865, -9809953, -11205336, -12347114, -15593476, -18218569, -16082738, -9623317, -2730253, 2919568, 8355838, 12865862, 13759303, 11311700, 9562077, 10381282, 10380241, 6002127, -1271501, -7111366, -9016577, -6498527, 323028, 9057695, 14670957, 14833077, 13759970, 16368680]
6498A6368680L794951j853795p854416o003936J164574M118016J45548m133407
6490E746215l741457j416863j172924k370357l129489m132049n303036l462306
6482a8982266K094346N566736J890010m436824m152598L666740R665130O746032
6474B057306j047687n147679l536617r52213o32512p98031P87712K854501K906390
6465c508830J277466P45786K358152L212953l14223p132364j0973965p229044
6457b1564069P45450N167712L750463K115396M620989P327866M418672j739119
6449D843360l303539J186874M522025J828512k492067k180814J794546M223644
6441A0422541L743828K502250N04707l541022p016512n493327l96275J601290
$$ y = [16368680, 20163631, 18309836, 10455420, 4451484, 5616058, 9734074, 9879622, 5746215, 2004758, 587895, -585029, -2955386, -6084875, -10216924, -15519960, -18982266, -16887920, -11321184, -9431174, -13867998, -18020596, -14353856, -4688726, 2057306, 1009619, -4138060, -7674677, -8626890, -9259402, -10057433, -9269721, -6415220, -3508830, -2231364, -1485578, 872574, 4085527, 3771304, -3361060, -14335025, -21564069, -20818619, -15650907, -11900444, -9785048, -5164059, 2163807, 6582479, 4843360, 1539821, 2726695, 7248720, 9077232, 6585165, 4404351, 6198897, 10422541, 14166369, 16668619, 17173326, 13632304, 6615792, 1122465, 726190, 2327480]
6433B327480j528984l732718l40985M249516K957537l557659q159749p013191
6425a4798753k903010N04391K624049L597944K565992Q9420j069549L24828J875400
6416g189288R78991j697390l733803l819038j547386L053544P572191P543898
6408A161719J998550l649779m289231k594742m453703q207777n808095L865002
6400b1978056J0643119O704494j738302l151271L232356Q056982O365814K665217
6392A0800353J219812L7456k709762l902592j662179l37105l817981q153855o621734
6383a5147587M73735O330318O381313K182868j998365k819021K47549L414597
6375i34593J362139n150147p885556j850065O431298P464800K142174j147107
$$ y = [2327480, 798496, -2934222, -3275207, 974309, 3931846, 374187, -7785562, -14798753, -17701763, -17197372, -14573323, -10975379, -8409387, -8319967, -9389516, -9064688, -7189288, -6210297, -7907687, -11641490, -15460528, -17007914, -13954370, -6382179, 1161719, 3160269, -489510, -4778741, -7373483, -11827186, -20034963, -25843058, -21978056, -11334937, -4630443, -6368745, -9520016, -6287660, 1769322, 8135136, 10800353, 12020165, 12057621, 9347859, 5445267, 3783088, 3445983, -371998, -8525853, -15147587, -14673852, -8343534, -1962221, 220647, -1777718, -4596739, -4349190, -934593, 427546, -4722601, -12608157, -14458222, -8026924, -562124, 1580050, 432943]
6367D32943k37588p34062m368072n755061k618512K1756q48098j221491J500577
6358a3827608L053336M00726k031181j85582K064578j90704m062734l940085o76593
6349a9395847J291345J675221K053055J74526n507310r337341n184750L024474
6341c1206627O293093L838610K134346K510514K32489m267219m348007P62178
6333b4050623L404082L63857j585850K280669O127646L175856l598931o961579
6325b0844873n684209k959519L60508M609636P521400P427547O654577O767858
6317C852925M660469j390989o449742n824032k819983k787703l665301l94073
6309a4818429M695715M955298R26945n87490J613445J751140j572146k229300
$$ y = [432943, 195355, -538707, -4906779, -10661840, -13280352, -13258596, -14106694, -15328185, -13827608, -10774272, -10373546, -12404727, -12590309, -10525731, -10716435, -14779169, -18719254, -19395847, -18104502, -16429281, -14376226, -14201700, -19709010, -29046351, -34231101, -31206627, -24913534, -21074924, -18940578, -16430064, -16197575, -20464794, -24812801, -24050623, -20646541, -20282684, -21868534, -19587865, -13460219, -10284363, -13883294, -20844873, -26529082, -29488601, -29128093, -24518457, -16997057, -9569510, -2914933, 3852925, 8513394, 7122405, 672663, -5151369, -7971352, -10759055, -14424356, -14818429, -10122714, -5167416, -4240471, -4827961, -3214516, -1463376, -3035522, -5264822]
6301e264822K397423N974360L221129j864437k941993o29042O40157L12188M33554
6292B278517J94104k288065m887934l769554K94702K804647K311415J913019L710447
6283B561298N502017L984880j103425o620017q319072m044579L470201P750506
6275C181809M901089j659144n063282k996359P96985K390440J615603j31374k270150
6266G65617l723251k425978J535725M569185L758608O58501j438188k263491l628838
6257b192110m968486l510753J032047N277991O506899N440436L789096J806807
6249A3181927l09903j223007n93671k57599j265983j840123m52320J245999J211910
6240I697230N47975J036208J192827j236905m419964m637253k413918j622708
$$ y = [-5264822, -2867399, 3106961, 6328090, 4463653, 1521660, 892618, 1532775, 1844963, 2278517, 2472621, 184556, -4703378, -8472932, -8178230, -5373583, -3062168, -1149149, 2561298, 8063315, 12048195, 10944770, 4324753, -3994319, -8038898, -4568697, 3181809, 8082898, 6423754, 1360472, -1635887, -838902, 1551538, 3167141, 3035767, 765617, -2957634, -5383612, -3847887, 721298, 4479906, 5138407, 3700219, 1436728, -2192110, -7160596, -10671349, -9639302, -4361311, 2145588, 7586024, 11375120, 13181927, 12872024, 11649017, 11055346, 10797747, 9531764, 7691641, 7239321, 8485320, 9697230, 10245205, 11281413, 12474240, 11237335, 6817371, 2180118, -233800, -1856508]
6232a856508l007927l799111l446393l709124k872818K785417J0156742J0208663
6224D458941J581049m881268j095325O311278O835957K143591J077823L380905
6216A9812951O37429p774237j2034674p243041o45248L30106j938565k013311
6208a0868590j18511J434760L682028O785830O245164r8880o048690m924308K70818
6199c640379J572762j855906l643845p13073L237803M597648L920856K527090
6191F002956L76425j714933k220299k005570l158155m293685j586906M475608
6183d124559P891939M677912j950642o028070n667658l514864k676908l966635
6175a5359485n562549m385929N76444O023476P592585N448731L764389M363548
$$ y = [-1856508, -4864435, -8663546, -12109939, -15819063, -18691881, -15906464, -5749722, 4458941, 6039990, 1158722, 63397, 6374675, 13210632, 15354223, 16432046, 19812951, 20450380, 12676143, 641469, -6601572, -7246820, -6916714, -8855279, -10868590, -10987101, -9552341, -5870313, 915517, 7160681, 7061801, 1013111, -3911197, -3640379, -2067617, -3923523, -7567368, -8280441, -5042638, -444990, 3475866, 6002956, 6379381, 4664448, 2444149, 438579, -2719576, -7013261, -8600167, -4124559, 3767380, 8445292, 6494650, 466580, -5201078, -8715942, -11392850, -15359485, -20922034, -25307963, -24731519, -18708043, -11115458, -5666727, -1902338, 2461210]
6167B461210M486313J900206j644095l919341n363895o138163l860452J920664
6159a0157553O101724L755974k169225m042786j34161L113116N74257m374848
6151g333502m945990j94441M319605M081638P75295n99280K063751N772066O065567
6142A0004709K089605k481799l607283j173426J602523K314127J388105J53150
6134A0289711j041361j875095j100790J526947L331816J107374m359656q203473
6126c24527o895198k328159P35326K51594j595532j882610j55801J959049K718005
6117g517853J233053k084016n001216m497557J33946N502954O841592K852284
6109b536813k900111n611571l638647P55441M171193N036430M241187L499219
$$ y = [2461210, 6947523, 8847729, 7203634, 3284293, -2079602, -8217765, -12078217, -10157553, -4055829, -299855, -2469080, -6511866, -6646027, -3532911, -2958654, -7333502, -12279492, -12473933, -8154328, -4072690, -3297395, -3896675, -1832924, 3939142, 10004709, 12094314, 9612515, 6005232, 4831806, 6434329, 8748456, 10136561, 10289711, 9248350, 7373255, 6272465, 7799412, 11131228, 12238602, 7878946, -324527, -7219725, -9547884, -8812558, -8560964, -10156496, -12039106, -12194907, -10235858, -7517853, -6284800, -8368816, -13370032, -17867589, -17733643, -12230689, -5389097, -2536813, -5436924, -11048495, -14687142, -13931701, -9760508, -4724078, -482891, 3016328]
6101C016328L354865K886099J336301m27815p34938N83606J462971j01927l179860
6092H195630m228242j015514M157655O339111L439544j275903l209020j841388
6084A0561873l36534m81816q22848l10382o55429k953817m381674j503809M078879
6075C194443O693348L444049k554543o394789o510205m720322l229826k883146
6067a2960991l013782j997434R03265L738799L605495Q40933p28929R56960L147941
6058e507743K717351J298149K497603N375602N145481P15427k860692j482327
6050G898851J909796J496207l208900o808955n078282N06293N482714P057070
6042I254794N348572K208767J5487O5498Q43612r37305o123116j0724373r442546
$$ y = [3016328, 6371193, 9257292, 10593593, 10165778, 9430840, 10014446, 11477417, 11375490, 8195630, 3967388, 2951874, 7109529, 13448640, 16888184, 15612281, 12403261, 10561873, 10225339, 9743523, 8920675, 8610293, 7954864, 5001047, 619373, -884436, 3194443, 9887791, 13331840, 10777297, 4382508, -2127697, -6848019, -10077845, -12960991, -15974773, -17972207, -17068942, -13330143, -9724648, -8883715, -9612644, -8655684, -5507743, -2790392, -1492243, 1005360, 6380962, 11526443, 12241870, 9381178, 7898851, 9808647, 11304854, 8095954, 1286999, -3791283, -3284990, 2197724, 9254794, 14603366, 16812133, 16827620, 16893118, 17736730, 16799425, 10676309, -48064, -9490610]
6033i490610j749827O687310R260701M792224j709820m637314l546301k424683
6025b818320l462329l936793j067818K478998K090482o51795J007685Q198489
6017A838599J2564575P512973j521660m363150m99609J437274k492674o634902
6009G841426o103896l982238m418274n190295k278971K931573O137834O106929
6001A044088L691997j152240o439055o457047Q40050Q249052P913269K510121
5993A0200235L24973J826183K81685n344705q250637n578172k312866q70072L059304
5984f664072R860545J1222898K877868o374497o620765q69290J788253Q05075
5976F026015J466288K339806k261050r211985q748610o88180L689132p04867m619667
$$ y = [-9490610, -11240437, -4553127, 4707574, 9499798, 7789978, 3152664, -393637, -2818320, -6280649, -10217442, -11285260, -8806262, -6715780, -7367575, -6359890, 1838599, 14403174, 21916147, 20394487, 16031337, 15531728, 16969002, 14476328, 7841426, 1737530, -2244708, -6662982, -11853277, -14132248, -11200675, -5062841, 1044088, 4736085, 3583845, -2855210, -9312257, -8472207, -223155, 7690114, 10200235, 10525208, 12351391, 12633076, 7288371, -962266, -6540438, -8853304, -9723376, -6664072, 3196473, 14419371, 17297239, 10922742, 4301977, 3432687, 5220940, 6026015, 7492303, 9832109, 7571059, -1640926, -10389536, -11077716, -7388584, -8093451, -12713118]
5967a2713118K81713P927436P623125N3196n534834n478734l882084l044923o16019
5958a5384242L685504O047144M739618K536653J337804n72481l882009n444205
5950f936214k972050R38389K662598K877651M518470O898994N822552k9812n982720
5941G797858o527449k059832J833915J611694k20154K98173K205015J136101l322615
5932B752706o011589l576535L54761P09725j267640n86948K620616K682014k246532
5923d569422o010152k924781L518857M881020j054067p636172p840616k044194
5915b3679527L582666M235629P93539k010213q60845K603882L710544L39804m377395
5906a5661916n720464k612661K047157N149672N669801L997505J213271r41532
$$ y = [-12713118, -12431405, -4503969, 3119156, 3172352, -2362482, -7841216, -11723300, -14768223, -15384242, -11698738, -5651594, -911976, 1624677, 2962481, 2390000, -1492009, -6936214, -9908264, -8969875, -6307277, -3429626, 1088844, 7987838, 13810390, 13780578, 7797858, 1270409, -789423, 1044492, 2656186, 2436032, 2734205, 4939220, 6075321, 2752706, -3258883, -6835418, -6480657, -5770932, -7038572, -7625520, -5004904, -2322890, -4569422, -10579574, -13504355, -9985498, -5104478, -6158545, -13794717, -21635333, -23679527, -20096861, -15861232, -15067693, -17077906, -17938751, -15334869, -11624325, -11284521, -15661916, -21382380, -23995041, -21947884, -16798212, -11128411, -7130906, -5917635, -6859167]
5898f859167j157283J11395J458039K183726J938078p6971l418939n152808l226502
5889a4200432r6824O81287N88414L780734Q479018P303515j120940p389563l376400
5880e351191N849793Q828806L320553k301110k068336Q45116J477991L76425N96059
5871A1574106K153776K813061J731232J5138p20400L74285J768366l1364n429885
5862A4248315q597935m272635L261167M383186k444702q683326q416523m913121
5854a5435574j796520L161855J0157643J2247253N970847n00786Q14904M296650
5846A8916272J86348p819859p850427k88974J834323n760038j1198766n353544
5838a7334665M449124P061088L738246K799256N467808O484227M204046J484812
$$ y = [-6859167, -8016450, -7905055, -6447016, -4263290, -2325212, -2402183, -5821122, -10973930, -14200432, -14297256, -13615969, -13027555, -9246821, -767803, 6535712, 5414772, -1974791, -5351191, 498602, 9327408, 12647961, 10346851, 8278515, 9123631, 10601622, 10978047, 11574106, 13727882, 16540943, 18272175, 18287313, 17566913, 17941198, 19709564, 19678200, 14248315, 5650380, 1377745, 4638912, 9022098, 6577396, -2105930, -10522453, -15435574, -17232094, -14070239, -3912596, 8334657, 14305504, 13804718, 14619622, 18916272, 19102620, 11282761, 3432334, 3143360, 4977683, -782355, -11981121, -17334665, -12885541, -5824453, -2086207, 713049, 6180857, 12665084, 16869130, 18353942]
5830A8353942n91088k584540k724922L03842K761731L46189m621161o596968n446522
5821g99497n099446n129889j180977O066026R697714O291505Q16442r27301Q4906
5812I819483n67976l339494m595782k568704j47912j087094m786035o301244k441209
5803a6015967L187165M004239l75348k726927J884319Q811093J0249676N584054
5795A4602304L77652k393643m191483n301887l733841j06876J939418J321848
5787B513492Q15502J811812K301365J129991k44327j442953l970518o740884n606172
5778i432692J33269M987403M182592M4822j696596M46638K803959J825733k016344
5769A278784m924994l499398J380457M840526L894549J551548J852059K820192
$$ y = [18353942, 17762854, 15178314, 12453392, 12757234, 15518965, 15865154, 11243993, 4647025, -799497, -5898943, -11028832, -12209809, -6143783, 3553931, 9845436, 10661878, 9734577, 9819483, 9251507, 5912013, 1316231, -1252473, -1400385, -2487479, -7273514, -13574758, -16015967, -12828802, -8824563, -9199911, -11926838, -10042519, -1231426, 9018250, 14602304, 14979956, 12586313, 8394830, 3092943, -640898, -747774, 1191644, 2513492, 3328994, 5140806, 7442171, 8572162, 8327835, 6884882, 2914364, -3826520, -9432692, -9299423, -4312020, -129428, -84606, -1781202, -1334564, 1469395, 3295128, 1278784, -3646210, -7145608, -5765151, -924625, 2969924, 4521472, 6373531, 9193723]
5761I193723k19644n459392n980028j033703J986925n21226k561043P73184M487640
5752F66436K239580k593396k541682J524116K271269j952099n162384l524013
5744i072173N7758J611319N65436j861952l687221j566236N752770J3170509J3224175
5735A8194385M788444o060968j3195178j4148941q327208K302725J1060123J1601956
5727F215338N918274J516091M35617k016227o788314p782591k373969K614585
5719b261196P70757m331366n485393k734882j188574j689826q81163J419197J863373
5710a4519073R4112m58450J405909L133796L589137M820011P306899P823458M196321
5701A7392120r89439l611220k687967j65357J886267K183379K26866k703873l917506
$$ y = [9193723, 8974079, 3514687, -2465341, -3499044, -1512119, -2033345, -4594388, -3821204, 666436, 2906016, 312620, -2229062, -704946, 1566323, -385776, -5548160, -9072173, -9014415, -7403096, -6837660, -8699612, -12386833, -13953069, -8200299, 4970210, 18194385, 22982829, 16921861, 3726683, -10422258, -18749466, -16446741, -5386618, 6215338, 12133612, 13649703, 14085320, 12069093, 5280779, -2501812, -4875781, -2261196, -1490439, -5821805, -11307198, -14042080, -15230654, -16920480, -17801643, -16382446, -14519073, -14424961, -14883411, -13477502, -10343706, -6754569, -1934558, 5372341, 13195799, 17392120, 16402681, 12791461, 10103494, 9938137, 11824404, 14007783, 14234649, 11530776, 7613270]
5692G613270k502609j074868k438658n309770n584937j784317K959358M936579
5684c185952L901749J910270J867j789022k277759M7331L879934N561634L654948
5675A1705000O29494j171222k496884m208042m263339r70341K835983K913057
5667D973706J7604q67512K221527N391966L984397k253783r408776j2386185q109519
5658a6436575J157662Q103815P443709K210624p76518m42977q75998k079284P35037
5649i60505O864888P728588m39932q833199p656808J66860M415211K380788j13111
5640C552780K03961R14125J137556L162816N814984M151549j867486n370137k457399
5631I242749J899858J741664j204130j404176J644325L480189J542157k440115
$$ y = [7613270, 5110661, 4035793, 1597135, -3712635, -9297572, -11081889, -8122531, -3185952, 715797, 2626067, 2627934, 838912, -1438847, -1391516, 2488418, 8050052, 11705000, 12334494, 11163272, 8666388, 4458346, 195007, -775334, 2060649, 4973706, 4991310, 4123798, 6345325, 11737291, 15721688, 13467905, 4059129, -8327056, -16436575, -15278913, -7175098, 268611, 2479235, 1702717, 1259740, 383742, -1695542, -960505, 5904383, 13632971, 13193039, 4359840, -3296968, -3130108, 1285103, 3665891, 3552780, 3756741, 4670866, 5808422, 8971238, 14786222, 18937771, 17070285, 11700148, 9242749, 11142607, 12884271, 11680141, 10275965, 11920290, 15400479, 16942636, 14502521]
5623A4502521n867526p365358n966115j574289L353791N077405K530966j126497
5615C564898j724351J311226L894939J521009m908839q717313m757790L770759
5607f045462Q635216O599645K671205K345607M474244M577536K201332Q23887
5599B6283210J570724J258710k513361p372270q921121n914505j283082J175099
5591D283404J16705k639418l704680r50773M008551O377594K806174m117530p749460
5582a569433m923363K64625K310823J906221L701138P440646P165096J014650
5574A7310403m093671k027376K906502K056087m545904q368652m980642O79507
5566a063746K831288K016786J019818n80104l636462n386630k819212K244327
$$ y = [14502521, 8634995, 1269637, -4696478, -6270767, -2916976, 2160429, 4691395, 3564898, 1840547, 3151773, 7046712, 8567721, 3658882, -5058431, -9816221, -6045462, 2589754, 9189399, 11860604, 14206211, 18680455, 23257991, 25459323, 26283210, 27853934, 29112644, 26599283, 19227013, 10305892, 4391387, 3108305, 4283404, 4400109, 1760691, -1943989, -2894762, 1113789, 7491383, 10297557, 6180027, -1569433, -6492796, -6228171, -3917348, -2011127, 1690011, 9130657, 16295753, 17310403, 13216732, 11189356, 14095858, 16151945, 11606041, 3237389, -1743253, -1063746, 1767542, 3784328, 4804146, 4224042, 587580, -4799050, -7618262, -5373935]
5558e373935N303063M798142K480600j27049k433522l244161j696694Q59122K344083
5549B909649K647269K817964K562721P77394k133718m407449m750226k695088
5541b271484J406665N068288M319225j653161p943775q958719n069852j396950
5533a6499763q62249j709376j487841K1003K199332M625363N791246L705358p66903
5524d983830l440240j450266L022117N150760K795025j539407l464698q92331
5516d802870L925930O280417L632156j592110m670648l884393j876134j645235
5508d632887k770464k493310M16348L999048N220328L166200j20270j907760j414748
5499e37515K57231K058617L357613K784543p22819m987733n565182j496436K524990
$$ y = [-5373935, -70872, 4727270, 7207870, 7080821, 4647299, 1403138, -293556, 565566, 2909649, 5556918, 8374882, 10937603, 11714997, 9581279, 5173830, 423604, -2271484, -864819, 4203469, 8522694, 6869533, -1074242, -10032961, -15102813, -16499763, -17362012, -19071388, -20559229, -20538226, -18338894, -13713531, -7922285, -4216927, -4983830, -8424070, -9874336, -6852219, -1701459, 1093566, -445841, -3910539, -4802870, -876940, 5403477, 9035633, 7443523, 2772875, -1111518, -2987652, -4632887, -7403351, -9896661, -9480313, -5481265, -260937, 2905263, 2784993, 877233, -537515, -280284, 1778333, 5135946, 7920489, 7197670, 2209937, -3355245, -4851681, -2326691]
5490b326691K267311l74483j258645r12479k489970m402394j604475N030053P428630
5481A356857J569201n674997n652458L46846M174764K845329Q98943J427228J419190
5472B710903k072095o318747o760463l330121K50306J553153R44215o55549k580419
5463a6258817l463940k055122Q15424K974946L706617L983890L906310K331537
5455d059155j19356l48753K778588N299743K728057k986016m959709p20506L838127
5446A451020K487766k501908l894826k85715K141544n42910l974404k617089J450479
5437f286043K127482p22760j216867K588098N077878J873825l130882l718675
5429c407944n09928R75228q11368k126788q94907M94284J08503p31726j180634
$$ y = [-2326691, -59380, -433863, -1692508, -2604987, -5094957, -9497351, -11101826, -6071773, 1356857, 2926058, -2748939, -8401397, -8054551, -3879787, -1034458, -135515, 1291713, 2710903, 638808, -5679939, -12440402, -15770523, -15520217, -13967064, -13022849, -13678398, -16258817, -19722757, -21777879, -20962455, -17987509, -14280892, -10297002, -6390692, -4059155, -4178511, -4527264, -1748676, 3551067, 6279124, 3293108, -1666601, -2387107, 1451020, 3938786, 1436878, -2457948, -2743663, -602119, -1145029, -5119433, -7736522, -6286043, -4158561, -4881321, -6098188, -3510090, 1567788, 3441613, 310731, -3407944, -3917872, -2942644, -3754012, -5880800, -6775707, -6281423, -6172920, -6904646, -8085280]
5420h085280k889116n976868p074314m428624j407462j302254j771270J122085
5412c1813103N667216O474520K760206m53799L06114L050819M796635N638095
5404c573297O309922N140838M33519n722972q554713n449978J105729N312041
5396d998911L231401k861970o228427l399861J140131P58206l948046n564641
5388b1872118J11080Q518298J2188350Q834263J960715l712274n584199m195698
5380c751583k531857k688045k847950n4170M087921M478340K89439k832631o09104
5371f459640L932781N381855L243255Q57073j1826J78729J196229K568081K455251
5362A3341788Q3323k407077l123271l192082l657587k357925K538564Q114928
$$ y = [-8085280, -10974396, -16951264, -24025578, -28454202, -29861664, -31163918, -32935188, -31813103, -26145887, -19671367, -16911161, -17364960, -17058846, -14008027, -9211392, -3573297, 2736625, 7877463, 8310982, 2588010, -5966703, -11416681, -10310952, -4998911, -1767510, -4629480, -10857907, -14257768, -13117637, -12359431, -16307477, -21872118, -21761038, -13242740, -1054390, 7779873, 9740588, 6028314, 444115, -3751583, -6283440, -8971485, -11819435, -11873605, -7785684, -3307344, -3017905, -5850536, -6459640, -2526859, 2854996, 6098251, 6955324, 6943498, 7122227, 8318456, 10886537, 13341788, 13425111, 11018034, 7894763, 4702681, 1045094, -1312831, 1225733, 9340661]
5354I340661R559992N845895m10946o508218r972225q263507k320339K089452
5346f39235R79601k128723j546384K071431L789698K640119J692275J373232p50454
5337G481560l937730m357087j620444M07008j45780j293687j830635k529404k510069
5328a0336268O0268L307921L359633J018064O79132K264912J186756k588826l101703
5319d150111J560951N314206L695179L96118m9323O46961j24494K36543M003645
5310A1529675O647189K910397m228177p508978n782435l869153l747327k482301
5302f531110J275065M419637L989206Q30008k023253k120863J028139N159854
5294F026683O493527L609319r87808m442204o469814p207611n433079j589168
$$ y = [9340661, 18900653, 24746548, 24335602, 17827384, 7855159, -408348, -2728687, -639235, 340366, -1788357, -3334741, -1263310, 2526388, 5166507, 6858782, 8232014, 7481560, 3543830, -813257, -2433701, -2026693, -2172473, -3466160, -5296795, -7826199, -10336268, -10276000, -6968079, -3608446, -2590382, -1911250, 353662, 1540418, -1048408, -4150111, -2589160, 2725046, 6420225, 6816343, 6767020, 7413981, 7289487, 7526030, 11529675, 18176864, 21087261, 16859084, 9350106, 3567671, -301482, -4048809, -6531110, -5256045, -836408, 3152798, 3982806, 1959553, -161310, 866829, 6026683, 12520210, 16129529, 15141721, 10699517, 4229703, -2977908, -8410987, -10000155]
5286a0000155O51848q04519k991716k619814j134534j039473m68349L398764P903043
5277g104905P572537K074839l617088o231418o585769n638200k985268O94827
5269b1820445L724509N786341O934405N612757J555596j320121L5868J784274
5261B293184j529846p070852o743870k49588L437353m8210l591546l18516N218955
5252h602936M546630j070353k602968L100073R299189R398920M696407K36334
5244A9001296k149561l626548m333424l174390o73175P43229m09419l059566n086111
5235b767669n363883m056294j895407K74325J898415L056510L751534K890424
5227b212045l88283l838155l129341K143691N926459K745872m372461p567178
$$ y = [-10000155, -9348307, -10152826, -13144542, -15764356, -16898890, -17938363, -18406712, -15007948, -7104905, 467632, 2542471, -1074617, -7306035, -13891804, -19530004, -22515272, -21820445, -18095936, -12309595, -5375190, 237567, 1793163, 473042, 508910, 2293184, 763338, -6307514, -13051384, -13300972, -9863619, -9911829, -13503375, -13821891, -8602936, -4056306, -5126659, -7729627, -4629554, 4669635, 14068555, 18764962, 19001296, 16851735, 13225187, 8891763, 5717373, 5044198, 5787427, 5378008, 2318442, -2767669, -8131552, -12187846, -14083253, -13808928, -11910513, -8854003, -5102469, -2212045, -2600328, -6438483, -9567824, -7424133, -1497674, 1248198, -3124263, -10691441]
5219a0691441m859219j645968j166948p2448M031453P106755N307721J814455
5211a75640J405798K343744J28182l588971k985210K247116O017894M692382Q25598
5202A0910893k364667m509030n197052l196990j67506n0163k775980l321478O09860
5193a0062113M502138L637751j98877k278990j982132k018887k595521j014568
5185a2011199K983196N348746K659021l144717o608429m694518L37772L933626
5177a1196502M046411K302501J253382J870622L493050M612277L637843O17763
5169A0637347j767469j047561J246488J459953m78988j131609k0145j037659n238836
5160B621521p506232m105344J196692L068214K248983K081273J725299q72176
$$ y = [-10691441, -15550660, -17196628, -18363576, -18436024, -14404571, -7297816, -1990095, -175640, 1230158, 3573902, 3702084, 113113, -2872097, -624981, 5392913, 10085295, 10910893, 8546226, 4037196, -1159856, -4356846, -4524352, -4574515, -7350495, -10671973, -10062113, -5559975, -1922224, -2121101, -4400091, -6382223, -8401110, -10996631, -12011199, -9028003, -3679257, -1020236, -4164953, -10773382, -15467900, -15130128, -11196502, -7150091, -4847590, -3594208, -1723586, 1769464, 6381741, 10019584, 10637347, 8869878, 7822317, 9068805, 10528758, 10049770, 8918161, 8898016, 7860357, 2621521, -4884711, -8990055, -7793363, -4725149, -2476166, -394893, 1330406, 458230]
5152D58230k849008l93988L708928L755906M12485j010527O4040m04014k664926
5143A077126k988938j395821j313267j689381J701978O622554N671883r77725
5135F708409l971287Q52121N937754M328448m23242k241789k291355m072268n542136
5126g15345l306690N55627K538124L981089O961448Q329300M536514j206296l223120
5117A8450651j944189j923161l765121m209147k510979j039782o46221k14641
5109B197410L15125M64416J134220K449536K005365j057183l068231j045352K133443
5100E528749K290139M53374l48517j464088n412120q772503n589435K772953P993300
5091b548148N607883j96386l384575k576232K65257K983426L583621J190969j892727
$$ y = [458230, -2390778, -2784766, 924162, 4680068, 5092553, 4082026, 4146066, 3742052, 1077126, -1911812, -3307633, -4620900, -6310281, -4608303, 2014251, 7686134, 6708409, 2737122, 3589243, 9526997, 13855445, 13432203, 11190414, 8899059, 4826791, -715345, -4022035, -3466408, -928284, 3052805, 10014253, 18343553, 22880067, 21673771, 18450651, 16506462, 14583301, 10818180, 6609033, 4098054, 3058272, 2412051, 2197410, 2512535, 2976951, 4111171, 6560707, 8566072, 7508889, 4440658, 3395306, 5528749, 7818888, 8272262, 7923745, 6459657, 1047537, -7724966, -13314401, -10541448, -2548148, 3059735, 2863349, -521226, -3097458, -2832201, 151225, 3734846, 4925815, 3033088]
5082C033088k032858Q01433K560225M55515l424777m622556r61774N355985R096347
5073A0260628O232743j544585p541465o947118j743451K894678N011182N999920
5065A2622532O206863M155469j10347l952978n012816l635412k310682l281980
5057D680649n957246o532860j990035N182553Q757128O038821P07664k355433
5049H531241j991230K47337K359095K127861r70162l219419o26471L940999L640912
5040A4040163j127526k161728K952775N454469r18287r194868r676884m114453
5032d746339o23866l04013J317129L851980L321673J070040J483304K760677j70017
5023G960568m823887l518505L366851O517514J555764n252812p331748n589910
$$ y = [3033088, 1000230, 1801663, 4361888, 4817403, 1392626, -3229930, -4191704, 1164281, 10260628, 16493371, 14948786, 7407321, 460203, -1283248, 1611430, 6622612, 12622532, 18829395, 22984864, 22874517, 18921539, 13908723, 10273311, 7962629, 4680649, -1276597, -7809457, -9799492, -4616939, 4140189, 10179010, 10886674, 8531241, 6540011, 6787348, 9146443, 11274304, 10304142, 7084723, 6458252, 10399251, 14040163, 12912637, 10750909, 13703684, 19158153, 18239866, 9044998, -631886, -4746339, -5370205, -5674218, -4357089, -505109, 2816564, 3886604, 5369908, 8130585, 7960568, 3136681, -381824, 2985027, 9502541, 11058305, 5805493, -1526255, -7116165]
5015g116165l155510J65763M529637O958316N140435M56611m503345p676374o542590
5006a1743222l49371O301393P400574L644953J288025K552833L240803Q70182
4998A3206170j250201l52186J074732R699j981917j607286R24898K143004m47212
4989A1719701n357535p883011m964848R204L78733m037958n203454J344912Q551255
4980e443001P804892J693925j083840P10082J629002Q63575K561833O046957N750784
4971B0534209J007055l151452m985376o878173p409660k425957N219377O894153
4963H804176J000810m472476m072972q73118J333618K924731L484110O90536l436222
4954E383193l359621Q01806K833465N53801j968202l222079n843713q132759m318463
$$ y = [-7116165, -10271675, -10105912, -5576275, 1382041, 6522476, 6979087, 2475742, -5200632, -11743222, -12092593, -5791200, 1609374, 5254327, 6542352, 9095185, 12335988, 13206170, 11955969, 11603783, 12678515, 12688214, 10706297, 9099011, 10023909, 12166913, 11719701, 6362166, -1520845, -6485693, -6476489, -6097756, -10135714, -15339168, -13994256, -5443001, 2361891, 4055816, 2971976, 3682058, 5311060, 6174635, 8736468, 14783425, 20534209, 21541264, 18389812, 13404436, 6526263, -883397, -3309354, 1910023, 8804176, 9804986, 5332510, 1259538, 386420, 1720038, 4644769, 8128879, 8819415, 5383193, 2023572, 2825378, 5658843, 6212644, 4244442, 1022363, -4821350, -12954109, -17272572]
4945a7272572M376457R228479P420926N719814P626748P506292J702419m659993
4937B1648570o761646o728565o807427n014026j750976j538980l976730k280629
4929a3210409M912104R589232O522834L42897l419860n102797n163132j405397
4921f934528M289163N944310L261383J760329J514817k748049q692223o881036
4913h485834K949645R795545Q560356N245432K707245k700304p541434k492562
4905H038089Q638476J0135541j74294o635627k588410K43788m001085n200244
4897H456234J22333Q32700m325885p99761J2013077J4037287R50518m348753O872363
4888C3810113J0952146m196855j3778594p90238J2126907O303470K438928J6109439
$$ y = [-17272572, -12896115, -3667636, 3753290, 9473104, 17099852, 24606144, 26308563, 21648570, 14886924, 8158359, 1350932, -3663094, -5414070, -6953050, -10929780, -13210409, -8298305, 1290927, 7813761, 8156658, 4736798, -365999, -5529131, -6934528, -2645365, 3298945, 6560328, 8320657, 9835474, 7087425, -1604798, -8485834, -5536189, 4259356, 12819712, 18065144, 20772389, 18072085, 10530651, 8038089, 16676565, 26812106, 26637812, 20002185, 17413775, 17657563, 13656478, 8456234, 8578567, 9411267, 5085382, 4285621, 16298698, 30335985, 31286503, 26937750, 33810113, 44762259, 40565404, 26786810, 25996572, 38123479, 44426949, 46865877, 62975316]
4880F2975316K1057075J208312o957184K0807253L9350649J4254341Q138521Q5087488
4872B45921771J62976907R1834944j13542278k52570312j95869556m6179777K6036348
4865h1391953L841629j3822772R013907K1267750K223080q665681M516204J0182321
4857e2835515k819971n701291J0106713J5071997j941255j2798882j382623J1002126
4849d1298701P757370K944308Q089683R936359p30591r561596n118924J977211
4841b6004881J268641m15827L003681M360438K57278q00944L000818J328336o691495
4832b0693955p461457K044604P008565J596306m09460P694980J1919787L349686
4824E049056n233866k921139N65559m528340q771230k355848M982780J412325
$$ y = [62975316, 84032391, 85240703, 78283519, 99090772, 138441421, 152695762, 160834283, 245921771, 408898678, 500733622, 387191344, 134621032, -61248524, -107428301, -81391953, -77550324, -91373096, -82359189, -61091439, -58868359, -67534040, -63017836, -52835515, -55655486, -61356777, -51250064, -36178067, -38119322, -50918204, -52300827, -41298701, -33541331, -30597023, -22507340, -12570981, -13301572, -22863168, -27982092, -26004881, -24736240, -25152067, -22148386, -17787948, -17530670, -18331614, -15330796, -14002460, -20693955, -28155412, -26110808, -19102243, -17505937, -17915397, -10220417, 1699370, 5049056, -184810, -3105949, -2540390, -7068730, -15839960, -18195808, -13213028, -11800703]
4816a1800703n355113k738002M098557L318796j722817p88059L010735K78410
4808a1698196n317758l314495L989039N821689K033818J195622L491297J865098
4800a933886k415262j268151M379756N350278O32829j277473J658129J544766
4792F670986m482963q586728n675378j544285k184868l884136l98581O149757
4784a3936196Q080257K880597l896506n670111j885890K236316K178883m49555
4776a0462205m56448L196113N658548L749057J249461L245648Q183676R652582
4768B4016432M512987l977199r909518r406454l378166K586659L323474L14125
4760H082340m35413K311764K944802j457533n536768m075573n66940j241125m534803
$$ y = [-11800703, -17155816, -19893818, -15795261, -12476465, -14199282, -14987341, -11976606, -11698196, -17015954, -20330449, -16341410, -10519721, -8485903, -7290281, -3798984, -1933886, -4349148, -5617299, -1237543, 4112735, 4745564, 3468091, 5126220, 6670986, 2188023, -6398705, -12074083, -13618368, -15803236, -19687372, -20085953, -13936196, -5855939, -2975342, -6871848, -12541959, -14427849, -12191533, -10012650, -10462205, -10918653, -7722540, -2063992, 1685065, 2934526, 6180174, 14363850, 24016432, 28529419, 24552220, 14642702, 5236248, 1858082, 4444741, 7768215, 8082340, 7646927, 9958691, 12903493, 11445960, 5909192, 1833619, 1266679, 25554, -4509249]
4751d509249l556912K916782Q573893Q315328L518756j539169m135066l725118
4743E859245j748351j190763l674816o934400p157382l324905K288310O585710
4735i297352P062389K921014k915406n108409k080289J103699o68664m811220
4727a3794238m088259K964616R040181P192583L7311l301318J082824O613459
4719E747159N006462k034501m901727j52925L997748R3207o760954o505314O51640
4710d859205N448427M028416J539906J193991l51652m387091o115774l099387
4702f602369l3556r40458l290560l624853k415609M4166N254730J0213196P603690
4693F208377k638101r904886p047189j79708K270878K135410M640705O614788
$$ y = [-4509249, -8066161, -5149379, 3424514, 11739842, 15258598, 13719429, 9584363, 5859245, 4110894, 2920131, -754685, -7689085, -14846467, -18171372, -15883062, -9297352, -2234963, 686051, -2229355, -7337764, -9418053, -8314354, -8983018, -13794238, -17882497, -14917881, -5877700, 1314883, 1352194, -1949124, -866300, 5747159, 10753621, 8719120, 3817393, 3664468, 7662216, 7755423, 994469, -5510845, -4859205, 589222, 4617638, 6157544, 7351535, 6999883, 2612792, -3502982, -6602369, -6635925, -7576383, -10866943, -14491796, -16907405, -16863239, -11608509, -1395313, 6208377, 3570276, -6334610, -13381799, -13561507, -11290629, -9155219, -4514514, 2100274]
4685B100274K281662m430981m766696N19147K407759k142735p036282p627535
4677a8695387n370195j846177L110790O528131L803695l139398o412529k982269
4669b5003339J418886J485848m06600P75440M938543P510524N402724j8785m534653
4660h431412m543857P8212O204751J0541030J1250724P012386j739371r698763
4652A0673700r945281l087984K000781J58886l191005j984005L42417j884009
4644f916500n019854j707007N481400O776613N99318m219177k518440N04957p59058
4635g777748l917473l795431K6674M427200P088400P020748M198101L00628k812279
4626D758820n325707p349695o394825j413928K794320J186141l128244k877349
$$ y = [2100274, 4381936, -49045, -4815741, -4296594, -1888835, -4031570, -11067852, -18695387, -24065582, -25911759, -22800969, -16272838, -12469143, -15608541, -22021070, -25003339, -23584453, -22098605, -22505205, -21729765, -16791222, -9280698, -3877974, -3896759, -8431412, -12975269, -12897057, -6692306, 3848724, 15099448, 22111834, 20372463, 10673700, 728419, -2359565, -358784, -199898, -3390903, -5374908, -5032491, -6916500, -11936354, -13643361, -8161961, -1385348, -786030, -5005207, -7523647, -7018690, -7777748, -11695221, -15490652, -15463978, -11036778, -3948378, 3072370, 7270471, 7571099, 4758820, -566887, -7916582, -14311407, -15725335, -12931015, -11744874, -14873118, -17750467]
4618a7750467K021937M613939K179391n97640n43144r7728p10900K62149L438357
4609g184106M983013L135550J079449Q43318M12888p72976O5060K650120J940316
4600G152632l630934q247220o938769k307544P55100J803481K287522J250701
4592g875031j964243m617043m076010j188768K412364O351378Q695768O229518
4584C967933M08375k289370O58485L811742K336353j109751k363572k799304m965713
4575b344822o403111m020980m66879J38949p17254O17587K649539J499806j439290
4566a0486455j408834J525795K598310O0064l012260m403146m904773m657056
4558b4688355k331945J340682L404702K821282J413072L31528j057051k295418
$$ y = [-17750467, -15728530, -11114591, -8935200, -9532840, -10075984, -10173712, -10884612, -10622463, -7184106, -2201093, 934457, 2013906, 2857224, 3270112, 2497136, 2562196, 5212316, 7152632, 3521698, -4725522, -11664291, -13971835, -13216735, -11413254, -9125732, -7875031, -9839274, -14456317, -18532327, -19721095, -17308731, -10957353, -2261585, 3967933, 4376308, 2086938, 2745423, 6557165, 8893518, 7783767, 5420195, 2620891, -2344822, -8747933, -12768913, -13235792, -13096843, -13814097, -13196510, -10546971, -9047165, -10486455, -11895289, -10369494, -7771184, -7711120, -10723380, -15126526, -20031299, -24688355, -27020300, -25679618, -22274916, -19453634, -18040562, -17709034, -18766085, -21061503]
4550b1061503j199724K649363O133853N797892J817173k089150k568674l16913
4542a0837683P16565j531775m304757m308140l037004l753981m634066j099830
4534c2790671M943338N795500J51478l312331J090657P031440O280628J151415
4526i658546q22885Q56944J444786Q33783K246723L815260J236017k639031q90629
4517c577578M942379N615936j104064o431918m336450m9632k11197k710153k373005
4508a0235682k88657o17941k492686j770085J671450M005953L188582J99352l643514
4499i983228o516978n244079Q24465O494944O026391J041927j578591L80335J791586
4490f763228j198398m827475l425065J846908M631224K730170R60912L343561
$$ y = [-21061503, -22261227, -19611864, -13478011, -7680119, -5862946, -7952096, -10520770, -10837683, -10121118, -11652893, -15957650, -20265790, -23302794, -27056775, -31690841, -32790671, -27847333, -22051833, -21900355, -25212686, -24122029, -17090589, -10809961, -9658546, -10481431, -9624487, -8179701, -7345918, -5099195, -1283935, -47918, -2686949, -3577578, 1364801, 6980737, 5876673, -555245, -4891695, -4941327, -5152524, -7862677, -10235682, -10524339, -11142280, -13634966, -15405051, -13733601, -9727648, -6539066, -6339714, -9983228, -16500206, -21744285, -20919820, -14424876, -8398485, -7356558, -8935149, -8554814, -6763228, -7961626, -12789101, -16214166, -14367258, -9736034, -7005864, -6044952, -2701391]
4482b701391O550749M610846k058955o698881n130600m93269K091157J802809
4474b027535Q84757M04273L30206J368282L247606L007996j284918o355866p054375
4465g479574l151356Q69021K207189K022043J618866O77305k37845M58171K029670
4456i86510J830768J82472Q15151M780786P929351O833883L597517J835044J090482
4447B7908944j160101m336071n531991m250959k840593k762573l394980m168706
4439e37030n079649n076826k557307J917526N232882M774781J022972k839251
4431c141902l207618J094332O770591P864937J896491o193970q749489m236447
4423g903075J250829K027508o70145k228194j956984l004247n774111n861749
$$ y = [-2701391, 3849358, 8460204, 6401249, -297632, -5428232, -5921501, -3830344, -2027535, -1142778, -738505, -408299, 959983, 4207589, 7215585, 5930667, -425199, -7479574, -10630930, -9761909, -7554720, -5532677, -3913811, -3236506, -3474351, -3016180, -986510, 844258, 1026730, 1841881, 6622667, 14552018, 21385901, 24983418, 26818462, 27908944, 26748843, 22412772, 16880781, 12629822, 9789229, 7026656, 3631676, -537030, -5616679, -10693505, -13250812, -11333286, -6100404, -1325623, -302651, -3141902, -6349520, -5255188, 1515403, 9380340, 11276831, 5082861, -3666628, -7903075, -6652246, -4624738, -5294883, -7523077, -9480061, -12484308, -18258419, -24120168]
4415b4120168l22275P044103R630669N957941Q66920p53447J337831M459097O408368
4406A0509039N837057J887510m048362p624300n359810R43245N636345N264916
4398A3045640J574934j657125k987884l644233m855843o332237p183571p151516
4390a9191835o286809l931403P78950O808730J0623510R282438M142221l6790
4382B189012k28555J805945K230949k13075l141055l453948p25323K080462J550742
4373B095154j866653l609598q35464K877350J975019k722790m786018j714962
4365h587962J857560K461569L050859N900782O451570R08556m816349k445055
4357D781530M906303O026718j313119o584234k598653L862388K958304l941709
$$ y = [-24120168, -24442443, -17398340, -7767671, -1809730, -942810, -1696257, -358426, 4100671, 10509039, 16346096, 18233606, 14185244, 6560944, 1201134, 2144379, 7780724, 13045640, 14620574, 12963449, 9975565, 6331332, 1475489, -4856748, -12040319, -19191835, -25478644, -29410047, -28631097, -21822367, -11198857, -1916419, 2225802, 2189012, 1960457, 3766402, 5997351, 5784276, 2643221, -810727, -1536050, 544412, 2095154, 228501, -3381097, -4216561, -1339211, 635808, -2086982, -6873000, -8587962, -6730402, -4268833, -1217974, 4682808, 11134378, 12042934, 7226585, 4781530, 9687833, 15714551, 14401432, 7817198, 5218545, 9080933, 12039237, 8097528]
4349H097528p980668o066879k872901j899083j579656n8960J756046K697070L011751
4340d895752L011747K895981L607221M984148L975750j611332q191371r522413
4332e746021m899322K08971K317018L610726N627321M874465q86130o275864m423691
4323e592527K345914M508097j439704p766674o028109J988477P681196O771697
4315B468367K498333o93843j914167k160646j927444j746019k287612k557345
4307h320376k43946M618428Q100051O229868l37607o515862p282364k045878M508433
4298a289253O362341K412489j997581j840368P48865J17796l530706m159044M72
4289c174989L107309J490267l1248L064170O047248K574435l131460j622905N675245
$$ y = [8097528, 116860, -5950019, -8822920, -10722003, -12301659, -12360619, -10604573, -7907503, -4895752, -1884005, 1011976, 4619197, 9603345, 13579095, 11967763, 3776392, -5746021, -10645343, -10436372, -8119354, -4508628, 1118693, 5993158, 5107028, -1168836, -5592527, -3246613, 1261484, -178220, -7944894, -13973003, -11984526, -4303330, 2468367, 4966700, 4272857, 2358690, 198044, -1729400, -3475419, -5763031, -8320376, -8564322, -3945894, 4154157, 10384025, 10046418, 3530556, -3751808, -5797686, -1289253, 5073088, 7485577, 5487996, 3647628, 4396493, 4514289, 983583, -3175461, -3174989, -67680, 1422587, 1391339, 4455509, 10502757, 13077192, 9945732, 8322827, 13998072]
4280A3998072O433391m269427j5205050j3801207k620305N579557M744676L34482
4272d805811q92501R66390K031103J006693j68849M532O88016M83702k68152j51124
4262a106001O64199L94804p71667M68021N545022J0006127Q336085J573603m226489
4253B0883704o264796o521027n422472p53569N579682O854090J248907m108718
4245A1495801l555196j273785l130703n858512k746712L832069N462782J704687
4237E930431N90652M204835M399773l222038j0627405r095383k256214L85866
4229i689483k288184l682797j145885J727143L031885M394829M956635J675452
4221a020405l322269l705367O93106K462282j391674m426554k351300q30410m554823
$$ y = [13998072, 20431463, 16162036, 956986, -12844221, -15464526, -9884969, -5140293, -4805811, -5698312, -4731922, -2700819, -1694126, -1862975, -1858443, -1170427, -686725, -954877, -1106001, -441802, -46998, -818665, -350644, 5194378, 15200505, 23536590, 25110193, 20883704, 14618908, 8097881, 2675409, 1921840, 7501522, 14355612, 15604519, 11495801, 7940605, 6666820, 3536117, -2322395, -5069107, -1237038, 4225744, 5930431, 6521083, 10725918, 15125691, 11903653, 1276248, -7819135, -10075349, -9689483, -11977667, -15660464, -16806349, -15079206, -12047321, -7652492, -2695857, -1020405, -4342674, -8048041, -7354935, -4892653, -6284327, -10710881, -13062181, -13892591, -18447414]
4212a8447414o807179q3642R167882Q808245M54581k916364K031593M880235O42979
4203b269084j764071L587195P806385J858616p631079q621100j914173K593460
4195f353851K158112J610333J501544j789746n919640m389239J655854M219246
4187g307387J580497L66357L402362N630764M211594K979152L885414L100530
4179A7849283p64544l027655j589076j250374m785716p108894l672659J686334
4171b663301K940249P38889l67650N41512J026629M9379j557007l079612l864901
4162f235813l551566l306991l907750l191004J81389K062240j609914o410327
4154b5969736n100357j40311m210m049314l981073m38389k540843r185610r649795
$$ y = [-18447414, -25254593, -25338235, -16170353, -7362108, -6907527, -9823891, -7792298, -2912063, -2269084, -4033155, -445960, 7360425, 9219041, 1587962, -7033138, -8947311, -6353851, -4195739, -2585406, -1083862, -2873608, -8793248, -13182487, -11526633, -7307387, -5726890, -5360533, -1958171, 3672593, 7884187, 10863339, 14748753, 17849283, 17084739, 14057084, 12468008, 11217634, 6431918, -676976, -4349635, -2663301, 276948, 1015837, 648187, 1189699, 2216328, 2265707, 708700, -2370912, -6235813, -9787379, -13094370, -17002120, -20193124, -20011735, -17949495, -19559409, -25969736, -31070093, -31210404, -31214614, -35263928, -39245001, -39683390, -42224233, -51409843, -61059638]
4145f1059638p465420k0378008m4769414m5281151k255253N0199330O2546348
4138f8463206L4381503R400028J1532226K0302264J3441031L92180j045709M635495
4130B4575812L003323m478759o458899k691533j462753k928586n64376M888221
4122A3882450O419373L348685J275704P68436l186469j0148128j2169120n244071
4114e053140M025516O611347J984382k370362r59507K917429J832312n143593
4106C844384j0116298o902491J96918L134185J997620K719701N268052L659221
4098C801292k181715m661550q35314L029539K501959J434326L208590M436355
4090A0733482K425701N67779Q30778r63834o507257r759644o732029k468209j472363
$$ y = [-61059638, -68525058, -88903066, -133672480, -178953631, -181208884, -131009554, -68463206, -34081703, -24681675, -13149449, 7152815, 20593846, 20986026, 19940317, 24575812, 27579135, 23100376, 16641477, 13949944, 12487191, 9558605, 8994229, 13882450, 20301823, 23650508, 24926212, 25694648, 22508179, 12360051, 190931, -5053140, -1027624, 5583723, 7568105, 5197743, 4238236, 7155665, 8987977, 3844384, -6271914, -13174405, -12977487, -9843302, -7845682, -5125981, 142071, 3801292, 1619577, -3041973, -3877287, -847748, 1654211, 3088537, 6297127, 10733482, 13159183, 13726962, 14557740, 13593906, 7086649, -2672995, -9405024, -11873233, -13345596]
4081a3345596K51006N540001P310751k66905r287392q384960J32005N185714M366589
4072h498787M133030N854548M519364J36338j747930r02463k529118o196431n717252
4063a0948701j036976P23871k108052k833870J254914L996018J527020j368571
4055a0794347n78872N09303j470295l472362k504476j319812k170754j500500
4047b3302115L257232P437501N890772J174835r61962j76847J55160l66282N8982
4038f832724P19337j37831j180162j12571J797202J568251n69044j765433p77257
4029g290232J319957L131643L403781J600706n4329J901168O440870P524570K168164
4020B0146298m795977p397481o000308m217617k581686j96917J129555Q0484r6008
$$ y = [-13345596, -13094590, -7554589, -243838, -510743, -9798135, -18183095, -18051090, -12865376, -8498787, -4365757, 1488791, 6008155, 6144493, 4396563, 3494100, 964982, -5231449, -10948701, -11985677, -11261806, -13369858, -16203728, -14948814, -10952796, -9425776, -10794347, -11373219, -10863916, -12334211, -15806573, -18311049, -19630861, -21801615, -23302115, -20044883, -12607382, -6716610, -5541775, -6503737, -6680584, -6525424, -6891706, -6832724, -6113387, -6251218, -7431380, -7543951, -5746749, -4178498, -4747542, -6512975, -7290232, -5970275, -2838632, 565149, 2165855, 2111526, 4012694, 10453564, 17978134, 20146298, 15350321, 7952840, 1952532, -2265085, -4846771, -5043688, -3914133, -3833649, -3929657]
4011c929657L199221N558518J354083o248777q691399m474769l00164L67748J508757
4002a1656439N358368P041599K525965m116077o161032k848890J543437L864526
3994d448543L642710J436523r48082j147952N9598j193465n218380o021617M41264
3985a3397944Q561911R235365J937936n134177o375509m316837l165543k654536
3977a5309334r90582N48333j36816j509448m3226M290136P200326N257861n29
3968f93279m113352m811025l650029k483217k55766M489705Q852005P302732j96853
3959D440921n635894k273636N960941R098314L912605l120165n494165l702382
3951C186539j383873O1352M63168p71436k123622Q8258N702738Q514018M165237
$$ y = [-3929657, -730436, 4828082, 6182165, -66612, -8758011, -13232780, -13532944, -13165196, -11656439, -6298071, 743528, 3269493, -846584, -7007616, -9856506, -8313069, -4448543, -805833, 630690, -317392, -1465344, -1405746, -2599211, -7817591, -13839208, -13397944, -4836033, 4399332, 6337268, 1203091, -5172418, -9489255, -12654798, -15309334, -16299916, -15751583, -15888399, -17397847, -17441073, -13150937, -5950611, -692750, -693279, -4806631, -9617656, -13267685, -15750902, -16006668, -11516963, -2664958, 4637774, 4440921, -1194973, -3468609, 2492332, 11590646, 15503251, 12383086, 6888921, 3186539, 1802666, 1864018, 2327186, 1555750, -567872, -479614, 5223124, 13737142, 17902379]
3942A7902379l118210o139761m087169j429110k00965Q74695J276193j153033
3934C925019n146841o510659m113993j050677K69065K02834n20419j204195m8722
3925a4198588L035387L944478r0655m370211k697075K267508K882446k08523J140537
3916h294696P581579R563458L379080j695846J108940M277334r44965q706141
3908F268743p316647K042082P380568L496798l683093q608404j1181736j0694069
3900b2295758m955466L143282O735282M343525J162804K55502m29592j666729
3892a3707150j065117J194564J702338J29311l52989M52274p9484n49171K927021
3883i348403P630177O101459r27171l506283K121741P306071N210288R58056O25431
$$ y = [17902379, 14784169, 8644408, 4557239, 3128129, 2927164, 3801859, 5078052, 3925019, -1221822, -7732481, -11846474, -12897151, -12628086, -12425252, -12945671, -14149866, -14198588, -11163201, -7218723, -7309378, -11679589, -14376664, -12109156, -9226710, -9435233, -8294696, -713117, 8850341, 12229421, 10533575, 11642515, 15919849, 14974884, 6268743, -1047904, 994178, 8374746, 11871544, 8188451, -419953, -11601689, -22295758, -27251224, -24107942, -17372660, -13029135, -11866331, -11610829, -12040421, -13707150, -14772267, -13577703, -11875365, -11746054, -12099043, -11646769, -11726253, -12275424, -9348403, -1718226, 4383233, 3456062, -50221, 2071520, 9377591, 14587879, 15545935, 16171366]
3874A6171366J05589n508030r804745m157844O302185Q292871p243o547484l081109
3865A765556M843806P776376M043436j650101n139513m884263j300074L026167
3857H481390M767692K972180o90561m265925n966186l875466J368107M932310
3849G723541K815514k379234m612997k358282Q08445K456143L203163K852825
3841A0509118j0442l895690m716997j614817J318361L77122l622221p041835o622993
3832a5320394j475143N104682P029588K434039k454538j317340K534119J191139
3824b273848m612077o130074j129775J997306j949087o320232l493235L415864
3816b0495158O795232O164892N582364M350708p42643o685961o640370m05863
$$ y = [16171366, 16276955, 10768925, 964180, -3193664, 3108521, 11401392, 11394149, 4846665, 1765556, 6609362, 14385738, 18429174, 16779073, 11639560, 6755297, 5455223, 8481390, 13249082, 16221262, 15530701, 11264776, 5298590, 1423124, 2791231, 7723541, 10539055, 8159821, 3546824, 1188542, 1996987, 4453130, 7656293, 10509118, 10498676, 6602986, 1885989, 271172, 1589533, 1966655, -1655566, -8697401, -15320394, -16795537, -11690855, -4661267, -2227228, -4681766, -5999106, -3464987, -2273848, -6885925, -13015999, -14145774, -12148468, -14097555, -20417787, -23911022, -20495158, -13699926, -7535034, -1952670, 2398038, 1655395, -5030566, -11670936, -12076799]
3808a2076799N096452N785613M065561K346722k40912l478956m526116k601497
3800e629932l17558R17515K023010J985970j817586p436486q442570k911102L224380
3791a8404359M960204M708141N784932N130698j128465q791548r681239l170079
3783b0591715L162653M218650K450303J405556K71744k564793n179462m885545
3775b1712609k620337j286197j203350j4956L356003O646991O380450J475826
3767h978179m937959p400837l139496M334573Q053068M836076j481031m861577
3759a3575362l654103q66472J031831L020602O437648Q957598O377681j087365
3751F642058o900269n267477J084097L932252N42981k941956j069263K948498
$$ y = [-12076799, -6980347, -1194734, 2870827, 5217549, 4976637, 1497681, -3028435, -5629932, -5947490, -5029975, -3006965, -1020995, -2838581, -10275067, -18717637, -21628739, -18404359, -13444155, -8736014, -2951082, 2179616, 1051151, -7740397, -17421636, -20591715, -17429062, -13210412, -10760109, -9354553, -9082809, -11647602, -16827064, -21712609, -24332946, -25619143, -26822493, -26837449, -23481446, -16834455, -10454005, -8978179, -13916138, -21316975, -24456471, -20121898, -12068830, -7232754, -8713785, -13575362, -17229465, -18095937, -17064106, -14043504, -7605856, 1351742, 7729423, 6642058, -258211, -5525688, -4441591, -509339, 33642, -2908314, -3977577, -1029079]
3743a029079L185387P82382J321926M731974N368462J910292o89030o09483k484007
3734A2488824p787572r554288k589560O897915Q976975L446809j665512k508716
3726G704875k624519m563573n821089m336850j897393m6659K437687N679361O492835
3717C024675K919565j847565k921090K84191L499586K479520k479915o580628
3709a621661n159870J235767P136669Q041605M556511L8093l223622l935888j343516
3700E724088K305187K234471k168217m589690m76297M924849L336000m333767
3692F956624r515028q050711l332769J578819O813407J0528167R208917M442756
3684A8630182J720588J281099j742724o779931o942875j505321Q12780m157597
$$ y = [-1029079, 2156308, 2938690, 4260616, 8992590, 14361052, 16271344, 15582314, 14972831, 12488824, 4701252, -4853036, -7442596, -544681, 8432294, 11879103, 10213591, 7704875, 5080356, 516783, -5304306, -9641156, -11538549, -11585208, -9147521, -3468160, 3024675, 5944240, 4096675, 1175585, 1459776, 4959362, 7438882, 4958967, -1621661, -6781531, -5545764, 1590905, 9632510, 14189021, 14227114, 11003492, 7067604, 5724088, 8029275, 10263746, 8095529, 3505839, 3029542, 7954391, 11290391, 6956624, -2558404, -10609115, -13941884, -12363065, -5549658, 4978509, 14187426, 18630182, 20350770, 21631869, 19889145, 13109214, 6166339, 4661018, 5473798, 1316201]
3676A316201q381032m363514L168135N796135L808324J860549n85201n243835
3668b624238p513087l031483K900285K507839j636791j233726L413410M578161
3660b639630Q54247j366137R3358L98225k057811k622606L87726K473176J492936
3651b986516J270394L926626O040433N224185L738234L070779J483090q46354
3643B0920871r47944N02471j163970o161450q640605o152544l226949k503367
3635g373487m23754M137480N319106o305n579288n366112k876193l538615m244144
3626a9951312O88928P966955R325167M332269Q1249l88510n08106j410415L87410
3617E23635M910849O014458K2257q260402j1474570q053085k060116K391328M008414
$$ y = [1316201, -7064831, -11428345, -8260210, -2464075, 1344249, 3204798, 2619597, -2624238, -10137325, -13168808, -10268523, -7760684, -9397475, -10631201, -7217791, -2639630, -1785383, -3151520, -3058162, -2659937, -4717748, -7340354, -6952628, -4479452, -2986516, -1716122, 2210504, 8250937, 13475122, 17213356, 20284135, 21767225, 20920871, 19972927, 20475398, 19311428, 13149978, 4509373, -1643171, -4870120, -7373487, -7797241, -3659761, 1659345, 1653040, -3926248, -9292360, -12168553, -15707168, -19951312, -19262384, -11295429, -1970262, 2362007, 2443256, 2054746, 1546640, 136225, 523635, 5434484, 11448942, 11471199, 3210797, -8263773, -16316858, -18376974, -15985646, -11977232]
3608a1977232L418752J730826j26639j292591n95522K453241N787813N986826
3600E385474K769663L2164M32872J484075k88504l861072n780537n397298m138731
3591i361894j728715K207827M420931J376422m147667n303027n68937M222832
3583h882228M430288K202095J563892K519400L009404L040227L267171K059850
3575A3210099k116303o691319p107023k930063J160840J276322j090807j790729
3567f078983K66969K357037K522620K194207K953498L199114R96337j350384R8587
3558G159002L861375L749340j620156n375980k262386K733798J374070n248204
3550D370859q033163l006113L716333N266143K415676J82221O67660K333365L208370
$$ y = [-11977232, -8558480, -6827654, -6954293, -8246884, -8842406, -6389165, -601352, 5385474, 8155137, 8187301, 8620173, 10104248, 9815744, 5954672, 174135, -5223163, -9361894, -11090609, -8882782, -4461851, -3085429, -7233096, -12536123, -13105060, -8882228, -4451940, -2249845, -685953, 1833447, 4842851, 7883078, 11150249, 13210099, 11093796, 4402477, -2704546, -5634609, -4473769, -3197447, -4288254, -6078983, -5812014, -3454977, -932357, 1261850, 4215348, 7414462, 8410799, 7060415, 7159002, 11020377, 14769717, 13149561, 7773581, 5511195, 8244993, 9619063, 4370859, -3662304, -6668417, -2952084, 2314059, 4729735, 4911956, 5579616, 7912981, 11121351]
3541A1121351K011708j595528n587522o395881l093200R93418K293824O91876
3533D40046j900562m070891m401280j294567M180112P498650N523516N63317k853416
3524C684925l529094l156217k109079N68555L637806M053535J499301o56549j06449
3515C886734J234229K95412k833186n328292n180259k819560O5467K019200K407456
3506f252799J469793r0312j668141k641964k099110J48925K319250K097110j05290
3497f822538j105478P57599L140054L193626J737248J436263K247911J957552
3489F542237N64685L43868J349539R32061j179887j563597R94462K440881m26859
3480I997390m497209n243221l932070m639871o272153l918687K240062N772797
$$ y = [11121351, 13133059, 11537531, 5950009, -445872, -3539072, -2545654, -251830, 440046, -1460516, -5531407, -9932687, -11227254, -7047142, 451508, 5975024, 6538341, 3684925, 155831, -3000386, -5109465, -4540910, -903104, 3150431, 4649732, 3993183, 3886734, 5120963, 5416375, 2583189, -2745103, -7925362, -10744922, -10679455, -8660255, -6252799, -4783006, -4873318, -6541459, -9183423, -11282533, -11133608, -8814358, -6717248, -6822538, -7928016, -7170417, -4030363, -836737, 900511, 2336774, 4584685, 6542237, 7106922, 7450790, 8800329, 9732390, 8552503, 6988906, 7983368, 10424249, 9997390, 5500181, 256960, -3675110, -8314981, -14587134, -18505821, -16265759, -10492962]
3472a0492962L075971j778450l362912j565864M63644J237991J108932L27260
3464a0986390p68152j598502k480566l691885l443182k92139K727441J488308
3456a9045067j432763J014450Q504769J1343281M425167m179025m707785O14385
3448c462588K993728R80208m1265R72579k92640m217030n834882l366657n59360
3439a2827907M91349J899645M170126M463419K291653Q72672J206568O40663j219558
3430A988630j309628M54335k1735l372895m430083p07235L018714K578313J028543
3421g73041K655613N436795M832281J164811k006083l670711m625404l892056
3413h77795q25587J696040J021135n14148P11477L212987K686787q88128l474543
$$ y = [-10492962, -7416991, -9195441, -12558353, -14124217, -13660573, -12422582, -11313650, -10986390, -11754542, -13353044, -15833610, -19525495, -22968677, -23260816, -20533375, -19045067, -20477830, -19463380, -10958611, 384670, 4809837, 630812, -4076973, -3462588, -468860, 511348, 470083, 1442662, 1150022, -3067008, -8901890, -12268547, -12827907, -12336558, -10436913, -6266787, -1803368, 488285, 1360957, 2567525, 3208188, 1988630, 679002, 1133337, 1111602, -2261293, -6691376, -7398611, -4379897, -1801584, -773041, 1882572, 7319367, 12151648, 13316459, 11310376, 7639665, 3014261, -877795, -1703382, -7342, 1013793, 499645, 1211122, 4424109, 7110896, 6222768, 2748225]
3404B748225l312647k205862j113575P76918K703257K585612J007154Q77626K528831
3395F595539K877216L26550k827239l918910k985534j287140P20008K739788L814750
3386F055028L130799O08081l171685o283234n632235l04226N662954O778121K762957
3377I606560r32965p0302L340548M221974Q02175l884385o059986n202680l555461
3368a734522k341178n9617M100903O625393L043450m732305q907388n841392j017329
3359a0863985k12314m64433L876732R672669Q257717m61329o378731l829449P45895
3350C42772J17179k497723k11894N236016O227181J406394l128737l965730l919823
3341c94365m587928k759624K783866O820024M402247j785762n238692m384863
$$ y = [2748225, -564422, -2770284, -3883859, -3106941, -403684, 2181928, 3189082, 4066708, 6595539, 9472755, 9799305, 6972066, 3053156, 67622, -1219518, -499510, 2240278, 6055028, 9185827, 9793908, 6622223, 338989, -5293246, -5597472, 65482, 6843603, 9606560, 8673595, 8603293, 11943841, 16165815, 16967990, 13083605, 7023619, 1820939, -1734522, -4075700, -4135317, -34414, 6590979, 9634429, 4902124, -4005264, -9846656, -10863985, -11076299, -11540732, -7664000, 2008669, 10266386, 9805057, 3426326, -403123, 342772, 459951, -2037772, -2249666, 2986350, 9213531, 10619925, 7491188, 3525458, -394365, -4982293, -7741917, -4958051, 1861973, 6264220, 4478458, -760234, -5145097]
3333e145097l153611m049323n045574l661361n25970K429517M782879O796709
3325g571831P387985N211523J485147m70501M74633J085678j910109o035569n093993
3316e437037J709816O525022K584878n589842p600037j885106K318231n83923
3308g957998m203328j270779M181272L874808m77585k11686N049896O268712J51651
3299E404963n250891l675338K42327K36972j758930j603059j140700k650876j761588
3290a1957120M946262J0473761N782940n559014j1371199p667835j415579K277361
3282a4490423M876023O093738K282839m280006n072668J603537O602639L763913
3274A379592r83254q5570L966255M240458L52422l024941l742213k109547K232121
$$ y = [-5145097, -8298708, -12348031, -17393605, -21054966, -21580936, -19151419, -14368540, -7571831, -183846, 5027677, 6512824, 6042323, 6516956, 7602634, 5692525, -343044, -5437037, -3727221, 2797801, 5382679, -207163, -7807200, -9692306, -7374075, -7957998, -12161326, -13432105, -9250833, -5376025, -5853610, -6065296, -1015400, 5253312, 5404963, 154072, -3521266, -3278939, -3041967, -4800897, -6403956, -7544656, -10195532, -11957120, -7010858, 3462903, 9245843, 3686829, -7684370, -15352205, -16767784, -14490423, -9614400, -3520662, -1237823, -5517829, -10590497, -8986960, -2384321, 1379592, 396338, 310768, 4277023, 8517481, 8869903, 5844962, 2102749, -6798, 2225323]
3265B225323P569723Q597491L314475k669081l954100k885222l870261n408248
3257B920100m210181k214286k226421j201374M163269R226753P393535J005858
3249A4857253k489780k293128k967015m126866j674175K296503J691281j903299
3241C390774r48567L901003L175851n225020j0890387o760686M00036J807189
3233a1149807k27011J139453M696669M052436r28038l576619J07676O941133J0655396
3224A1711288P351138j378532q703667q635445l254098j36352j728925k876573
3216g651166n04708J451910K96186J84070L938441O042571R43763o891483q886454
3207a1076870m510943j25361J226504J531290J768462J331296J571477L241349
$$ y = [2225323, 9795046, 18392537, 21707012, 19037931, 15083831, 12198609, 8328348, 2920100, -1290081, -3504367, -5730788, -6932162, -2768893, 6457860, 13851395, 14857253, 12367473, 10074345, 7107330, 2980464, 1306289, 3602792, 5294073, 3390774, 2442207, 6343210, 9519061, 4294041, -6596346, -13357032, -12956996, -11149807, -11376818, -10237365, -5540696, -1488260, -2416298, -5992917, -5885241, 1055892, 11711288, 19062426, 17683894, 8980227, 344782, -2909316, -3045668, -4774593, -7651166, -8155874, -6703964, -6407778, -6223708, -2285267, 3757304, 4701067, -2190416, -11076870, -15587813, -15713174, -14486670, -12955380, -11186918, -9855622, -8284145, -5042796]
3199e042796K614150k822936p312581l787398L799345M565440k891326q075827
3191a8953929m536784J474402K376558N90035K268346O157882O092440J148465
3183c382585l410415m030337k463988j659376j792342q59160K552995O891915
3175h153293P700673K127916n859748q035841j788180N733886O353785R00761
3167a020041l357397k985627j033814k05028J008871L798514N241762K320526
3159C767766k815309n113510l170911l46605O26327R96652K668790M071697K056207
3150B741104k893468o122922m195663R52926M301935L193709k93032j695169J518627
3141b491953P094712R328276M753602l088267o617560l108565J613882N81013
$$ y = [-5042796, -2428646, -5251582, -12564163, -16351561, -12552216, -7986776, -10878102, -18953929, -23490713, -22016311, -19639753, -19049718, -16781372, -10623490, -4531050, -3382585, -6793000, -10823337, -13287325, -14946701, -16739043, -17598203, -15045208, -8153293, -452620, 1675296, -4184452, -12220293, -14008473, -8274587, -1920802, -1020041, -4377438, -7363065, -8396879, -8601907, -7593036, -3794522, 1447240, 3767766, 952457, -4161053, -7331964, -7678569, -7052242, -6055590, -3386800, 684897, 2741104, -152364, -6275286, -10470949, -9518023, -5216088, -2022379, -2315411, -4010580, -2491953, 4602759, 13931035, 18684637, 15596370, 8978810, 5870245, 7484127, 8065140]
3133H065140n013019p243013j895717N921962Q042853K982514k747869k639965
3125E472886K348447N347487J904101m991388q997307p841901m493352j948205
3117a3199232j21602J700937K634037J912279L23903j417840l224195l489525
3109a4881238K03357O433751R729190P551716L640704J369498j510344o832728
3101E703906r624075m797011L055089M750456j87960l863795l074742k616154
3093a0654286m349910l073676K906423O472805K843830j972186r69563K501212
3085f295351J534212j826639o73375L855339M411354P56005K73695M294181M839339
3076A1168760j420518o061643k021898M332700K639020n353485q621313l561569
$$ y = [8065140, 3052121, -4190892, -6086609, -164647, 7878206, 10860720, 8112851, 5472886, 7821333, 13168820, 15072921, 10081533, 1084226, -6757675, -11251027, -13199232, -13320834, -11619897, -8985860, -7073581, -6749678, -8167518, -11391713, -14881238, -14677881, -8244130, 1485060, 9036776, 12677480, 14046978, 12536634, 5703906, -3920169, -8717180, -5662091, -911635, -1099595, -4963390, -8038132, -10654286, -15004196, -18077872, -15171449, -8698644, -5854814, -7827000, -8796563, -6295351, -4761139, -6587778, -7261153, -3405814, 1005540, 1761545, 2035240, 6329421, 11168760, 9748242, 3686599, 1664701, 5997401, 8636421, 3282936, -5338377, -8899946]
3068h899946J728978P51333k375067r07952L792455M984534O89017m298349n494586
3059a0029583l328792n26578J324814J626597K89744r89402N77617M828038P153867
3050I26322L641675l294182p200485n327272j296628N08375L10228Q88125K443387
3041h400455K505193L14054j689753j506104m62273r70479k791946l376458j407263
3032a7785484J753305M219596N571729O180926N984847M863262L168012R59371
3024A4915564k139274n215080n686159k630030O71382J86387l390417n591324
3016h878951m487970k508460j310030J011651N416790Q371532O272307R46713
3008D833582k835518l564277l245142l072590k603326k080477j804096k16542
$$ y = [-8899946, -7170968, -6419635, -8794702, -9702654, -5910199, -925665, -236648, -4534997, -10029583, -13358375, -13884953, -12560139, -10933542, -10643798, -11633200, -11055583, -6227545, 926322, 4567997, 1273815, -5926670, -11253942, -12550570, -12042195, -11731967, -10843842, -8400455, -5895262, -5581208, -7270961, -8777065, -9239338, -10209817, -13001763, -16378221, -17785484, -16032179, -11812583, -6240854, -59928, 5924919, 10788181, 13956193, 14915564, 12776290, 7561210, 1875051, -754979, -83597, 102790, -3287627, -8878951, -13366921, -15875381, -17185411, -16173760, -10756970, -2385438, 3886869, 4833582, 1998064, -1566213, -4811355, -7883945, -10487271, -12567748, -14371844, -14588386]
3000a4588386L396395N406016J951898l816257m239194K040896P211221M539176
2992A901765l143011q119480p095762k623079J567485L212835J832007m66314
2984a2933554j79918L262166O288545O122477M211445K586755K32694l646792
2976E943818o014618m003131k00222O79689j224732j976705p10708l65721j741822
2967i614152j843028Q50955L539629K965520p96334n279362p751904o130380p21175
2958b4780231M663524O366099N704218O564968Q230847N588051j965471p127292
2950C244713l978090L142210M896199p70930o484736n475281M75999M533833L314587
2941B898504m62114k575457j945785o3799K191285M827123O279334L838658j899792
$$ y = [-14588386, -11191991, -5785975, -3834077, -7650334, -11889528, -9848632, -2637411, 1901765, -1241246, -9360726, -16456488, -19079567, -17512082, -14299247, -12467240, -12933554, -13113472, -9851306, -3562761, 2559716, 6771161, 9357916, 9590610, 5943818, -70800, -4073931, -4274153, -3594464, -4819196, -6795901, -7506609, -7872330, -9614152, -11457180, -10606225, -7066596, -4101076, -4897410, -10176772, -17928676, -24059056, -24780231, -20116707, -13750608, -8046390, -1481422, 6749425, 12337476, 10372005, 3244713, -733377, 2408833, 7305032, 6534102, 49366, -5425915, -4949916, -416083, 2898504, 2436390, -139067, -2084852, -2148651, 42634, 4869757, 11149091, 14987749, 13087957]
2932A3087957n730932l879872N37789J656828r18973k491954j316489q65245k963280
2923b884171m177968j917188N86228n49829l215478k534160J470093M163332L198374
2914e860767P87601n49366n74231M36093K407168L792320K361669j264038l388399
2905a851950j800566J224385J610991j929653o635057q281937m980855R85724
2897b1658918N502062P114576P715689Q100347N812742j7758m702759l402538
2889D463443J173872J915189k187435m636086j695568K018096J232218j987441
2881B96288k412611K7471J321952N39650O31276K730402M217585K820605p68283
2872I404335m707670p574527p931881n093629p63639K287281L253321K977578
$$ y = [13087957, 7357025, 3477153, 4014942, 5671770, 4752797, 2260843, 944354, 79109, -2884171, -7062139, -8979327, -8393099, -8942928, -12158406, -14692566, -13222473, -9059141, -5860767, -5073166, -5622532, -6196763, -5760670, -3353502, 438818, 2800487, 1536449, -1851950, -3652516, -2428131, -817140, -2746793, -9381850, -17663787, -22644642, -21658918, -16156856, -9042280, -1326591, 6773756, 12586498, 12568740, 7865981, 4463443, 5637315, 7552504, 5365069, 728983, -966585, 1051511, 2283729, 296288, -2116323, -2088852, -766900, -227250, 404026, 3134428, 7352013, 10172618, 9404335, 4696665, -2877862, -10809743, -15903372, -16667011, -14379730, -11126409, -8148831]
2864h148831J327360k033406m572522k533321L353614P392300N865146J396087
2856B046427j482433j959308j592144m19562J833899K819860L31523k851437j607001
2847b880176L616877O183963K324825l353286m360504r04302K053660K832997
2839E514054L860942N204056L233915k507975o294165l599963K155166M429688
2831A1995718K439498M53586M8449j302091m155599n304195l250392n57523Q24968
2822A192419J774896J809622j722734p304404q072783j759254L702106R27083
2814i453049n220871m806084J518768L801116r21483m028121N16843O785250O571080
2805e236551J134363k750732l208427l396276m564401m777275k766365J258346
$$ y = [-8148831, -6821471, -8854877, -13427399, -15960720, -12607106, -5214806, 650340, 2046427, 563994, -1395314, -2987458, -3407020, -1573121, 1246739, 1578262, -1273175, -2880176, 736701, 6920664, 9245489, 5892203, 1531699, 627397, 2681057, 5514054, 9374996, 14579052, 17812967, 15304992, 9010827, 5410864, 7566030, 11995718, 14435216, 14888802, 14937251, 13635160, 9479561, 4175366, 924974, 367451, 1192419, 2967315, 4776937, 3054203, -4250201, -12322984, -14082238, -10380132, -9453049, -14673920, -19480004, -17961236, -14160120, -15081603, -19109724, -18592881, -11807631, -5236551, -4102188, -6852920, -10061347, -13457623, -18022024, -22799299, -25565664, -24307318]
2797b4307318O823805J1706008J1708027N808443p83069k661839j073236o78122
2789F542699j880469j258206J859785M211518L511601M67601l588509p416936
2781B449084q935514p154266m357603l142391k456371P1937L461857M885242M275280
2772a0902745L407623K127427j48469j198684O80475K172064m39298m086933l089950
2763a1478490J079596K001629m76538m5129M411624O290944K682428q41924m05257
2754C218883J03080k054473k077108L353990Q069310N111289k118400n111101
2746H495470k368245J066534K547702L015601K100523r73333l718439l735308
2738F430505l349382n165912o220755l103292N04787q52484m348706k805620L068512
$$ y = [-24307318, -17483513, -5777505, 5930522, 11738965, 10955896, 8294057, 7220821, 6542699, 4662230, 3404024, 5263809, 9475327, 12986928, 13454529, 9866020, 2449084, -6486430, -13640696, -17998299, -21140690, -23597061, -23525124, -20063267, -15178025, -10902745, -7495122, -5367695, -5516164, -6714848, -6034373, -3862309, -4301607, -8388540, -11478490, -10398894, -8397265, -8873803, -8918932, -4507308, 1783636, 4466064, 3624140, 3218883, 3321963, 1267490, -809618, 2544372, 10613682, 15724971, 13606571, 8495470, 6127225, 7193759, 9741461, 12757062, 14857585, 13884252, 10165813, 6430505, 3081123, -2084789, -8305544, -11408836, -10904049, -11756533, -16105239, -18910859, -15842347]
2729a5842347N630463L019946J411682L561298M426817Q12741k963625k639480
2721b582505k18594J128702K214471M083406M551749K237615n76193k090626l266773
2712E481252l555508j36718N445609O228615q7076n948388m426657L97213J53092
2703C551434m920412p380310m456520p69782L26963R75754L126998M397796K128724
2694c019355k015054l922937j787672K349945M885669M141357K042767J659176
2686D333896K844830K361508p90965l194995k274857n16035j095400k213618l38150
2677h83786K843323K109438k943557o382738l917681J612748M384130K321281
2669h56842j841205m101744k572658J159753L400584K220410k88433j024519r588
$$ y = [-15842347, -10211884, -7191938, -5780256, -2218958, 2207859, 3020600, 56975, -2582505, -2801099, -1672397, 542074, 4625480, 9177229, 11414844, 10838651, 8748025, 5481252, 1925744, 1789026, 7234635, 13463250, 13376174, 7427786, 3001129, 3398342, 3551434, -1368978, -8749288, -13205808, -13975590, -13648627, -12672873, -9545875, -5148079, -3019355, -5034409, -8957346, -10745018, -8395073, -3509404, 631953, 2674720, 4333896, 7178726, 9540234, 8749269, 5554274, 3279417, 2763382, 1667982, -545636, -883786, 1959537, 4068975, 1125418, -5257320, -9175001, -7562253, -3178123, -856842, -2698047, -6799791, -9372449, -8212696, -4812112, -2591702, -2880135, -3904654, -3914242]
2660c914242Q93774J963290M407995N807050J898496n824950r452460m697394
2652h918441K541774L969691K48120q98553L249611O441800L172749k929267m430511
2643B446973p16109J848933k00964k644078o91027L222400K859894k399898o215964
2634b489840l857130J694014M055084J289169k872177m235247k383127j09783
2626h909037n444j597528j677467J829356O616355Q331561O079681L106989J645031
2617A5419497L44279j887264l210916k524515k266958m056573m716423j168435
2609d067308L271488L015391q32711j773009J954200M875901L202513P3515p55468
2600H964512q68691k908691m926885l893224j611860j856721l597384k504922
$$ y = [-3914242, -3020468, -1057178, 3350817, 9157867, 11056363, 5231413, -4221047, -8918441, -6376667, -2406976, -2158856, -3057409, 192202, 6634002, 9806751, 6877484, 2446973, 1730864, 3579797, 3378833, 734755, 43728, 3266128, 6126022, 3726124, -2489840, -6346970, -4652956, -597872, 691297, -2180880, -6416127, -8799254, -8909037, -8914481, -10512009, -12189476, -10360120, -3743765, 4587796, 10667477, 13774466, 15419497, 15763776, 13876512, 10665596, 8141081, 5874123, 1817550, -2898873, -4067308, -795820, 2219571, 1386860, -386149, 1568051, 6443952, 9646465, 9719980, 8964512, 8095821, 5187130, 260245, -3632979, -5244839, -7101560, -10698944, -13203866]
2592a3203866J586747M116781L104401J898957K994337L741353J263510j897359
2584C604861j204725K645551M398713J963723q20082m65375Q78138p24638m423147
2575E853019n764315l521551j180058j029017q07160J681177L988597K552369
2567A773061j074053j577435K550734O285397M278642k245079o588413m191151
2559g88297J946339M279935m37675o566187o132153N89068N133670K645971j658020
2550i87349j590009j64300l618810q804847o214166M319151J0955498O337892
2542B33060j998131l303252J566937M275630K434083L52819m31927k475751n145208
2533d491740m246078K99739L421903K876254J947424K643061K475866L14439o66648
$$ y = [-13203866, -11617119, -7500338, -4395937, -2496980, 497357, 4238710, 5502220, 3604861, 2400136, 5045687, 9444400, 11408123, 10588041, 10122666, 11000804, 10276166, 5853019, 88704, -3432847, -4612905, -5641922, -6449082, -4767905, -779308, 1773061, 699008, -878427, 1672307, 7957704, 12236346, 9991267, 3402854, -788297, 1158042, 5437977, 5000302, -1565885, -7698038, -7108970, -1975300, 670671, -987349, -2577358, -2741658, -6360468, -15165315, -21379481, -17060330, -6104832, 233060, -1765071, -5068323, -3501386, 774244, 3208327, 3561146, 3129219, 653468, -4491740, -8737818, -8438079, -5016176, -2139922, -192498, 2450563, 4926429, 5240868, 4574220]
2524D574220R26580J289179j966683m838047l252458M9860L61964r13745O89876
2515c079254L964357L206062k363642o737567n556042j067926K616281M327943
2507d689788M091264J215645l023911m381276o29297M675695O250153L243774
2499F752259j027230l864650n109306n301281m399447k227215J072737M529367
2491i574766N784580K812350k564619n016551j789012L218811M113516N42999
2483b472692k448649j547799J105410J787952o0903k274561l212560k934837j939069
2474a3997708j71688K337680M315148L748755O14321j660507J55337L845320L509454
2465B696112j940794n996648l557772J069349N38248l750919l329159M083902
$$ y = [4574220, 5500800, 6789979, 4823296, -14751, -3267209, -3217349, -2855385, -3769130, -3079254, 885103, 4091165, 1727523, -5010044, -10566086, -11634012, -9017731, -4689788, -598524, 617121, -2406790, -6788066, -7417363, -2741668, 3508485, 6752259, 5725029, 1860379, -3248927, -8550208, -12949655, -15176870, -14104133, -9574766, -3790186, -977836, -3542455, -8559006, -10348018, -7129207, -3015691, -2472692, -4921341, -6469140, -5363730, -3575778, -3636681, -5911242, -9123802, -12058639, -13997708, -14169396, -11831716, -7516568, -3767813, -3153492, -4813999, -4658662, -813342, 2696112, 755318, -5241330, -8799102, -7729753, -7191505, -10942424, -14271583, -10187681]
2457a0187681J0460657Q774046J828786l731468o244980o835572l556038N131982
2449d360268J3486737J2718553K704669o520582o901254j445256J362324j266203
2441I778720m320403k548542L187220P470399O310174O37804n227754p433293
2433G854325n088309l39673L184607L007429J59875j751069r86963M3540j246083
2424D837679l189315k769582j509050l444852p275852o583095J02632N419181
2416a4412254L227699k450198l563713P19206M488191M181473J556349p46243
2408f999490j324610R79256N132695O239968J032528o080386p859011m074699
2400a2953749o37711J14993J258555L340551K374502k254484n046584k727917
$$ y = [-10187681, 272976, 9047022, 10875808, 7144340, 899360, -5936212, -9492250, -4360268, 9126469, 21845022, 24549691, 18029109, 11127855, 9682599, 11044923, 9778720, 5458317, 2909775, 6096995, 13567394, 19877568, 20515372, 15287618, 7854325, 2766016, 2426343, 5610950, 8618379, 8778254, 7027185, 6040222, 6083762, 4837679, 1648364, -1121218, -2630268, -6075120, -13350972, -19934067, -19831435, -14412254, -11184555, -13634753, -17198466, -16479260, -11991069, -7809596, -6253247, -6999490, -8324100, -7344844, -2212149, 4027819, 5060347, -1020039, -8879050, -12953749, -13591460, -13476467, -12217912, -8877361, -6502859, -8757343, -13803927, -16531844]
2392a6531844Q40681J624610J467022K949661L517961r81m870340n723668j848918
2383a8575816L165732O602057P321548L963655k791426p905885o642242p63531
2375a5625908L755406M353340L509835L470662L284917J464602j377370l321533
$$ y = [-16531844, -15691163, -14066553, -12599531, -9649870, -6131909, -6132890, -11003230, -16726898, -18575816, -15410084, -8808027, -1486479, 2477176, -314250, -8220135, -14862377, -15625908, -11870502, -7517162, -4007327, -536665, 2748252, 4212854, 2835484, -486049]
$$ [...]
##END NTUPLES=NMR SPECTRUM
##END=
