##TITLE=31Pdec_DCCDE
 , 24 sc
 1.03.2021
##JCAMPDX= 6.0         $$ Bruker NMR JCAMP-DX V2.0
##DATA TYPE= NMR SPECTRUM
##DATA CLASS= NTUPLES
##ORIGIN= UXNMR, Bruker Analytische Messtechnik GmbH
##OWNER= root
$$ XWIN-NMR		Version 3.5
$$ Mon Mar  1 11:53:17 2021 Russian Standard Time (UT+4h)  she@DPX200
##.OBSERVE FREQUENCY= 81.013821
##.OBSERVE NUCLEUS= ^31P
##.ACQUISITION MODE= SIMULTANEOUS
##.ACQUISITION SCHEME= undefined
##.AVERAGES= 24
##.DIGITISER RES= 16
##SPECTROMETER/DATA SYSTEM= spect
##.PULSE SEQUENCE= zgpg30
##.SOLVENT NAME= CD3CN
##.SHIFT REFERENCE= (INTERNAL, CD3CN, 0, 248.564)
##AUDIT TRAIL= $$ (NUMBER, WHEN, WHO, WHERE, WHAT)
$$ ##TITLE= Audit trail, XWIN-NMR		Version 3.5
$$ ##JCAMPDX= 5.01
$$ ##ORIGIN= Bruker BioSpin GmbH
$$ ##OWNER= she
$$ F:/spectra/data/she/nmr/P31/1/pdata/1/auditp.txt
$$ ##AUDIT TRAIL=  $$ (NUMBER, WHEN, WHO, WHERE, WHAT)
(   1,<2021-03-01 11:51:24.65 +0400>,<she>,<DPX200>,
      <created by zg, POWCHK disabled, PULCHK disabled
       configuration hash MD5:
       00 E9 B6 7A A2 85 ED C7 34 08 36 98 17 FE 4E 26
       data hash MD5: 32K
       EC 1E 34 5D 97 70 1E C5 13 55 36 0E 5C EE 13 9B>)
(   2,<2021-03-01 11:51:26.93 +0400>,<she>,<DPX200>,
      <Start of raw data processing
       efp BC_mod = 2 LB = 1 FT_mod = 6 PKNL = 1 PHC0 = -2834.331 PHC1 = -247.1975 SI = 64K 
       data hash MD5: 64K
       EE 1E 81 7A 55 44 EC C7 91 08 DD C8 22 4A 23 F3>)
(   3,<2021-03-01 11:51:54.31 +0400>,<she>,<DPX200>,
      <pk PHC0 = -51.93154 PHC1 = 112.2 
       data hash MD5: 64K
       4A C1 3D 51 D3 A5 EA 57 A0 78 AF DF 6D 9E 63 68>)
(   4,<2021-03-01 11:51:56.78 +0400>,<she>,<DPX200>,
      <abs ABSG = 5 
       data hash MD5: 64K
       1C 64 C5 05 78 56 81 67 FF 8B 06 BE 91 88 07 82>)
(   5,<2021-03-01 11:52:40.76 +0400>,<she>,<DPX200>,
      <pk PHC0 = -16.20412 PHC1 = 27.79999 
       data hash MD5: 64K
       90 77 29 52 B2 B1 89 91 C7 16 88 D0 B5 8B 09 2E>)
$$ ##END=
$$ 
$$ hash MD5
$$ 77 93 17 9D 5C 7F 93 D6 9D D6 0E 7D 7A 38 B9 E5
##$RELAX= 
##$RELAX= 
##$RELAX= 
##$RELAX= 
##$RELAX= 
##$RELAX= 
##$RELAX= 
##$RELAX= 
$$ Bruker specific parameters
$$ --------------------------
##$DU= <F:/spectra>
##$EXPNO= 1
##$NAME= <P31>
##$PROCNO= 1
##$TYPE= <nmr>
##$USER= <she>
##$AMP= (0..31)
100 100 100 100 100 100 100 100 100 100 100 100 100 100 100 100 100 100 
100 100 100 100 100 100 100 100 100 100 100 100 100 100 
##$AQSEQ= 0
##$AQ_mod= 1
##$AUNM= <au_zg>
##$AUTOPOS= <>
##$BF1= 81.014009
##$BF2= 200.13
##$BF3= 200.13
##$BF4= 200.13
##$BF5= 200.13
##$BF6= 200.13
##$BF7= 200.13
##$BF8= 200.13
##$BYTORDA= 1
##$CFDGTYP= 0
##$CFRGTYP= 5
##$CHEMSTR= <none>
##$CNST= (0..31)
1 1 145 1 1 1 1 1 1 1 1 1 1 1 1 1 1 1 1 1 1 1 1 1 1 1 1 1 1 1 1 1 
##$CPDPRG= <waltz16>
##$CPDPRG1= <>
##$CPDPRG2= <waltz16>
##$CPDPRG3= <>
##$CPDPRG4= <mlev>
##$CPDPRG5= <mlev>
##$CPDPRG6= <mlev>
##$CPDPRG7= <mlev>
##$CPDPRG8= <mlev>
##$CPDPRGB= <>
##$CPDPRGT= <>
##$D= (0..31)
0 1 0 0 0 0 0 0 0 0 0 0.03 2e-05 3e-06 0 0 0 0 0 0 0 0 0 0 0 0 0 0 0 0 
0 0 
$$ [...]
##$SUBNAM3= <"">
##$SUBNAM4= <"">
##$SUBNAM5= <"">
##$SUBNAM6= <"">
##$SUBNAM7= <"">
##$SUBNAM8= <"">
##$SUBNAM9= <"">
##$SW= 501.771253377433
##$SWIBOX= (0..15)
0 1 3 0 0 0 0 0 0 0 0 0 0 0 0 0 
##$SW_h= 40650.406504065
##$TD= 32768
##$TD0= 1
##$TE= 0
##$TE2= 300
##$TE3= 300
##$TEG= 300
##$TL= (0..7)
0 120 53 12 22 120 120 120 
##$TP= (0..7)
150 150 150 150 150 150 150 150 
##$TP07= 0
##$TPNAME0= <>
##$TPNAME1= <>
##$TPNAME2= <>
##$TPNAME3= <>
##$TPNAME4= <>
##$TPNAME5= <>
##$TPNAME6= <>
##$TPNAME7= <>
##$TPOAL= (0..7)
0.5 0.5 0.5 0.5 0.5 0.5 0.5 0.5 
##$TPOFFS= (0..7)
0 0 0 0 0 0 0 0 
##$TUNHIN= 0
##$TUNHOUT= 0
##$TUNXOUT= 0
##$USERA1= <user>
##$USERA2= <user>
##$USERA3= <user>
##$USERA4= <user>
##$USERA5= <user>
##$V9= 5
##$VALIST= <valist>
##$VCLIST= <CCCCCCCCCCCCCCC>
##$VD= 0
##$VDLIST= <DDDDDDDDDDDDDDD>
##$VPLIST= <PPPPPPPPPPPPPPP>
##$VTLIST= <TTTTTTTTTTTTTTT>
##$WBST= 1024
##$WBSW= 4
##$XGAIN= (0..3)
0 0 0 0 
##$XL= 0
##$YL= 0
##$YMAX_a= 6398
##$YMIN_a= -8560
##$ZGOPTNS= <>
##$ZL1= 120
##$ZL2= 120
##$ZL3= 120
##$ZL4= 120
##$ABSF1= 248.5645
##$ABSF2= -253.2056
##$ABSG= 5
##$ABSL= 3
##$ALPHA= 0
##$AQORDER= 0
##$ASSFAC= 0
##$ASSFACI= 0
##$ASSFACX= 0
##$ASSWID= 0
##$AUNMP= <proc_1d>
##$AZFE= 0.1
##$AZFW= 0.5
##$BCFW= 0
##$BC_mod= 2
##$BYTORDP= 0
##$COROFFS= 0
##$CY= -3
##$DATMOD= 1
##$DC= 0
##$DFILT= <>
##$DTYPP= 0
##$F1P= 0
##$F2P= 0
##$FCOR= 1
##$FTSIZE= 65536
##$FT_mod= 6
##$GAMMA= 0
##$GB= 0
##$INTBC= 1
##$INTSCL= 5.30512e-09
##$ISEN= 30
##$LB= 1
##$LEV0= 0
##$LPBIN= 0
##$MAXI= 10000
##$MC2= 0
##$MEAN= 0
##$ME_mod= 0
##$MI= 50
##$NCOEF= 0
##$NC_proc= -6
##$NLEV= 6
##$NOISF1= 182.463
##$NOISF2= 159.3651
##$NSP= 0
##$NTH_PI= 0
##$NZP= 0
##$OFFSET= 248.5645
##$PC= 4
##$PHC0= -2902.467
##$PHC1= -107.1975
##$PH_mod= 1
##$PKNL= yes
##$PPARMOD= 0
##$PSCAL= 0
##$PSIGN= 0
##$REVERSE= no
##$SF= 81.014009
##$SI= 65536
##$SIGF1= 159.3651
##$SIGF2= -187.1042
##$SINO= 113.3802
##$SIOLD= 16384
##$SREGLST= <1H.CDCl3>
##$SSB= 0
##$STSI= 65536
##$STSR= 0
##$SW_p= 40650.406504065
##$SYMM= 0
##$S_DEV= 0
##$TDeff= 32768
##$TDoff= 0
##$TI= <>
##$TILT= no
##$TM1= 0
##$TM2= 0
##$TOPLEV= 0
##$USERP1= <user>
##$USERP2= <user>
##$USERP3= <user>
##$USERP4= <user>
##$USERP5= <user>
##$WDW= 1
##$XDIM= 65536
##$YMAX_p= 463553898
##$YMIN_p= -13675563
$$ End of Bruker specific parameters
$$ ---------------------------------
##NTUPLES= NMR SPECTRUM
##VAR_NAME=  FREQUENCY,     SPECTRUM/REAL,   SPECTRUM/IMAG
##SYMBOL=    X,             R,               I
##VAR_TYPE=  INDEPENDENT,   DEPENDENT,       DEPENDENT
##VAR_FORM=  AFFN,          ASDF,            ASDF
##VAR_DIM=   65536,         65536,           65536
##UNITS=     HZ,            ARBITRARY UNITS, ARBITRARY UNITS
##FACTOR=    0.620285442955139, 1,           1
##FIRST=     20137.2065510759, 0,            0
##LAST=      -20513.1999529892, 0,           0
##MIN=       -20513.1999529892, -13675563,   0
##MAX=       20137.2065510759, 463553898,    0
$$ Real data points
##PAGE= N=1
##DATA TABLE= (X++(R..R)), XYDATA
$$ [...]
$$ plain form
36557 -528158 -785816 -902044 -1447776 -2459415 -2240449 184254 2898609 3217473 1170022
36548 1170022 -730139 -751953 460027 1473358 1935899 2413379 3185804 3947607 4528723
36539 4528723 5207986 5923309 5660158 3551842 631373 -693782 366703 1550660 326188
36530 326188 -2584994 -4057102 -2756858 -807095 -864124 -2959950 -4973910 -5166986 -3428507
36521 -3428507 -816951 1255577 1845315 1189937 344398 -201159 -948856 -2011799 -2128938
36512 -2128938 -78930 3206598 5035613 3841019 1109035 -120634 1405540 3840407
36504 3840407 4610012 3633738 3119066 3999673 4134517 1412854 -2484732 -3725700 -1644945
36495 -1644945 62476 -1594618 -4825374 -5738907 -3499088 -638326 835586 1212264
$$ packed form
36557e28158k57658j16228n45732j011639K18966K424703K714355L18864k047451
36548A170022j900161k1814J211980J013331M62541M77480P72425P61803N81116
36539D528723O79263P15323k63151k108316k920469j325155J060485J183957j224472
36530C26188k911182j472108J300244J949763n7029k095826k013960j93076J738479
36521c428507K611556K072528N89738o55378q45539n45557p47697j062943j17139
36512b128938K050008L285528J829015j194594k731984j229669J526174K434867
36504C840407P69605r76274n14672Q80607J34844k721663l897586j240968K080755
36495a644945J707421j657094l230756r13533K239819K860762J473912L76678
$$ plain form
36487 1212264 1095024 34983 -2053641 -3762009 -3579294 -1639221 554849 1523638 684513
36478 684513 -1258817 -2444354 -1341318 1376679 3297904 3059534 1760798 1189179 1801885
36469 1801885 3099335 4649177 5689619 5035357 2836507 1295135 1849846 2592160 669926
36460 669926 -3298975 -5720276 -4900456 -2783138 -1308022 148948 2330668 3620299
36452 3620299 2200952 -931912 -3345411 -4423923 -5053734 -4972851 -2988287 317053 2484287
36443 2484287 2280920 1081209 534766 440867 -151927 -921020 -577873 1110379 2488536
36434 2488536 1537675 -1859296 -5514289 -7169099 -6740408 -5438154 -3197104 925012
36426 925012 5474936 6539971 2792976 -1682255 -2184888 702952 2912239 3061545 3183591
$$ packed form
36487A212264j17240j060041k088624j708368J82715J940073K194070R68789q39125
36478F84513j943330j185537J103036K717997J921225k38370j298736n71619O12706
36469A801885J297450J549842J040442o54262k198850j541372N54711P42314j922234
36460F69926l968901k421301Q19820K117318J475116J456970K181720J289631
36452C620299j419347l132864k413499j078512o29811Q0883J984564L305340K167234
36443B484287k03367j199711n46443r3899n92794p69093L43147J688252J378157
36434B488536r50861l396971l654993j654810M28691J302254K241050M122116
36426I25012M549924J065035l746995m475231n02633K887840K209287J49306J22046
$$ plain form
36417 3183591 4030213 3733047 1574867 -488807 -985801 -592242 143952 1765964 3756559
36408 3756559 4395764 3637886 3136857 2725790 427990 -3053273 -3969091 -1337801 1108926
36399 1108926 1035810 1067064 3142960 3940807 382433 -4161753 -4482737 -1488075 46444
36390 46444 -479590 279470 2529116 2699622 -49086 -2383353 -2590103 -2645801 -3395315
36381 -3395315 -2580853 567682 3004869 2202494 -480680 -2396748 -2597897 -1036657 2060396
36372 2060396 4778319 4575438 1987367 323378 811249 1397834 1199664 2109552 4493891
36363 4493891 5496910 3832826 2295737 2844481 2982804 251660 -3042623 -3276705 -1040920
36354 -1040920 489865 618017 923902 1635967 1667415 1113345 696499 -182623 -2138328
$$ packed form
36417C183591Q46622k97166k158180k063674m96994L93559P36194J622012J990595
36408C756559O39205p57878n01029m11067k297800l481263r15818K631290K446727
36399A108926p3116L1254K075896P97847l558374m544186l20984K994662J534519
36390D6444n26034P59060K249646J70506k748708k334267k06750n5698p49514
36381c395315Q14462L148535K437187q02375k683174j916068k01149J561240L097053
36372B060396K717923k02881k588071j663989M87871N86585j98170R09888K384339
36363D493891J003019j664084j537089N48744J38323k731144l294283k34082K235785
36354a040920J530785J28152L05885P12065L1448n54070m16846q79122j955705
$$ plain form
36345 -2138328 -3744987 -3387600 -1915810 -978321 -202120 1305877 2235188 894929 -1525400
36336 -1525400 -2618281 -2606055 -3437723 -5024234 -5616578 -5260315 -5641049 -6832415 -7204924
36327 -7204924 -6363780 -5397567 -4433910 -2627302 -346893 1181839 2067640 3058326 3248960
36318 3248960 1341947 -1291647 -1940226 -764677 -495937 -1838262 -2462191 -1156654 131307
36309 131307 -472742 -1953276 -2067765 -232211 1984371 2167182 -944952 -5481705 -7315310
36300 -7315310 -4695451 -858965 163538 -1216434 -1973822 -1698024 -1969517 -1868298 968546
36291 968546 5144024 6431261 4283196 2435547 2351064 1373749 -1316094 -2536784 -1140349
36282 -1140349 -752731 -3347411 -5090135 -2454293 1856727 3336392 2299435 1695892
$$ packed form
36345b138328j606659L57387J471790R37489P76201J507997R29311j340259k420329
36336a525400j092881J2226q31668j586511n92344L56263l80734j191366l72509
36327g204924Q41144R66213R63657J806608K280409J528732Q85801R90686J90634
36318C248960j907013k633594o48579J175549K68740j342325o23929J305537J287961
36309A31307o04049j480534j14489J835554K216582J82811l112134m536753j833605
36300g315310K619859L836486J022503j379972p57388K75798k71493J01219K836844
36291I68546M175478J287237k148065j847649q4483r77315k689843j220690J396435
36282a140349L87618k594680j742724K635842M311020J479665j036957o03543
$$ plain form
36274 1695892 1657459 921162 828133 2944235 4982872 4107652 2345841 3436284 5815441
36265 5815441 4541909 -323058 -3151014 -1204685 1714176 1574897 -585140 -1768174
36257 -1768174 -1587285 -1265064 -899137 -103162 608634 947954 1685024 2861592 2852601 772831
36247 772831 -1539583 -1457320 1399486 5113639 7592042 7861302 6091630 3298123 728877
36238 728877 -862419 -1255647 -549045 405772 56574 -2062883 -4040512 -3523915 -635641
36229 -635641 2502886 4711538 6425559 7734052 7846176 6710461 5312944 4097071
36221 4097071 2753732 1624217 1408305 1384703 64106 -2082143 -2842722 -1797660 -1236610
36212 -1236610 -2575520 -4203606 -4311434 -3726391 -4076980 -4794936 -4067737 -1843956 -7410
$$ packed form
36274A695892l8433p36297r3029K116102K038637q75220j761811J090443K379157
36265E815441j273532m864967k827956J946329K918861j39279k160037j183034
36257a768174J80889L22221L65927P95975P11796L39320P37070J176568q991k079770
36247G72831k312414Q2263K856806L714153K478403K69260j769672k793507k569246
36238G28877j591296l93228P06602R54817l49198k119457j977629N16597K888274
36229f35641L138527K208652J714021J308493J12124j135715j397517j215873
36221D097071j343339j129515k15912k3602j320597k146249p60579J045062N61050
36212a236610j338910j628086j07828N85043l50589p17956P27199K223781J836546
$$ plain form
36203 -7410 6826 -1575185 -3550796 -4478146 -3239704 -53170 3248317 4680767 3669732
36194 3669732 953416 -2253086 -4549853 -4801716 -3107939 -732420 1370870 3184659
36186 3184659 4535622 4632242 3323040 1606849 174318 -1285317 -2553580 -2254966 -81387
36177 -81387 1783896 1215808 -882093 -2002466 -1671449 -1582440 -2396221 -2645846 -1328809
36168 -1328809 243702 246341 -1097927 -1885574 -1031526 522778 1109605 188467 -1423087
36159 -1423087 -2759820 -3446068 -3173405 -1389180 1751789 4820525 6534344 7182570 7410757
36150 7410757 6356208 3065062 -522813 -773848 2630728 5479687 4406090 1298384
36142 1298384 300166 2175799 4138818 4169761 2908555 1664689 842009 376683 13037
$$ packed form
36203g410J4236j582011j975611r27350J238442L186534L301487J432450j011035
36194C669732k716316l206502k296767k51863J693777K375519K103290J813789
36186C184659J350963R6620j309202j716191j432531j459635j268263K98614K173579
36177h1387J865283n68088k097901j120373L31017Q9009q13781k49625J317037
36168a328809J572511K639j344268p87647Q54048J554304N86827r21138j611554
36159a423087j336733o86248K72663J784225L140969L068736J713819O48226K28187
36150G410757j054549l291146l587875k51035L404576K848959j073597l107706
36142A298384r98218J875633J963019L0943j261206j243866q22680m65326l63646
$$ plain form
36133 13037 -810530 -1983335 -2080744 -198956 2214892 3126500 2817429 2983465 3652336
36124 3652336 3540997 3026038 3708967 4907093 3944858 828009 -798116 893623 2686976
36115 2686976 1181197 -1755779 -1834518 1013957 2765674 1643720 382069 1259335 2309011
36106 2309011 614660 -2843709 -4321231 -2473562 38900 319944 -1244232 -2089743
36098 -2089743 -961613 861876 1494719 614388 -463598 -296557 1375069 3468078 4403428
36089 4403428 3303893 652686 -2165257 -3963423 -4430643 -4076354 -3881795 -4664016 -6078904
36080 -6078904 -6452684 -4571811 -1648356 -309493 -1341764 -2799710 -2948009 -2525984 -2949868
36071 -2949868 -3774160 -3637232 -2585563 -1525346 -281655 1626073 3026280 2462508 1112286
$$ packed form
36133A3037q23567j172805r7409J881788K413848R11608l09071J66036O68871
36124C652336j11339n14959O82929J198126r62235l116849j626125J691739J793353
36115B686976j505779k936976p8739K848475J751717j121954j261651Q77266J049676
36106B309011j694351l458369j477522J847669K512462K81044j564176q45511
36098b089743J128130J823489O32843q80331j077986J67041J671626K093009R35350
36089D403428j099535k651207k817943j798166m67220L54289J94559p82221j414888
36080f078904l73780J880873K923455J338863j032271j457946j48299M22025m23884
36071b949868q24292J36928J051669J060217J243691J907728J400207n63772j350222
$$ plain form
36062 1112286 1440043 2852974 1940405 -2094694 -5527381 -5349153 -3451080 -3149093 -4040762
36053 -4040762 -3480274 -1511182 -727486 -1730873 -2147289 -615621 1116284 1164047 422144
36044 422144 1049403 3265356 4968993 4090056 588603 -3643970 -6547996 -7631549 -7780630
36035 -7780630 -7340840 -5432734 -1981110 811317 767026 -1143345 -2010200 -1068281 -296295
36026 -296295 -749851 -912358 213754 824811 -880507 -3339444 -3524367 -1329539 484463
36017 484463 593313 806600 2698384 4698450 4173045 1214751 -1452385 -1966006 -1046864
36008 -1046864 -85444 832289 2052880 2713069 1568369 -760147 -1898666 -632305 1313346
35999 1313346 1241715 -1286827 -4029749 -4689013 -3230502 -1454993 -753656 -671654 246328
$$ packed form
36062A112286L27757J412931r12569m035099l432687J78228J898073L01987q91669
36053d040762N60488J969092P83696j003387m16416J531668J731905M7763p41903
36044D22144O27259K215953J703637q78937l501453m232573k904026j083553j49081
36035g780630M39790J908106L451624K792427m4291j910371q66855R41919P71986
36026b96295m53556j62507J126112O11057j705318k458937j84923K194828J814002
36017D84463J08850K13287J891784K000066n25405k958294k667136n13621R19142
36008a046864R61420R17733J220591O60189j144700k328516j138519J266361J945651
35999A313346p1631k528542k742922o59264J458511J775509P01337Q2002R17982
$$ plain form
35990 246328 2324506 3878280 2947745 -166405 -2737107 -2321140 642511 3182184 2677124
35981 2677124 -514578 -3208295 -2610525 341852 1760652 -270802 -2830034 -2045461
35973 -2045461 1193306 2345381 -49074 -2255005 -1149662 1262228 1453879 -316474
35965 -316474 -1331101 -978270 -636827 -399160 605318 1441617 413146 -1475687 -1504365
35956 -1504365 297088 966378 -799171 -3085041 -4341060 -5301199 -6381640 -6213795 -4136439
35947 -4136439 -1618509 84092 1400613 2503487 2300667 594995 -981025 -1360369
35939 -1360369 -1298522 -1404813 -1255611 -1184132 -2235003 -3547615 -2869239 -583630 338523
35930 338523 -419292 437094 3624182 4844803 1614938 -2007672 -1534352 1235236 2257708
$$ packed form
35990B46328K078178J553774r30535l114150k570702M15967K963651K539673n05060
35981B677124l191702k693717N97770K952377J418800k031454k559232P84573
35973b045461L238767J152075k394455k205931J105343K411890J91651j770353
35965c16474j014627L52831L41443K37667J004478Q36299j028471j888833k8678
35956a504365J801453O69290j765549k285870j256019r60139j080441J67845K077356
35947d136439K517930J702601J316521J102874k02820j705672j576020l79344
35939a360369O1847j06291J49202P1479j050871j312612O78376K285609R22153
35930C38523p57815Q56386L187088J220621l229865l622610M73320K769588J022472
$$ plain form
35921 2257708 2114403 3285060 3962632 1154596 -2440038 -1846704 1212642 410472 -4217843
35912 -4217843 -5386990 -220748 4836681 3926747 -55070 -1442135 -454821 -791781 -2543039
35903 -2543039 -2877087 -1508098 -685454 -900498 -521512 872162 1840570 1420089 -66870
35894 -66870 -1978675 -3481351 -3595246 -2518080 -1784346 -1961597 -1732206 -429450 471859
35885 471859 -129656 -1035201 -1070923 -1225294 -2428355 -3219381 -1979289 169517 994792
35876 994792 233543 -1022959 -2374137 -3351337 -2368573 1007929 4144257 4211168 1810298
35867 1810298 -449292 -1526257 -1795109 -1008408 878506 2296551 2167954 1914807 2662641
35858 2662641 2376861 -832052 -4424067 -4540905 -1983607 -574200 -590784 1013052 4057472
$$ packed form
35921B257708j43305J170657O77572k808036l594634N93334L059346q02170m628315
35912d217843j169147N166242N057429r09934l981817j387065R87314l36960j751258
35903b543039l34048J368989Q22644k15044L78986J393674R68408m20481j486959
35894f6870j911805j502676j13895J077166P33734j77251K29391J302756R01309
35885D71859o01515r05545l5722j54371j203061p91026J240092K148806Q25275
35876I94792p61249j256502j351178r77200R82764L376502L136328O6911k400870
35867A810298k259590j076965k68852P86701J886914J418045j28597k53147P47834
35858B662641k85780l208913l592015j16838K557298J409407j6584J603836L044420
$$ plain form
35849 4057472 4413755 937773 -2090588 -1521207 180085 -458765 -2742745 -4175807 -4681728
35840 -4681728 -5234832 -4920755 -2748795 -503382 -531663 -1980377 -2208797 -999310 -525173
35831 -525173 -1670949 -3042939 -3559732 -3707078 -3901187 -3473559 -1948985 -164830 576896
35822 576896 46689 -540601 294475 2595179 4657927 4962981 4049386 3471461 3357306
35813 3357306 2685243 1832727 2586811 5016767 6592357 5598390 3474188 2364397 2169586
35804 2169586 1675768 926670 490525 -285533 -2093381 -3608124 -2781676 192018 3020893
35795 3020893 4176333 4066207 3636849 3340265 3443340 4110923 5103776 6095150 6950391
35786 6950391 7206968 6249209 4822612 5089060 7855838 10999340 12302279 12652456 14348961
$$ packed form
35849D057472L56283l475982l028361N69381J701292o38850k283980j433062n05921
35840d681728n53104L14077K171960K245413k8281j448714k28420J209487M74137
35831e25173j145776j371990n16793j47346j94109M27628J524574J784155P41726
35822E76896n30207n87290Q35076K300704K062748L05054r13595n77925j14155
35813C357306o72063q52516P54084K429956J575590r93967k124202j109791j94811
35804B169586m93818p49098m36145p76058j807848j514743Q26448K973694K828875
35795C020893J155440j10126m29358k96584J03075O67583R92853R91374Q55241
35786F950391K56577r57759j426597K66448K766778L143502J302939L50177J696505
$$ plain form
35777 14348961 17234133 19055194 19263898 19870482 22424342 26530888 31691180 38302477
35769 38302477 46220203 54447395 62996558 73028900 84250883 94145012 100848891 104853460
35761 104853460 106611098 104630675 97980966 89022938 81157381 74743842 67672312 59458374
35753 59458374 52163397 47108163 43160846 39026184 35039783 31512175 27237536 21414433
35745 21414433 15739793 12615215 11986208 11878300 11590244 12155250 13557488 13844828 11934581
35736 11934581 9428398 8394727 8842376 9687337 10723583 11964820 12345182 11100116
35728 11100116 9449896 8743444 7854198 5054183 1855997 1786561 5177621 8442917 9256556
35719 9256556 9106356 9431027 8787765 6161392 3898202 4211089 5242050 4149070 2205340
$$ packed form
35777A4348961K885172J821061K08704O06584K553860M106546N160292O611297
35769C8302477P917726Q227192Q549163J0032342J1221983R894129O703879M004569
35761A04853460J757638j980423o649709q958028p865557o413539p071530q213938
35753E9458374p294977n055234l947317m134662l986401l527608m274639n823103
35745B1414433n674640l124578o29007j07908k88056N65006J402238K87340j910247
35736A1934581k506183j033671M47649Q44961J036246J241237L80362j245066
35728A1100116j650220p06452q89246k800015l198186o9436L391060L265296Q13639
35719I256556j50200L24671o43262k626373k263190L12887J030961j092980j943730
$$ plain form
35710 2205340 2831010 5675311 6888839 5084111 2981387 2660385 2961013 2625739 2567939
35701 2567939 3494610 4192675 3867142 3717825 4601382 5474606 5743178 6725019 8934276
35692 8934276 10318271 9392811 7883611 7757737 7772216 5935881 3546396 3298706 4665340
35683 4665340 4933659 4112617 4736407 6794123 7150223 5013458 3875299 6000112 8492719
35674 8492719 7600674 4268814 2289379 2743434 3511118 3265209 2815127 2818603 2916913 3173769
35664 3173769 3979503 4433812 3161877 985904 404937 1867077 2909857 1886063 243316
35655 243316 -171154 124993 -54052 14471 1572910 3626030 3934696 2211871 303123
35646 303123 -411531 81742 1621851 3763572 4676069 2628611 -966979 -2311325 28154
$$ packed form
35710B205340O25670K844301J213528j804728k102724l21002L00628l35274n7800
35701B567939R26671O98065l25533j49317Q83557Q73224K68572R81841K209257
35692H934276J383995r25460j509200j25874J4479j836335k389485k47690J366634
35683D665340K68319q21042O23790K057716L56100k136765j138159K124813K492607
35674H492719q92045l331860j979435M54055P67684k45909m50082L476R8310K56856
35664C173769Q05734M54309j271935k175973n80967J462140J042780j023794j642747
35655B43316m14470K96147j79045O8523J558439K053120L08666j722825j908748
35646C03123p14654M93273J540109K141721R12497k047458l595590j344346K339479
$$ plain form
35637 28154 3060338 3263356 882234 -1068444 -748082 1189113 3339328 4932062 5692777
35628 5692777 5567952 4746109 3556684 2612734 2998738 5186691 7466987 7104515 4049554
35619 4049554 1825109 3118819 5968954 6480824 4228703 2298467 2403617 2897975 2099348
35610 2099348 846095 519136 717936 583913 862236 2713193 5282315 6266732 4780685
35601 4780685 2391777 1230758 1889137 3229509 3718650 2926622 1938707 2061382 3073834
35592 3073834 3429331 2468183 1535428 2184578 3971406 4941839 3908115 1443682 -995850
35583 -995850 -2114096 -1308280 853596 2782572 3287408 2730082 2102548 1395708 19787
35574 19787 -1400033 -1196144 939906 3041364 3161586 1682848 541667 919438 2514307
$$ packed form
35637B8154L032184K03018k381122j950678L20362J937195K150215J592734P60715
35628E692777j24825q21843j189425r43950L86004K187953K280296l62472l054961
35619D049554k224445J293710K850135N11870k252121j930236J05150M94358p98627
35610B099348j253253l26959J98800j34023K78323J850957K569122R84417j486047
35601D780685k388908j161019O58379J340372M89141p92028r87915J22675J012452
35592C073834L55497r61148r32755O49150J786828R70433j033724k464433k439532
35583i95850j118246Q05816K161876J928976N04836n57326o27534p06840j375921
35574A9787j419820K03889K136050K101458J20222j478738j141181L77771J594869
$$ plain form
35565 2514307 4329726 5135992 3774003 328713 -3179324 -4476151 -3413479 -1650885
35557 -1650885 -181367 1373614 2956991 3476518 2870544 3014849 5028622 6987408 6329540
35548 6329540 3807468 2711950 4128184 5317944 3705914 528755 -1015087 -33665
35540 -33665 1395939 1385595 461798 434920 2105154 4500152 5866243 5193422 3087079
35531 3087079 1201616 599786 828081 902177 821742 1359258 2416407 2598035 1059479
35522 1059479 -832294 -738150 1660301 3896737 3606037 1460811 181808 1049500 2871551
35513 2871551 4456015 6237750 8572733 10215850 10143984 9586730 10306295 11907303 13146851
35504 13146851 15158876 20652429 30040258 40946569 51341346 60027920 64020991 59723517
$$ packed form
35565B514307J815419Q06266j361989l445290l508037j296827J062672J762594
35557a650885J469518J554981J583377N19527o05974J44305K013773J958786o57868
35548F329540k522072j095518J416234J189760j612030l177159j543842R81422
35540c3665J429604j0344r23797k6878J670234K394998J366091o72821k106343
35531C087079j885463o01830K28295P4096q0435N37516J057149J81628j538556
35522A059479j891773R4144K398451K236436k90700k145226j279003Q67692J822051
35513B871551J584464J781735K334983J643117p1866n57254P19565J601008J239548
35504A3146851K012025N493553R387829J0906311J0394777Q686574L993071m297474
$$ plain form
35496 59723517 48434288 36920772 29956028 25439870 19674064 13985718 11922719 12456211
35488 12456211 11174721 7317810 4603627 4872452 5514773 4256807 2481323 2134577
35480 2134577 2580557 2437454 2071966 2477001 3511080 4574241 5387992 5289179 3650802
35471 3650802 1636177 1276273 2116716 1431375 -1229004 -2685892 -973537 1373235 1135651
35462 1135651 -980478 -2164212 -1878783 -1618427 -1858408 -2052526 -2490872 -3454612 -3450366
35453 -3450366 -926511 2908400 5394035 5907418 5741325 5296492 4061964 2938951 3747879
35444 3747879 6230215 7915801 7321891 5384356 3621894 2699133 2726341 3141118 2517644
35435 2517644 389186 -1237538 -437719 1186378 483658 -2154284 -3109689 -1271077 267200
$$ packed form
35496E9723517j1289229j1513516o964744m516158n765806n688346k062999N33492
35488A2456211j281490l856911k714183K68825O42321j257966j775484l46746
35480B134577M45980j43103l65488M05035J034079J063161Q13751r8813j638377
35471C650802k014625l59904Q40443o85341k660379j456888J712355K346772k37584
35462A135651k116129j183734K85429K60356k39981j94118m38346r63740M246
35453c450366K523855L834911K485635N13383j66093m44833j234528j123013Q08928
35444C747879K482336J685586n93910j937535j762462r22761K7208M14777o23474
35435B517644k128458j626724P99819J624097p02720k637942r55405J838612J538277
$$ plain form
35426 267200 -572479 -1531780 18215 2796634 3845316 2820459 1550917 1015525 985548
35417 985548 1127274 543941 -1889351 -4685934 -3633959 2587088 8946434 9953182 7237903
35408 7237903 6818637 9936907 11919768 10328439 8505004 9093969 9303764 6055437 1718594
35399 1718594 407157 1410027 923891 -1475668 -2834049 -2388687 -2335651 -2969830 -1788834
35390 -1788834 1457238 3138854 1119991 -1864870 -2554026 -1686815 -1420743 -1100798 872676
35381 872676 3005916 2511549 191622 -282388 2202845 4914888 5609390 4902139 3755880
35372 3755880 1805851 -609667 -1505551 73117 2515413 4184766 5557467 7435738
35364 7435738 8929680 8845287 7532305 5863236 3871081 1812320 965930 1819372 3051776
$$ packed form
35426B67200q39679r59301J549995K778419J048682j024857j269542n35392k9977
35417I85548J41726n83333k433292k796583J051975O221047O359346J006748k715279
35408G237903m19266L118270J982861j591329j823435N88965K09795l248327m336843
35399A718594j311437J002870m86136k399559j358381M45362N3036o34179J180996
35390a788834L246072J681616k018863k984861o89156Q67211K66072L19945J973474
35381H72676K133240m94367k319927m74010K485233K712043O94502p07251j146259
35372C755880j950029k415518q95884J578668K442296J669353J372701J878271
35364G435738J493942q4393j312982j669069j992155k058761q46390Q53442J232404
$$ plain form
35355 3051776 3839558 5225011 7280142 7209754 3246523 -1334184 -1779691 1360215 2819324
35346 2819324 31747 -3676243 -4113873 -1246495 2116563 4013972 4146515 3017873
35338 3017873 1778706 1494720 1608739 667859 -798622 -265163 2859163 5575422 5251214
35329 5251214 3226014 2392806 2852634 2488864 875050 -45283 910177 2481104 2787886
35320 2787886 1451333 -396481 -1326951 -847579 -34578 -476343 -1942356 -2056089 548843
35311 548843 3720766 4116697 1464686 -1307398 -1945339 -1017531 -163817 -92362 -799008
35302 -799008 -2161065 -3588330 -4281074 -4382342 -4716511 -4948592 -3431579 285603 4092019
35293 4092019 5601562 4876826 3688960 2814784 1486378 -709649 -2707852 -3043542 -1350503
$$ packed form
35355C051776P87782J385453K055131p0388l963231m580707m45507L139906J459109
35346B819324k787577l707990m37630K867378L363058J897409J32543j128642
35338C017873j239167k83986J14019r40880j466481N33459L124326K716259l24208
35329E251214k025200q33208M59828l63770j613814r20333R55460J570927L06782
35320B787886j336553j847814r30470M79372Q13001m41765j466013j13733K604932
35311E48843L171923L95931k652011k772084o37941R27808Q53714P1455p06646
35302g99008j362057j427265o92744j01268l34169k32081J517013L717182L806416
35293D092019J509543p24736j187866q74176j328406k196027j998203l35690J693039
$$ plain form
35284 -1350503 1402549 3703041 4503410 3931831 3117836 3032350 3498433 3565143 2751138
35275 2751138 1654835 1386028 2519496 4454715 5774580 5608026 4752655 4935248 6711310
35266 6711310 8667300 9027594 7377664 4428314 1101552 -1335931 -1432268 583212 1894873
35257 1894873 108894 -3055031 -3332925 450265 4580841 5194728 2654723 -135965
35249 -135965 -1631461 -1858298 -618859 1803383 3257754 1951856 -416695 -608677 1228000
35240 1228000 1609276 -936969 -3689600 -3928218 -2379858 -904538 599608 2825636
35232 2825636 4636138 4374162 2283372 -284249 -2731162 -4516455 -4242590 -1656047
35224 -1656047 837136 984480 -257821 -836473 -1269830 -3271160 -5949330 -6799884 -5758071
$$ packed form
35284a350503K753052K300492Q00369n71579q13995q5486M66083O6710q14005
35275B751138j096303k68807J133468J935219J319865j66554q55371J82593J776062
35266F711310J955990L60294j649930k949350l326762k437483r6337K015480J311661
35257A894873j785979l163925k77894L783190M130576O13887k540005k790688
35249a35965j495496k26837J239439K422242J454371j305898k368551j91982J836677
35240A228000L81276k546245k752631k38618J548360J475320J504146K226028
35232B825636J810502k61976k090790k567621k446913j785293K73865K586543
35224a656047K493183J47344j242301n78652m33357k001330k678170q50554J041813
$$ plain form
35215 -5758071 -4702694 -3406553 -18435 4254308 5304513 2178810 -983557 -893530
35207 -893530 494824 -237721 -2828892 -4523513 -4059572 -2054084 594249 2507366 2004809
35198 2004809 -364610 -1378776 689643 3488373 4287426 3935716 4548787 5615062 5569616
35189 5569616 5183155 5789652 5796294 2904647 -1271197 -2847461 -1399954 -153562 -661024
35180 -661024 -1126279 -138027 1637628 3790143 6552980 8459857 7335356 4261863 2808224
35171 2808224 3532152 3268560 1014818 84755 2329223 4471979 3169713 117287 -1272293
35162 -1272293 -1181093 -1598941 -1781953 194376 2866913 2710193 -374479 -2617588 -1644327
35153 -1644327 793145 1769802 585104 -1145095 -1124758 1750535 5625727 6445619 2378923
$$ packed form
35215e758071J055377J296141L388118M272743J050205l125703l162367R0027
35207h93530J388354p32545k591171j694621M63941K005488K648333J913117n02557
35198B004809k369419j014166K068419K798730P99053l51710O13071J066275m5446
35189E569616l86461O06497O642k891647m175844j576264J447507J246392n07462
35180f61024m65255R88252J775655K152515K762837J906877j124501l073493j453639
35171B808224P23928k63592k253742r30063K244468K142756j302266l052426j389580
35162a272293R1200m17848j83012J976329K672537j56720l084672k243109R73261
35153a644327K437472R76657j184698j730199K0337K875293L875192Q19892m066696
$$ plain form
35144 2378923 -3209146 -5370983 -3552484 -1536129 -1848615 -3034214 -2735458 -781561
35136 -781561 1670507 3909810 5449352 5565296 4133437 2013741 32899 -1646180
35128 -1646180 -3007263 -3943833 -4524284 -4615433 -3603518 -1615559 -421543 -1489217 -3507826
35119 -3507826 -3694130 -1477425 961332 1873680 1762121 1721228 1760660 1332214 159200
35110 159200 -1777419 -3878908 -4646782 -3217407 -1007940 -245013 -1141596 -2234697 -2880813
35101 -2880813 -3155417 -2011025 1382704 4700108 4377598 824661 -1898430 -2221646 -2814004
35092 -2814004 -5026115 -6176824 -4658296 -3168306 -3509614 -2495335 2444677 7207259
35084 7207259 6158133 999098 -1472199 686975 2905144 2268272 1237456 2006769
$$ packed form
35144B378923n588069k161837J818499K016355l12486j185599K98756J953897
35136g81561K452068K239303J539542J15944j431859k119696j980842j679079
35128a646180j361083r36570n80451r1149J011915J987959J194016j067674k018609
35119c507826j86304K216705K438757R12348j11559m0893L9432m28446j173014
35110A59200j936619k101489p67874J429375K209467P62927q96583j093101o46116
35101b880813k74604J144392L393729L317404l22510l552937k723091l23216n92358
35092b814004k212111j150709J518528J489990l41308J014279M940012M762582
35084G207259j049126n159035k471297K159174K218169o36872j030816P69313
$$ plain form
35076 2006769 2759055 1823133 854503 1092064 443247 -2521599 -4969635 -3687631 -105692
35067 -105692 1952780 1597014 634338 -298203 -1757918 -2681778 -1212537 1875559 3769184
35058 3769184 3679108 3371558 3544264 2873186 1372941 1470962 4107581 6392957 5312735
35049 5312735 1938330 -275341 -52934 1124057 2048730 2877203 3432544 2837609 1271389
35040 1271389 167601 72730 16696 -289549 592335 3481004 6608768 7481840 5774252
35031 5774252 3036843 443700 -1649783 -2670418 -2132303 -701187 501677 1273465
35023 1273465 1645586 712448 -1770697 -3375373 -1430711 2600218 4283976 2264863
35015 2264863 -148708 -466526 -369194 -1531801 -1875778 567153 3040892 1708682 -1901561
$$ packed form
35076B006769P52286r35922r68630K37561o48817k964846k448036J282004L581939
35067a05692K058472l55766r62676r32541j459715r23860J469241L088096J893625
35058C769184r0076l07550J72706o71078j500245R8021K636619K285376j080222
35049E312735l374405k213671K22407J176991R24673Q28473N55341n94935j566220
35040A271389j103788r4871n6034l06245Q81884K888669L127764Q73072j707588
35031E774252k737409k593143k093483j020635N38115J431116J202864P71788
35023A273465L72121r33138k483145j604676J944662M030929J683758k019113
35015B264863k413571l17818R7332j162607l43977K442931K473739j332210l610243
$$ plain form
35006 -1901561 -2809176 -156289 1939848 1294889 584985 1956672 3017493 755068 -3588680
34997 -3588680 -6328626 -6045959 -4080337 -1882420 -272964 -372484 -2965812 -6966430 -9831420
34988 -9831420 -9623016 -6397857 -2193406 242886 -175073 -1570226 -1432248 -155355 -302704
34979 -302704 -2241607 -3188857 -1522972 711648 1187775 594293 517478 451796 -541585
34970 -541585 -1296295 -586425 -10681 -1628739 -3990179 -3950400 -1670695 -304508 -1063632
34961 -1063632 -2171637 -2727288 -3786537 -4935247 -3696252 52002 2553307 1351933
34953 1351933 -856415 -225605 2678361 4379852 3952245 3570410 4242417 4368655 2997995
34944 2997995 1727917 2221171 3762475 4543005 4036588 2898736 1512015 -85629 -1361887
$$ packed form
35006a901561r07615K652887K096137o44959p09904J371687J060821k262425m343748
34997c588680k739946K82667J965622K197917J609456r9520k593328m000618k864990
34988i831420K08404L225159M204451K436292m17959j395153J37978J276893j47349
34979c02704j938903r47250J665885K234620M76127n93482p6815o5682r93381
34970e41585p54710P09870N75744j618058k361440L9779K279705J366187p59124
34961a063632j108005n55651j059249j148710J238995L748254K501305j201374
34953A351933k208348O30810K903966J701491m27607l81835O72007J26238j370660
34944B997995j270078M93254J541304P80530n06417j137852j386721j597644j276258
$$ plain form
34935 -1361887 -1519708 -413969 1465248 3603314 5355033 5721002 4310602 2322772
34927 2322772 1364556 1285364 585115 -722596 -423249 2595276 5966837 6760338 5790077
34918 5790077 6423217 9090996 9834987 5664743 -817676 -4329330 -3318849 -1098699
34910 -1098699 -798639 -1626029 -1127100 649562 1255227 -274815 -1646548 -357336 2708933
34901 2708933 4319933 3151365 1214928 691100 1187697 1241559 892528 1009066 1210571
34892 1210571 512987 -655404 -1158365 -1334591 -2250223 -3164953 -2253479 203132 1943352
34883 1943352 2168381 2116517 1972984 412205 -2027931 -2557706 -536630 1055522 368247
34874 368247 -384008 1028111 3163416 4081494 5018385 7428203 9177700 7771862 5176683
$$ packed form
34935a361887j57821J105739J879217K138066J751719L65969j410400j987830
34927B322772r58216p9192p00249j307711K99347L018525L371561P93501r70261
34918E790077O33140K667779P43991m170244o482419l511654J010481K220150
34910a098699L00060q27390M98929J776662O05665j530042j371733J289212L066269
34901B708933J611000j168568j936437n23828M96597N3862l49031J16538K01505
34892A210571o97584j168391n02961j76226r15632r14730R11474K456611J740220
34883A943352K25029n1864j43533j560779k440136n29775K021076J592152o87275
34874C68247p52255J412119K135305R18078R36891K409818J749497j405838k595179
$$ plain form
34865 5176683 5034513 6697865 6633636 4659039 3898336 4858130 4427418 1330979 -1791394
34856 -1791394 -2722725 -2244529 -1368436 299978 2132323 1871278 -861132 -3244767 -3002745
34847 -3002745 -1148757 95353 -171183 -1837907 -4106376 -4879379 -2621381 548268
34839 548268 762925 -1809803 -2642660 458446 4141614 4904376 3921680 3777002 3736917
34830 3736917 1736122 -1307393 -2702673 -2110545 -1492044 -1928717 -2853590 -3478901 -3103812
34821 -3103812 -1213315 1104188 1457027 -449415 -1676967 -299110 1381016 347963
34813 347963 -2383955 -3438775 -1922365 341214 2090473 3149977 2819893 915050
34805 915050 -343812 1334092 4397291 4853533 1580016 -2424090 -4172491 -3590824 -2091336
$$ packed form
34865E176683j42170J663352o4229j974597p60703R59794m30712l096439l122373
34856a791394r31331M78196Q76093J668414J832345k61045k732410k383635K42022
34847c002745J853988J244110k66536j666724k268469p73003K257998L169649
34839E48268K14657k572728q32857L101106L683168P62762r82696j44678m0085
34830C736917k000795l043515j395280N92128O18501m36673r24873o25311L75089
34821c103812J890497K317503L52839j906442j227552J377857J680126j033053
34813C47963k731918j054820J516410K263579J749259J059504l30084j904843
34805I15050j258862J677904L063199M56242l273517m004106j748401N81667J499488
$$ plain form
34796 -2091336 -651180 110496 -204188 -1205340 -2145733 -2914446 -3562330 -3410178 -2061043
34787 -2061043 -699850 -764069 -1815471 -2310103 -1934410 -1585218 -1642332 -1906618 -2610011
34778 -2610011 -3781549 -4235273 -2910545 -672140 748141 883156 234764 -983953 -2195398
34769 -2195398 -1949587 1003 1582406 1450136 1464140 3645567 6498388 7327500 6384821
34760 6384821 5262217 3082938 -1338037 -4979491 -3455050 1950719 5244397 4094886
34752 4094886 2192762 2419603 2895919 1599043 59580 -16820 316129 241258 1307246
34743 1307246 3875382 5011598 2859426 -86965 -996173 -813204 -1240893 -883596 1712994
34734 1712994 3932910 2512398 -690162 -962449 2043185 3759849 1483738 -2091629
$$ packed form
34796b091336J440156P61676l14684j001152r40393p68713o47884J52152J349135
34787b061043J361193o4219j051402m94632L75693L49192n7114k64286p03393
34778b610011j171538m53724J324728K238405J420281J35015o48392j218717j211445
34769b195398K45811J950590J581403j32270J4004K181427K852821Q29112r42679
34760F384821j122604k179279m420975l641454J524441N405769L293678j149511
34752D094886j902124K26841M76316j296876j539463p6400L32949p4871J065988
34743A307246K568136J136216k152172k946391r09208J82969m27689L57297K596590
34734A712994K219916j420512l202560k72287L005634J716664k276111l575367
$$ plain form
34726 -2091629 -2921761 -372287 2986697 4408141 3156194 978367 478134 1997037
34718 1997037 2758959 466645 -3210977 -4615258 -2802177 -168334 1180785 1529669
34710 1529669 2031325 2947530 3701800 3538661 2226022 865786 1130681 2617600 2357526
34701 2357526 -1230292 -5244414 -5600653 -2514375 32319 -207155 -1694182 -2492691 -2593634
34692 -2593634 -2189260 -545463 2022461 3319445 2052854 -168074 -1115890 -901481 -1131607
34683 -1131607 -2149954 -2777766 -2378734 -1758390 -1903644 -2665959 -2913762 -1723337 506265
34674 506265 2030297 1205733 -1791561 -4959538 -6340972 -5629284 -3842622 -1905881 -26544
34665 -26544 1695360 2699934 2529479 1741108 1400971 1337903 -85564 -3472379 -6568545
$$ packed form
34726b091629q30132K549474L358984J421444j251947k177827n00233J518903
34718A997037P61922k292314l677622j404281J813081K633843J349119L48884
34710A529669N01656R16205P54270j63139j312639j360236K64895J486919k60074
34701B357526l587818m014122l56239L086278K546694k39474j487027p98509j00943
34692b593634M04374J643797K567924J296984j266591k220928r47816K14409k30126
34683a131607j018347o27812L99032O20344j45254p62315k47803J190425K229602
34674E06265J524032q24564k997294l167977j381434P11688J786662J936741J879337
34665b6544J721904J004574j70455p88371l40137o3068j423467l386815l096166
$$ plain form
34656 -6568545 -6594955 -3965496 -1730322 -1417516 -1697264 -1438422 -1400629 -1927555 -1721264
34647 -1721264 -524971 -401296 -2245809 -3546439 -2228232 -390370 -1037614 -3080220
34639 -3080220 -3259588 -1549557 -617988 -884854 -377081 921369 954161 -96381 238803
34630 238803 2027859 2698807 2218064 3590099 6727029 7067736 2967786 -497016 1178568
34621 1178568 5124151 5987790 4001547 3048457 3439292 2349512 -19207 -492075 1148405
34612 1148405 1618794 19711 -605932 1307275 3254530 3046342 1956747 1710757 1746025
34603 1746025 1426631 1881805 3486820 4266886 3073705 1864199 2445498 3276581 2164790
34594 2164790 146428 -233419 1012592 1947143 2286753 3281244 4603746 4355361 2212620
$$ packed form
34656f568545k6410K629459K235174L12806k79748K58842L7793n26926K06291
34647a721264J196293J23675j844513j300630J318207J837862o47244k042606
34639c080220j79368J710031R31569k66866N07773J298450L2792j050542L35184
34630B38803J789056O70948m80743J372035L136930L40707m099950l464802J675584
34621A178568L945583Q63639j986243r53090L90835j089780k368719m72868J640480
34612A148405M70389j599083o25643J913207J947255k08188j089595k45990L5268
34603A746025l19394M55174J605015P80066j193181j209506N81299Q31083j111791
34594B164790k018362l79847J246011R34551L39610R94491J322502k48385k142741
$$ plain form
34585 2212620 75073 -653963 -386329 132250 668513 778035 76353 -688902 -511458
34576 -511458 93244 -69294 -727710 -1049296 -2123435 -5537004 -9454176 -9606173 -5148133
34567 -5148133 -221923 1737068 1880366 2139424 1182002 -2398862 -5671199 -4601313 -409653
34558 -409653 1748113 214211 -1316992 -35857 1961812 1727571 301446 787261 3408035
34549 3408035 5208912 4172382 1637114 504016 2129720 5102491 6584925 5002470
34541 5002470 1630549 -828304 -1232528 -822335 -994412 -1411779 -980483 206199 919526
34532 919526 523898 -105624 483946 2706597 5333588 6599888 5898591 3974625 1432265
34523 1432265 -1915186 -5614716 -7814617 -7387156 -5867623 -5471941 -5883163 -5158020 -3354628
$$ packed form
34585B212620k137547p29036K67634N18579N36263J09522p01682p65255J77444
34576e11458O04702j62538o58416l21586j074139l413569l917172j51997M458040
34567e148133M926210J958991J43298K59058r57422l580864l272337J069886M191660
34558d09653K157766j533902j531203J281135J997669k34241j426125M85815K620774
34549C408035J800877j036530k535268j133098J625704K972771J482434j582455
34541E002470l371921k458853m04224M10193j72077m17367M31296J186682P13327
34532I19526l95628o29522N89570K222651K626991J266300p01297j923966k542360
34523A432265l347451l699530k199901M27461J519533L95682m11222P25143J803392
$$ plain form
34514 -3354628 -2588973 -3308915 -3336059 -1465338 643985 1460745 1938923 3132424 3753434
34505 3753434 2385344 349213 -183355 273532 -533402 -2795827 -4288223 -3644905 -1829227
34496 -1829227 -218159 958124 1983744 2878443 3486867 3324949 1514083 -1950676 -5117254
34487 -5117254 -5692223 -3835105 -2098059 -2330411 -3636765 -3740428 -1719374 905952 1648059
34478 1648059 -226144 -2506873 -2324928 356898 2833815 3496657 3626046 4355120 4123471
34469 4123471 1328238 -2176150 -3032650 -1076226 607599 78500 -1443631 -1985715 -1004163
34460 -1004163 1055818 3366882 4566504 3761074 1969803 1046167 1144487 859493 -238379
34451 -238379 -1025608 -786353 21673 941554 1725494 1575981 98832 -1246258 -749119
$$ packed form
34514c354628P65655p19942k7144J870721K109323Q16760M78178J193501O21010
34505C753434j368090k036131n32568M56887q06934k262425j492396O43318J815678
34496a829227J611068J176283J025620Q94699O08424j61918j810866l464759l166578
34487e117254n74969J857118J737046k32352j306354j03663K021054K625326P42107
34478A648059j874203k280729J81945K681826K476917O62842J29389P29074k31649
34469D123471k795233l504388q56500J956424J683825n29099j522131n42084R81552
34460a004163K059981K311064J199622q05430j791271r23636R8320k84994j097872
34451b38379p87229K39255Q08026R19881P83940j49513j477149j345090M97139
$$ plain form
34442 -749119 816085 1370462 954200 1128355 1393933 -174027 -2545531 -2100423 1560876
34433 1560876 4290446 3639798 2348680 3093061 3756258 1480065 -1919675 -2879237 -2018683
34424 -2018683 -2540201 -4245370 -3977398 -1474828 9084 -594392 -303199 2592902 5053717
34415 5053717 3484323 -998517 -3937896 -2966376 52469 1756439 777344 -1400042
34407 -1400042 -2330500 -1220095 421450 867539 281139 1738 416227 786231 807345
34398 807345 907580 1039491 531315 -668970 -1700884 -1912360 -1376836 -329378 947381
34389 947381 1745393 1433728 277479 -1152399 -3103510 -6008333 -8902255 -9803907 -7880382
34380 -7880382 -4319073 -1052219 609540 488431 -190710 573381 3392167 6282506 6908005
$$ packed form
34442g49119J565204N54377m16262J74155K65578j567960k371504M45108L661299
34433A560876K729570o50648j291118P44381O63197k276193l399740r59562Q60554
34424b018683n21518j705169K67972K502570J483912o03476K91193K896101K460815
34415E053717j569394m482840k939379R71520L018845J703970r79095k177386
34407a400042r30458J110405J641545M46089n86400k79401M14489L70004K1114
34398H07345J00235J31911n08176j200285j031914k11476N35524J047458J276759
34389I47381P98012l11665j156249j429878j951111k904823k893922r01652J923525
34380g880382L561309L266854J661759j21109o79141P64091K818786K890339O25499
$$ plain form
34371 6908005 5513944 4111208 3430307 2796483 2561576 3921133 6010212 5989551 3070325
34362 3070325 37163 -538135 658540 1973522 3790463 6873944 9383326 8459944
34354 8459944 4355762 566028 -267651 1201830 2732376 2909808 1541294 -818324
34346 -818324 -3042835 -4144885 -4402218 -5008582 -6124782 -6093788 -3393777 1086670 4658912
34337 4658912 5717349 5119555 4304577 3032446 268932 -3115218 -4501652 -3084818
34329 -3084818 -1406049 -1779956 -2775640 -1582802 1214269 2285685 776400 -480517
34321 -480517 282706 1142398 273453 -674839 495597 2597905 3036307 2075495 1991559
34312 1991559 3009344 3307562 2578472 2382329 2950076 2737067 1601616 1434434 2746615
$$ packed form
34371F908005j394061j402736o80901o33824k34907J359557K089079k0661k919226
34362C070325l033162n75298J196675J314982J816941L083481K509382r23382
34354H459944m104182l789734q33679J469481J530546J77432j368514k359618
34346h18324k224511j102050k57333o06364j116200L0994K700011M480447L572242
34337D658912J058437n97794q14978j272131k763514l384150j386434J416834
34329c084818J678769l73907r95684J192838K797071J071416j509285j256917
34321d80517P63223Q59692q68945r48292J170436K102308M38402r60812q3936
34312A991559J017785K98218p29090j96143N67747k13009j135451j67182J312181
$$ plain form
34303 2746615 3471675 2500922 1799488 3154221 5014296 4910002 3514995 3708666 6190291
34294 6190291 8390921 7897620 5163181 2310010 508493 -709665 -2115083 -3436573
34286 -3436573 -3503732 -1735271 725779 1866864 881091 -1143628 -2707750 -3357361 -3381193
34277 -3381193 -2835935 -1476698 739167 3468960 5997798 7356586 6992977 5459636
34269 5459636 3886278 2769677 1874828 1008245 -79575 -2074950 -4866722 -6350894
34261 -6350894 -4635466 -1434247 -570389 -2456292 -3117150 -233105 2951002 2286292 -1323010
34252 -1323010 -3810673 -3772762 -2782122 -1369578 1171742 3514883 2996466 -61027 -2357725
34243 -2357725 -2499238 -2415628 -3266275 -3617246 -2882204 -2911733 -4323415 -4534186 -1675998
$$ packed form
34303B746615P25060r70753p01434J354733J860075j04294j395007J93671K481625
34294F190291K200630m93301k734439k853171j801517j218158j405418j321490
34286c436573o7159J768461K461050J141085r85773k024719j564122o49611k3832
34277c381193N45258J359237K215865K729793K528838J358788l63609j533341
34269E459636j573358j116601q94849q66583j087820j995375k791772j484172
34261f350894J715428L201219Q63858j885903o60858K884045L184107o64710l609302
34252a323010k487663L7911R90640J412544K541320K343141n18417l057493k296698
34243b357725j41513Q3610q50647l50971P35042k9529j411682k10771K858188
$$ plain form
34234 -1675998 2301014 4626564 5173313 4753059 2859252 -117636 -1189700 1253467
34226 1253467 3953231 3038093 82206 -195507 2772766 4806295 3559616 1465119
34218 1465119 1316643 2583431 3466661 3671364 3589617 3031480 2254628 2446671 3891477
34209 3891477 5126388 4936192 3864432 3008651 2692983 2949680 3801433 4348352 3090141
34200 3090141 71400 -2529212 -2813614 -1206620 492363 1139365 884756 668821 1309867
34191 1309867 2319615 1943216 -448276 -2621203 -1930317 988078 3190266 3713900 4140782
34182 4140782 4889122 4239501 1878662 147676 282087 394952 -957356 -2014569 -852363
34173 -852363 1329043 2450956 2838328 3514050 3264708 645251 -2470528 -2691057 162416
$$ packed form
34234a675998L977012K325550N46749m20254j893807k976888j072064K443167
34226A253467K699764r15138k955887k77713K968273K033529j246679k094497
34218A465119j48476J266788Q83230K04703q1747n58137p76852J92043J444806
34209C891477J234911j90196j071760q55781l15668K56697Q51753N46919j258211
34200C090141l018741k600612k84402J606994J698983O47002k54609k15935O41046
34191A309867J009748l76399k391492k172927O90886K918395K202188N23634M26882
34182D140782P48340o49621k360839j730986J34411J12865j352308j057213J162206
34173h52363K181406J121913L87372O75722k49342k619457l115779k20529K853473
$$ plain form
34164 162416 3032608 3931124 3624002 3328048 3280380 3531443 3903008 3261527 943485
34155 943485 -1353688 -1355697 303834 772634 -819274 -2299490 -1923527 -501710 630709
34146 630709 1578031 2775835 3629277 3397093 2322040 1122087 296290 333303 1499373
34137 1499373 2991333 3369578 2295878 956503 438011 513711 302381 -575730 -1670712
34128 -1670712 -2069860 -1264389 -1506 370711 -135992 30762 1438095 2554672 2442082
34119 2442082 2613671 4130585 4843650 2552377 -686440 -1190792 347965 -174609 -3412594
34110 -3412594 -5290846 -3496466 -736873 251187 707615 2280659 3185611 1294198 -1671475
34101 -1671475 -2532806 -1323096 -289951 194976 1380468 2830477 2717396 1148627 395797
$$ packed form
34164A62416K870192Q98516l07122k95954m7668K51063L71565o41481k318042
34155I43485k297173k009J659531M68800j591908j480216L75963J421817J132419
34146F30709R47322J197804Q53442k32184j075053j199953q25797L7013J166070
34137A499373J491960L78245j073700j339375n18492P5700k11330q78111j094982
34128a670712l99148Q05471J262883L72217n06703J66754J407333J116577j12590
34119B442082J71589J516914P13065k291273l238817n04352J538757n22574l237985
34110c412594j878252J794380K759593R88060M56428J573044R04952j891413k965673
34101a671475q61331J209710J033145M84927J185492J450009j13081j568769p52830
$$ plain form
34092 395797 1682016 3827111 5059793 4487058 2156265 -583583 -1268718 1226372 4724964
34083 4724964 5996129 4627033 2919906 2370774 2256914 1589876 439957 -936544 -2530029
34074 -2530029 -3699997 -3329610 -1450567 293202 352002 -1026869 -1963082 -715462 2259485
34065 2259485 4040341 2235010 -1519038 -2956937 -923879 764115 -973106 -3547064
34057 -3547064 -2565168 1437519 4149501 4206617 4154542 4747678 3249543 -1060798 -4068910
34048 -4068910 -2244336 2206657 4530824 3576572 1895976 1318696 1361206 1273484 1099605
34039 1099605 834097 364438 204393 1014664 2629796 4443477 6121894 7127535 6629046
34030 6629046 5014348 4248091 5227120 5992685 4415922 1574812 227170 717131 1023262
$$ packed form
34092C95797J286219K145095J232682n72735k330793k739848o85135K495090L498592
34083D724964J271165j369096j707127n49132j13860o67038j149919j376501j593485
34074b530029j169968L70387J879043J743769N8800j378871r36213J247620K974947
34065B259485J780856j805331l754048j437899K033058J687994j737221k573958
34057c547064R81896M002687K711982N7116n2075N93136j498135m310341l008112
34048d068910J824574M450993K324167r54252j680596n77280M2510q7722j73879
34039A099605k65508m69659j60045Q10271J615132J813681J678417J005641m98489
34030F629046j614698p66257R79029P65565j576763k841110j347642M89961L06131
$$ plain form
34021 1023262 627656 1442270 4233707 6696571 6437735 4069175 1915579 985770 631008
34012 631008 257053 41826 447438 1841494 4000814 5518003 4858949 2788697 2292751
34003 2292751 4750286 7641999 8030230 7049089 8091362 10985375 11467423 7479501 2823911
33994 2823911 2265920 5202754 7122820 6155508 4839374 5289433 5795169 3736302 -161506
33985 -161506 -2522138 -1514093 1327082 3397320 3870242 3824749 4294772 5017642 5241019
33976 5241019 5147200 5659693 6856793 7622830 7401297 7240956 8144490 9395567 9885506
33967 9885506 10095995 10824089 10740895 7925588 3827551 2702653 6159323 10965806 13680915
33958 13680915 14850675 16609864 18536315 18724673 17472678 16946460 17907332 19377476
$$ packed form
34021A023262l95606Q14614K791437K462864k58836k368560k153596r29809l54762
34012F31008l73955k15227M05612J394056K159320J517189o59054k070252m95946
34003B292751K457535K891713L88231r81141J042273K894013M82048l987922m655590
33994B823911n57991K936834J920066r67312j316134M50059N05736k058867l897808
33985a61506k360632J008045K841175K070238M72922m5493M70023P22870K23377
33976E241019r3819N12493J197100P66037k21533j60341R03534J251077M89939
33967I885506K10489P28094q3194k815307m098037j124898L456670M806483K715109
33958A3680915J169760J759189J926451J88358j251995n26218R60872J470144
$$ plain form
33950 19377476 21071539 23643492 26670269 28653172 29076426 28684238 28093785 28098154 30731849
33941 30731849 37460834 46396404 53821572 58656615 63135827 69186135 76868833 86425923
33933 86425923 98598152 112321389 125644918 140253647 161577559 192482817 230324061
33926 230324061 272758681 322293104 379586441 433490727 463553898 455086723 410625111
33919 410625111 346809083 282302716 228451200 187590845 156705634 132146584 111972855
33912 111972855 95158045 80350573 66695915 55123599 47188443 42606285 39142669
33905 39142669 35048318 30609027 27181192 25535784 25213709 24809828 22972544 19827028
33897 19827028 17220912 16725470 17492011 16966806 13839092 9573568 6788201 6517442 7279249
$$ packed form
33950A9377476J694063K571953L026777J982903M23254l92188n90453M369K633695
33941C0731849O728985Q935570P425168M835043M479212O050308P682698R557090
33933H6425923J2172229J3723237J3323529J4608729K1323912L0905258L7841244
33926B30324061M2434620M9534423N7293337N3904286L0063171q467175m4461612
33919D10625111o3816028o4506367n3851516m0860355l0885211k4559050k0173729
33912A11972855j6814810j4807472j3654658j1572316p935156m582158l463616
33905C9142669m094351m439291l427835j645408l22075m03881j837284l145516
33897A9827028k606116m95442P66541n25205l127714m265524k785367k70759P61807
$$ plain form
33888 7279249 6785371 4572488 2655887 3121529 5491961 7489079 8057309 8010856 7696522
33879 7696522 6226205 3781070 2352285 2743364 3006869 1785101 1086370 3112068 6039779
33870 6039779 6201328 3502303 1296967 1221349 1568618 1032492 683316 1295801 1675129
33861 1675129 962787 166721 60582 -231242 -1186934 -1579979 -835735 -741262 -2846331
33852 -2846331 -5604392 -6126042 -3903002 -1062812 453402 489640 -67608 -347588 -12815
33843 -12815 541464 825210 1287950 2751597 4558751 4791804 3076867 1612812 2308763
33834 2308763 4291925 5449265 5057582 3579743 1324535 -1073597 -2200720 -1745997
33826 -1745997 -1679143 -3593273 -5958939 -6194858 -4493687 -3093831 -2490927 -1301972 274689
$$ packed form
33888G279249m93878k212883j916601M65642K370432J997118N68230m6453l14334
33879G696522j470317k445135j428785L91079K63505j221768o98731K025698K927711
33870F039779J61549k699025k205336p5618L47269n36126l49176O12485L79328
33861A675129p12342p96066j06139k91824r55692l93045P44244R4473k105069
33852b846331k758061n21650K223040K840190J516214L6238n57248k79980L34773
33843a2815N54279K83746M62740J463647J807154K33053j714937j464055O95951
33834B308763J983162J157340l91683j477839k255208k398132j127123M54723
33826a745997O6854j914130k365666k35919J701171J399856O02904J188955J576661
$$ plain form
33817 274689 73546 -2220601 -3767792 -2546793 -367757 -121949 -1696529 -2612055 -1679763
33808 -1679763 -10831 1218523 2163896 3229034 3966964 3783398 3073108 2867941 3383984
33799 3383984 3546005 2438735 887060 628670 1713969 1959859 -44276 -2440195 -2246080
33790 -2246080 456099 2390094 1399327 -858945 -1314492 768883 3483845 4839364
33782 4839364 4564614 3725086 3323349 3317131 2944053 2168473 2260875 3994175 5734894 4970072
33772 4970072 1831176 -744834 -932590 -161574 -311225 -762568 517 1464434 1990191
33763 1990191 1585380 1406839 1218162 -8398 -1192064 195749 3934052 6261107 4630005
33754 4630005 1019211 -1175008 -1607528 -2227558 -3553808 -4318620 -4208056 -4365897 -5009294
$$ packed form
33817B74689k01143k294147j547191J220999K179036K45808j574580r15526R32292
33808a679763J668932J229354R45373J065138P37930j83566p10290k05167N16043
33799C383984J62021j107270j551675k58390J085299K45890k004135k395919J94115
33790b246080K702179J933995r90767k258272m55547K083375K714962J355519
33782D839364k74750q39528m01737o218l73078p75580R2402J733300J740719p64822
33772D970072l138896k576010j87756P71016j49651m51343P63085J463917N25757
33763A990191m04811j78541j88677j226560j183666J387813L738303K327055j631102
33754D630005l610794k194219m32520o20030j326250p64812J10564j57841o43397
$$ plain form
33745 -5009294 -4720320 -2647466 311952 2990919 4889495 5159543 2791291 -1018279
33737 -1018279 -2786678 -1015205 1074802 -376681 -4080318 -5034009 -1702825 1667172
33729 1667172 1167736 -1452221 -2067706 -506246 -112380 -1830477 -2557496 -266878 2448226
33720 2448226 2076211 -613398 -1736593 135321 2196479 1479396 -1410930 -3588129
33712 -3588129 -3440365 -1628301 598560 2644283 4276099 5268027 5647866 5625774 5003674
33703 5003674 3192082 198469 -2675385 -3512113 -1332717 2789978 6036159 5778755
33695 5778755 2009005 -2240662 -3706319 -2238468 -525709 -416747 -837823 -34484 1574071
33686 1574071 2303078 2003870 1936615 2124512 1105422 -1116227 -2019881 108857 3304221
$$ packed form
33745e009294K88974K072854K959418K678967J898576K70048k368252l809570
33737a018279j768399J771473K090007j451483l703637r53691L331184L369997
33729A667172m99436k619957o15485J561460L93866j718097p27019K290618K715104
33720B448226l72015k689609j123195J871914K061158p17083k890326k177199
33712c588129J47764J812064K226861K045723J631816R91928L79839k2092o22100
33703E003674j811592k993613k873854q36728K179396M122695L246181k57404
33695E778755l769750m249667j465657J467851J712759J08962m21076Q03339J608555
33686A574071P29007k99208o7255J87897j019090k221649r03654K128738L195364
$$ plain form
33677 3304221 4186778 2319996 448816 649810 2135100 3260690 3958257 4996358 5892744
33668 5892744 5172939 2672791 282280 -207370 787739 1541968 1570802 2019456 3263147
33659 3263147 3520629 1138428 -2396747 -3391605 -199840 4667008 7275615 6284598 3651226
33650 3651226 2076649 2503118 3763992 4073052 2925247 1674770 1954971 3617874 4908545
33641 4908545 4690856 3623036 2993206 3397220 4758867 6393266 6649927 4036203 -386566
33632 -386566 -3132124 -2052813 1121062 3177476 3181126 2490421 2247294 2552609 3188432
33623 3188432 3447805 2182807 -218932 -1099125 978689 3196000 1898244 -1709624
33615 -1709624 -2822547 34668 3196536 3807794 3558567 4495960 4850542 2348996 -864223
$$ packed form
33677C304221Q82557j866782j871180K00994J485290J125590O97567J038101Q96386
33668E892744p19805k500148k390511m89650R95109P54229K8834M48654J243691
33659C263147K57482k382201l535175r94858L191765M866848K608607r91017k633372
33650C651226j574577M26469J260874L09060j147805j250477K80201J662903J290671
33641D908545k17689j067820o29830M04014J361647J634399K56661k613724m422769
33632c86566k745558J079311L173875K056414L650o90705k43127L05315O35823
33623C188432K59373j264998k401739q80193K077814K217311j297756l607868
33615a709624j112923K857215L161868O11258k49227R37393L54582k501546l213219
$$ plain form
33606 -864223 -546960 3441726 6852883 6887496 5290121 5069784 6617823 8156427 8373180
33597 8373180 7441021 6346473 6097234 7069300 8518184 9039625 7953052 6144877 5281299
33588 5281299 6002952 6861649 5488161 1422629 -2546000 -2952271 352865 3959324 4933152
33579 4933152 3757491 2687854 2691978 3160748 3474274 3475636 3105170 2693577 2946093 3711438
33569 3711438 3683574 2351203 1134436 1289741 1864068 1393455 556017 1070358 2670745
33560 2670745 3431468 2803125 2104075 2022867 1864947 1559962 2197624 3825028 4581754
33551 4581754 3024128 6785 -2454011 -3014562 -1315198 2039691 5175494 6053268
33543 6053268 4662059 2909530 1816044 378076 -1978777 -3571498 -2574194 202780
$$ packed form
33606h64223L17263L988686L411157L4613j597375k20337J548039J538604K16753
33597H373180r32159j094548k49239R72066J448884N21441j086573j808175q63578
33588E281299P21653Q58697j373488m065532l968629m06271L305136L606459R73828
33579D933152j175661j069637M124M68770L13526J362l70466m11593K52516P65345
33569C711438k7864j332371j216767J55305N74327m70613q37438N14341J600387
33560B670745P60723o28343o99050q1208j57920l04985O37662J627404P56726
33551D581754j557626l017343k460796n60551J699364L354889L135803Q77774
33543F053268j391209j752529j093486j437968k356853j592721R97304K776974
$$ plain form
33535 202780 2201098 2116224 756043 -498992 -877410 -264305 862263 1736887 2177855
33526 2177855 2691431 3222094 2686129 582328 -1807863 -2867247 -2536584 -1718048 -656319
33517 -656319 757269 1855412 2008648 2055828 3131625 4333356 3571690 943750 -790911
33508 -790911 168536 2371178 3486159 3326798 3042505 2655650 1436809 139893 672432
33499 672432 3219946 5460711 5445697 3981435 3174431 3644496 4481623 5275712 6448742
33490 6448742 7501318 6780050 4064852 2068656 3549427 7241736 8571295 5093588
33482 5093588 -218169 -2352032 -72519 3199115 4126127 3320398 3642378 5897496 7857089
33473 7857089 7512831 5847109 5472330 7176740 8957393 8548404 5936763 2854930 557012
$$ packed form
33535B02780J998318q4874j360181j255035l78418O13105J126568Q74624M40968
33526B177855N13576N30663n35965k103801k390191j059384L30663Q18536J061729
33517f56319J413588J098143J53236M7180J075797J201731p61666k627940j734661
33508g90911R59447K202642J114981j59361k84293l86855j218841j296916N32539
33499F72432K547514K240765j5014j464262q07004M70065Q37127P94089J173030
33490F448742J052576p21268k715198j996196J480771L692309J329559l477707
33482E093588n311757k133863K279513L271634R27012q05729L21980K255118J959593
33473G857089l44258j665722l74779J704410J780653m08989k611641l081833k297918
$$ plain form
33464 557012 -939498 -1785430 -1775348 -1173891 -878285 -989990 -190473 2284418 4687942
33455 4687942 4338875 1134692 -2025344 -2689290 -1262980 621534 2428573 4060907
33447 4060907 4409634 2756515 927713 1629787 4600505 6735664 6480311 5664592 5999929
33438 5999929 6326488 5247594 4260622 5440213 7351099 6556334 2978041 645259 2450651
33429 2450651 6701763 9850684 10445801 9149984 6827514 4337044 2956048 3332517
33421 3332517 4635645 5804091 6826100 7824813 7958482 6653509 5275127 6108312 9770092
33412 9770092 14519027 17938442 18735791 17393207 15730503 15397743 16330656 17274544 18008038
33403 18008038 19772312 22836007 25136950 24708529 22451864 21101549 22154182 24993812
$$ packed form
33464E57012j496510q45932J0082O01457K95606j11705P99517K474891K403524
33455D687942l49067l204183l160036o63946J426310J884514J807039J632334
33447D060907L48727j653119j828802P02074K970718K135159k55353q15719L35337
33438E999929L26559j078894r86972J179591J910886p94765l578293k332782J805392
33429B450651M251112L148921N95117j295817k322470k490470j380996L76469
33421C332517J303128J168446J022009R98713J33669j304973j378382Q33185L661780
33412I770092M748935L419415P97349j342584j662704l32760R32913R43888P33494
33403A8008038J764274L063695K300943m28421k256665j350315J052633K839630
$$ plain form
33395 24993812 28187234 30333895 30521461 29475713 29601944 32416413 36552381 39680142
33387 39680142 41523473 43270003 44892951 45328612 45005528 45872486 48588935 51562151
33379 51562151 53278968 54121768 55373025 57524670 59916743 61297465 60838253 59302078
33371 59302078 58669771 59728117 60927412 60830681 60488612 61588545 63379839 63752542 62620081
33362 62620081 61772752 61861301 61970195 61706957 61164511 59431328 56166238 54151816 56594320
33353 56594320 61669968 63561834 59779423 53891372 49972827 48063351 46587034 45419549
33345 45419549 44319754 41726429 37691867 35041819 35032006 34806990 32076872 29379408 30092933
33336 30092933 32587814 32420576 28885225 25390052 24073591 23757293 23038646 22097640 21179283
$$ packed form
33395B4993812L193422K146661J87566j045748J26231K814469M135968L127761
33387C9680142J843331J746530J622948M35661l23084Q66958K716449K973216
33379E1562151J716817Q42800J251257K151645K392073J380722m59212j536175
33371E9302078o32307J058346J199295r6731l42069J099933J791294L72703j132461
33362F2620081q47329Q8549J08894k63238n42446j733183l265090k014422K442504
33353E6594320N075648J891866l782411n888051l918545j909476j476317j167485
33345D5419549j099795k593325m034562k650048r813k25016k730118k697464P13525
33336C0092933K494881j67238l535351l495173j316461l16298p18647r41006r18357
$$ plain form
33327 21179283 19943698 18639590 17886484 17291353 16019912 14354153 12974205 11397830
33319 11397830 8983322 6615887 5424619 4860341 4172594 4443405 6492931 8147943
33311 8147943 6954542 4637779 4988600 7635877 8108826 4667717 992070 626252 2290713
33302 2290713 2710348 1237922 -591898 -1941132 -2859747 -3148223 -2970176 -3365677 -4492581
33293 -4492581 -4536032 -2042414 1613534 3721299 3489387 2281324 1159523 -103205 -1504795
33284 -1504795 -1822588 3451 3055512 4911378 4187466 2072485 720788 532298 157660
33275 157660 -904378 -1398102 -534898 707273 1545332 2662312 3912017 2913390 -1472282
33266 -1472282 -5900806 -5969713 -2033686 1552293 2423659 2062744 1879607 1207584 -68973
$$ packed form
33327B1179283j235585j304108p53106n95131j271441j665759j379948j576375
33319A1397830k414508k367435j191268n64278o87747K70811K049526J655012
33311H147943j193401k316763L50821K647277M72949l441109l675647l65818J664461
33302B290713M19635j472426j829820j349234r18615k88476J78047l95501j126904
33293d492581m3451K493618L655948K107765k31912j208063j121801j262728j401590
33284a504795l17793J826039L052061J855866p23912k114981j351697j88490l74638
33275A57660j062038m93724Q63204J242171Q38059J116980J249705r98627m385672
33266a472282m428524o8907L936027L585979Q71366l60915j83137o72023j276557
$$ plain form
33257 -68973 -358221 761441 1249878 -338062 -2705332 -3950922 -3873627 -3160300 -2218586
33248 -2218586 -1604329 -1668258 -1345465 408706 1798270 -95282 -4160260 -5479571 -2160370
33239 -2160370 1722632 2112175 326737 -312653 176908 57682 105910 2055538 4494122
33230 4494122 4452113 2237556 925785 1484206 1936771 1265347 756311 1108033 1194821
33221 1194821 369245 -499140 -941162 -1649184 -2659709 -2733969 -1300106 528640 1423264
33212 1423264 1053955 -314810 -2028971 -2779608 -1643878 501931 2005123 2690237 3417207
33203 3417207 3710499 2159105 -581348 -1762517 -528505 394159 -1404679 -4293586
33195 -4293586 -4859721 -2731618 -809236 -966215 -1771419 -1140776 473748 970140 -83310
$$ packed form
33257f8973k89248J119662M88437j587940k367270j245590P7295P13327R41714
33248b218586O14257o3929L22793J754171J389564j893552m064978j319311L319201
33239b160370L883002L89543j785438o39390M89561j19226M8228J949628K438584
33230D494122m2009k214557j311771N58421M52565o71424n09036L51722Q6788
33221A194821q25576q68385m42022p08022j010525p4260J433863J828746Q94624
33212A423264l69309j368765j714161p50637J135730K145809J503192O85114P26970
33203C417207K93292j551394k740453j181169J234012R22664j798838k888907
33195d293586n66135K128103J922382j56979q05204O30643J614524M96392j053450
$$ plain form
33186 -83310 -680008 760281 3082501 3985570 3164609 2459947 3051749 4075214 4429627
33177 4429627 4444535 4784106 4868268 3670646 1452938 -418568 -963974 -48950 1989216
33168 1989216 4095793 4480464 2269772 -869661 -1962960 134196 3559581 5560805
33160 5560805 5182217 3671887 2696580 2524010 2016073 268839 -2178114 -4017717 -4447842
33151 -4447842 -3197783 -220855 3359125 4899376 2922476 -183607 -521991 2191588
33143 2191588 4457228 4280953 3574449 4230512 5034108 4425325 3541334 4135971 5774880
33134 5774880 7438051 9640519 12444545 13650687 11893054 9587085 9808736 11987520
33126 11987520 13578053 14116231 14629255 15097294 15677989 18123146 22619900 26166573 27982022
$$ packed form
33186h3310n96698J440289K322220R03069q20961p04662N91802J023465L54413
33177D429627J4908L39571Q4162j197622k217708j871506n45406R15024K038166
33168A989216K106577L84671k210692l139433j093299K097156L425385K001224
33160E560805l78588j510330r75307j72570n07937j747234k446953j839603m30125
33151d447842J250059K976928L579980J540251j976900l106083l38384K713579
33143B191588K265640j76275p06504O56063Q03596o08783q83991N94637J638909
33134E774880J663171K202468K804026J206142j757633k305969K21651K178784
33126A1987520J590533N38178N13024M68039N80695K445157M496754L546673J815449
$$ plain form
33117 27982022 32572501 42082868 50702674 55390294 67588202 100461180 143393886 163885962
33109 163885962 142550402 96247676 57827093 40951482 34853908 27023490 17442965
33102 17442965 11083903 8399304 7172535 6626558 6089629 4151280 1465853 636838
33094 636838 1848366 2285957 1033225 662520 2516973 4153634 3370525 1599413 1283916
33085 1283916 2472796 3834685 4787917 4998046 3857378 1956046 1115550 1668743 1720013
33076 1720013 309179 -945460 -801904 -626100 -1753019 -2738743 -1581491 900856 2338101
33067 2338101 2343512 2420416 3056515 3202706 2406365 1500228 1115696 1004833 842449 503991
33057 503991 -242966 -1158479 -1038286 815352 2925569 2955464 600703 -2303215 -4451587
$$ packed form
33117B7982022M590479R510367Q619806M687620J2197908L2872978M2932706K0492076
33109A63885962k1335560m6302726l8420583j6875611o097574p830418r580525
33102A7442965o359062k684599j226769n45977n36929j938349k685427q29015
33094F36838J211528M37591j252732l70705J854453J636661p83109j771112l15497
33085A283916J188880J361889R53232K10129j140668j901332q40496N53193N1270
33076A720013j410834j254639J43556J75804j126919r85724J157252K482347J437245
33067B338101N411P6904O36099J46191p96341r06137l84532j10863j62384l38458
33057E03991p46957r15513J20193J853638K110217K9895k354761k903918k148372
$$ plain form
33048 -4451587 -6069659 -7042652 -6153196 -3248735 -484510 132993 -650064 -749160 118587
33039 118587 549354 212559 345814 1302793 1738793 1095275 1025348 2953563 5634972
33030 5634972 6785578 6094665 4869107 3605259 2061010 1227875 2741031 6076245
33022 6076245 8547512 8630592 7287344 5496914 2834279 -450523 -2298704 -1484101 442591
33013 442591 1581774 2336971 3711562 4626801 3394141 817584 -604252 -18636 1254728
33004 1254728 1910770 1508005 -9221 -1630369 -1148951 1963851 4625620 3795192 1037989
32995 1037989 256765 1760766 2501517 1862961 2624522 5424404 6962620 5562526 4242678
32986 4242678 5685044 7969943 8430616 8304811 9792529 11371957 10472054 8853642 10537873
$$ packed form
33048d451587j618072r72993Q89456K904461K764225O17503p83057r9096Q67747
33039A18587M30767l36795J33255R56979M36000o43518o9927J928215K681409
33030E634972J150606o90913j225558j263848j544249q33135J513156L335214
33022F076245K471267Q3080j343248j790430k662635l284802j848181Q14603J926692
33013D42591J139183P55197J374591R15239j232660k576557j421836N85616J273364
33004A254728O56042m02765j517226j621148M81418L112802K661769q30428k757203
32995A037989p81224J504001P40751o38556P61561K799882J538216j400094j319848
32986D242678J442366K284899M60673j25805J487718J579428q99903j618412J684231
$$ plain form
32977 10537873 15185129 18202682 17656266 16871141 19168756 23599316 27514241 30672258
32969 30672258 34876612 41057122 48035854 53214123 54004394 49838904 43058193 36531027
32961 36531027 30518403 23632226 16563859 12118143 10965472 10227395 7729361 5128381
32953 5128381 4772456 5568815 4653086 1898891 -94633 -80160 505456 542948 1032757
32944 1032757 2846574 4627430 4539073 2998281 1984337 2114688 2056739 894955 -468547
32935 -468547 -807426 -126804 1099565 2932223 4882871 5033731 2297180 -1046264 -1515151
32926 -1515151 818524 2332942 1136850 -576437 -748337 -885808 -2784697 -4497393
32918 -4497393 -3054074 450511 2243392 1461347 590785 779589 756189 629730 2465514
$$ packed form
32977A0537873M647256L017553n46416p85125K297615M430560L914925L158017
32969C0672258M204354O180510O978732N178269P90271m165490o780711o527166
32961C6531027o012624o886177p068367m445716j152671p38077k498034k600980
32953E128381l55925P96359r15729k754195j993524J4473N85616L7492M89809
32944A032757J813817J780856q8357j540792j013944J30351n7949j161784j363502
32935d68547l38879O80622J226369J832658J950648J50860k736551l343444m68887
32926a515151K333675J514418j196092j713287j71900j37471j898889j712696
32918d497393J443319L504585J792881p82045q70562J88804k3400j26459J835784
$$ plain form
32909 2465514 5834784 6805331 3491967 -689294 -1789486 -597538 -430503 -1939318
32901 -1939318 -3159822 -3230725 -3072881 -3132605 -2962082 -2654299 -2785263 -3348954 -4134556 -5287275
32891 -5287275 -6182841 -5120881 -1855735 1032668 1362065 509189 954677 2064126 1283233
32882 1283233 -1382025 -3373099 -3772604 -4180816 -5163002 -5131469 -3724906 -3318804 -5518892
32873 -5518892 -8321169 -8566451 -5812108 -2211662 396290 1763260 2145593 1332679 -912253
32864 -912253 -3835791 -5570544 -4694098 -2156248 -728824 -1830818 -3853793 -4474016 -3347111
32855 -3347111 -1356734 1108119 3243084 2958826 -389650 -3763501 -4015101 -2560173
32847 -2560173 -2918498 -4583184 -3834336 -528027 1045053 -735093 -1871647 721984
$$ packed form
32909B465514L369270R70547l313364m181261j100192J191948J67035j508815
32901a939318j220504p0903J57844n9724J70523L07783j30964n63691p85602j152719
32891e287275q95566J061960L265146K888403L29397q52876M45488J109449p80893
32882A283233k665258j991074l99505m08212r82186L1533J406563M06102k200088
32873e518892k802277k45282K754343L600446K607952J366970L82333q12914k244932
32864i12253k923538j734753Q76446K537850J427424j101994k022975o20223J126905
32855c347111J990377K464853K134965k84258l348476l373851k51600J454928
32847b560173l58325j664686P48848L306309J573080j780146j136554K593631
$$ plain form
32839 721984 4172546 4322749 1887614 412056 930862 2253109 4135762 6383865 6753423
32830 6753423 3764180 294169 391096 3236840 4127681 1220429 -2383606 -3566279 -2801145
32821 -2801145 -2003844 -1643255 -1290656 -1057061 -1169758 -1176511 -361597 1508343 3833112
32812 3833112 5216875 4595406 2824889 1827009 1497806 -381544 -3841646 -5180778 -2272482
32803 -2272482 1383628 1548302 -298280 -69655 1256344 -947398 -6219672 -8156208
32795 -8156208 -3876882 1425069 2177709 -174909 -956099 525373 1589465 1245659 633094
32786 633094 178791 -188020 638147 3245967 5520090 5104517 3017217 1950285 1927634
32777 1927634 689625 -2121851 -4150934 -3762935 -1891878 -337446 -165234 -1671205
$$ packed form
32839G21984L450562J50203k435135j475558N18806J322247J882653K248103L69558
32830F753423k989243l470011R6927K845744Q90841k907252l604035j182673P65134
32821b801145P97301L60589L52599K33595j12697o753Q14914J869940K324769
32812C833112J383763o21469j770517r97880l29203j879350l460102j339132K908296
32803b272482L656110J64674j846582K28625J325999k203742n272274j936536
32795h156208M279326N301951P52640k352618p81190J481472J064092l43806o12565
32786F33094m54303l66811Q26167K607820K274123m15573k087300j066932k2651
32777A927634j238009k811476k029083L87999J871057J554432J72212j505971
$$ plain form
32769 -1671205 -4030591 -5142295 -3632490 -811853 963296 1270977 1113658 330317 -1909674
32760 -1909674 -4470286 -4962871 -3234260 -1453345 -435420 1245356 3782220 4799641
32752 4799641 2958609 327370 -693099 -689657 -1461178 -2747031 -3073705 -2596723 -2673111
32743 -2673111 -3313743 -3312452 -2496407 -1684805 -605492 1863964 5046007 6209764 3938768
32734 3938768 244517 -1720012 -962658 1244670 3468351 5052470 5622785 5110484 4362298
32725 4362298 4738328 6711340 9233886 10611185 9819054 7167908 4051601 1903653
32717 1903653 1055195 786698 709535 1489402 3514037 5462368 5516522 3982434 3274116
32708 3274116 4683329 6316990 5262659 1178944 -3261734 -5248828 -4396419 -2618967
$$ packed form
32769a671205k359386j111704J509805K820637J775149L07681j57319p83341k239991
32760a909674k560612m92585J728611J780915J017925J680776K536864J017421
32752D799641j841032k631239j020469L442p71521j285853l26674M76982p6388
32743b673111o40632J291Q16045Q11602J079313K469456L182043J163757k270996
32734C938768l694251j964529P57354K207328K223681J584119N70315n12301p48186
32725D362298L76030J973012K522546J377299p92131k651146l116307k147948
32717A903653q48458k68497p7163P79867K024635J948331N4154j534088p08318
32708C274116J409213J633661j054331m083715m440678j987094Q52409J777452
$$ plain form
32700 -2618967 -2099978 -3343915 -4880948 -5009382 -3855890 -3124427 -3661734 -4240664 -3330360
32691 -3330360 -1124423 1006635 2210447 2403542 1779818 1158249 1814643 3617381 4334587
32682 4334587 2420272 -487058 -1743204 -1345143 -1008236 -545230 1640650 4661999 5307554
32673 5307554 2800319 84658 -718496 -810353 -1191088 -246258 2663426 4436142 2378133
32664 2378133 -1283451 -2583236 -1633274 -1479290 -2573311 -2571781 -1049017 -194235 -617446
32655 -617446 -432808 735217 609674 -1529803 -2909410 -1466581 765245 680184 -1555890
32646 -1555890 -3324037 -3147655 -1539484 411684 1490699 597696 -1633995 -2481019 -265367
32637 -265367 2909373 3447701 869398 -1690109 -1561850 451657 1509944 95700 -2538125
$$ packed form
32700b618967N18989j243937j537033j28434J153492P31463n37307n78930R10304
32691c330360K205937K131058J203812J93095o23724o21569O56394J802738P17206
32682D334587j914315k907330j256146L98061L36907M63006K185880L021349O45555
32673E307554k507235k715661q03154r1857l80735R44830K909684J772716k058009
32664B378133l661584j299785R49962J53984j094021J530J522764Q54782m23211
32655f17446J84638J168025j25543k139477j379607J442829K231826q5061k236074
32646a555890j768147J76382J608171J951168J079015q93003k231691q47024K215652
32637b65367L174740N38328k578303k559507J28259K013507J058287j414244k633825
$$ plain form
32628 -2538125 -3792145 -2332490 630718 2757352 3050157 2265791 1091350 -724320
32620 -724320 -3030644 -4553185 -4480598 -3639465 -3080037 -2572175 -1581964 -588931 -119574
32611 -119574 426109 1496495 2068413 1393787 935488 2233569 3663897 2207765 -1678575
32602 -1678575 -4099050 -3299229 -2096713 -3186249 -4848883 -3860234 -704872 1165906
32594 1165906 412212 -850449 -766988 -77218 -45290 -331923 -144772 170787 119869 456918
32584 456918 2085408 4304987 5641190 5968320 6293075 6624035 5743227 3451057 1488801
32575 1488801 1368059 2399835 2858147 2212694 1135440 106400 -616076 -232893 1640107
32566 1640107 3320844 2254893 -1526476 -4757494 -4757672 -2600824 -1239955 -1599185 -2174900
$$ packed form
32628b538125j254020J459655K963208K126634K92805p84366j174441j815670
32620g24320k306324j522541P2587Q41133N59428N07862R90211R93033M69357
32611a19574N45683J070386N71918o74626m58299J298081J430328j456132l886340
32602a678575k420475P99821J202516j089536j662634R88649L155362J870778
32594A165906p53694j262661Q3461O89770L1928k86633J87151L15559n0918L37049
32584D56918J628490K219579J336203L27130L24755L30960q80808k292170j962256
32575A488801j20742J031776M58312o45453j077254j029040p22476L83183J873000
32566A640107J680737j065951l781369l231018j78K156848J360869l59230n75715
$$ plain form
32557 -2174900 -1865819 -1318641 -1445946 -2262874 -3544999 -5153817 -6099541 -4721896 -977740
32548 -977740 2359441 2229906 -1108178 -4142459 -4080671 -2002401 -1424477 -3958900 -7189337
32539 -7189337 -7468693 -4486812 -1858256 -2608092 -5285829 -6037261 -3814888 -1396056 -1125540
32530 -1125540 -2078308 -2558142 -3141971 -5099148 -7261171 -7126666 -4637889 -2405359 -2078643
32521 -2078643 -2683064 -2868549 -2594343 -1894227 -169540 2068346 2652072 565346 -2119166
32512 -2119166 -2772206 -1538780 -436402 -143147 330183 1347053 2061840 2036656 1705853
32503 1705853 1173239 70988 -1301300 -2085109 -2143287 -1942111 -1357373 -133020 718165
32494 718165 -103665 -1783381 -2072778 -628213 613208 858860 1597073 3260115 3622920
$$ packed form
32557b174900L09081N47178j27305q16928j282125j608818r45724J377645L744156
32548i77740L337181j29535l338084l034281O1788K078270N77924k534423l230437
32539g189337k79356K981881K628556p49836k677737p51432K222373K418832K70516
32530a125540r52768m79834n83829j957177k162023J34505K488777K232530L26716
32521b078643o04421j85485K74206P00116J724687K237886N83726k086726k684512
32512b119166o53040J233426J102378K93255M73330J016870P14787k5184l30803
32503A705853n32614j102251j372288p83809n8178K01176N84738J224353Q51185
32494G18165q21830j679716k89397J444565J241421K45652P38213J663042L62805
$$ plain form
32485 3622920 1465253 -748439 -478579 680020 -439953 -3236015 -4091313 -1878219
32477 -1878219 830070 2129646 2889542 3695213 2959349 -243224 -3855189 -5242945 -4391373
32468 -4391373 -3239295 -3166814 -4353122 -6246997 -7423617 -6265475 -3036881 -120778
32460 -120778 867941 867042 1235194 1552079 1025665 349781 225389 -364487 -2046934 -2621552
32450 -2621552 342847 5178374 7436392 5503650 2109294 39746 -762322 -1141724
32442 -1141724 -632987 1125379 2956242 3597970 3116100 1916335 47211 -1616776 -1532823
32433 -1532823 -107198 -78463 -2602756 -4946804 -4226741 -1703669 -734958 -1705023 -1993881
32424 -1993881 -497739 859381 495659 -517932 -452972 587197 1199241 564609 -961378
$$ packed form
32485C622920k157667k213692K69860J158599j119973k796062q55298K213094
32477a878219K708289J299576P59896Q05671p35864l202573l611965j387756Q51572
32468d391373J152078P2481j186308j893875j176620J158142L228594K916103
32460a20778R88719q99L68152L16885n26414o75884j24392n89876j682447n74618
32450b621552K964399M835527K258018j932742l394356k069548q02068l79402
32442a141724N08737J758366J830863O41728m81870j199765j869124j663987Q3953
32433a532823J425625K8735k524293k344048P20063K523072R68711r70065k88858
32424a993881J496142J357120l63722j013591O4960J040169O12044o34632j525987
$$ plain form
32415 -961378 -2442567 -3163796 -3251695 -3304050 -3026387 -1222682 1843062 3401657 1401403
32406 1401403 -2212943 -3797952 -2893397 -2064279 -2288995 -1893081 -509045 -483085 -2803908
32397 -2803908 -4750584 -3800972 -1479022 -859460 -1991625 -2277840 -319202 2716218 4830200
32388 4830200 4788703 2870160 1149440 1714845 3558330 3153218 -485081 -3731427 -3484408
32379 -3484408 -1850995 -2642610 -5313637 -6202206 -4440870 -2465561 -1276479 436001
32371 436001 2283213 1717612 -1282075 -3012052 -1360681 915770 353361 -2411903 -4236795
32362 -4236795 -3817110 -2268732 -977878 -880179 -2544979 -5092238 -6155312 -4706289 -2923272
32353 -2923272 -3438387 -5505535 -5839022 -3048906 465279 1410696 -646891 -2979207 -2842470
$$ packed form
32415i61378j481189p21229q7899n2355K77663J803705L065744J558595k000254
32406A401403l614346j585009R04555Q29118k24716L95914J384036K5960k320823
32397b803908j946676R49612K321950O19562j132165k86215J958638L035420K113982
32388D830200m1497j918543j720720N65405J843485m05112l638299l246346K47019
32379c484408J633413p91615k671027q88569J761336J975309J189082J712480
32371D36001J847212n65601k999687j729977J651371K276451n62409k765264j824892
32362d236795M19685J548378J290854R7699j664800k547259j063074J449023J783017
32353b923272n15115k067148l33487K790116L514185R45417k057587k332316J36737
$$ plain form
32344 -2842470 -514845 1169585 313215 -1865135 -2943376 -2349215 -1279151 -571936 -431783
32335 -431783 -1449997 -3654940 -5020564 -3463815 -242666 1241329 125062 -1174892
32327 -1174892 -1136226 -1016004 -1944261 -3207577 -4315575 -5716988 -6536983 -4958054 -1999705
32318 -1999705 -1204412 -3011985 -3518210 -962263 993356 -474213 -2316234 -1070503
32310 -1070503 700421 -1302646 -5549660 -7280980 -6407952 -6508584 -7298493 -4891011 441601
32301 441601 3440681 2028816 217443 809585 856338 -2532112 -6601448 -7049189 -4360977
32292 -4360977 -2253068 -2129879 -2650892 -3239293 -4663884 -6726256 -7902964 -7175151 -4783621
32283 -4783621 -1721544 409066 -55223 -3139177 -6650906 -8198962 -7266887 -4940779
$$ packed form
32344b842470K327625J684430q56370k178350j078241N94161J070064P07215J40153
32335d31783j018214k204943j365624J556749L221149J483995j116267j299954
32327a174892L8666J20222r28257j263316j107998j401413q19995J578929K958349
32318a999705P95293j807573n06225K555947J955619j467569j842021J245731
32310a070503J770924k003067m247014j731320Q73028j00632p89909K407482N332612
32301D41601K999080j411865j811373N92142M6753l388450m069336m47741K688212
32292d360977K107909J23189n21013n88401j424591k062372j176708P27813K391530
32283d783621L062077K130610m64289l083954l511729j548056R32075K326108
$$ plain form
32275 -4940779 -2585605 -1198282 -967347 -1078355 -927244 -1375850 -3295576 -5193050 -4602271
32266 -4602271 -2025106 -823787 -2384501 -4048217 -3209292 -1031807 -256457 -1227055 -2048356
32257 -2048356 -1348776 740941 3211260 4533930 3698322 1943258 1902327 3997286 5595046
32248 5595046 5016435 4136346 5139888 6900086 7081961 6086004 6009133 6820506 6516350
32239 6516350 4520883 2218979 402721 -1189478 -1847932 -97704 3526725 6175678
32231 6175678 5996121 4042218 2222938 1057483 339889 407451 1406135 2336235 2225760
32222 2225760 1713328 2179399 3511973 4009152 2746198 895421 -21171 -282442 -1157700
32213 -1157700 -2431643 -2427852 -766208 687676 582966 131125 869749 1860257 1246134
$$ packed form
32275d940779K355174J387323K30935j11008J51111m48606j919726j897474N90779
32266d602271K577165J201319j560714j663716Q38925K177485P75350r70598q21301
32257b048356O99580K089717K470319J322670q35608j755064m0931K094959J597760
32248E595046n78611q80089J003542J760198J81875r95957p6871Q11373l04156
32239F516350j995467k301904j816258j592199o58454J750228L624429K648953
32231F175678j79557j953903j819280j165455p17594O7562R98684R30100j10475
32222B225760n12432M66071J332574M97179j262954j850777r16592k61271q75258
32213a157700j273943L791J661644J453884j04710m51841P38624R90508o14123
$$ plain form
32204 1246134 -463327 -1258227 -1253588 -2558982 -5327679 -6770078 -4970898 -1330861 1782814
32195 1782814 3678787 4559422 4116659 2237776 -349738 -3032945 -5481177 -6488140
32187 -6488140 -4707911 -1140984 1396939 2007624 2414816 3228052 2661652 353250 -949136
32178 -949136 314854 1730362 1036369 -78170 533320 1224217 -231370 -1714170 238393
32169 238393 4121047 5164651 2716956 991850 2279463 4126497 4170570 3375728 2884956
32160 2884956 1596027 -925415 -2365186 -1133809 421545 -992744 -4830597 -7341513
32152 -7341513 -6284644 -3108366 -760309 -741328 -2229250 -3176463 -2250470 -101472 1389117
32143 1389117 1121145 -352283 -1798509 -2458820 -2268098 -1603726 -848598 161351 1831018
$$ packed form
32204A246134j709461p94900M639j305394k768697j442399J799180L640037L113675
32195A782814J895973Q80635m42763j878883k587514k683207k448232j006963
32187f488140J780229L566927K537923O10685M07192Q13236n66400k308402j302386
32178i49136J263990J415508o93993j114539O11490O90897j455587j482800J952563
32169B38393L882654J043604k447695j725106J287613J847034M4073p94842m90772
32160B884956j288929k521442j439771J231377J555354j414289l837853k510916
32152g341513J056869L176278K348057J8981j487922r47213R25993K148998J490589
32143A389117k67972j473428j446226o60311J90722O64372P55128J009949J669667
$$ plain form
32134 1831018 3487756 3301107 617323 -2437742 -3186116 -1782012 -857577 -2027422 -4206069
32125 -4206069 -5330193 -4471343 -2325052 -714795 -1308191 -3646046 -4889101 -2897824
32117 -2897824 801470 2523093 582715 -3318522 -6328759 -6625920 -4024540 -196197
32109 -196197 2064128 1472128 -138844 -300259 694992 662787 -978979 -2785719 -3839112
32100 -3839112 -4378974 -4163957 -2609705 -575448 211667 -394673 -1039722 -1177220 -1235723
32091 -1235723 -911614 332812 1482079 1235816 582545 1260377 2228929 1134434 -996135
32082 -996135 -544047 2858111 5451761 5240023 4489504 4867438 4445456 1946368 48701
32073 48701 1312863 3784451 3830412 1155231 -1763119 -3318139 -3492660 -2816761 -2601199
$$ packed form
32134A831018J656738j86649k683784l055065p48374J404104R24435j169845k178647
32125d206069j124124Q58850K146291J610257n93396k337855j243055J991277
32117b897824L699294J721623j940378l901237l010237k97161K601380L828343
32109a96197K260325n92000j610972j61415R95251l2205j641766j806740j053393
32100c839112n39862K15017J554252K034257P87115o06340o45049j37498n8503
32091a235723L24109J244426J149267k46263o53271O77832R68552j094495k130569
32082i96135M52088L402158K593650k11738p50519L77934m21982k499088j897667
32073D8701J264162K471588M5961k675181k918350j555020j74521O75899K15562
$$ plain form
32064 -2601199 -4126754 -5932228 -4647735 -427535 1818405 -723069 -4222311 -4018671
32056 -4018671 -1609826 -1460305 -3651504 -4803628 -4400724 -4796494 -5870390 -4984334 -2173885
32047 -2173885 -573327 -1332979 -2372870 -2486445 -2586939 -2652358 -1630099 -651805 -1936676
32038 -1936676 -4115753 -3475370 -610295 -484823 -4266291 -6675148 -4141256 -205657
32030 -205657 869220 792888 2727968 4407615 1786921 -3185343 -4790800 -2289162 -407704
32021 -407704 -1342973 -2102166 -662617 554174 -763248 -3104920 -4224301 -4508471 -5064210
32012 -5064210 -5352833 -4883234 -4684595 -5049620 -4363070 -2358486 -1909092 -4820370 -8104630
32003 -8104630 -7667351 -4088572 -1440115 -1536506 -2767707 -3836440 -4955956 -5403057 -3546399
$$ packed form
32064b601199j525555j805474J284493M220200K245940k541474l499242K03640
32056d018671K408845J49521k191199j152124M02904l95770j073896Q86056K810449
32047b173885J600558p59652j039891j13575j00494o5419J022259R78294j284871
32038a936676k179077O40383K865075J25472l781468k408857K533892L935599
32030b05657J074877p6332J935080J679647k620694m972264j605457K501638J881458
32021d07704r35269p59193J439549J216791j317422k341672j119381k84170n55739
32012e064210k88623M69599J98639l65025O86550K004584M49394k911278l284260
32003h104630M37279L578779K648457r6391j231201j068733j119516m47101J856658
$$ plain form
31994 -3546399 -67764 1927019 1026267 -867111 -1926030 -2727489 -3993874 -4604659 -3535866
31985 -3535866 -1752516 -571954 147993 891597 1353536 1563311 2080353 1976301 -707525
31976 -707525 -4869144 -5821075 -1520281 3488296 3789103 475902 -1139219 550191 2349101
31967 2349101 2268425 1882797 2392896 2623260 1895480 1250727 783505 -823946 -2981694
31958 -2981694 -2832167 251285 2954505 2641938 874441 318026 729557 383326 -539864
31949 -539864 -525990 503772 1094665 309673 -1383365 -2643001 -2167208 -158469 1085016
31940 1085016 -218211 -2291188 -1948290 181866 68653 -3261319 -5653047 -4136406
31932 -4136406 -1487762 -1645403 -3827644 -4561501 -2943686 -412758 2458711 5313925
$$ packed form
31994c546399L478635J994783r00752j893378j058919q01459j266385o10785J068793
31985c535866J783350J180562P19947P43604M61939K09775N17042j04052k683826
31976g07525m161619r51931M300794N008577L00807l313201j615121J689410J798910
31967B349101q0676l85628N10099K30364p27780o44753m67222j607451k157748
31958b981694J49527L083452K703220l12567j767497n56415M11531l46231r23190
31949e39864J3874J029762N90893p84992j693038j259636M75793K008739J243485
31940A085016j303227k072977L42898K130156j13213l329972k391728J516641
31932d136406K648644j57641k182241p33857J617815K530928K871469K855214
$$ plain form
31924 5313925 6086093 3582427 628620 858472 3319771 3878805 1306805 -1475172 -1778362
31915 -1778362 336105 3420270 5613452 4970238 1761941 -446642 897153 3142241
31907 3142241 2141434 -1114639 -2011408 243064 1706614 471868 -758484 -14583
31899 -14583 835555 203878 -266800 814112 1799034 1091664 -217414 -1128874 -2927539
31890 -2927539 -5932742 -7051833 -3791093 1435775 4077702 2969918 484612 -1283625
31882 -1283625 -1846847 -1133599 396282 1231276 521397 -463956 -316822 182782 -425016
31873 -425016 -1564689 -1419118 396005 2708399 4497868 5179596 4246570 2265897 1129543
31864 1129543 1655992 2122840 877854 -955638 -1317784 -365368 377285 620872 588690
$$ packed form
31924E313925P72168k503666k953807K29852K461299N59034k572000k781977l03190
31915a778362K114467L084165K193182o43214l208297k208583J343795K245088
31907C142241j000807l256073q96769K254472J463550j234746j230352P43901
31899a4583Q50138o31677m70678J080912R84922p07370j309078r11460j798665
31890b927539l005203j119091L260740N226868K641927j107784k485306j768237
31882a283625n63222P13248J529881Q34994p09879r85353J47134M99604o07798
31873d25016j139673J45571J815123K312394J789469O81728r33026j980673j136354
31864A129543N26449M66848j244986j833492l62146R52416P42653K43587l2182
$$ plain form
31855 588690 -945485 -4872321 -8847776 -9421581 -6853646 -4793739 -5134936 -6146226 -5989219
31846 -5989219 -5086365 -4281470 -3437115 -2897015 -3857107 -6048843 -7177215 -5880053 -3362766
31837 -3362766 -1057512 1281428 3868752 5334805 4617239 2885093 1913797 1742347 1367660
31828 1367660 577065 -241978 -904696 -845888 762961 2975818 3006225 82793 -2532089
31819 -2532089 -1896985 -13950 -798332 -3647851 -4123888 -979511 1737193 686980 -2495351
31810 -2495351 -4701564 -5526594 -5448902 -3164559 1683026 5457714 4348716 41595 -2440396
31801 -2440396 -1879701 -1534346 -2622750 -1961863 2260542 6632650 7260937 5202337 3960472
31792 3960472 3956881 3025429 827653 -861905 -1460945 -1774913 -1437119 318272 1501280
$$ packed form
31855E88690j534175l926836l975455n73805K567935K059907l41197j011290J57007
31846e989219R02854Q04895Q44355N40100r60092k191736j128372J297162K517287
31837c362766K305254K338940K587324J466053p17566j732146r71296j71450l74687
31828A367660p90595q19043o62718N8808J608849K212857L0407k923432k614882
31819b532089O35104J883035p84382k849519m76037L144377K716704j050213l182331
31810b495351k206213q25030P7692K284343M847585L774688j108998m307121k481991
31801b440396N60695L45355j088404O60887M222405M372108O28287k058600j241865
31792C960472l591r31452k197776j689558n99040l13968L37794J755391J183008
$$ plain form
31783 1501280 -1097661 -6466750 -9259639 -6707176 -2294550 -497868 -1042722 -1181967
31775 -1181967 -811919 -1493255 -2220864 -617594 2099337 1717262 -2625990 -6522991 -6300464
31766 -6300464 -3681055 -2325435 -2622159 -2852697 -3297657 -5349583 -7474810 -6199360 -1676367
31757 -1676367 1433946 266708 -2137850 -1433067 1759823 3388295 2286785 1127981
31749 1127981 1287809 809468 -1270886 -2256032 -66590 2506253 1363638 -2450504 -3710062
31740 -3710062 -380117 3611105 4025510 1602996 -185466 -188505 163787 42514 -203048
31731 -203048 -988739 -3187080 -5718413 -5986763 -3499342 -970463 -747232 -1927216 -2356091
31722 -2356091 -1854292 -1676327 -2009527 -2145662 -2384335 -3399081 -3962273 -1912871 2101932
$$ packed form
31783A501280k598941n369089k792889K552463M412626J796682n44854j39245
31775a181967L70048o81336p27609J603270K716931l82075m343252l897001K22527
31766f300464K619409J355620k96724k30538m44960k051926k125227J275450M522993
31757a676367L110313j167238k404558P04783L192890J628472j101510j158804
31749A127981J59828m78341k080354r85146K189442K572843j142615l814142j259558
31740c710062L329945L991222M14405k422514j788462l039L52292j21273k45562
31731b03048p85691k198341k531333k68350K487421K528879K23231j179984m28875
31722b356091N01799J77965l33200j36135k38673j014746n63192K049402M014803
$$ plain form
31713 2101932 4353466 2696940 -559900 -1950315 -1170811 -272756 -156030 -183268 -195340
31704 -195340 -410002 76669 2177352 4493234 4642390 2903445 1966159 2798544 3436794
31695 3436794 2499194 1174780 653877 196246 -770335 -987218 448596 2231876 2923147
31686 2923147 3019792 3252549 2777000 1030838 -487363 -494815 -253657 -1288887 -2430909
31677 -2430909 -1720294 185726 1267981 1579764 2558382 3909343 4138153 3475454 3403332
31668 3403332 3865384 3724712 3338631 3790371 4183371 2694315 -224294 -2635876 -4315077
31659 -4315077 -5945369 -6212825 -3670459 -654872 -702205 -2391158 -909423 3944889 6931806
31650 6931806 5714135 4228335 5487675 6662588 4628373 1382531 -46976 -761948
$$ packed form
31713B101932K251534j656526l256840j390415P79504Q98055J16726k7238j2072
31704a95340k14662M86671K100683K315882J49156j738945r37286Q32385O38250
31695C436794r37600j324414n20903m57631r66581k16883J435814J783280O91271
31686B923147R6645K32757m75549j746162j518201p452K41158j035230j142022
31677b430909P10615J906020J082255L11783R78618J350961K28810o62699p2122
31668C403332M62052j40672l86081M51740L93000j489056k918609k411582j679201
31659d315077j630292k67456K542366L015587m7333j688953J481735M854312K986917
31650F931806j217671j485800J259340J174913k034215l245842j429507p14972
$$ plain form
31642 -761948 -2737663 -4221067 -3079223 -1515822 -2458893 -3897304 -2118553 1367576
31634 1367576 1742701 -1213522 -2601417 54166 3539528 4118015 2076564 -66167
31626 -66167 -939866 -786198 -591190 -1402756 -3132602 -4226740 -3765966 -2886884 -2618070
31617 -2618070 -1953486 -111347 1306981 1086544 1198866 3527765 5845576 4993793 2327176
31608 2327176 1559843 2572339 2218216 351046 -203916 640920 -25794 -2373081 -3178046
31599 -3178046 -1655164 -658008 -1042372 -279876 1783188 1403469 -2454606 -5233393 -3401864
31590 -3401864 753151 3869415 6240063 8423967 7983630 3969466 577058 1571595
31582 1571595 4359241 4301398 1903544 737724 842338 -394750 -2566018 -2872685 -1451188
$$ packed form
31642g61948j975715j483404J141844J563401r43071j438411J778751L486129
31634A367576L75125k956223j387895K655583L485362N78487k041451k142731
31626f6167q73699J53668J95008q11566j729846j094138M60774Q79082K68814
31617b618070O64584J842139J418328k20437J12322K328899K317811q51783k666617
31608B327176p67333J012496l54123j867170n54962Q44836o66714k347287q04965
31599c178046J522882R97156l84364P62496K063064l79719l858075k778787J831529
31590c401864M155015L116264K370648K183904m40337m014164l392408R94537
31582A571595K787646n7843k397854j165820J04614j237088k171268l06667J421497
$$ plain form
31573 -1451188 -1075407 -2094130 -2305827 -1523788 -1781446 -3081628 -3219387 -1932569 -1166195
31564 -1166195 -1110377 -88113 1402249 862205 -1362227 -1789066 447863 1744345 -322707
31555 -322707 -3276714 -3878351 -2781633 -2617879 -3935771 -5391779 -6044306 -5485999 -3442516
31546 -3442516 -931783 -84417 -1269619 -2213109 -1480532 -811699 -2112831 -4012983 -3712788
31537 -3712788 -1002999 1705258 2485350 1255965 -1014524 -2663500 -1737312 2045956
31529 2045956 6142419 7529548 5828569 2885648 74221 -2318719 -3678198 -3184439
31521 -3184439 -1549366 -839884 -1888643 -3147580 -2976848 -2182864 -3080444 -6158508 -8882020
31512 -8882020 -8605746 -6005512 -4169533 -4207991 -3700204 -724366 2441436 2115523 -1273351
$$ packed form
31573a451188L75781j018723k11697P82039k57658j300182j37759J286818P66374
31564a166195N5818J022264J490362n40044k224432m26839K236929J296482k067052
31555c22707k954007o01637J096718J63754j317892j456008o52527N58307K043483
31546c442516K510733Q47366j185202r43490P32577O68833j301132j900152L00195
31537c712788K709789K708257P80092j229385k270489j648976R26188L783268
31529B045956M096463J387129j700979k942921k811427k392940j359479M93759
31521c184439J635073P09482j048759j258937J70732P93984q97580l078064k723512
31512h882020K76274K600234J835979l8458N07787K975838L165802l25913l388874
$$ plain form
31503 -1273351 -3522271 -2511273 -564825 -144748 -378726 273769 629832 -1166438 -3822686
31494 -3822686 -4097862 -1361974 1473618 1747187 40432 -1008660 124629 2187605
31486 2187605 2399414 -372384 -3812231 -4625328 -2811727 -1653942 -2932983 -4511970
31478 -4511970 -4035298 -2572172 -2294284 -2619892 -1714015 -464921 -1491295 -4569480 -6377168
31469 -6377168 -5183800 -2979852 -2238281 -2989869 -3986641 -4600330 -4457370 -2977615 -547355
31460 -547355 1089564 723161 -851357 -1974099 -2012226 -1606781 -1635178 -2223047 -2418885
31451 -2418885 -1136217 1010807 1607385 -641938 -3685777 -4449695 -2756375 -1017069
31443 -1017069 -543130 -492742 -354187 -913207 -2267247 -3133153 -2803927 -1889595 -709886
$$ packed form
31503a273351k248920J010998J946448M20077k33978O52495L56063j796270k656248
31494c822686k75176K735888K835592K73569j706755j049092J133289K062976
31486B187605K11809k771798l439847q13097J813601J157785j279041j578987
31478d511970M76672J463126K77888l25608R05877J249094j026374l078185j807688
31469f377168J193368K203948P41571p51588r96772o13689J42960J479755K430260
31460e47355J636919l66403j574518j122742l8127M05445k8397n87869j95838
31451b418885J282668K147024N96578k249323l043839p63918J693320J739306
31443a017069M73939N0388J38555n59020j354040q65906L29226R14332J179709
$$ plain form
31434 -709886 976295 2283714 1629193 -520762 -1742567 -1227267 -696292 -896460 -124954
31425 -124954 2330607 4261085 4042189 3341033 3959154 4492535 2902565 257223 -1123895
31416 -1123895 -1488384 -2452738 -3478102 -2962220 -1838057 -2523416 -4653362 -5215648 -3044839
31407 -3044839 -233168 1180523 1258610 672594 -234209 -565209 407518 1184855 -785911
31398 -785911 -5164955 -8257193 -7429796 -4080071 -1349107 -585887 -871167 -582200 1171230
31389 1171230 3423576 3589106 364057 -3791286 -5093843 -3236106 -1315468 -940007
31381 -940007 -404938 1544846 3302840 3310613 2702093 3150907 4260200 4935345 5290347
31372 5290347 5280460 3549434 -33855 -2502269 -1108840 2706492 5173317 4991931 3774055
$$ packed form
31434g09886J686181J307419o54521k149955j221805N15300N30975k00168P71506
31425a24954K455561J930478k18896p01156O18121N33381j589970k645342j381118
31416a123895l64489r64354j025364N15882J124163o85359k129946n62286K170809
31407c044839K811671J413691P8087n86016r06803l31000R72727P77337j970766
31398g85911m379044l092238Q27397L349725K730964P63220k85280K88967J753430
31389A171230K252346J65530l225049m155343j302557J857737J920638L75461
31381i40007N35069J949784J757994P773o08520M48814J109293O75145L55002
31372E290347r887j731026l583289k468414J393429L815332K466825j81386j217876
$$ plain form
31363 3774055 2592550 941631 -1078504 -2207966 -2029419 -1488601 -1078507 -258977 1043032
31354 1043032 2019038 2396702 2770642 3198070 2881684 1603149 163334 -932561 -1956012
31345 -1956012 -2806344 -2701257 -1479234 -12109 1138314 2253782 3148209 2730041 811880
31336 811880 -868674 -749104 269531 166504 -949786 -710299 1957609 4696812 4434114
31327 4434114 1467086 -797535 -281662 1251695 1074543 -515685 -924677 604868 1864118
31318 1864118 1109240 -513263 -1159412 -1111967 -1602821 -2082776 -998670 1107148 1681346
31309 1681346 -152260 -1980314 -1298316 1035224 1982063 324905 -1991845 -2630797 -1749444
31300 -1749444 -1284528 -1900405 -1954156 -65248 2276442 2107522 -1095686 -4463813 -5311853
$$ packed form
31363C774055j181505j650919k020135j129462J78547N40818M10094Q19530J302009
31354A043032R76006L77664L73940M27428l16386j278535j439815j095895j023451
31345a956012q50332J05087J222023J467125J150423J115468Q94427m18168j918161
31336H11880j680554J19570J018635j03027j116290K39487K667908K739203k62698
31327D434114k967028k264621N15873J533357j77152j590228m08992J529545J259250
31318A864118p54878j622503o46149M7445m90854m79955J084106K105818N74198
31309A681346j833606j828054O81998K333540R46839j657158k316750o38952Q81353
31300a749444M64916o15877n3751J888908K341690j68920l203208l368127q48040
$$ plain form
31291 -5311853 -4252119 -3581574 -3767757 -3321856 -1627084 119055 1004562 1643245 2549578
$$ packed form
31291e311853J059734O70545j86183M45901J694772J746139Q85507O38683R06333
$$ [...]
##END NTUPLES=NMR SPECTRUM
##END=
