##TITLE=31Pdec_D58 Ac 6
 
 24 sc
 3.6.2024
##JCAMPDX= 6.0         $$ Bruker NMR JCAMP-DX V2.0
##DATA TYPE= NMR SPECTRUM
##DATA CLASS= NTUPLES
##ORIGIN= UXNMR, Bruker Analytische Messtechnik GmbH
##OWNER= root
$$ XWIN-NMR		Version 3.5
$$ Mon Jun  3 14:21:04 2024 Russian Standard Time (UT+4h)  she@DPX200
##.OBSERVE FREQUENCY= 81.013821
##.OBSERVE NUCLEUS= ^31P
##.ACQUISITION MODE= SIMULTANEOUS
##.ACQUISITION SCHEME= undefined
##.AVERAGES= 24
##.DIGITISER RES= 16
##SPECTROMETER/DATA SYSTEM= spect
##.PULSE SEQUENCE= zgpg30
##.SOLVENT NAME= CDCl3
##.SHIFT REFERENCE= (INTERNAL, CDCl3, 0, 298.009)
##AUDIT TRAIL= $$ (NUMBER, WHEN, WHO, WHERE, WHAT)
$$ ##TITLE= Audit trail, XWIN-NMR		Version 3.5
$$ ##JCAMPDX= 5.01
$$ ##ORIGIN= Bruker BioSpin GmbH
$$ ##OWNER= she
$$ F:/spectra/data/she/nmr/P31/1/pdata/1/auditp.txt
$$ ##AUDIT TRAIL=  $$ (NUMBER, WHEN, WHO, WHERE, WHAT)
(   1,<2024-06-03 14:20:00.31 +0400>,<she>,<DPX200>,
      <created by zg, POWCHK disabled, PULCHK disabled
       configuration hash MD5:
       00 E9 B6 7A A2 85 ED C7 34 08 36 98 17 FE 4E 26
       data hash MD5: 32K
       BB 91 5E 1C 72 F9 19 6D 3A 8B 59 F8 F8 E5 D5 23>)
(   2,<2024-06-03 14:20:01.93 +0400>,<she>,<DPX200>,
      <Start of raw data processing
       efp BC_mod = 2 LB = 10 FT_mod = 6 PKNL = 1 PHC0 = -224.9977 PHC1 = 0 SI = 64K 
       data hash MD5: 64K
       1C 5A 58 18 F1 22 81 57 E9 78 39 26 E3 C1 5C 1E>)
$$ ##END=
$$ 
$$ hash MD5
$$ 0D B3 5A E9 2D 54 4C 21 9A F2 53 FE 54 7C F7 42
##$RELAX= 
##$RELAX= 
##$RELAX= 
##$RELAX= 
##$RELAX= 
##$RELAX= 
##$RELAX= 
##$RELAX= 
##$RELAX= 
$$ Bruker specific parameters
$$ --------------------------
##$DU= <F:/spectra>
##$EXPNO= 1
##$NAME= <P31>
##$PROCNO= 1
##$TYPE= <nmr>
##$USER= <she>
##$AMP= (0..31)
100 100 100 100 100 100 100 100 100 100 100 100 100 100 100 100 100 100 
100 100 100 100 100 100 100 100 100 100 100 100 100 100 
##$AQSEQ= 0
##$AQ_mod= 1
##$AUNM= <au_zg>
##$AUTOPOS= <>
##$BF1= 81.014009
##$BF2= 200.13
##$BF3= 200.13
##$BF4= 200.13
##$BF5= 200.13
##$BF6= 200.13
##$BF7= 200.13
##$BF8= 200.13
##$BYTORDA= 1
##$CFDGTYP= 0
##$CFRGTYP= 5
##$CHEMSTR= <none>
##$CNST= (0..31)
1 1 145 1 1 1 1 1 1 1 1 1 1 1 1 1 1 1 1 1 1 1 1 1 1 1 1 1 1 1 1 1 
##$CPDPRG= <waltz16>
##$CPDPRG1= <>
##$CPDPRG2= <waltz16>
##$CPDPRG3= <>
##$CPDPRG4= <mlev>
##$CPDPRG5= <mlev>
##$CPDPRG6= <mlev>
##$CPDPRG7= <mlev>
##$CPDPRG8= <mlev>
##$CPDPRGB= <>
##$CPDPRGT= <>
##$D= (0..31)
0 1 0 0 0 0 0 0 0 0 0 0.03 2e-05 3e-06 0 0 0 0 0 0 0 0 0 0 0 0 0 0 0 0 
0 0 
##$DATE= 1717409999
##$DBL= (0..7)
120 120 120 11 120 120 24 19 
##$DBP= (0..7)
150 150 150 150 150 150 150 150 
##$DBP07= 0
##$DBPNAM0= <>
##$DBPNAM1= <>
##$DBPNAM2= <>
##$DBPNAM3= <>
##$DBPNAM4= <>
##$DBPNAM5= <>
##$DBPNAM6= <>
##$DBPNAM7= <>
##$DBPOAL= (0..7)
0.5 0.5 0.5 0.5 0.5 0.5 0.5 0.5 
##$DBPOFFS= (0..7)
0 0 0 0 0 0 0 0 
##$DE= 6
##$DECBNUC= <off>
##$DECIM= 3
##$DECNUC= <off>
##$DECSTAT= 4
##$DIGMOD= 1
##$DIGTYP= 9
##$DL= (0..7)
0 0 52 120 120 21 21 25 
##$DP= (0..7)
$$ [...]
##$SUBNAM2= <"">
##$SUBNAM3= <"">
##$SUBNAM4= <"">
##$SUBNAM5= <"">
##$SUBNAM6= <"">
##$SUBNAM7= <"">
##$SUBNAM8= <"">
##$SUBNAM9= <"">
##$SW= 600.660478495614
##$SWIBOX= (0..15)
0 1 3 0 0 0 0 0 0 0 0 0 0 0 0 0 
##$SW_h= 48661.800486618
##$TD= 32768
##$TD0= 1
##$TE= 0
##$TE2= 300
##$TE3= 300
##$TEG= 300
##$TL= (0..7)
0 120 53 12 22 120 120 120 
##$TP= (0..7)
150 150 150 150 150 150 150 150 
##$TP07= 0
##$TPNAME0= <>
##$TPNAME1= <>
##$TPNAME2= <>
##$TPNAME3= <>
##$TPNAME4= <>
##$TPNAME5= <>
##$TPNAME6= <>
##$TPNAME7= <>
##$TPOAL= (0..7)
0.5 0.5 0.5 0.5 0.5 0.5 0.5 0.5 
##$TPOFFS= (0..7)
0 0 0 0 0 0 0 0 
##$TUNHIN= 0
##$TUNHOUT= 0
##$TUNXOUT= 0
##$USERA1= <user>
##$USERA2= <user>
##$USERA3= <user>
##$USERA4= <user>
##$USERA5= <user>
##$V9= 5
##$VALIST= <valist>
##$VCLIST= <CCCCCCCCCCCCCCC>
##$VD= 0
##$VDLIST= <DDDDDDDDDDDDDDD>
##$VPLIST= <PPPPPPPPPPPPPPP>
##$VTLIST= <TTTTTTTTTTTTTTT>
##$WBST= 1024
##$WBSW= 4
##$XGAIN= (0..3)
0 0 0 0 
##$XL= 0
##$YL= 0
##$YMAX_a= 1842
##$YMIN_a= -3413
##$ZGOPTNS= <>
##$ZL1= 120
##$ZL2= 120
##$ZL3= 120
##$ZL4= 120
##$ABSF1= 0
##$ABSF2= 0
##$ABSG= 0
##$ABSL= 0
##$ALPHA= 0
##$AQORDER= 0
##$ASSFAC= 0
##$ASSFACI= 0
##$ASSFACX= 0
##$ASSWID= 0
##$AUNMP= <proc_1d>
##$AZFE= 0.1
##$AZFW= 0.5
##$BCFW= 0
##$BC_mod= 2
##$BYTORDP= 0
##$COROFFS= 0
##$CY= -3
##$DATMOD= 1
##$DC= 0
##$DFILT= <>
##$DTYPP= 0
##$F1P= 0
##$F2P= 0
##$FCOR= 1
##$FTSIZE= 65536
##$FT_mod= 6
##$GAMMA= 0
##$GB= 0
##$INTBC= 1
##$INTSCL= 6.047779e-11
##$ISEN= 30
##$LB= 10
##$LEV0= 0
##$LPBIN= 0
##$MAXI= 10000
##$MC2= 0
##$MEAN= 0
##$ME_mod= 0
##$MI= 50
##$NCOEF= 0
##$NC_proc= -11
##$NLEV= 6
##$NOISF1= 182.463
##$NOISF2= 159.3651
##$NSP= 0
##$NTH_PI= 0
##$NZP= 0
##$OFFSET= 298.0089
##$PC= 4
##$PHC0= -224.9977
##$PHC1= 0
##$PH_mod= 1
##$PKNL= yes
##$PPARMOD= 0
##$PSCAL= 0
##$PSIGN= 0
##$REVERSE= no
##$SF= 81.0140089999694
##$SI= 65536
##$SIGF1= 159.3651
##$SIGF2= -187.1042
##$SINO= 113.3802
##$SIOLD= 16384
##$SREGLST= <1H.CDCl3>
##$SSB= 0
##$STSI= 65536
##$STSR= 0
##$SW_p= 48661.800486618
##$SYMM= 0
##$S_DEV= 0
##$TDeff= 32768
##$TDoff= 0
##$TI= <>
##$TILT= no
##$TM1= 0
##$TM2= 0
##$TOPLEV= 0
##$USERP1= <user>
##$USERP2= <user>
##$USERP3= <user>
##$USERP4= <user>
##$USERP5= <user>
##$WDW= 1
##$XDIM= 65536
##$YMAX_p= 523938051
##$YMIN_p= -63777470
$$ End of Bruker specific parameters
$$ ---------------------------------
##NTUPLES= NMR SPECTRUM
##VAR_NAME=  FREQUENCY,     SPECTRUM/REAL,   SPECTRUM/IMAG
##SYMBOL=    X,             R,               I
##VAR_TYPE=  INDEPENDENT,   DEPENDENT,       DEPENDENT
##VAR_FORM=  AFFN,          ASDF,            ASDF
##VAR_DIM=   65536,         65536,           65536
##UNITS=     HZ,            ARBITRARY UNITS, ARBITRARY UNITS
##FACTOR=    0.742531479157977, 1,           1
##FIRST=     24142.8966085848, 0,            0
##LAST=      -24518.9038780332, 0,           0
##MIN=       -24518.9038780332, -63777470,   0
##MAX=       24142.8966085848, 523938051,    0
$$ Real data points
##PAGE= N=1
##DATA TABLE= (X++(R..R)), XYDATA
$$ [...]
56312 15401183 16638095 17506523 18073176 18384179 18448158 18244244 17761249 17045476 16219546
56303 16219546 15454149 14906194 14651938 14644475 14720821 14665207 14300521 13560528 12514950 11351648
56293 11351648 10326869 9685804 9568136 9942417 10614511 11311388 11789624 11904273 11608664
56284 11608664 10910760 9841880 8469156 6927259 5420807 4184365 3432314 3327740
56276 3327740 3963694 5339805 7340256 9733191 12200760 14396470 16017945 16865398
56268 16865398 16850013 15957145 14223572 11774619 8883090 5962523 3462790 1731346
56260 1731346 929584 1037770 1916473 3370931 5184510 7124878 8954464 10468627 11547159
56251 11547159 12184390 12485810 12646250 12914907 13532244 14643084 16233522 18140696 20127534
56242 20127534 21960403 23436592 24369995 24591606 24003687 22655737 20762341 18620933
56234 18620933 16479722 14450714 12513725 10582304 8582388 6517150 4499582 2729567
56226 2729567 1416734 693154 565328 916929 1544176 2206999 2682199 2798654 2444379
56217 2444379 1559856 133473 -1807725 -4218297 -7040122 -10164559 -13374437 -16332596
56209 -16332596 -18651870 -20008749 -20232984 -19336268 -17485690 -14948426 -12038950 -9090752
56201 -9090752 -6444265 -4415619 -3227581 -2936570 -3415261 -4412170 -5648623 -6895385 -8004454
56192 -8004454 -8907924 -9599258 -10098857 -10408538 -10478721 -10217484 -9546264 -8471370 -7123269
56183 -7123269 -5729287 -4523807 -3644597 -3082607 -2719838 -2424713 -2136498 -1893206 -1805936
56174 -1805936 -2003972 -2569166 -3479612 -4592538 -5683513 -6522779 -6948057 -6905080 -6449004
56165 -6449004 -5712312 -4854626 -4016882 -3291673 -2702325 -2187885 -1616666 -849596 169987
56156 169987 1359824 2516741 3400731 3844714 3841719 3562219 3277394 3221740 3479802 3967844
56146 3967844 4508688 4936765 5169827 5226230 5205303 5255889 5540925 6193085 7271060 8748299
56136 8748299 10549912 12600274 14824937 17108624 19278555 21161903 22676109 23867738
56128 23867738 24870897 25830982 26846611 27941046 29054196 30058730 30805100 31175834
56120 31175834 31114253 30614217 29696658 28413428 26887844 25347993 24090956 23369490 23275451
56111 23275451 23714329 24487937 25405036 26327327 27139038 27708785 27909372 27687562 27113445
56102 27113445 26350907 25564047 24835844 24162564 23514958 22903465 22400559 22124834 22211221
56093 22211221 22771063 23834867 25295119 26889676 28247848 28978587 28761225 27415429
56085 27415429 24945553 21551325 17589037 13482655 9615540 6245665 3466141 1206614
56077 1206614 -730312 -2593819 -4581461 -6751686 -8999734 -11098855 -12764559 -13709101
56069 -13709101 -13693862 -12594046 -10454684 -7497858 -4072352 -578744 2595775 5127815
56061 5127815 6802383 7547316 7440713 6682574 5539269 4280084 3126831 2233494 1700333
56052 1700333 1605395 2018454 2968772 4377130 6009429 7515147 8556186 8953419 8754482
56043 8754482 8181189 7496300 6872088 6331065 5783017 5124341 4323899 3431870 2516189
56034 2516189 1593158 611955 -505965 -1810110 -3274482 -4770242 -6070695 -6906905 -7068146
56025 -7068146 -6503595 -5369641 -3993936 -2772285 -2048387 -2028836 -2756364 -4129215 -5944529
56016 -5944529 -7955724 -9936656 -11729721 -13252483 -14468744 -15363586 -15951796 -16302168 -16533816
56007 -16533816 -16771351 -17099681 -17568437 -18240508 -19219281 -20601741 -22384924 -24410562 -26399132
55998 -26399132 -28042948 -29092776 -29406600 -28969646 -27895660 -26404265 -24772624 -23272727
55990 -23272727 -22109302 -21374505 -21039651 -20991852 -21091456 -21211813 -21249766 -21128302 -20808025 -20295246
55980 -20295246 -19626927 -18834745 -17912449 -16812555 -15481441 -13912468 -12174596 -10391137
55972 -10391137 -8694427 -7205323 -6043885 -5326261 -5121453 -5407335 -6080082 -7008969 -8076520
55963 -8076520 -9173053 -10180121 -10989627 -11553533 -11913046 -12169942 -12416807 -12679262 -12909304
55954 -12909304 -13024772 -12960614 -12703811 -12305749 -11876971 -11569033 -11548321 -11965973 -12923721 -14439701
55944 -14439701 -16432758 -18740797 -21155600 -23435689 -25293242 -26403229 -26474225 -25349033
55936 -25349033 -23058086 -19786544 -15788635 -11311981 -6568542 -1748538 2951134 7316104
55928 7316104 11133870 14224939 16457275 17740981 18029026 17342543 15803216 13635110
55920 13635110 11119226 8524703 6060121 3867036 2038065 626787 -358016 -950992
55912 -950992 -1204552 -1152983 -794036 -100031 948578 2324324 3935322 5652901 7369665
55903 7369665 9031577 10608370 12042255 13246287 14159089 14787911 15193190 15451957 15659390
55894 15659390 15955467 16504813 17404646 18595049 19869102 20989633 21814434 22330380 22595372
55885 22595372 22668041 22584310 22366898 22032822 21604689 21147278 20804028 20772665 21203401 22081352
55875 22081352 23177373 24105874 24467731 24012663 22734148 20836881 18602879 16260795
55867 16260795 13946363 11743961 9728522 7948947 6367028 4815881 3039327 821840
55859 821840 -1859256 -4771201 -7512500 -9689839 -11058445 -11552408 -11238255 -10267804 -8859485
55850 -8859485 -7277234 -5774015 -4516130 -3544201 -2809743 -2263912 -1928896 -1901333 -2298811
55841 -2298811 -3197389 -4592790 -6388299 -8404782 -10410482 -12160913 -13436632 -14081894
55833 -14081894 -14053914 -13467411 -12592585 -11781894 -11351160 -11472024 -12123992 -13125028 -14225109
55824 -14225109 -15212268 -15970803 -16471048 -16727274 -16769154 -16628465 -16316417 -15797469 -14997926
55815 -14997926 -13860322 -12399524 -10712204 -8943040 -7246556 -5764514 -4608172 -3839239
55807 -3839239 -3464353 -3453487 -3767674 -4373598 -5240913 -6334758 -7611390 -9011270 -10441870
55798 -10441870 -11756428 -12752012 -13210405 -12977202 -12036321 -10528563 -8699965 -6814271 -5078205
55789 -5078205 -3605665 -2419111 -1471866 -670256 117110 1049971 2276899 3862439 5729973
55780 5729973 7678606 9472181 10933290 11980910 12615059 12894923 12934919 12897664 12957132
55771 12957132 13244396 13818139 14679880 15804326 17142406 18597566 20017063 21220885
55763 21220885 22038361 22314487 21898197 20659331 18546734 15640647 12145525 8321575
55755 8321575 4405846 577854 -3017892 -6232933 -8914444 -10952001 -12317476 -13044863
55747 -13044863 -13169885 -12701710 -11659920 -10135311 -8321536 -6509880 -5057861 -4320883
55739 -4320883 -4546418 -5786165 -7897130 -10630614 -13731022 -16978846 -20185885 -23188182
55731 -23188182 -25857567 -28120664 -29967265 -31431212 -32533089 -33207164 -33276713 -32528436 -30853460
55722 -30853460 -28350206 -25307459 -22082697 -18962821 -16086287 -13451007 -10986204 -8642279
55714 -8642279 -6443801 -4467768 -2760625 -1260624 203858 1824203 3684607 5688343
55706 5688343 7600635 9191944 10383216 11284671 12106890 13027248 14108632 15291010 16416085
55697 16416085 17261524 17594544 17238828 16117308 14250102 11731101 8713172 5401471
55689 5401471 2039688 -1117064 -3848774 -6042416 -7761174 -9245654 -10812558 -12704687
55681 -12704687 -14991041 -17565814 -20214931 -22688248 -24736348 -26107460 -26536785 -25779183
55673 -25779183 -23703790 -20399486 -16208016 -11649055 -7276063 -3532604 -663371 1293527
55665 1293527 2439693 2919606 2849934 2297423 1286747 -184938 -2131821 -4560101 -7446016
55656 -7446016 -10707128 -14168433 -17550904 -20516124 -22755785 -24067107 -24370669 -23685499
55648 -23685499 -22100120 -19751365 -16801284 -13415344 -9757072 -5998267 -2324109 1082246
55640 1082246 4068510 6532991 8418511 9691413 10342452 10429425 10120357 9662984 9263443
55631 9263443 8954807 8561190 7787342 6374661 4240082 1539921 -1366928 -4045595 -6145409
55622 -6145409 -7514637 -8219154 -8471405 -8517354 -8538575 -8610614 -8724007 -8837758 -8925525 -8996025
55612 -8996025 -9090789 -9265358 -9561490 -9990158 -10546013 -11247996 -12172866 -13449277 -15204850
55603 -15204850 -17485673 -20187661 -23043271 -25679771 -27719600 -28874436 -29008086 -28167245
55595 -28167245 -26572044 -24552853 -22451256 -20537220 -18977394 -17840376 -17109822 -16703773
55587 -16703773 -16512553 -16443204 -16438105 -16454790 -16429991 -16264072 -15846447 -15113902 -14105397 -12967952
55577 -12967952 -11897286 -11047866 -10470440 -10107020 -9827511 -9474723 -8899444 -7985810 -6670801
55568 -6670801 -4955320 -2901317 -616890 1756888 4044899 6030596 7466784 8115850
55560 8115850 7801510 6447089 4095421 916955 -2800513 -6696070 -10411503 -13672621
55552 -13672621 -16347323 -18462943 -20175964 -21704328 -23255502 -24981610 -26956647 -29148862
55544 -29148862 -31394011 -33416689 -34922583 -35710892 -35730033 -35058163 -33855387 -32329543 -30709951
55535 -30709951 -29210278 -27991410 -27149894 -26729648 -26725333 -27059340 -27556438 -27960280 -28009527
55526 -28009527 -27542506 -26571051 -25278120 -23937768 -22800066 -22002038 -21547530 -21352165 -21304549
55517 -21304549 -21289729 -21164015 -20722174 -19708904 -17890073 -15152967 -11582989 -7472798 -3252004
55508 -3252004 631106 3817507 6092560 7389636 7768798 7386163 6453422 5191889 3794931
55499 3794931 2405851 1108897 -63171 -1097013 -1951132 -2522436 -2651827 -2170994 -975651
55490 -975651 904013 3283636 5893314 8504229 11012681 13404923 15642864 17594606
55482 17594606 19086143 20025969 20487502 20679741 20830138 21059951 21325231 21448319 21209698
55473 21209698 20441893 19084299 17199676 14971865 12682944 10647843 9111379 8166727
55465 8166727 7763219 7803972 8252138 9156497 10581926 12508581 14773698 17081324 19059126
55456 19059126 20333770 20613330 19773282 17925145 15421254 12757717 10401292 8636812
55448 8636812 7527111 6985494 6875666 7064429 7428036 7854134 8255356 8576640 8783317
55439 8783317 8840835 8706244 8344756 7768543 7070193 6412414 5967212 5846764 6070920 6568161
55429 6568161 7179842 7668200 7758307 7218381 5941175 3992352 1618856 -791153 -2813191
55420 -2813191 -4131276 -4638841 -4428400 -3698573 -2669734 -1555579 -555687 178161 588686
55411 588686 717684 647401 426747 52693 -477023 -1099571 -1683850 -2093523 -2250266 -2140917
55401 -2140917 -1784984 -1217975 -506889 239294 893904 1350637 1535178 1386380 842423
55392 842423 -140603 -1552456 -3312985 -5291970 -7338043 -9281502 -10914591 -11992958
55384 -11992958 -12288952 -11670187 -10143993 -7840882 -4967575 -1773830 1461412 4455270
55376 4455270 6976558 8907067 10259518 11128787 11607619 11729757 11478407 10838001 9831284
55367 9831284 8506206 6891027 4967479 2697006 92632 -2708752 -5427593 -7700185
55359 -7700185 -9186549 -9669322 -9103844 -7619688 -5485209 -3030029 -528407 1903437
55351 1903437 4315979 6820356 9449633 12100847 14591050 16759105 18529497 19919026
55343 19919026 21017479 21960095 22880493 23846019 24814035 25646219 26170320 26243731 25791260
55334 25791260 24825933 23459640 21878124 20257550 18660975 17002469 15125457 12937982
55326 12937982 10496977 7994071 5688833 3852040 2724496 2464299 3091811 4480163
55318 4480163 6411551 8658391 11032901 13389295 15601069 17538451 19061423 20040953
55310 20040953 20407055 20191570 19523387 18570749 17473282 16309278 15102210 13837748 12470817
55301 12470817 10928589 9124955 6991222 4513296 1755958 -1147049 -4044145 -6834677
55293 -6834677 -9509712 -12133805 -14780859 -17469852 -20138150 -22655485 -24856680 -26573056
55285 -26573056 -27657141 -28001185 -27544107 -26261172 -24147557 -21223581 -17575257 -13401507
55277 -13401507 -9017093 -4793719 -1077120 1869141 3878803 4872065 4828072 3745787
55269 3745787 1620325 -1532520 -5616556 -10419447 -15637060 -20928579 -25954389 -30392766
55261 -30392766 -33963284 -36463764 -37800816 -38003178 -37221527 -35705985 -33745347 -31585276
55253 -31585276 -29379348 -27207885 -25136805 -23251604 -21628339 -20267166 -19058331 -17832008
55245 -17832008 -16466173 -14961343 -13417965 -11953159 -10649874 -9575218 -8816167 -8474069
55237 -8474069 -8623915 -9281242 -10395586 -11860571 -13530850 -15240495 -16814983 -18080807
55229 -18080807 -18892225 -19175573 -18953120 -18314115 -17354963 -16139833 -14701443 -13063799 -11270844
55220 -11270844 -9415466 -7648113 -6138246 -5000686 -4241221 -3762056 -3414142 -3053267 -2570029
55211 -2570029 -1891715 -974115 194275 1573356 3065985 4550519 5929675 7147775
55203 7147775 8167649 8950552 9470550 9739005 9797942 9679193 9358877 8735080 7648561
55194 7648561 5955162 3615990 727464 -2549928 -6095034 -9842950 -13692637 -17418141
55186 -17418141 -20702372 -23280266 -25065702 -26162195 -26771817 -27092330 -27271617 -27416680 -27608112
55177 -27608112 -27885538 -28218283 -28500811 -28588216 -28348319 -27702352 -26650063 -25282176 -23765430
55168 -23765430 -22286956 -20983888 -19909837 -19054871 -18377563 -17805141 -17217116 -16467938 -15465828
55159 -15465828 -14250474 -12991470 -11891249 -11060645 -10462136 -9961255 -9438266 -8866541 -8301170
55150 -8301170 -7806147 -7399438 -7064798 -6803791 -6661508 -6692769 -6902217 -7221872 -7554025 -7842352
55140 -7842352 -8105185 -8403157 -8780965 -9246446 -9801360 -10472492 -11287699 -12207285 -13081483
55131 -13081483 -13689634 -13841242 -13463247 -12615055 -11438198 -10093341 -8727266 -7470818 -6442733
55122 -6442733 -5740749 -5421187 -5479569 -5845041 -6393947 -6974861 -7429614 -7607410 -7390191 -6739822
55112 -6739822 -5735350 -4546392 -3335883 -2163470 -975254 313513 1726670 3213128
55104 3213128 4712536 6224185 7811172 9548412 11477207 13602462 15903762 18318510
55096 18318510 20712164 22893437 24689986 26021867 26902638 27375417 27455537 27130565 26404120
55087 26404120 25340388 24081171 22826467 21780334 21082878 20769305 20785787 21047603 21489340
55078 21489340 22066834 22716882 23320359 23711290 23731696 23290739 22385877 21077858 19440799
55069 19440799 17513437 15273055 12649743 9580945 6075245 2244267 -1709863 -5531509
55061 -5531509 -8953544 -11742706 -13745713 -14919559 -15331774 -15132415 -14505321 -13607202 -12520489
55052 -12520489 -11260788 -9850817 -8410694 -7186365 -6480978 -6529090 -7396821 -8974531 -11064584
55043 -11064584 -13495286 -16170973 -19027763 -21953285 -24753032 -27185350 -29022258 -30094231
55035 -30094231 -30313937 -29683269 -28275259 -26195018 -23553690 -20481221 -17154475 -13793372
55027 -13793372 -10615102 -7782676 -5379377 -3405108 -1783623 -391860 880397 2073622
55019 2073622 3156146 4080558 4839850 5467804 5995940 6423118 6722755 6860959 6800408
55010 6800408 6505119 5968867 5251325 4483306 3832916 3463423 3507727 4050738 5102835
55001 5102835 6573035 8270956 9958158 11441219 12665725 13748342 14905046 16308532
54993 16308532 17978765 19792901 21595796 23305827 24929097 26484793 27910294 29017435
54985 29017435 29538260 29250853 28116906 26329973 24222894 22096915 20104674 18265063
54977 18265063 16565102 15040759 13777968 12866477 12373672 12361876 12912201 14108794 15984886
54968 15984886 18479368 21444377 24690234 28017805 31209990 34004137 36090026 37157847
54960 37157847 36983785 35513771 32900237 29469488 25640647 21844408 18470793 15833648
54952 15833648 14128821 13392321 13488577 14144950 15018584 15769381 16119152 15887296 15005678
54943 15005678 13526544 11629447 9605918 7791680 6454475 5698521 5451339 5541759 5812794
54934 5812794 6196199 6711465 7405592 8285575 9294564 10345034 11371849 12347393 13236140
54925 13236140 13930217 14236012 13940301 12914343 11188807 8968310 6597242 4493138
54917 4493138 3053088 2553516 3088057 4574270 6810519 9536363 12469969 15329093
54909 15329093 17851414 19821565 21101848 21649882 21498574 20698320 19267285 17202958
54901 17202958 14550112 11458980 8177227 4985058 2125748 -231383 -1995224 -3140467
54893 -3140467 -3690351 -3699748 -3242993 -2413128 -1335240 -179193 858627 1616511 2033249
54884 2033249 2155746 2071036 1819908 1369303 664996 -283799 -1358235 -2361269 -3112044
54875 -3112044 -3542271 -3723587 -3796765 -3845484 -3804712 -3476870 -2656243 -1282371 484619 2320345
54865 2320345 3880615 4933901 5411431 5376679 4957696 4281914 3437245 2468928 1399669
54856 1399669 245470 -984742 -2289855 -3662758 -5069955 -6436141 -7631672 -8468813
54848 -8468813 -8733896 -8263769 -7021218 -5112331 -2746687 -191499 2251906 4272500
54840 4272500 5602528 6090122 5760654 4839285 3711848 2816372 2502548 2934867 4089653
54831 4089653 5823295 7947771 10274436 12631275 14872819 16890396 18619933 20041935
54823 20041935 21170121 22032660 22656679 23060579 23246299 23186500 22820124 22076457 20926882
54814 20926882 19434748 17767026 16153736 14815355 13899653 13461144 13484262 13922630 14723450
54805 14723450 15824104 17129159 18490612 19717184 20621141 21079457 21070305 20666416 20000729
54796 20000729 19230228 18509924 17976801 17741922 17886440 18453807 19435544 20755520 22257783
54787 22257783 23706281 24817824 25343923 25171393 24371871 23160168 21797737 20508629
54779 20508629 19433456 18605899 17948820 17307250 16511591 15432755 14008560 12259401 10304627
54770 10304627 8350777 6622562 5262609 4268768 3516488 2851981 2192278 1561625 1039193
54761 1039193 668684 419860 240567 138982 202035 528860 1150497 2014918 3042257
54752 3042257 4185912 5435648 6760089 8049767 9126948 9822687 10050002 9808128 9130904
54743 9130904 8043825 6560595 4691799 2438466 -215731 -3291376 -6786429 -10652719
54735 -10652719 -14771589 -18921893 -22764821 -25883263 -27876418 -28464479 -27554869 -25254294
54727 -25254294 -21840391 -17714740 -13351371 -9241169 -5825207 -3419860 -2154744 -1950223
54719 -1950223 -2550819 -3614987 -4839516 -6067300 -7319045 -8730213 -10434641 -12457752
54711 -12457752 -14660915 -16757922 -18409420 -19357147 -19510374 -18922688 -17700221 -15944902
54703 -15944902 -13779698 -11405368 -9118737 -7275403 -6218091 -6192659 -7279398 -9377585
54695 -9377585 -12255462 -15628369 -19215110 -22756578 -26011683 -28751840 -30775583 -31953406
54687 -31953406 -32270705 -31807864 -30649166 -28807985 -26264310 -23096175 -19579916 -16161874
54679 -16161874 -13322714 -11428677 -10642591 -10912602 -12025147 -13695803 -15659409 -17718705
54671 -17718705 -19733672 -21572625 -23071940 -24040451 -24304828 -23762124 -22412286 -20366513
54663 -20366513 -17832036 -15068205 -12323969 -9789718 -7583461 -5753180 -4275988 -3075490
54655 -3075490 -2084323 -1317253 -876695 -867754 -1295896 -2035794 -2881828 -3622893 -4095975 -4220685
54645 -4220685 -4028776 -3674235 -3391010 -3391933 -3757361 -4391446 -5085139 -5640309 -5959764 -6046610
54635 -6046610 -5940841 -5663435 -5209586 -4580407 -3815057 -2987698 -2156002 -1287678 -228389
54626 -228389 1235418 3236579 5704826 8358078 10814879 12737602 13906908 14213783
54618 14213783 13637469 12262722 10304396 8065500 5815032 3664002 1535880 -744620
54610 -744620 -3306239 -6119639 -8977538 -11568175 -13597153 -14892543 -15440142 -15335341 -14688534
54601 -14688534 -13552920 -11926290 -9814616 -7290210 -4490766 -1574572 1309285 4007205
54593 4007205 6334527 8082043 9063939 9175691 8425449 6926283 4864255 2466960 -18829
54584 -18829 -2355278 -4361575 -5968966 -7250307 -8402017 -9678746 -11297930 -13350180
54576 -13350180 -15765640 -18361270 -20932263 -23320018 -25430465 -27231212 -28749831 -30054385
54568 -30054385 -31200505 -32175824 -32886652 -33190478 -32943300 -32041799 -30459577 -28268545 -25626730
54559 -25626730 -22733080 -19777489 -16914483 -14264996 -11929165 -9988192 -8485554 -7401561
54551 -7401561 -6650212 -6112549 -5688906 -5338800 -5090992 -5024219 -5229414 -5774387 -6693747 -8002567
54541 -8002567 -9702158 -11755122 -14049524 -16389696 -18520964 -20167264 -21073394 -21063333 -20107797
54532 -20107797 -18360764 -16130043 -13791800 -11693753 -10086768 -9096546 -8724454 -8862830
54524 -8862830 -9321788 -9874470 -10317311 -10518740 -10427173 -10040697 -9375006 -8463683 -7389245
54515 -7389245 -6311600 -5459742 -5078476 -5351657 -6334534 -7916611 -9822407 -11656684 -12999180
54506 -12999180 -13529002 -13124774 -11885680 -10062801 -7943192 -5752246 -3624168 -1644903
54498 -1644903 81799 1413517 2217254 2441237 2146803 1480889 612742 -337296 -1350459
54489 -1350459 -2504341 -3888268 -5486660 -7124491 -8521702 -9409673 -9628929 -9170417 -8168098
54480 -8168098 -6856711 -5507384 -4366599 -3621870 -3388155 -3692859 -4462348 -5542015 -6765665
54471 -6765665 -8039826 -9383161 -10893107 -12670074 -14755132 -17107842 -19607324 -22057490
54463 -22057490 -24211678 -25839483 -26811135 -27132465 -26894909 -26183420 -25020308 -23382118 -21265041
54454 -21265041 -18748408 -16015416 -13315093 -10883273 -8867962 -7297490 -6092375 -5099738
54446 -5099738 -4143121 -3092025 -1931606 -787242 118396 544314 296528 -733278 -2534016
54437 -2534016 -4941318 -7640027 -10240753 -12414417 -14014059 -15112776 -15936981 -16731192
54429 -16731192 -17623636 -18564854 -19378049 -19890722 -20054023 -19963283 -19775224 -19594995 -19407011
54420 -19407011 -19070075 -18361250 -17051416 -14989493 -12154766 -8647475 -4634930 -301226
54412 -301226 4171258 8597146 12780256 16518707 19638756 22057015 23826424 25102727
54404 25102727 26030925 26645264 26882597 26699290 26174678 25501659 24881100 24418247 24093229
54395 24093229 23800679 23415445 22854907 22123114 21315182 20564534 19954622 19456779 18944772
54386 18944772 18275895 17375654 16265730 15024140 13717356 12360679 10937464 9458501
54378 9458501 8007257 6727450 5759384 5172342 4934308 4923045 4958820 4843986 4403896
54369 4403896 3519070 2134647 247170 -2111904 -4877911 -7944184 -11162932 -14365911
54361 -14365911 -17390683 -20088031 -22304072 -23861652 -24576733 -24318033 -23073110 -20968593
54353 -20968593 -18226613 -15087655 -11741689 -8284460 -4699655 -878490 3310298 7922264
54345 7922264 12867690 17908862 22706926 26876820 30038080 31878400 32228907 31113844
54337 31113844 28739911 25434141 21572219 17527875 13639934 10178346 7306924 5064848
54329 5064848 3389498 2173967 1322693 771302 469243 350850 320417 262673 78127
54320 78127 -271755 -743226 -1244261 -1714764 -2195168 -2821020 -3732031 -4949022 -6300866
54311 -6300866 -7454832 -8034174 -7746891 -6454451 -4176889 -1084469 2500227 6132755
54303 6132755 9357608 11865965 13595946 14702153 15424610 15954759 16373817 16669598 16791685
54294 16791685 16704241 16417220 15991869 15520352 15084863 14715234 14372263 13970875 13429716
54285 13429716 12715450 11853549 10897520 9877589 8774633 7556221 6255482 5016416
54277 5016416 4043350 3478306 3299216 3313141 3243960 2861135 2088031 1039210 -37755
54268 -37755 -887071 -1358043 -1440884 -1227650 -852815 -456794 -174643 -130867 -422797 -1083694
54258 -1083694 -2037834 -3089512 -3984810 -4525838 -4656817 -4458375 -4072429 -3637270 -3276966
54249 -3276966 -3111578 -3232668 -3644461 -4231323 -4802766 -5197698 -5374100 -5420889 -5488253 -5687041
54239 -5687041 -6020835 -6386611 -6633304 -6632841 -6321505 -5705631 -4853785 -3887630 -2960494 -2219033
54229 -2219033 -1770487 -1676225 -1956567 -2577766 -3427291 -4316822 -5031884 -5401151 -5347062 -4902281
54219 -4902281 -4190947 -3375957 -2592288 -1909334 -1347199 -920064 -658622 -597505 -751400 -1102179
54209 -1102179 -1601707 -2191595 -2836916 -3551347 -4387160 -5397054 -6604893 -8004142 -9565527
54200 -9565527 -11237483 -12954294 -14666317 -16367463 -18079063 -19789394 -21397047 -22706577
54192 -22706577 -23483240 -23537168 -22799894 -21366974 -19494152 -17547276 -15919118 -14938179 -14799014
54183 -14799014 -15532848 -17016394 -19006062 -21193235 -23283462 -25085895 -26573644 -27876720
54175 -27876720 -29204390 -30733726 -32518758 -34464732 -36378304 -38058366 -39365280 -40229400
54167 -40229400 -40617468 -40511208 -39931576 -38988761 -37903186 -36955264 -36372954 -36219562 -36354561
54158 -36354561 -36492542 -36319885 -35603098 -34247622 -32301814 -29918610 -27296062 -24626872
54150 -24626872 -22081712 -19823088 -18018078 -16816381 -16287766 -16353111 -16768285 -17198734 -17354512
54141 -17354512 -17100420 -16478680 -15658732 -14867116 -14318474 -14141178 -14323563 -14737047 -15239460
54132 -15239460 -15770873 -16348841 -16972939 -17541710 -17866385 -17769633 -17189882 -16219549 -15056673
54123 -15056673 -13900173 -12850100 -11873459 -10855225 -9694390 -8375874 -6978496 -5636097
54115 -5636097 -4496430 -3703235 -3395380 -3705204 -4740568 -6539993 -9011617 -11905877 -14878875
54106 -14878875 -17635244 -20049346 -22162013 -24058532 -25740413 -27097127 -27983086 -28318157
54098 -28318157 -28127003 -27495700 -26492487 -25120536 -23332377 -21081736 -18377268 -15330390
54090 -15330390 -12194059 -9354122 -7229672 -6110380 -6036576 -6811058 -8130960 -9745949
54082 -9745949 -11546442 -13540082 -15746493 -18097717 -20428779 -22561471 -24397754 -25945016
54074 -25945016 -27279405 -28502650 -29714525 -30983083 -32312314 -33636518 -34848671 -35826585
54066 -35826585 -36427257 -36471500 -35765768 -34173325 -31694536 -28499906 -24890375 -21209755 -17764579
54057 -17764579 -14791973 -12468966 -10922335 -10208563 -10274394 -10937662 -11919742 -12922519 -13706142
54048 -13706142 -14121919 -14092436 -13573771 -12543114 -11027528 -9153991 -7177208 -5439076 -4247974
54039 -4247974 -3733246 -3773384 -4055525 -4224388 -4017498 -3313252 -2094978 -387371 1774824
54030 1774824 4324427 7121584 9959249 12635417 15037645 17168218 19100990 20920405
54022 20920405 22683527 24405936 26063818 27614107 29022560 30274992 31364857 32275438
54014 32275438 32964844 33342854 33248904 32471895 30826949 28238035 24759654 20533208 15734824
54005 15734824 10560314 5236912 20895 -4840507 -9163685 -12857802 -15905231 -18316759
53997 -18316759 -20109539 -21323437 -22040047 -22367380 -22403132 -22218196 -21871085 -21422909 -20930225
53988 -20930225 -20430635 -19944425 -19485948 -19060129 -18643769 -18185764 -17650554 -17073787 -16563866
53979 -16563866 -16224876 -16060211 -15942901 -15670641 -15043286 -13902996 -12141566 -9710395 -6638401
53970 -6638401 -3036398 917366 4996790 8951961 12549064 15614187 18044265 19770618
53962 19770618 20709497 20749206 19789910 17811300 14928787 11408403 7630362 4012855 922724
53953 922724 -1397857 -2866950 -3553251 -3634925 -3353755 -2976792 -2748423 -2818307 -3175226 -3644835
53943 -3644835 -3970829 -3931977 -3428658 -2509599 -1344326 -153264 882260 1684041 2275185
53934 2275185 2725671 3098481 3425175 3693093 3829871 3710007 3204182 2236455 794590
53925 794590 -1099829 -3394982 -5957382 -8531075 -10791212 -12480536 -13522662 -14024389
53917 -14024389 -14181454 -14172913 -14112900 -14065557 -14080991 -14204280 -14444045 -14736089 -14952947 -14967077
53907 -14967077 -14717265 -14223015 -13543074 -12719307 -11747258 -10592209 -9246456 -7791906 -6407040
53898 -6407040 -5288684 -4543440 -4146207 -3997080 -4005384 -4115302 -4267846 -4358388 -4233012 -3720794
53888 -3720794 -2683013 -1061758 1096571 3660231 6454206 9285952 11950643 14254410
53880 14254410 16073466 17406966 18370258 19131242 19839945 20589201 21409867 22292327 23221612
53871 23221612 24196595 25207577 26194594 27045109 27649676 27958212 27971924 27683393 27039383
53862 27039383 25971131 24461640 22589787 20523182 18473576 16644152 15192326 14215651
53854 14215651 13749542 13761474 14146241 14744072 15386073 15936075 16293424 16358855 16002794 15073389
53844 15073389 13447969 11097253 8116891 4695189 1028681 -2758635 -6634822 -10611279
53836 -10611279 -14673951 -18747754 -22704369 -26384557 -29609537 -32187460 -33938506 -34745373
53828 -34745373 -34604091 -33637519 -32053885 -30067865 -27824821 -25366690 -22654670 -19632672
53820 -19632672 -16295401 -12730017 -9122192 -5730208 -2828317 -627293 793002 1493383
53812 1493383 1621566 1345700 829664 247654 -211213 -381277 -184502 323430 958965
53803 958965 1474944 1656751 1398724 722351 -250214 -1320888 -2225978 -2674755 -2448879
53794 -2448879 -1517821 -76919 1537184 3001141 4126767 4882684 5327420 5524098 5504399
53785 5504399 5292747 4944044 4547570 4201698 4000920 4051621 4483149 5414307 6881202
53776 6881202 8776317 10846856 12760602 14204907 14968849 14980339 14307667 13146296 11785686
53767 11785686 10535000 9622643 9132385 9021335 9189367 9531365 9949528 10359300 10708121
53758 10708121 10975857 11130701 11077261 10664659 9772738 8419405 6809541 5287166 4215490
53749 4215490 3851004 4274701 5399021 7020957 8882071 10719530 12305809 13467021
53741 13467021 14075364 14038726 13315928 11947505 10061926 7845883 5515077 3312962 1507792
53732 1507792 339675 -73020 206734 972935 1995923 3136910 4377958 5759280 7287098
53723 7287098 8886663 10423420 11756076 12774227 13408527 13633711 13480343 13044978 12477038
53714 12477038 11937952 11555538 11404153 11517615 11910851 12583794 13509279 14626790 15850243
53705 15850243 17077018 18192676 19085301 19674334 19927795 19839836 19382022 18476221 17020420
53696 17020420 14951196 12298628 9199418 5863125 2512779 -667484 -3553694 -6070418
53688 -6070418 -8163348 -9778261 -10862983 -11396693 -11431273 -11111900 -10648191 -10238438 -9986718
53679 -9986718 -9866526 -9759740 -9546658 -9181300 -8700806 -8182901 -7710261 -7369790 -7252045
53670 -7252045 -7412309 -7816522 -8331666 -8777920 -8999251 -8906973 -8491207 -7812925 -6975775 -6075916
53660 -6075916 -5150871 -4160072 -3010637 -1612174 72194 2008083 4111066 6280420
53652 6280420 8410464 10376323 12027660 13217755 13853352 13925438 13497507 12660479 11483606
53643 11483606 9993649 8200174 6152180 3982119 1900377 142987 -1094091 -1704474
53635 -1704474 -1694139 -1176728 -342497 593190 1450569 2140587 2693685 3240139 3941959 4915031
53625 4915031 6193629 7752081 9545312 11520615 13597191 15654885 17566448 19256856
53617 19256856 20736791 22075807 23332025 24484674 25403073 25861740 25603730 24446064
53609 24446064 22389579 19667021 16686511 13897370 11655719 10152010 9408205 9316138
53601 9316138 9690243 10323069 11035475 11706601 12270599 12687091 12914677 12913364 12669797 12213469
53591 12213469 11603421 10896539 10121100 9267273 8296674 7171206 5887189 4481503 2992850
53582 2992850 1415351 -292006 -2127483 -3967928 -5571803 -6673191 -7091894 -6773612
53574 -6773612 -5740954 -4014357 -1583478 1540164 5233769 9216660 13093065 16462090
53566 16462090 19027325 20648703 21329014 21171471 20345760 19063060 17534299 15910160
53558 15910160 14249108 12559545 10894949 9418467 8372838 7974166 8306605 9281769
53550 9281769 10673417 12195526 13578355 14610643 15149281 15124353 14555111 13553466 12283125
53541 12283125 10887783 9444559 7977101 6501774 5059374 3722173 2596971 1825351
53533 1825351 1555947 1885792 2812955 4241067 6024207 8006740 10035598 11959497 13632158
53524 13632158 14919942 15715021 15963606 15703551 15080768 14320346 13663522 13301922 13332290
53515 13332290 13746469 14468400 15424312 16592914 17988766 19598849 21341329 23079703
53507 23079703 24655657 25897376 26616354 26633465 25835545 24221658 21911479 19125498 16152394
53498 16152394 13301705 10842024 8945267 7660562 6922325 6583776 6467168 6415905 6323230
53489 6323230 6125522 5785848 5308208 4783201 4412383 4461323 5157387 6604464 8768295
53480 8768295 11517388 14668789 18018351 21374428 24598716 27614396 30351014 32668948
53472 32668948 34352103 35200807 35152282 34325458 32963797 31339806 29690386 28187219 26902768
53463 26902768 25760700 24518112 22838120 20447799 17292322 13578046 9675010 5954454
53455 5954454 2668876 -80495 -2322320 -4187609 -5882308 -7635435 -9613502 -11831908
53447 -11831908 -14119974 -16182967 -17746032 -18693804 -19105070 -19161188 -19015569 -18735299 -18339886
53438 -18339886 -17866731 -17389705 -16986728 -16698420 -16501827 -16292352 -15877176 -15013858 -13516222
53429 -13516222 -11383467 -8854044 -6319318 -4142465 -2511231 -1420001 -760211 -420006
53421 -420006 -322494 -410964 -625249 -890810 -1116440 -1201282 -1062524 -683343 -156516 309486
53411 309486 439427 -15936 -1180234 -2991465 -5213982 -7522656 -9624362 -11360063 -12734613
53402 -12734613 -13856681 -14824575 -15629563 -16136062 -16144862 -15492575 -14125792 -12117089 -9634185
53393 -9634185 -6896906 -4145335 -1617834 469967 1943614 2680031 2614637 1755504 202540
53384 202540 -1841623 -4078632 -6143814 -7665198 -8350722 -8073913 -6913092 -5124756 -3069895
53375 -3069895 -1119954 442434 1504622 2144287 2564185 2975436 3503570 4169364 4937471
53366 4937471 5783477 6728598 7822721 9098031 10536832 12078583 13650831 15188611
53358 15188611 16625055 17869760 18808381 19342571 19452091 19231676 18868966 18579569 18544952
53349 18544952 18874108 19573523 20518089 21449720 22030470 21939914 20980801 19155417 16674444
53340 16674444 13874151 11077000 8490069 6207288 4279226 2759611 1687818 1038386
53332 1038386 680834 374702 -177768 -1216291 -2796698 -4738205 -6675360 -8171710 -8842962
53323 -8842962 -8469702 -7077055 -4935358 -2464616 -94755 1842099 3154017 3780054
53315 3780054 3757160 3192035 2258970 1208132 333587 -122081 -74721 364034 943179 1373096
53305 1373096 1409383 901795 -171523 -1670297 -3284819 -4605247 -5274515 -5142156 -4304414
53296 -4304414 -3004417 -1487009 81811 1611082 3046381 4333598 5392460 6112481
53288 6112481 6383103 6134542 5350037 4049804 2283717 146213 -2216335 -4631492 -6946904
53279 -6946904 -9067058 -10963538 -12653856 -14152499 -15415468 -16312056 -16645912 -16224188 -14955432
53270 -14955432 -12935978 -10465583 -7955726 -5767869 -4078104 -2842797 -1862134 -885180
53262 -885180 296484 1792426 3602434 5648399 7830702 10074177 12329994 14534346
53254 14534346 16572955 18306021 19645178 20606784 21282332 21751279 22009590 21955365 21426669
53245 21426669 20275439 18450726 16037105 13209075 10139604 6947866 3718433 547419
53237 547419 -2428568 -5021288 -7000865 -8155200 -8389883 -7791772 -6593940 -5075742 -3481895
53228 -3481895 -1993272 -720331 302321 1105835 1749531 2273300 2669591 2894124 2913935
53219 2913935 2762352 2551755 2420745 2449727 2606110 2751443 2700035 2299799 1502613 394211
53209 394211 -824433 -1882429 -2489175 -2392969 -1451912 311616 2710814 5447125 8176823
53200 8176823 10560229 12289827 13108009 12833248 11414094 8994976 5926838 2670092
53192 2670092 -366455 -2938533 -4969149 -6483651 -7552087 -8263460 -8714796 -9005643 -9240180
53183 -9240180 -9526438 -9957244 -10578824 -11370051 -12245310 -13075766 -13717180 -14032945 -13905667
53174 -13905667 -13245564 -12015283 -10272499 -8194544 -6042284 -4065369 -2405573 -1061978
53166 -1061978 66801 1105879 2152071 3272385 4532221 6015671 7817711 10009896
53158 10009896 12590025 15434481 18284433 20791330 22612642 23515631 23445356 22532972 21040034
53149 21040034 19258241 17413658 15626825 13934690 12331922 10795872 9302249 7848436
53141 7848436 6469159 5218236 4129423 3202464 2434020 1859295 1558263 1620444 2101623
53132 2101623 3004474 4285294 5866497 7637444 9446996 11109408 12442345 13330103
53124 13330103 13774903 13892382 13839070 13712937 13498765 13102131 12444560 11540496 10492838
53115 10492838 9412087 8322936 7126980 5646858 3724066 1315956 -1452802 -4300375
53107 -4300375 -6851766 -8734663 -9674454 -9556196 -8443984 -6571382 -4304953 -2054349
53099 -2054349 -122468 1434272 2826813 4400458 6433710 8992974 11900757 14798765
53091 14798765 17265191 18945839 19649469 19368924 18239063 16478655 14341948 12067324
53083 12067324 9818025 7647918 5527691 3420793 1358166 -532505 -2050202 -2973570
53075 -2973570 -3114122 -2353367 -664691 1875231 5089121 8721093 12470941 16028827
53067 16028827 19111597 21507516 23116042 23955307 24135991 23834242 23281316 22740505 22440517
53058 22440517 22494510 22872507 23450905 24091179 24690063 25191098 25575833 25838151 25939569
53049 25939569 25773703 25184022 24037458 22299617 20057209 17487896 14816414 12279400
53041 12279400 10088722 8386118 7212794 6524659 6246166 6313719 6667217 7204680 7758240
53032 7758240 8126895 8137348 7677917 6695017 5195021 3279263 1172925 -816547 -2413155
53023 -2413155 -3477176 -4015250 -4093082 -3735366 -2904869 -1575942 170942 2126450 4027350
53014 4027350 5668016 6963809 7933612 8631963 9081467 9242530 9037447 8417011 7421243
53005 7421243 6181861 4866489 3620062 2547824 1726753 1211077 1030601 1198807 1716313
52996 1716313 2535353 3496165 4305172 4610276 4144552 2847086 888585 -1400117 -3644002
52987 -3644002 -5528192 -6867881 -7648226 -8029149 -8284907 -8665487 -9238868 -9823998 -10073533
52978 -10073533 -9645974 -8343297 -6145862 -3176205 344054 4124968 7848132 11223333
52970 11223333 14039005 16189036 17685650 18665065 19358435 19996156 20671582 21253699 21424451
52961 21424451 20825231 19218001 16572470 13059822 8990080 4734228 647514 -3000606
52953 -3000606 -6069674 -8531960 -10390689 -11587046 -11982030 -11446638 -9991490 -7822955
52945 -7822955 -5280752 -2717758 -414058 1441473 2736882 3437241 3610741 3449483 3235140
52936 3235140 3228417 3532709 4034333 4481865 4654494 4495651 4126609 3753198 3538469 3508546
52926 3508546 3528903 3359124 2760754 1606418 -55769 -1998652 -3870440 -5299490 -6022909
52917 -6022909 -5981768 -5328951 -4350559 -3358190 -2611229 -2284673 -2462733 -3139467 -4226661
52908 -4226661 -5578905 -7039279 -8495024 -9921580 -11392495 -13043217 -14996295 -17279134
52900 -17279134 -19780211 -22275483 -24511222 -26288876 -27503842 -28134757 -28210912 -27778042 -26868843
52891 -26868843 -25492160 -23659136 -21435781 -18976367 -16501594 -14234971 -12342763 -10907146
52883 -10907146 -9928587 -9340029 -9023582 -8831366 -8615539 -8266712 -7747757 -7105491 -6456931
52874 -6456931 -5964658 -5812121 -6170733 -7149503 -8742096 -10803191 -13072753 -15239911 -17021612
52865 -17021612 -18226212 -18775140 -18675059 -17964257 -16672732 -14820173 -12448148 -9662940
52857 -9662940 -6653959 -3655468 -855695 1688171 4060221 6414008 8880886 11519231
52849 11519231 14307773 17153943 19909785 22412003 24547100 26309531 27811376 29226253
52841 29226253 30693248 32242837 33799839 35255927 36540628 37629764 38505094 39124253
52833 39124253 39425436 39340003 38795313 37732248 36155257 34174757 31980050 29743453 27536771
52824 27536771 25340383 23136090 20992297 19062039 17504528 16410322 15790136 15613513
52816 15613513 15843921 16442163 17351166 18483611 19720525 20924723 21974067 22806711 23453288
52807 23453288 24033327 24712147 25630013 26826230 28195176 29512467 30534319 31119944 31305938
52798 31305938 31292826 31355264 31720700 32468574 33490303 34522779 35235419 35331655 34627345
52789 34627345 33081600 30775924 27865230 24540324 21019318 17540409 14317543 11466971
52781 11466971 8962719 6666798 4416620 2108577 -268020 -2647821 -4929154 -7006732
52773 -7006732 -8782665 -10163552 -11065641 -11438344 -11287234 -10669417 -9664102 -8352557 -6829164
52764 -6829164 -5222132 -3685271 -2353907 -1298433 -512156 60415 477425 764720 909900
52755 909900 883920 672110 295630 -180619 -648408 -969095 -1010063 -695452 -35409 891286
52745 891286 1981816 3139024 4272492 5295147 6137560 6773080 7237299 7638266 8153178
52736 8153178 8989474 10296782 12067317 14101591 16083670 17725800 18889383 19616387
52728 19616387 20075069 20468426 20950829 21577524 22299701 23007489 23601378 24051957 24413864
52719 24413864 24791693 25285074 25946028 26769092 27716750 28763093 29923429 31243971 32757966
52710 32757966 34444846 36223640 37976979 39578291 40906397 41858365 42377975 42495815
52702 42495815 42351483 42165968 42160162 42455815 43016318 43665648 44176627 44380187 44241187 43868983
52692 43868983 43463656 43227728 43287463 43656493 44243854 44887348 45399613 45627450 45514186
52683 45514186 45130954 44646695 44247453 44052291 44070895 44217676 44366608 44409324 44273389 43887858
52673 43887858 43139125 41880466 40003178 37503322 34480838 31086760 27486512 23868529
52665 23868529 20457554 17484012 15117211 13415415 12331380 11759983 11578363 11643256 11764805
52656 11764805 11715221 11300661 10448743 9233593 7818461 6371816 5018153 3833919 2869049
52647 2869049 2181695 1871952 2084584 2965804 4602578 6982051 9969186 13281194 16475135
52638 16475135 18997906 20312592 20050046 18118369 14739968 10419727 5853759 1789646
52630 1789646 -1138776 -2564603 -2480753 -1225759 648812 2574613 4131839 5121304 5548955
52621 5548955 5560357 5350917 5073173 4777793 4417122 3897130 3136316 2111494 899925
52612 899925 -284449 -1096558 -1141150 -112658 2071959 5215817 8885983 12532751 15629548
52603 15629548 17781880 18779129 18594073 17355397 15316896 12825757 10273767 8024215
52595 8024215 6337078 5329017 4982577 5186215 5778190 6580999 7423333 8148445 8615016
52586 8615016 8706279 8356901 7585702 6509164 5318860 4225747 3393260 2891781 2697718
52577 2697718 2729559 2888218 3079514 3227797 3296681 3307592 3332135 3458072 3759759 4297408
52567 4297408 5132363 6326404 7917337 9900950 12251529 14970300 18109710 21734265
52559 21734265 25838325 30283704 34802060 39057501 42736634 45633031 47696045 49021175
52551 49021175 49788324 50186337 50358377 50372578 50214410 49813941 49112753 48132737 46993624
52542 46993624 45870485 44930958 44288460 43980648 43981253 44256326 44838341 45849562 47435656
52533 47435656 49657510 52429854 55542506 58726575 61715635 64286481 66284086 67629807
52525 67629807 68313128 68380601 67933728 67126694 66146024 65172253 64343126 63732395 63338662
52516 63338662 63074366 62761480 62154365 61001049 59128573 56518361 53337173 49905469
52508 49905469 46609730 43790878 41655006 40242111 39455411 39122427 39052856 39076377 39063398
52499 39063398 38936535 38672709 38288909 37809210 37225037 36472210 35442552 34026249 32162726
52490 32162726 29876781 27286012 24573090 21927101 19480053 17279349 15315269 13575021
52482 13575021 12074420 10851513 9950374 9421703 9330125 9745009 10719527 12283061 14450262
52473 14450262 17219547 20542346 24281169 28191926 31950407 35219615 37737093 39384873
52465 39384873 40203469 40346457 40017458 39429914 38782074 38216903 37776251 37398573 36979144
52456 36979144 36444035 35775170 34980766 34058641 32991790 31771141 30413375 28949493 27387897
52447 27387897 25682893 23742205 21475055 18844431 15887690 12706917 9454151 6320661
52439 6320661 3516784 1233868 -401275 -1364667 -1755676 -1784719 -1712647 -1751148 -1967776
52430 -1967776 -2245861 -2321153 -1880580 -684532 1335769 4048164 7171785 10388695 13465376
52421 13465376 16330652 19073229 21857473 24801833 27890696 30967549 33798615 36153897
52413 36153897 37861310 38828189 39047273 38594000 37603117 36216814 34526199 32550756 30282421
52404 30282421 27766590 25151465 22657188 20485643 18743220 17430034 16483663 15826230
52396 15826230 15386530 15113140 15000213 15114493 15592030 16593945 18242521 20567018 23479840
52387 23479840 26796450 30296563 33790929 37144195 40247082 42991610 45299368 47178987
52379 47178987 48738627 50119895 51400169 52536103 53378206 53736749 53462791 52509751 50946643
52370 50946643 48916355 46569418 44020826 41353308 38650233 36023415 33611352 31543920
52362 31543920 29890680 28628030 27658706 26880495 26253903 25813244 25617013 25687377 25984286
52353 25984286 26410512 26819365 27023494 26829563 26103026 24829656 23141380 21304742 19679441
52344 19679441 18639115 18456276 19197669 20696377 22623984 24621792 26425619 27936659
52336 27936659 29217438 30417780 31668282 33000109 34331029 35508451 36365514 36753992
52328 36753992 36552617 35675359 34096161 31872625 29133084 26022837 22657716 19136196
52320 19136196 15598536 12265511 9408803 7271205 5988994 5552662 5820313 6588887
52312 6588887 7702775 9135462 10973745 13302063 16074338 19079443 22028069 24686468
52304 24686468 26953979 28847470 30441503 31829710 33117709 34409758 35767474 37167975
52296 37167975 38503335 39629068 40428818 40852989 40911838 40639267 40065118 39219790 38157078
52287 38157078 36964124 35750507 34632703 33718248 33074857 32690106 32464339 32267268 32025438
52278 32025438 31767393 31583824 31526360 31512310 31303082 30586212 29127122 26902895 24135129
52269 24135129 21205034 18504459 16300115 14666955 13507450 12632759 11855320 11049431
52261 11049431 10169230 9236741 8312171 7457062 6708384 6075920 5551259 5109411 4709461
52252 4709461 4318632 3958900 3737079 3820346 4359065 5395467 6807345 8323332 9611250
52243 9611250 10394707 10535833 10058678 9136947 8069899 7231443 6971440 7500714 8836738
52234 8836738 10855217 13404869 16388955 19753225 23408830 27173318 30786790 33990326
52226 33990326 36612445 38622312 40137551 41382876 42597859 43917311 45281854 46435588
52218 46435588 47021467 46728883 45419274 43165893 40189837 36740162 33008202 29138611
52210 29138611 25312617 21809124 18965713 17050291 16134098 16060159 16530019 17246115 18014774
52201 18014774 18758720 19467230 20153239 20853250 21639930 22596991 23755097 25043625 26305301
52192 26305301 27360583 28072411 28384049 28334261 28047151 27679692 27340847 27044990 26749074
52183 26749074 26442618 26206479 26194251 26563818 27408010 28703289 30279542 31831231 32993830
52174 32993830 33471575 33156529 32170988 30804777 29381414 28132319 27148652 26417368 25889552
52165 25889552 25530700 25345430 25388209 25753295 26532215 27758467 29379739 31270002 33254991
52156 33254991 35128249 36667405 37668617 37992367 37595611 36536821 34964316 33109888
52148 33109888 31297028 29937473 29461951 30164808 32038614 34734840 37711939 40475950
52140 40475950 42750012 44500870 45880529 47161098 48668494 50686853 53354010 56612386
52132 56612386 60249827 64001837 67658788 71132112 74452059 77696549 80893306 83962687
52124 83962687 86739317 89049296 90785751 91940279 92582964 92811996 92709133 92330302 91726355
52115 91726355 90956670 90070205 89075733 87944389 86652938 85229333 83760564 82361244
52107 82361244 81129957 80116501 79309420 78650378 78078571 77587114 77248282 77171400 77406192
52098 77406192 77855268 78259829 78271412 77572881 76001418 73633519 70789240 67929349 65489271
52089 65489271 63762527 62910346 63042284 64238809 66473658 69535390 73059315 76653543
52081 76653543 80009558 82936806 85357224 87302760 88897359 90294630 91605110 92880314
52073 92880314 94164301 95548745 97166702 99123799 101417027 103894401 106282506 108273703
52065 108273703 109630151 110252367 110193508 109643659 108907658 108362924 108375623 109198430 110910400
52056 110910400 113430881 116576727 120111992 123777173 127323135 130566245 133443287 136024717
52048 136024717 138465385 140916819 143456010 146071047 148693302 151231003 153578491 155621399
52040 155621399 157266775 158485312 159318571 159830615 160046571 159945164 159521950 158862262 158142760
52031 158142760 157547860 157175204 157014950 157008105 157114165 157332492 157689595 158226668 158981508
52022 158981508 159940800 160989000 161925307 162573225 162905704 163077181 163340228 163934795 165049316
52013 165049316 166857475 169543937 173248872 177963258 183475832 189429555 195442298 201198149
52005 201198149 206463352 211057129 214835203 217716889 219743808 221125780 222222706 223446577
51997 223446577 225130750 227444793 230394293 233877633 237747987 241857728 246092034 250395679
51989 250395679 254780822 259301124 263994026 268821395 273660722 278379595 282956195 287548514
51981 287548514 292442507 297910815 304084409 310911881 318202864 325708991 333204593 340548993
51973 340548993 347719802 354811839 362002883 369490151 377409698 385772887 394463487 403303945
51965 403303945 412141741 420890383 429507825 437954870 446182693 454151362 461837803 469201790
51957 469201790 476133359 482445585 487950518 492578230 496448286 499837583 503071723 506409463
51949 506409463 509962900 513657982 517240632 520344905 522614130 523822275 523938051 523116618
51941 523116618 521644034 519863990 518101042 516586696 515399492 514440978 513474466 512232275
51933 512232275 510546763 508424059 506008110 503461245 500843454 498064405 494934406 491286234
51925 491286234 487090531 482474032 477616293 472613996 467440898 462034766 456414815 450720243
51917 450720243 445157466 439918200 435116793 430758289 426748513 422957242 419301562 415776434
51909 415776434 412394821 409087672 405655979 401816227 397296848 391914486 385601418 378407043
51901 378407043 370496708 362133205 353615460 345191561 337004371 329106086 321514708 314257514
51893 314257514 307378655 300927501 294946027 289455708 284441964 279844750 275565899 271493883
51885 271493883 267534201 263625855 259732485 255825575 251896692 248005739 244312202 241025313
51877 241025313 238281258 236038435 234079642 232122203 229952658 227495045 224783730 221882257
51869 221882257 218814842 215548874 212022262 208189481 204064972 199746724 195405052 191241420
51861 191241420 187447506 184185593 181573327 179649400 178340459 177476618 176860852 176337360
51853 176337360 175807107 175195796 174415256 173347509 171859884 169849530 167297845 164295167
51845 164295167 161010367 157626746 154289559 151084154 148029874 145079228 142135605 139099092
51837 139099092 135917746 132605960 129217923 125805151 122398736 119030487 115773545 112770669
51829 112770669 110224609 108337314 107209357 106751080 106675377 106595698 106169334 105193374 103615663
51820 103615663 101496795 98970991 96214839 93410289 90702482 88168367 85806648 83548634
51812 83548634 81285304 78903005 76317908 73502948 70505147 67449070 64521537 61938563
51804 61938563 59897552 58517241 57784787 57554635 57626470 57858878 58227744 58782806 59547403
51795 59547403 60445394 61303649 61925924 62197751 62156190 61964211 61797560 61733711 61730313 61688979
51785 61688979 61528437 61212743 60743648 60149284 59481820 58819388 58264115 57926477 57891310
51776 57891310 58178460 58722430 59385928 60005660 60457008 60710403 60843116 60992949 61287077
51767 61287077 61796228 62528265 63436474 64425537 65366431 66128141 66606951 66732756 66462255
51758 66462255 65783850 64732837 63384845 61809513 60017493 57959050 55589002 52941339
51750 52941339 50144739 47377267 44819773 42644644 41012011 40038537 39759708 40132498
51742 40132498 41079599 42528201 44409449 46628073 49028576 51378986 53392416 54796663
51734 54796663 55425361 55274929 54491747 53304894 51948221 50605202 49384691 48317429
51726 48317429 47361583 46421497 45395097 44243298 43036937 41940282 41142972 40789815 40940138
51717 40940138 41558910 42543243 43787531 45254462 46993424 49086469 51564746 54349070
51709 54349070 57233586 59911640 62041047 63323346 63548293 62586251 60372895 56932920
51701 56932920 52421176 47116778 41349805 35412318 29517976 23821845 18454797 13519077
51693 13519077 9042972 4958591 1167034 -2337587 -5403787 -7799238 -9368609 -10132931
51685 -10132931 -10261031 -9965368 -9409812 -8666118 -7711905 -6460287 -4811756 -2707347 -162538
51676 -162538 2724373 5790428 8852746 11762527 14434696 16839932 18985152 20911236
51668 20911236 22698736 24450861 26246253 28083082 29838309 31261962 32031881 31875589
51660 31875589 30705091 28669335 26078466 23259779 20454608 17809666 15427936 13414560
51652 13414560 11886563 10953291 10684698 11081357 12058719 13454335 15057335 16651921 18063328
51643 18063328 19191646 20019574 20591515 20976150 21229181 21369014 21375227 21212401 20862591
51634 20862591 20338400 19671358 18906183 18126372 17485436 17188035 17405566 18178392 19374012
51625 19374012 20726422 21931720 22755004 23102857 23025807 22649705 22083245 21362238 20448588
51616 20448588 19254359 17667674 15597009 13049517 10202562 7394651 5016467 3373193
51608 3373193 2607745 2702397 3509210 4773456 6167189 7358334 8100581 8303616 8055700
51599 8055700 7587851 7178525 7026355 7159533 7445824 7696750 7789247 7727874 7626579 7638739
51589 7638739 7879776 8379762 9082382 9877014 10634388 11228248 11546135 11498476 11033568 10166219
51579 10166219 9013013 7795682 6773434 6126921 5881241 5933147 6149272 6440047 6757022
51570 6757022 7050021 7251912 7311711 7238253 7108631 7032283 7095245 7312484 7605267 7817600
51560 7817600 7780202 7400427 6721753 5907420 5163506 4662312 4508443 4741514 5351842 6300166
51550 6300166 7539575 9030488 10741381 12637553 14657584 16674307 18460801 19709781
51542 19709781 20132682 19595239 18201839 16271779 14225224 12448898 11209047 10634672
51534 10634672 10744354 11474617 12696310 14238636 15934572 17668143 19391913 21106055
51526 21106055 22816764 24500333 26096487 27540877 28815935 29975954 31121146 32340766
51518 32340766 33664622 35045819 36383615 37590324 38676743 39789677 41152497 42944325
51510 42944325 45209085 47843049 50632619 53302635 55575810 57249007 58251052 58637382
51502 58637382 58530891 58067380 57384190 56633328 55978641 55564503 55473704 55693450 56100391
51493 56100391 56482598 56618521 56394624 55884398 55308446 54884470 54680707 54590368 54435409
51484 54435409 54097229 53564305 52871849 51999664 50824640 49180590 46988865 44354556 41544100
51475 41544100 38863118 36536263 34668146 33273726 32316930 31727105 31411233 31282220 31291621
51466 31291621 31438455 31742167 32196227 32734079 33232020 33550798 33593903 33349426 32890041
51457 32890041 32329895 31766719 31249007 30785295 30374162 30022046 29742278 29553179 29481980
51448 29481980 29556951 29775222 30066021 30286666 30270163 29907217 29218905 28373940 27632896 27249543
51438 27249543 27388319 28096235 29318052 30918561 32695550 34399187 35779886 36662655
51430 36662655 37014139 36957305 36714922 36512551 36499263 36720684 37133351 37633298 38088416 38373890
51420 38373890 38400622 38127070 37563360 36779156 35903092 35093437 34491756 34198414 34283600 34800640
51410 34800640 35766308 37116556 38675100 40158138 41214046 41490117 40715165 38774486
51402 38774486 35749466 31907964 27646148 23391168 19494317 16167978 13501088 11521961
51394 11521961 10237800 9622777 9595763 10031771 10796020 11766233 12842300 13962594 15117517
51385 15117517 16334493 17647148 19092818 20741453 22698474 25042120 27739670 30625134
51377 30625134 33464243 36053359 38281499 40127027 41610148 42746082 43535463 43993103
51369 43993103 44179254 44195527 44143566 44078182 43985566 43792221 43388312 42642851 41401939 39491078
51359 39491078 36758635 33166625 28877952 24273582 19884051 16278434 13957134 13259113
51351 13259113 14280653 16826092 20428780 24458736 28285622 31429661 33638287 34872915
51343 34872915 35242471 34931768 34140891 33027971 31667550 30062944 28225081 26264466
51335 26264466 24414553 22955752 22091312 21860607 22138005 22699284 23299553 23718568 23770199
51326 23770199 23303202 22217648 20495279 18220799 15573123 12785868 10094966 7692652
51318 7692652 5695265 4126672 2927071 1998334 1272065 755270 515205 615310 1056476
51309 1056476 1766027 2628980 3528174 4372961 5118526 5776074 6397880 7027756 7645664
51300 7645664 8161903 8483758 8604282 8629892 8717146 8973244 9398093 9897244 10342518 10642420
51290 10642420 10785993 10828939 10825539 10765355 10579871 10213475 9687469 9109497 8652139 8536949
51280 8536949 9006584 10247835 12290684 14970634 18007557 21149803 24271961 27361220
51272 27361220 30425523 33407456 36156702 38455249 40067568 40801062 40564939 39399859
51264 39399859 37456073 34936305 32043843 28953991 25797791 22656311 19584603 16663181
51256 16663181 14029731 11844774 10205450 9075426 8291111 7649275 7026089 6455025 6114334
51247 6114334 6233157 6975353 8361703 10255715 12407564 14534833 16402286 17858138
51239 17858138 18818127 19236066 19101087 18457084 17414708 16148038 14886067 13889617 13392252
51230 13392252 13520486 14250568 15441106 16916990 18541868 20235538 21939795 23574125
51222 23574125 25030459 26224125 27163294 27973039 28844649 29940812 31313082 32870179
51214 32870179 34407003 35681416 36504034 36796800 36596275 36011163 35158642 34103441 32829458
51205 32829458 31272631 29404642 27304534 25157762 23188848 21587904 20473630 19883951
51197 19883951 19770026 19994131 20349468 20610302 20603076 20275063 19725086 19166795 18836212 18902581
51187 18902581 19438026 20442458 21871831 23633403 25564277 27434678 28995245 30049422
51179 30049422 30510639 30408695 29839706 28895892 27630080 26078447 24310849 22459244 20706231
51170 20706231 19251032 18271566 17887922 18135874 18966876 20275207 21926932 23766396 25603257
51161 25603257 27200920 28282975 28568172 27839778 26031206 23276002 19875710 16197850
51153 16197850 12568553 9212038 6236638 3642680 1346454 -770049 -2790635 -4707823
51145 -4707823 -6405418 -7687803 -8343691 -8219980 -7276114 -5598366 -3376197 -858753 1694455
51136 1694455 4062832 6102062 7750981 9007081 9901573 10507125 10967915 11497985 12309435
51127 12309435 13503921 15015402 16660579 18255960 19695570 20925999 21865980 22375824
51119 22375824 22322028 21673927 20536828 19099634 17559679 16088738 14840281 13956828 13554637
51110 13554637 13697249 14376170 15506408 16940514 18500239 20009098 21303619 22227009
51102 22227009 22638061 22453362 21692757 20481007 19000894 17441277 15975717 14759077
51094 14759077 13908901 13469405 13389912 13538965 13738043 13787899 13489555 12688785 11354584
51085 11354584 9649652 7921394 6580306 5920094 5994044 6631049 7572291 8628317 9764324
51076 9764324 11091404 12794709 15034909 17852232 21110042 24513557 27703553 30378445
51068 30378445 32383698 33730883 34545731 34978806 35133432 35052940 34760573 34303633 33761658
51059 33761658 33218812 32722534 32247617 31687730 30898768 29783014 28349602 26693608 24918681
51050 24918681 23088563 21248980 19470026 17838396 16396080 15084909 13748692 12195250
51042 12195250 10283789 7992578 5431708 2797367 303673 -1862092 -3548987 -4643495
51034 -4643495 -5087995 -4908885 -4224666 -3216631 -2074319 -945972 80989 967456 1700035
51025 1700035 2285729 2769871 3252232 3867731 4726991 5854053 7170561 8541877 9852372
51016 9852372 11059377 12197694 13341619 14552616 15843907 17181906 18520059 19835938
51008 19835938 21140104 22450388 23753356 24981554 26021580 26748616 27067182 26933465
51000 26933465 26348822 25336587 23921846 22123053 19957153 17462822 14737652 11960489
50992 11960489 9365930 7175884 5533466 4477479 3953762 3837089 3951417 4094912 4073693
50983 4073693 3734952 2985048 1787391 152621 -1857326 -4108128 -6384634 -8426092
50975 -8426092 -9992421 -10915577 -11115110 -10600954 -9479810 -7940541 -6197400 -4424948 -2739265
50966 -2739265 -1225456 43844 1031447 1767018 2336727 2828257 3273871 3630278 3800208
50957 3800208 3675414 3176004 2269218 965813 -692529 -2637008 -4760977 -6910055 -8899453
50948 -8899453 -10568378 -11842889 -12755104 -13393201 -13817355 -14010573 -13902332 -13438575 -12637965
50939 -12637965 -11596236 -10447279 -9317499 -8303555 -7477153 -6897643 -6610174 -6625935 -6906157
50930 -6906157 -7376892 -7973619 -8677218 -9502493 -10449029 -11468292 -12482368 -13429855 -14291835
50921 -14291835 -15088265 -15867213 -16689326 -17585205 -18491920 -19221020 -19498570 -19056367 -17720236
50912 -17720236 -15462128 -12409176 -8808819 -4961763 -1158709 2349395 5360563 7744280
50904 7744280 9477917 10660575 11482023 12167539 12934939 13978016 15463316 17517038 20189128
50895 20189128 23408388 26965162 30546774 33810389 36453267 38254769 39089594 38919790
50887 38919790 37776017 35746599 32985244 29720105 26237091 22839249 19808604 17379170
50879 17379170 15704869 14822723 14643391 14987257 15635978 16358502 16916238 17088154 16730121
50870 16730121 15828227 14493867 12894764 11168653 9372400 7483024 5436046 3186078
50862 3186078 776814 -1616221 -3723003 -5302734 -6275017 -6755650 -6973690 -7144470 -7387433
50853 -7387433 -7717163 -8084972 -8442282 -8802739 -9275528 -10045833 -11302051 -13138338 -15479890
50844 -15479890 -18077507 -20583709 -22664346 -24071332 -24645778 -24294099 -22996503 -20850603
50836 -20850603 -18095660 -15070047 -12110338 -9447670 -7161232 -5212616 -3532525 -2100553
50828 -2100553 -974549 -271164 -127232 -663143 -1949196 -3972186 -6609181 -9620605 -12670927
50819 -12670927 -15379340 -17397477 -18501870 -18673237 -18121883 -17228379 -16410613 -15976779 -16034572
50810 -16034572 -16487769 -17100521 -17587395 -17693987 -17247902 -16174600 -14485813 -12252745 -9574509
50801 -9574509 -6557393 -3323584 -41512 3070544 5806024 8060229 9859849 11292161
50793 11292161 12395114 13104108 13292370 12867702 11858760 10431109 8807074 7130695
50785 7130695 5379213 3399537 1043328 -1706791 -4705569 -7710077 -10485840 -12891415
50777 -12891415 -14897361 -16532447 -17801692 -18645944 -18972588 -18716687 -17870438 -16468139 -14569131
50768 -14569131 -12276038 -9770996 -7316883 -5195389 -3609952 -2608908 -2063027 -1697409
50760 -1697409 -1164182 -139254 1587185 4064656 7194480 10775230 14550034 18249600
50752 18249600 21636961 24542950 26873210 28591129 29704158 30269455 30406089 30291339
50744 30291339 30130655 30106209 30322012 30772911 31355957 31913313 32276155 32292836 31848410 30879351
50734 30879351 29367246 27302033 24644063 21333952 17362536 12853304 8092847 3488276
50726 3488276 -516785 -3527103 -5267454 -5640634 -4756489 -2906061 -476706 2160482
50718 2160482 4743803 7157407 9398470 11497012 13441464 15158978 16552194 17550092
50710 17550092 18134475 18336915 18217805 17838851 17248054 16496129 15666876 14869117 14171664
50701 14171664 13540029 12846502 11945012 10735098 9172073 7252606 5011395 2516031
50693 2516031 -163357 -2987459 -5939890 -8980007 -12011831 -14910275 -17579515 -19981438
50685 -19981438 -22107413 -23930827 -25396625 -26459491 -27130356 -27490763 -27674850 -27842039 -28150107
50676 -28150107 -28724789 -29632615 -30872289 -32383766 -34057402 -35737078 -37233633 -38363041
50668 -38363041 -38998917 -39109663 -38752207 -38015944 -36947114 -35511028 -33628847 -31259679 -28453841
50659 -28453841 -25332288 -22017244 -18575195 -15013027 -11325837 -7560673 -3845678 -356817
50651 -356817 2746546 5348892 7343730 8595767 8974844 8452572 7167689 5382859 3354064
50642 3354064 1209319 -1076732 -3597448 -6377228 -9275125 -11995609 -14202550 -15664299
50634 -15664299 -16343139 -16388757 -16058752 -15620063 -15274171 -15122924 -15174453 -15378493 -15668877 -15986803
50624 -15986803 -16275712 -16467322 -16488423 -16298692 -15942021 -15578446 -15461392 -15840669 -16821126
50615 -16821126 -18268600 -19855137 -21235375 -22226316 -22853998 -23250147 -23502908 -23573299 -23309993
50606 -23309993 -22531043 -21127324 -19140753 -16770495 -14298129 -11988155 -10035894 -8569388
50598 -8569388 -7650736 -7253331 -7265853 -7567652 -8125320 -9009890 -10310869 -12032584 -14063429
50589 -14063429 -16220476 -18314437 -20202385 -21827461 -23233540 -24531476 -25826698 -27157001
50581 -27157001 -28478475 -29693479 -30692182 -31388104 -31739046 -31749698 -31461847 -30944816 -30289456
50572 -30289456 -29598707 -28974047 -28502494 -28234369 -28136590 -28042743 -27661421 -26677719 -24898925
50563 -24898925 -22348959 -19260309 -15990333 -12920388 -10375502 -8575324 -7614894 -7465997
50555 -7465997 -7985911 -8929622 -9975188 -10772220 -11012151 -10508191 -9260771 -7470730 -5472565
50546 -5472565 -3610670 -2131817 -1153970 -700626 -742397 -1212601 -2011722 -3017747 -4090546
50537 -4090546 -5063403 -5752789 -6017982 -5843452 -5373702 -4865729 -4593444 -4757728 -5424760
50528 -5424760 -6499710 -7756996 -8936052 -9854394 -10456472 -10766521 -10802332 -10537520 -9942918
50519 -9942918 -9058099 -8019889 -7018943 -6217460 -5684450 -5380464 -5188981 -4978539 -4677483
50510 -4677483 -4330022 -4095354 -4182075 -4758150 -5885828 -7494855 -9384694 -11264214 -12844659
50501 -12844659 -13958670 -14632665 -15059297 -15484610 -16072188 -16811700 -17524981 -17985708 -18092828
50492 -18092828 -17973967 -17931421 -18272616 -19158814 -20563155 -22313973 -24149098 -25757203 -26839186
50483 -26839186 -27202587 -26838647 -25917267 -24694938 -23396087 -22132741 -20884933 -19531608
50475 -19531608 -17914950 -15913238 -13486027 -10672712 -7568700 -4316959 -1112289 1819864
50467 1819864 4280907 6151633 7401060 8067700 8255423 8147978 8002617 8094416 8630145
50458 8630145 9676931 11138665 12785702 14322133 15463795 16000039 15823409 14927799 13387858
50449 13387858 11333948 8927998 6336592 3701870 1122510 -1347143 -3693133 -5949868
50441 -5949868 -8204845 -10561836 -13059129 -15601899 -17976571 -19949756 -21384284 -22296863
50433 -22296863 -22828568 -23153157 -23378626 -23494799 -23386542 -22892637 -21877027 -20291290 -18214202
50424 -18214202 -15849076 -13468516 -11324966 -9563171 -8163943 -6941346 -5613125 -3935279
50416 -3935279 -1836234 533815 2867953 4834485 6203811 6924692 7130880 7074794 7015175
50407 7015175 7119281 7432116 7911280 8479208 9046757 9501875 9695338 9461418 8676514
50398 8676514 7312140 5434384 3155004 587461 -2160206 -4983189 -7803836 -10600051
50390 -10600051 -13381631 -16105785 -18599455 -20568394 -21706299 -21837084 -20995996 -19398919
50382 -19398919 -17331738 -15048082 -12741918 -10582610 -8747802 -7411943 -6702371 -6654777
50374 -6654777 -7185027 -8084736 -9048506 -9728548 -9796363 -9000271 -7226216 -4553134 -1256884
50365 -1256884 2272085 5658433 8629402 11014100 12697867 13604865 13728931 13169767 12123633
50356 12123633 10818004 9425489 8012559 6558798 5029533 3441243 1871411 423105
50348 423105 -804683 -1709140 -2157536 -1989550 -1074622 598090 2860300 5391469 7822601
50339 7822601 9839101 11212328 11772964 11399044 10052737 7820071 4897713 1537632
50331 1537632 -1995711 -5436382 -8529943 -11076184 -12980416 -14270504 -15063204 -15498218
50323 -15498218 -15670125 -15584896 -15161849 -14287711 -12902186 -11070854 -9004735 -7018444 -5454286
50314 -5454286 -4607651 -4668661 -5677394 -7498370 -9836101 -12303347 -14521121 -16212425 -17263759
50305 -17263759 -17741842 -17852988 -17846432 -17904576 -18087485 -18359145 -18651458 -18899653 -19030849 -18941734
50295 -18941734 -18503070 -17593813 -16143394 -14160042 -11731050 -8995494 -6112345 -3252915
50287 -3252915 -613453 1597033 3225969 4267584 4894511 5392322 6043598 7039386 8448017
50278 8448017 10215190 12170466 14051432 15564117 16464687 16619953 16017588 14734586 12898465
50269 12898465 10672861 8271286 5967637 4061084 2789222 2240796 2334502 2876871 3645481
50260 3645481 4437562 5077477 5418210 5358126 4860588 3963081 2785289 1541918 530391
50251 530391 53838 295072 1227800 2646687 4301853 6028667 7772794 9516176 11200432
50242 11200432 12728560 14031357 15118088 16054281 16884032 17559761 17928840 17784275 16952417
50233 16952417 15374741 13144667 10487447 7706137 5126282 3048291 1696946 1171953
50225 1171953 1426638 2291865 3529369 4888608 6159230 7217084 8044548 8704605 9280813
50216 9280813 9821571 10314366 10690328 10855058 10741543 10361424 9818486 9275081 8898068
50207 8898068 8806842 9021351 9418045 9734332 9648745 8899224 7365329 5077357 2172252
50198 2172252 -1170091 -4790780 -8597173 -12566347 -16704643 -20990961 -25334383 -29559299
50190 -29559299 -33423178 -36667563 -39080272 -40527253 -40936785 -40270377 -38529031 -35799131
50182 -35799131 -32293491 -28343750 -24339795 -20646556 -17537835 -15174581 -13626641 -12906141
50174 -12906141 -12976640 -13737000 -15017039 -16614700 -18354919 -20117532 -21807937 -23300740
50166 -23300740 -24410166 -24913887 -24620234 -23455628 -21542876 -19222576 -16971906 -15236616
50158 -15236616 -14272253 -14094368 -14544916 -15393656 -16402622 -17353612 -18071430 -18447440 -18446600 -18101131
50148 -18101131 -17509171 -16833035 -16269248 -15985070 -16054435 -16427787 -16943487 -17376392 -17518740
50139 -17518740 -17265879 -16651508 -15801296 -14844398 -13854715 -12845356 -11781693 -10589752 -9182389
50130 -9182389 -7516030 -5632127 -3628918 -1584524 482939 2567939 4586065 6326007
50122 6326007 7494477 7838248 7284038 6022758 4484629 3210001 2682377 3200650 4825858
50113 4825858 7396706 10595964 14042791 17372514 20275049 22504626 23898018 24409687
50105 24409687 24128727 23244001 21967838 20462969 18814042 17056497 15241227 13489804
50097 13489804 12002658 11019563 10759471 11359669 12822782 14996113 17617622 20418369
50089 20418369 23208815 25884553 28370269 30577043 32411599 33806140 34724482 35142369
50081 35142369 35030967 34365058 33155189 31482500 29499147 27368392 25171635 22859503
50073 22859503 20301591 17402347 14189871 10812919 7461024 4273918 1299032 -1485812
50065 -1485812 -4111265 -6566754 -8797723 -10740632 -12352644 -13605234 -14455027 -14832850
50057 -14832850 -14676017 -13986070 -12863504 -11482713 -10020854 -8598792 -7280751 -6119728
50049 -6119728 -5195083 -4608996 -4452646 -4766058 -5505528 -6537034 -7679026 -8783056 -9791392
50040 -9791392 -10721614 -11600886 -12416834 -13116689 -13633272 -13914404 -13954924 -13820443 -13629550 -13485550
50030 -13485550 -13406426 -13317887 -13122823 -12795326 -12426834 -12185973 -12217583 -12557007 -13124981 -13796296
50020 -13796296 -14474641 -15122116 -15751283 -16408616 -17152692 -18021227 -19007009 -20071317 -21189093
50011 -21189093 -22387815 -23749188 -25369618 -27296148 -29471991 -31731388 -33851353 -35617837
50003 -35617837 -36858731 -37444991 -37293303 -36378532 -34733287 -32427616 -29553375 -26234146
49995 -26234146 -22654379 -19085765 -15882477 -13414967 -11944250 -11503048 -11872141 -12672948
49987 -12672948 -13510420 -14087962 -14264238 -14053488 -13574580 -12970636 -12342340 -11722707 -11087309
49978 -11087309 -10390746 -9627312 -8881030 -8299297 -7981337 -7878368 -7809884 -7578677 -7069303
49969 -7069303 -6260022 -5185122 -3909333 -2519680 -1109562 242522 1477135 2542494
49961 2542494 3393992 4017139 4454190 4804065 5184699 5676540 6280859 6914573 7436941
49952 7436941 7689541 7537059 6903137 5792422 4292511 2563962 831406 -627541 -1512117
49943 -1512117 -1552852 -577137 1435360 4330689 7814063 11535958 15183702 18521787 21379406
49934 21379406 23642543 25288820 26425845 27262420 28004809 28754483 29489355 30130515 30618621
49925 30618621 30931301 31053788 30972718 30722917 30426066 30242616 30253096 30376673 30401619 30085941
49915 30085941 29235103 27725712 25514838 22664105 19359134 15900489 12671559 10089585
49907 10089585 8523860 8181761 9019763 10753232 12972104 15284573 17399963 19128984
49899 19128984 20345829 20963332 20936665 20281744 19088869 17516088 15753668 13969303 12266483
49890 12266483 10687933 9260995 8044289 7135338 6635818 6604467 7029151 7828693 8876524
49881 8876524 10033781 11184219 12265739 13286301 14304902 15373661 16474646 17502269
49873 17502269 18303751 18731824 18661170 17980183 16608457 14548650 11916400 8900419 5681414
49864 5681414 2382885 -915322 -4138734 -7206373 -10052834 -12651954 -15010611 -17130697
49856 -17130697 -18968413 -20430877 -21425363 -21925145 -21985486 -21679320 -21004470 -19859961 -18138652
49847 -18138652 -15874902 -13325095 -10910215 -9064060 -8095299 -8132218 -9135905 -10933935
49839 -10933935 -13256547 -15787620 -18232890 -20384401 -22156804 -23580574 -24747043 -25723585
49831 -25723585 -26489883 -26941818 -26952091 -26430966 -25356582 -23796403 -21933828 -20062198 -18509647
49822 -18509647 -17530225 -17240034 -17627845 -18596370 -19985536 -21579645 -23129867 -24406971 -25268549
49813 -25268549 -25704318 -25821636 -25766861 -25635018 -25439065 -25154829 -24786704 -24394034 -24069795
49804 -24069795 -23898292 -23914804 -24085500 -24327683 -24565541 -24776477 -24987644 -25236284 -25537813
49795 -25537813 -25875167 -26190064 -26375465 -26298451 -25861294 -25057818 -23975347 -22742038 -21465580
49786 -21465580 -20206565 -18992880 -17847647 -16796739 -15847428 -14967692 -14104922 -13243361 -12450569
49777 -12450569 -11863139 -11614259 -11753786 -12210447 -12809223 -13325800 -13551655 -13347619 -12668773
49768 -12668773 -11551481 -10071145 -8301743 -6313194 -4212669 -2189261 -505633 580543
49760 580543 923489 560964 -284318 -1266910 -2015807 -2232210 -1752763 -556617 1271416
49751 1271416 3581247 6173760 8808828 11241252 13287027 14874011 16032326 16834403
49743 16834403 17337331 17561634 17491988 17072930 16205956 14778230 12728716 10114289 7129001
49734 7129001 4061245 1209974 -1204811 -3106366 -4579170 -5833298 -7127193 -8679403
49726 -8679403 -10606648 -12912632 -15521364 -18319278 -21169654 -23896836 -26273986 -28046312
49718 -28046312 -28985065 -28941057 -27878045 -25891450 -23217456 -20215900 -17306261 -14864735
49710 -14864735 -13122183 -12106544 -11652728 -11477754 -11294849 -10919106 -10317238 -9587720 -8900443
49701 -8900443 -8434915 -8330151 -8638853 -9291419 -10098805 -10816373 -11247791 -11326091 -11112142 -10709738
49691 -10709738 -10168015 -9456670 -8531974 -7425275 -6271112 -5258779 -4556631 -4258162 -4360179
49682 -4360179 -4766002 -5315013 -5838627 -6225049 -6465875 -6665136 -7002483 -7654714 -8700257
49673 -8700257 -10047787 -11424931 -12441523 -12718316 -12042019 -10472527 -8328739 -6048565
49665 -6048565 -4010443 -2425834 -1341508 -705299 -430085 -431168 -647168 -1049458 -1625749
49656 -1625749 -2331807 -3043025 -3557603 -3665243 -3230027 -2220849 -680150 1319206 3686945
49647 3686945 6304721 9019417 11655459 14052394 16124980 17909253 19535843 21121456
49639 21121456 22656138 23979185 24856883 25098706 24647118 23609003 22213449 20705866
49631 20705866 19240454 17850968 16515791 15250863 14155035 13388113 13105769 13383216
49623 13383216 14161061 15245125 16365243 17262273 17765800 17840824 17586645 17174507 16744581
49614 16744581 16325815 15834448 15145683 14182936 12972165 11639889 10357983 9257433 8354259
49605 8354259 7536734 6633672 5528188 4238450 2899422 1654933 549239 -492022
49597 -492022 -1587816 -2810490 -4145300 -5507239 -6790096 -7928890 -8950282 -9968973
49589 -9968973 -11115657 -12449285 -13931039 -15479211 -17046764 -18647672 -20308207 -21982719
49581 -21982719 -23503655 -24611947 -25049037 -24642403 -23337422 -21193775 -18386961 -15208672
49573 -15208672 -12023764 -9182042 -6946420 -5488742 -4926286 -5327919 -6665240 -8759208
49565 -8759208 -11286227 -13853254 -16099490 -17781437 -18824175 -19328708 -19517642 -19621589 -19759707
49556 -19759707 -19890993 -19865233 -19524620 -18777766 -17607974 -16036030 -14082992 -11764418 -9114978
49547 -9114978 -6214762 -3187868 -173241 2704884 5348000 7685529 9682288 11340730
49539 11340730 12677745 13682050 14286609 14384106 13880807 12757706 11103389 9098859 6962441
49530 6962441 4886303 2996383 1346592 -62852 -1261017 -2289980 -3197849 -4027540
49522 -4027540 -4792998 -5463309 -5986564 -6345606 -6589046 -6797738 -7020709 -7249996 -7453115
49513 -7453115 -7614366 -7737896 -7822609 -7851951 -7816112 -7740407 -7683302 -7701321 -7820687 -8056905
49503 -8056905 -8470726 -9197817 -10407347 -12216169 -14623111 -17494531 -20588998 -23610912
49495 -23610912 -26295527 -28502015 -30260494 -31744635 -33199926 -34873120 -36954628 -39529952
49487 -39529952 -42559561 -45910141 -49412923 -52888270 -56113470 -58786622 -60559382 -61146305
49479 -61146305 -60439068 -58543347 -55720460 -52287317 -48543193 -44749814 -41141992 -37930743
49471 -37930743 -35279882 -33266636 -31855531 -30910591 -30245139 -29682431 -29098905 -28440566 -27713937
49462 -27713937 -26949956 -26147365 -25227338 -24037188 -22406054 -20215558 -17448736 -14208726
49454 -14208726 -10710997 -7244592 -4100580 -1486800 539877 2100200 3464530 4963792
49446 4963792 6855204 9195952 11795108 14282040 16263042 17482534 17901087 17657302
49438 17657302 16957578 15975251 14809229 13491846 12010532 10329171 8418600 6299023
49430 6299023 4075715 1942282 140376 -1108829 -1665362 -1494760 -664058 658467 2196223
49421 2196223 3593691 4513865 4758041 4317700 3327434 1984494 513190 -828555 -1764813
49412 -1764813 -2068442 -1633149 -492690 1212166 3272713 5434016 7425566 9030243
49404 9030243 10169625 10940945 11561794 12249342 13117014 14161744 15342849 16675403 18244788
49395 18244788 20117421 22220875 24302375 26009529 27033940 27217490 26571998 25239342
49387 25239342 23442343 21442420 19487049 17741942 16240255 14892860 13568297 12198179
49379 12198179 10840816 9661431 8841121 8471790 8502275 8765167 9056113 9203168 9084900
49370 9084900 8611537 7714285 6363985 4596831 2514542 253870 -2052524 -4300358
49362 -4300358 -6413594 -8323244 -9939233 -11138306 -11787256 -11798376 -11187481 -10097686 -8773308
49353 -8773308 -7501078 -6551765 -6141937 -6412260 -7413435 -9101999 -11348704 -13948036 -16619728
49344 -16619728 -19022371 -20811643 -21735514 -21706880 -20801529 -19192951 -17078731 -14634939 -11997109
49335 -11997109 -9256963 -6470432 -3666456 -841942 2049787 5084670 8308523 11657945
49327 11657945 14915735 17743431 19794715 20864850 20991620 20429841 19498571 18399542
49319 18399542 17132408 15553343 13512937 10967369 8003349 4791763 1524427 -1621335
49311 -1621335 -4481485 -6890542 -8684154 -9731851 -9985937 -9516367 -8504863 -7191986
49303 -7191986 -5798340 -4458460 -3198794 -1964914 -680514 685735 2068848 3295546
49295 3295546 4126251 4339298 3819576 2611481 915832 -966361 -2721005 -4100919 -4961860
49286 -4961860 -5248841 -4966987 -4176946 -3016841 -1713040 -544167 237039 480844 169456
49277 169456 -615385 -1753339 -3125573 -4618295 -6123461 -7573830 -8996485 -10525251
49269 -10525251 -12339496 -14566963 -17218165 -20178310 -23226612 -26050723 -28271736 -29524717
49261 -29524717 -29600298 -28573909 -26817814 -24859728 -23168142 -21996557 -21359174 -21109394 -21046512
49252 -21046512 -20998400 -20863388 -20613100 -20273992 -19917694 -19671926 -19722858 -20271263 -21450757
49243 -21450757 -23263921 -25582206 -28201038 -30902096 -33481719 -35742464 -37481522 -38516378
49235 -38516378 -38752066 -38242658 -37187985 -35855293 -34474842 -33168552 -31935655 -30685690
49227 -30685690 -29295779 -27661520 -25711492 -23383448 -20600002 -17283863 -13406638 -9025410
49219 -9025410 -4276224 659670 5581978 10279487 14538186 18164809 21017725 23024361
49211 23024361 24174585 24497994 24042245 22864960 21039396 18662241 15849049 12713352
49203 12713352 9341657 5781930 2052866 -1830677 -5823158 -9814729 -13620371 -17014583
49195 -17014583 -19803389 -21886740 -23268494 -24020102 -24239515 -24029585 -23484939 -22673444 -21621450
49186 -21621450 -20319025 -18744773 -16896733 -14816101 -12590625 -10326854 -8101963 -5934196
49178 -5934196 -3807902 -1745466 126026 1570927 2325937 2234364 1358024 -11484 -1461899
49169 -1461899 -2623128 -3278263 -3366748 -2914673 -1973421 -614669 1037964 2793239 4418866
49160 4418866 5689803 6424449 6502430 5879748 4601151 2786859 588192 -1853600 -4411551
49151 -4411551 -6954449 -9346600 -11472795 -13254328 -14637429 -15579507 -16058893 -16091143 -15719920
49142 -15719920 -14986810 -13914020 -12513367 -10802594 -8815875 -6619031 -4330930 -2120439
49134 -2120439 -151031 1504987 2921324 4298548 5880381 7849169 10245810 12946682
49126 12946682 15710200 18271381 20428466 22067184 23117287 23493322 23083501 21804118
49118 21804118 19673992 16840794 13529622 9949269 6224781 2399051 -1510144 -5447400
49110 -5447400 -9294568 -12893840 -16096888 -18801969 -20950721 -22489808 -23335769 -23382637 -22557054
49101 -22557054 -20886532 -18535597 -15785325 -12966636 -10386768 -8291709 -6874544 -6293210
49093 -6293210 -6650116 -7930338 -9949651 -12366824 -14764121 -16753815 -18068194 -18615296
49085 -18615296 -18492043 -17942192 -17261017 -16684730 -16318348 -16124320 -15950695 -15573743 -14757324
49076 -14757324 -13333502 -11272933 -8698821 -5843104 -2994289 -471557 1396880 2326351
49068 2326351 2148051 857792 -1377184 -4236720 -7280440 -10005591 -11936013 -12725263
49060 -12725263 -12245808 -10634580 -8265484 -5643714 -3266488 -1514794 -596967 -516811 -1058424
49051 -1058424 -1829262 -2387286 -2398441 -1732083 -456468 1227390 3060020 4786131 6208095
49042 6208095 7226980 7858124 8208862 8416552 8567417 8641535 8526595 8098366 7311843
49033 7311843 6234808 5001058 3728172 2475382 1278623 223640 -520273 -745194
49025 -745194 -299551 823431 2444709 4228529 5787426 6824741 7230762 7072000 6504324
49016 6504324 5697847 4816425 4012789 3389338 2939680 2535568 1996140 1203893 189191
49007 189191 -870107 -1722649 -2136778 -1968573 -1193457 98988 1749868 3596984 5514699
48998 5514699 7401310 9149090 10647893 11814164 12593278 12926637 12739287 11984780 10705208
48989 10705208 9039582 7172451 5270458 3445269 1743588 152872 -1379884 -2917184
48981 -2917184 -4495658 -6100490 -7668255 -9129238 -10468624 -11755450 -13105649 -14606271
48973 -14606271 -16263441 -18004709 -19710955 -21241603 -22450720 -23214647 -23472587 -23249235
48965 -23249235 -22630088 -21702262 -20513364 -19089741 -17496820 -15878375 -14428731 -13311400
48957 -13311400 -12576184 -12119807 -11712771 -11098366 -10138734 -8932875 -7814886 -7207155 -7414072
48948 -7414072 -8492277 -10270237 -12474180 -14854591 -17237284 -19496648 -21500341 -23081945
48940 -23081945 -24072775 -24380691 -24062200 -23327650 -22463783 -21718218 -21211770 -20916449 -20696846
48931 -20696846 -20388038 -19870847 -19106647 -18122809 -16980195 -15759733 -14567445 -13528647 -12759103
48922 -12759103 -12332412 -12265739 -12530545 -13087576 -13935460 -15138529 -16797424 -18972532 -21617455
48913 -21617455 -24566182 -27567272 -30340690 -32647782 -34357510 -35466849 -36052590 -36194349
48905 -36194349 -35931895 -35272266 -34214506 -32768118 -30965488 -28862447 -26516521 -23964364
48897 -23964364 -21242187 -18451472 -15809867 -13628051 -12215769 -11767599 -12277713 -13516072
48889 -13516072 -15084081 -16536266 -17513477 -17827328 -17474718 -16598382 -15415006 -14131961 -12886693
48880 -12886693 -11739411 -10708317 -9799228 -9000464 -8268359 -7546657 -6820939 -6161695 -5713288
48871 -5713288 -5630559 -6000514 -6788995 -7835059 -8894041 -9707338 -10063380 -9827326 -8947859
48862 -8947859 -7460105 -5479446 -3162728 -642503 2012910 4767833 7541798 10166657
48854 10166657 12426100 14141351 15227232 15682526 15539983 14820394 13515247 11602303
48846 11602303 9087985 6054397 2675499 -814345 -4173465 -7187437 -9681226 -11538022
48838 -11538022 -12729747 -13320274 -13417485 -13114917 -12481016 -11589709 -10532415 -9387866 -8192800
48829 -8192800 -6950481 -5653206 -4282955 -2806702 -1206188 467371 2069291 3399053
48821 3399053 4274593 4600191 4401916 3819738 3060250 2339175 1848843 1751379 2166264 3139660
48811 3139660 4623547 6492689 8588763 10758602 12866831 14783794 16363979 17444905
48803 17444905 17893316 17680550 16918442 15803136 14498002 13048245 11389781 9431065
48795 9431065 7137703 4570349 1875565 -748039 -3100225 -5051006 -6616063 -7980713
48787 -7980713 -9429010 -11208957 -13425626 -16024634 -18841262 -21649000 -24181266 -26153349
48779 -26153349 -27312605 -27508711 -26751282 -25223525 -23237692 -21145475 -19242544 -17707275
48771 -17707275 -16587747 -15826996 -15308660 -14898780 -14457063 -13820511 -12811054 -11315142 -9399253
48762 -9399253 -7350552 -5573160 -4400334 -3960546 -4179086 -4875557 -5856704 -6945480 -7968342
48753 -7968342 -8759617 -9208950 -9318958 -9218401 -9111228 -9193446 -9586016 -10306374 -11270428 -12310427
48743 -12310427 -13205959 -13732556 -13723394 -13121588 -11992601 -10484273 -8759158 -6947754 -5152870
48734 -5152870 -3486801 -2091789 -1114987 -661442 -772645 -1441457 -2619544 -4178362 -5857808
48725 -5857808 -7285370 -8092947 -8053438 -7137591 -5480797 -3327852 -995209 1179536 2925817
48716 2925817 4124093 4826850 5216472 5542171 6051701 6904091 8079747 9346504 10318573
48707 10318573 10578948 9803145 7842769 4754669 772079 -3769056 -8509199 -13110253
48699 -13110253 -17264312 -20696185 -23180628 -24566355 -24793505 -23909559 -22093386 -19672527
48691 -19672527 -17096378 -14844661 -13298820 -12637539 -12803410 -13542239 -14482736 -15224947 -15426541
48682 -15426541 -14889437 -13639011 -11959033 -10328519 -9243609 -8997470 -9555879 -10618396
48674 -10618396 -11817160 -12908965 -13850830 -14756201 -15791291 -17064892 -18552274 -20094746
48666 -20094746 -21484327 -22572952 -23318395 -23746040 -23895309 -23822404 -23646331 -23559813 -23757761
48657 -23757761 -24324125 -25165973 -26046188 -26686729 -26870024 -26488891 -25546998 -24135714 -22400965
48648 -22400965 -20502402 -18575945 -16715383 -14971923 -13357028 -11846663 -10400070 -8990772
48640 -8990772 -7621186 -6300983 -5009293 -3679090 -2216508 -536805 1402085 3573511
48632 3573511 5868853 8109018 10083002 11597265 12517963 12801975 12515904 11828835 10962198
48623 10962198 10106547 9346250 8632002 7807949 6672225 5049333 2860716 171615 -2815658
48614 -2815658 -5825956 -8590472 -10889390 -12554822 -13475518 -13624953 -13081398 -12004352 -10585115
48605 -10585115 -9020007 -7514570 -6274563 -5453613 -5090664 -5096571 -5306438 -5560481 -5769088
48596 -5769088 -5943221 -6185162 -6636210 -7398182 -8478798 -9806413 -11298340 -12909996 -14613445
48587 -14613445 -16336904 -17942353 -19270864 -20207634 -20708729 -20791384 -20531106 -20079090 -19660290
48578 -19660290 -19509873 -19760723 -20351753 -21033289 -21489702 -21514121 -21123125 -20541853 -20089608
48569 -20089608 -20053923 -20608924 -21776063 -23420579 -25301397 -27169369 -28850231 -30248827
48561 -30248827 -31293838 -31905474 -32027397 -31676098 -30941507 -29935062 -28735979 -27376474 -25867355
48552 -25867355 -24244572 -22610866 -21139292 -20016692 -19350885 -19107520 -19127347 -19209773 -19200258
48543 -19200258 -19031221 -18713158 -18301916 -17861770 -17427151 -16966190 -16365410 -15459993 -14107559
48534 -14107559 -12262318 -9997233 -7465189 -4842371 -2296101 29355 2040877 3735588
48526 3735588 5207861 6599266 8020740 9494938 10937925 12175001 12987336 13181109
48518 13181109 12649528 11400324 9556227 7348272 5086731 3077421 1505805 373768
48510 373768 -455668 -1150325 -1829906 -2553214 -3333503 -4136647 -4862201 -5339850 -5368969 -4800434
48500 -4800434 -3620770 -1974772 -93974 1822394 3681107 5477352 7228342 8928451
48492 8928451 10546506 12036369 13337059 14368283 15035674 15251890 14977367 14277972 13370582
48483 13370582 12607663 12378546 12967414 14446983 16664588 19316976 22060791 24596387
48475 24596387 26693947 28182953 28958076 29027623 28561076 27859875 27236763 26888141 26862030
48466 26862030 27129763 27669708 28479964 29530038 30718722 31873414 32773300 33179687 32887863
48457 32887863 31805515 30010977 27725835 25197775 22577989 19893621 17131002 14342752
48449 14342752 11679997 9339278 7497451 6292549 5827262 6138978 7137744 8577274
48441 8577274 10105510 11366933 12093899 12157408 11586388 10559178 9352231 8248456 7445991
48432 7445991 7011896 6885369 6904217 6841112 6458099 5572531 4095686 2017863 -628675
48423 -628675 -3771340 -7255970 -10819527 -14125483 -16844637 -18731147 -19674933 -19741333 -19188050
48414 -19188050 -18422940 -17893451 -17955026 -18781819 -20346411 -22454588 -24807692 -27065832 -28890210
48405 -28890210 -29961436 -29996875 -28795145 -26309275 -22714544 -18419557 -13981384 -9932731
48397 -9932731 -6597178 -4002755 -1950909 -185457 1460647 3021195 4442524 5660193
48389 5660193 6663491 7524006 8363340 9257798 10141002 10798080 10980277 10557041 9587331
48380 9587331 8271780 6847981 5510979 4389368 3559235 3065617 2926386 3112324 3531844
48371 3531844 4060123 4601686 5115640 5561795 5828500 5739703 5144900 3994400 2332020
48362 2332020 246585 -2146305 -4695414 -7231023 -9614472 -11769009 -13664432 -15289634
48354 -15289634 -16652338 -17795010 -18789394 -19703198 -20573718 -21422040 -22298754 -23310522 -24580834
48345 -24580834 -26156880 -27939926 -29717077 -31291384 -32617199 -33836453 -35187635 -36850834
48337 -36850834 -38827189 -40917327 -42798553 -44150476 -44766115 -44604325 -43771062 -42448915
48329 -42448915 -40817203 -39004918 -37091873 -35141511 -33238364 -31509222 -30110326 -29171966
48321 -29171966 -28727373 -28687979 -28901421 -29245122 -29660197 -30088779 -30385855 -30310900 -29624641 -28209811
48311 -28209811 -26113227 -23486838 -20500605 -17312601 -14104073 -11109979 -8585085 -6721864
48303 -6721864 -5583194 -5086420 -5029698 -5144255 -5168279 -4926367 -4377184 -3604311 -2764902 -2030980
48293 -2030980 -1544010 -1384212 -1552698 -1968482 -2484215 -2924011 -3139327 -3063269 -2736445 -2291072
48283 -2291072 -1899464 -1701517 -1734206 -1901975 -2021072 -1922056 -1544225 -964004 -356340 72921
48273 72921 152578 -204539 -980575 -2066515 -3296483 -4478017 -5410916 -5906423 -5815827 -5064584
48263 -5064584 -3682392 -1816816 285507 2335414 4073042 5316829 5971212 6009403 5458953
48254 5458953 4397897 2947130 1248326 -559195 -2338932 -3937939 -5188000 -5959918
48246 -5959918 -6244234 -6187954 -6048366 -6098079 -6546970 -7515026 -9045291 -11126501 -13695490
48237 -13695490 -16608753 -19615560 -22392292 -24653251 -26264736 -27263994 -27766297 -27843256 -27469760
48228 -27469760 -26570540 -25124131 -23245419 -21177094 -19181482 -17408414 -15841672 -14357478
48220 -14357478 -12837350 -11259037 -9731638 -8468938 -7699536 -7543123 -7928242 -8613161 -9288888
48211 -9288888 -9683804 -9616598 -9008179 -7885793 -6391560 -4787823 -3444450 -2785294 -3176496
48202 -3176496 -4781964 -7465296 -10818113 -14318952 -17531993 -20226018 -22359235 -23977409
48194 -23977409 -25121923 -25806603 -26048896 -25906226 -25487425 -24938924 -24415061 -24043026 -23898841
48185 -23898841 -24006517 -24349915 -24873397 -25467674 -25967388 -26182792 -25950925 -25170457 -23807015
48176 -23807015 -21890324 -19523275 -16887537 -14210334 -11686427 -9400494 -7309620 -5302775
48168 -5302775 -3295031 -1293944 593871 2201575 3350315 3883811 3692047 2735342 1063229
48159 1063229 -1194125 -3869956 -6811926 -9898706 -13013570 -16008323 -18693723 -20861410
48151 -20861410 -22320129 -22932391 -22645051 -21505962 -19660926 -17333733 -14792658 -12302332
48143 -12302332 -10071903 -8231886 -6861471 -6037080 -5840449 -6302188 -7330048 -8697676
48135 -8697676 -10121876 -11385465 -12428507 -13350418 -14322946 -15475548 -16832417 -18329346
48127 -18329346 -19863555 -21313811 -22529339 -23343183 -23640822 -23438468 -22895587 -22240846 -21667309
48118 -21667309 -21272363 -21070371 -21042692 -21165317 -21386767 -21588050 -21584109 -21189504 -20307117 -18978129
48108 -18978129 -17371138 -15732107 -14318271 -13321313 -12792002 -12601837 -12474787 -12086056 -11187312
48099 -11187312 -9704250 -7764475 -5649365 -3708136 -2285309 -1672382 -2048959 -3397627
48091 -3397627 -5446221 -7715748 -9683098 -10972183 -11462932 -11269350 -10622445 -9741234 -8767191
48082 -8767191 -7785186 -6889575 -6223463 -5947503 -6156499 -6804595 -7690740 -8507256 -8909796
48073 -8909796 -8568358 -7202344 -4631936 -850780 3923428 9263111 14602380 19331125
48065 19331125 22900734 24947770 25407955 24556402 22934828 21191033 19893191 19377838
48057 19377838 19678447 20564776 21680146 22709655 23494681 24044123 24452449 24784798 25004777
48048 25004777 24983786 24564129 23617381 22074699 19948901 17356287 14510750 11674453 9095450
48039 9095450 6969588 5424830 4508110 4179031 4325271 4786909 5362625 5803220 5830393
48030 5830393 5202019 3800283 1694982 -856306 -3479190 -5792959 -7505099 -8454124
48022 -8454124 -8610184 -8059133 -6972880 -5556605 -3986165 -2366448 -724443 970284
48014 970284 2762740 4651950 6540176 8232233 9496533 10156481 10164925 9624361 8735952
48005 8735952 7697660 6615495 5491969 4292068 3021368 1753005 596317 -355449
47997 -355449 -1057487 -1507365 -1712837 -1666188 -1344455 -719461 243996 1586892 3320411
47988 3320411 5367871 7538261 9559483 11142105 12035963 12074308 11206134 9497030 7091790
47979 7091790 4174639 964190 -2272825 -5236792 -7654155 -9347543 -10278959 -10549594
47971 -10549594 -10355211 -9910244 -9375761 -8830969 -8296939 -7783133 -7319408 -6956644 -6743823
47962 -6743823 -6704283 -6831731 -7103670 -7486107 -7912646 -8259878 -8360156 -8061145 -7290656 -6071215
47952 -6071215 -4468631 -2518222 -197990 2521233 5594829 8874026 12155714 15258585
47944 15258585 18056175 20461652 22412991 23886190 24913493 25576520 25977521 26210114
47936 26210114 26339345 26391978 26364445 26252611 26083327 25911495 25767876 25589713 25194648 24337163
47926 24337163 22828455 20650678 17994455 15194507 12598212 10437923 8770830 7505990
47918 7505990 6486939 5576954 4711626 3911189 3256435 2836007 2687327 2764287 2949151
47909 2949151 3096873 3088841 2879287 2518450 2137864 1905237 1979530 2481416 3458467 4831540
47899 4831540 6361494 7693896 8480299 8503077 7729599 6280579 4347388 2104894 -340678
47890 -340678 -2945653 -5673130 -8428746 -11034503 -13262901 -14919157 -15927706 -16363663
47882 -16363663 -16395526 -16170969 -15726574 -14979627 -13789738 -12037044 -9681844 -6802073 -3605762
47873 -3605762 -401433 2479164 4774004 6346049 7174113 7306582 6829846 5869406 4589793
47864 4589793 3157305 1682688 199457 -1296103 -2779506 -4164573 -5323789 -6140196
47856 -6140196 -6554304 -6580391 -6285950 -5748804 -5018311 -4098988 -2955645 -1529757 240277
47847 240277 2400979 4974269 7954028 11294572 14885136 18529921 21963520 24909234
47839 24909234 27155179 28611188 29323010 29442557 29169877 28689286 28120053 27495388 26773733
47830 26773733 25872023 24699111 23174815 21244035 18905162 16247405 13461142 10792547
47822 10792547 8456010 6550931 5027611 3722266 2447270 1085879 -372359 -1876041
47814 -1876041 -3383139 -4883105 -6356500 -7736284 -8934586 -9923524 -10796219 -11746276 -12969117
47805 -12969117 -14547213 -16395108 -18302999 -20050189 -21508120 -22662413 -23550440 -24175082
47797 -24175082 -24460363 -24268605 -23456510 -21941791 -19761908 -17100584 -14246352 -11471094
47789 -11471094 -8881255 -6343553 -3557193 -243777 3664277 7959681 12257988 16185947
47781 16185947 19535210 22292616 24555334 26417654 27912350 29020399 29708584 29962733
47773 29962733 29816482 29373454 28796800 28251755 27837152 27562967 27384948 27249114 27102452
47764 27102452 26880981 26515573 25963910 25232972 24361217 23375797 22268165 21007382 19565501
47755 19565501 17918544 16022748 13804386 11194006 8189802 4904137 1563521 -1532787
47747 -1532787 -4078538 -5839099 -6721645 -6796737 -6247528 -5279312 -4055837 -2691412 -1263592
47738 -1263592 196155 1721107 3389375 5256616 7294323 9387717 11387409 13165234
47730 13165234 14640605 15781569 16595418 17114826 17386857 17474597 17461829 17433174 17427263 17406527
47720 17406527 17283578 16984317 16493711 15866890 15228580 14760093 14638385 14934228 15554311
47711 15554311 16296681 16971632 17469503 17726803 17657353 17134812 16041498 14341828 12139079
47702 12139079 9688623 7348517 5473553 4296257 3846366 3934675 4206095 4257134 3784020
47693 3784020 2689378 1087328 -778547 -2628127 -4191091 -5218608 -5508432 -4960606
47685 -4960606 -3626515 -1698789 566741 2944469 5280626 7465836 9381962 10877215
47677 10877215 11790524 12015819 11579233 10679594 9638137 8760681 8202316 7939595 7864959
47668 7864959 7916550 8144626 8682205 9653780 11083082 12857111 14771949 16631382 18331069
47659 18331069 19876569 21335843 22765824 24157929 25431541 26477738 27224584 27680312
47651 27680312 27927025 28070743 28178470 28239224 28170463 27855570 27171322 25985888 24160852
47642 24160852 21601514 18341988 14597435 10734558 7172111 4254923 2143996 767015
47634 767015 -135018 -880588 -1713159 -2727888 -3870805 -4986749 -5898621 -6496800 -6791874
47625 -6791874 -6891459 -6920527 -6950270 -6982828 -6990583 -6979060 -7033366 -7309900 -7965155 -9068092 -10564828
47614 -10564828 -12316426 -14161533 -15943876 -17496907 -18629508 -19155432 -18962735 -18074185
47606 -18074185 -16648759 -14922610 -13139530 -11519026 -10256313 -9508986 -9348794 -9713397
47598 -9713397 -10412795 -11203062 -11878314 -12314341 -12447480 -12243182 -11716648 -10989492 -10291003
47589 -10291003 -9848431 -9734308 -9803470 -9774152 -9375993 -8447685 -6939859 -4865323 -2258430
$$ [...]
##END NTUPLES=NMR SPECTRUM
##END=
