##TITLE=31Pdec_CPAA-3
 CDCl3, 64 sc
 13.4.2023
##JCAMPDX= 6.0         $$ Bruker NMR JCAMP-DX V2.0
##DATA TYPE= NMR SPECTRUM
##DATA CLASS= NTUPLES
##ORIGIN= UXNMR, Bruker Analytische Messtechnik GmbH
##OWNER= root
$$ XWIN-NMR		Version 3.5
$$ Thu Apr 13 14:02:55 2023 Russian Standard Time (UT+4h)  she@DPX200
##.OBSERVE FREQUENCY= 81.013821
##.OBSERVE NUCLEUS= ^31P
##.ACQUISITION MODE= SIMULTANEOUS
##.ACQUISITION SCHEME= undefined
##.AVERAGES= 64
##.DIGITISER RES= 16
##SPECTROMETER/DATA SYSTEM= spect
##.PULSE SEQUENCE= zgpg30
##.SOLVENT NAME= CDCl3
##.SHIFT REFERENCE= (INTERNAL, CDCl3, 0, 248.564)
##AUDIT TRAIL= $$ (NUMBER, WHEN, WHO, WHERE, WHAT)
$$ ##TITLE= Audit trail, XWIN-NMR		Version 3.5
$$ ##JCAMPDX= 5.01
$$ ##ORIGIN= Bruker BioSpin GmbH
$$ ##OWNER= she
$$ F:/spectra/data/she/nmr/P31/1/pdata/1/auditp.txt
$$ ##AUDIT TRAIL=  $$ (NUMBER, WHEN, WHO, WHERE, WHAT)
(   1,<2023-04-13 14:01:59.10 +0400>,<she>,<DPX200>,
      <continue with go, POWCHK disabled, PULCHK disabled
       configuration hash MD5:
       00 E9 B6 7A A2 85 ED C7 34 08 36 98 17 FE 4E 26
       data hash MD5: 32K
       0F 19 90 A9 38 1B E2 30 17 45 F6 27 C3 99 21 4E>)
(   2,<2023-04-13 14:02:01.42 +0400>,<she>,<DPX200>,
      <Start of raw data processing
       efp BC_mod = 2 LB = 1 FT_mod = 6 PKNL = 1 PHC0 = -11009.16 PHC1 = 99.08539 SI = 64K 
       data hash MD5: 64K
       90 58 DC 28 5A 94 EB 85 5C 78 3B 9C 23 9D 11 CB>)
(   3,<2023-04-13 14:02:28.71 +0400>,<she>,<DPX200>,
      <pk PHC0 = 30.64132 PHC1 = -23.6 
       data hash MD5: 64K
       6E 06 7C 62 80 B3 37 CE 37 E2 F2 94 32 25 07 47>)
(   4,<2023-04-13 14:02:33.40 +0400>,<she>,<DPX200>,
      <abs ABSG = 5 
       data hash MD5: 64K
       E3 A9 20 8D 2D 8B 86 6B F9 8A 17 09 E7 16 D7 AD>)
$$ ##END=
$$ 
$$ hash MD5
$$ 96 4C 28 A0 C2 52 07 09 D9 47 4F 25 4A 61 A7 05
##$RELAX= 
##$RELAX= 
##$RELAX= 
##$RELAX= 
##$RELAX= 
##$RELAX= 
##$RELAX= 
##$RELAX= 
##$RELAX= 
$$ Bruker specific parameters
$$ --------------------------
##$DU= <F:/spectra>
##$EXPNO= 1
##$NAME= <P31>
##$PROCNO= 1
##$TYPE= <nmr>
##$USER= <she>
##$AMP= (0..31)
100 100 100 100 100 100 100 100 100 100 100 100 100 100 100 100 100 100 
100 100 100 100 100 100 100 100 100 100 100 100 100 100 
##$AQSEQ= 0
##$AQ_mod= 1
##$AUNM= <au_zg>
##$AUTOPOS= <>
##$BF1= 81.014009
##$BF2= 200.13
##$BF3= 200.13
##$BF4= 200.13
##$BF5= 200.13
##$BF6= 200.13
##$BF7= 200.13
##$BF8= 200.13
##$BYTORDA= 1
##$CFDGTYP= 0
##$CFRGTYP= 5
##$CHEMSTR= <none>
##$CNST= (0..31)
1 1 145 1 1 1 1 1 1 1 1 1 1 1 1 1 1 1 1 1 1 1 1 1 1 1 1 1 1 1 1 1 
##$CPDPRG= <waltz16>
##$CPDPRG1= <>
##$CPDPRG2= <waltz16>
##$CPDPRG3= <>
##$CPDPRG4= <mlev>
##$CPDPRG5= <mlev>
##$CPDPRG6= <mlev>
##$CPDPRG7= <mlev>
##$CPDPRG8= <mlev>
##$CPDPRGB= <>
##$CPDPRGT= <>
##$D= (0..31)
0 1 0 0 0 0 0 0 0 0 0 0.03 2e-05 3e-06 0 0 0 0 0 0 0 0 0 0 0 0 0 0 0 0 
0 0 
##$DATE= 1681380036
##$DBL= (0..7)
120 120 120 11 120 120 24 19 
##$DBP= (0..7)
150 150 150 150 150 150 150 150 
##$DBP07= 0
##$DBPNAM0= <>
##$DBPNAM1= <>
$$ [...]
##$SUBNAM3= <"">
##$SUBNAM4= <"">
##$SUBNAM5= <"">
##$SUBNAM6= <"">
##$SUBNAM7= <"">
##$SUBNAM8= <"">
##$SUBNAM9= <"">
##$SW= 501.771253377433
##$SWIBOX= (0..15)
0 1 3 0 0 0 0 0 0 0 0 0 0 0 0 0 
##$SW_h= 40650.406504065
##$TD= 32768
##$TD0= 1
##$TE= 0
##$TE2= 300
##$TE3= 300
##$TEG= 300
##$TL= (0..7)
0 120 53 12 22 120 120 120 
##$TP= (0..7)
150 150 150 150 150 150 150 150 
##$TP07= 0
##$TPNAME0= <>
##$TPNAME1= <>
##$TPNAME2= <>
##$TPNAME3= <>
##$TPNAME4= <>
##$TPNAME5= <>
##$TPNAME6= <>
##$TPNAME7= <>
##$TPOAL= (0..7)
0.5 0.5 0.5 0.5 0.5 0.5 0.5 0.5 
##$TPOFFS= (0..7)
0 0 0 0 0 0 0 0 
##$TUNHIN= 0
##$TUNHOUT= 0
##$TUNXOUT= 0
##$USERA1= <user>
##$USERA2= <user>
##$USERA3= <user>
##$USERA4= <user>
##$USERA5= <user>
##$V9= 5
##$VALIST= <valist>
##$VCLIST= <CCCCCCCCCCCCCCC>
##$VD= 0
##$VDLIST= <DDDDDDDDDDDDDDD>
##$VPLIST= <PPPPPPPPPPPPPPP>
##$VTLIST= <TTTTTTTTTTTTTTT>
##$WBST= 1024
##$WBSW= 4
##$XGAIN= (0..3)
0 0 0 0 
##$XL= 0
##$YL= 0
##$YMAX_a= 24846
##$YMIN_a= -36160
##$ZGOPTNS= <>
##$ZL1= 120
##$ZL2= 120
##$ZL3= 120
##$ZL4= 120
##$ABSF1= 248.5645
##$ABSF2= -253.2056
##$ABSG= 5
##$ABSL= 3
##$ALPHA= 0
##$AQORDER= 0
##$ASSFAC= 0
##$ASSFACI= 0
##$ASSFACX= 0
##$ASSWID= 0
##$AUNMP= <proc_1d>
##$AZFE= 0.1
##$AZFW= 0.5
##$BCFW= 0
##$BC_mod= 2
##$BYTORDP= 0
##$COROFFS= 0
##$CY= -3
##$DATMOD= 1
##$DC= 0
##$DFILT= <>
##$DTYPP= 0
##$F1P= 0
##$F2P= 0
##$FCOR= 1
##$FTSIZE= 65536
##$FT_mod= 6
##$GAMMA= 0
##$GB= 0
##$INTBC= 1
##$INTSCL= 6.047779e-11
##$ISEN= 30
##$LB= 1
##$LEV0= 0
##$LPBIN= 0
##$MAXI= 10000
##$MC2= 0
##$MEAN= 0
##$ME_mod= 0
##$MI= 50
##$NCOEF= 0
##$NC_proc= -9
##$NLEV= 6
##$NOISF1= 182.463
##$NOISF2= 159.3651
##$NSP= 0
##$NTH_PI= 0
##$NZP= 0
##$OFFSET= 248.5645
##$PC= 4
##$PHC0= -10978.52
##$PHC1= 75.48539
##$PH_mod= 1
##$PKNL= yes
##$PPARMOD= 0
##$PSCAL= 0
##$PSIGN= 0
##$REVERSE= no
##$SF= 81.0140089999694
##$SI= 65536
##$SIGF1= 159.3651
##$SIGF2= -187.1042
##$SINO= 113.3802
##$SIOLD= 16384
##$SREGLST= <1H.CDCl3>
##$SSB= 0
##$STSI= 65536
##$STSR= 0
##$SW_p= 40650.406504065
##$SYMM= 0
##$S_DEV= 0
##$TDeff= 32768
##$TDoff= 0
##$TI= <>
##$TILT= no
##$TM1= 0
##$TM2= 0
##$TOPLEV= 0
##$USERP1= <user>
##$USERP2= <user>
##$USERP3= <user>
##$USERP4= <user>
##$USERP5= <user>
##$WDW= 1
##$XDIM= 65536
##$YMAX_p= 452021843
##$YMIN_p= -63902004
$$ End of Bruker specific parameters
$$ ---------------------------------
##NTUPLES= NMR SPECTRUM
##VAR_NAME=  FREQUENCY,     SPECTRUM/REAL,   SPECTRUM/IMAG
##SYMBOL=    X,             R,               I
##VAR_TYPE=  INDEPENDENT,   DEPENDENT,       DEPENDENT
##VAR_FORM=  AFFN,          ASDF,            ASDF
##VAR_DIM=   65536,         65536,           65536
##UNITS=     HZ,            ARBITRARY UNITS, ARBITRARY UNITS
##FACTOR=    0.620285442955139, 1,           1
##FIRST=     20137.2065510682, 0,            0
##LAST=      -20513.1999529968, 0,           0
##MIN=       -20513.1999529968, -63902004,   0
##MAX=       20137.2065510682, 452021843,    0
$$ Real data points
##PAGE= N=1
##DATA TABLE= (X++(R..R)), XYDATA
$$ [...]
##PAGE= N=2
##DATA TABLE= (X++(I..I)), XYDATA
14762 -5838059 -5927492 2848542 6150769 -1599225 -9274288 -8568250 -4615104 -4189805 -7388673
14753 -7388673 -12621910 -17112206 -12990617 3278012 18735133 16619814 1108441 -6877424
14745 -6877424 -1314 6171666 -1757152 -16436431 -22907521 -17544098 -6883091 1965419
14737 1965419 3195097 -6288349 -20796883 -28445678 -25468885 -21746093 -26921002 -36438259
14729 -36438259 -36965953 -22807984 -2611800 9593240 8245062 766145 -2556067 -1986491
14721 -1986491 -6785794 -19604897 -30154760 -28889690 -19892790 -13928988 -14641933 -17851396
14713 -17851396 -18574833 -12678022 1558941 16827962 19469903 6639929 -6988847 -8222381
14705 -8222381 -2837290 -4433732 -14110595 -22482002 -25029392 -24207959 -22038761 -20308799
14697 -20308799 -21749539 -22974592 -15473135 -1921048 1246225 -11373886 -21468847 -13816647
14689 -13816647 -759487 -1788019 -13124023 -18854457 -19091378 -22999650 -25262675 -15788658
14681 -15788658 -3708305 -4597576 -11986806 -9931477 -5517754 -16649389 -34005795 -31774536
14673 -31774536 -14441746 -13778442 -35351234 -47644644 -33949241 -16643283 -15559328
14666 -15559328 -18765973 -13383774 -11445171 -22245041 -28631969 -15910158 622533 1717609
14658 1717609 -4815050 -3764960 -1721614 -10100345 -17677134 -8108584 9549663 14828613
14650 14828613 8534806 5911746 7943884 5107748 567579 3590627 6563004 -5461400
14642 -5461400 -25999438 -32721117 -20856412 -8386151 -6941335 -8253257 -2787348 5805097
14634 5805097 9623799 6806993 -811149 -10689323 -18534971 -21246275 -19884711 -15052273
14626 -15052273 -5065327 5907243 7690116 106664 -2864674 4441727 7103794 -5049787
14618 -5049787 -14850690 -1965692 21739872 26413389 7970693 -8423661 -7485465 -777430
14610 -777430 -1075998 -3561896 -589084 4125675 5738711 7725128 12016906 12061944 4380058
14601 4380058 -2938967 -1235391 6750111 11930567 9486081 337076 -11306127 -18299157
14593 -18299157 -14986736 -4763720 2252974 1494748 -1475249 -396841 3192930 3077764
14585 3077764 -4119580 -15713144 -24247405 -22892864 -12968711 -3849851 -1388388 -267860
14577 -267860 6260313 13419457 10398162 -3167076 -15208471 -16192380 -8865674 -2112772
14569 -2112772 -1022981 -4433678 -8120496 -9076026 -8260927 -8457317 -9165393 -7125458 -2508653
14560 -2508653 834112 2515343 5990558 9733571 6383805 -5981959 -20378071 -31802974
14552 -31802974 -41218286 -45362692 -36395710 -18336076 -8931080 -15032840 -20576871 -11556686
14544 -11556686 1424478 1066271 -9369186 -15008505 -14606078 -16586084 -18228155 -10489768
14536 -10489768 1229515 2336393 -7196489 -13939465 -14292201 -17225518 -24147933 -25460278
14528 -25460278 -18973120 -13998947 -14503670 -14266562 -11069573 -10355942 -12926339 -14064995
14520 -14064995 -15983937 -24975891 -34662845 -29620088 -9425643 7994119 12309873 13535110
14512 13535110 21660386 29026330 23280067 6890803 -6468057 -8638174 -3133740 1102850
14504 1102850 -1342047 -6199261 -3012110 10626742 22613260 21532178 12014370 4419013
14496 4419013 -2847039 -15528883 -25312428 -19216066 -3588801 2530061 -2993063 -4623663
14488 -4623663 1258785 395016 -11000426 -16650600 -8115375 580403 -1980551 -6162223
14480 -6162223 -2357274 -1169932 -14705108 -32749556 -36922631 -28711343 -25283807 -33312992
14472 -33312992 -42876595 -44425210 -38798890 -31275190 -25192240 -21742145 -20851981 -22464257
14464 -22464257 -27366450 -33035115 -30862225 -16173973 374674 3144626 -6532404 -12091927
14456 -12091927 -6650193 -762632 -2049819 -4048997 -1848021 -2282390 -9477828 -15009784
14448 -15009784 -12552685 -9204491 -12208992 -16708889 -16504189 -14882829 -14804088 -10310275
14440 -10310275 1743951 12514868 13975373 10504318 8750706 7399128 5872376 10306193
14432 10306193 20628634 24735898 16663091 7472503 6354020 4854866 -6297868 -18260515
14424 -18260515 -18001835 -9729233 -5924900 -6770663 -4779331 -1062130 -679834 297979 6991774
14415 6991774 12126759 5988942 -6449895 -13255371 -13899307 -15598977 -18427360 -18580603
14407 -18580603 -18940616 -21575191 -18158868 -4011520 7145922 751754 -14027997 -16963230
14399 -16963230 -7564054 -2283964 -5563150 -5847002 826368 4586006 451274 -5201149
14391 -5201149 -8280215 -10394876 -8616546 932297 9168928 1631994 -18646467 -32825935
14383 -32825935 -32134832 -25419291 -20174016 -14199037 -8595893 -11036600 -21469880 -29669800
14375 -29669800 -30164514 -25786980 -16765970 -3236312 2301753 -14105404 -42486560 -56030514
14367 -56030514 -47111418 -34022455 -27977690 -19611084 -6491604 -5411042 -21778430 -33014480
14359 -33014480 -22933779 -10002885 -17483829 -34731002 -35539789 -20370467 -10671193 -10738428
14351 -10738428 -6327718 2749122 421902 -12671318 -14356087 1741639 10690815 -7323202
14343 -7323202 -36435607 -48838876 -43000403 -37959169 -40112314 -38135409 -28089114 -22206457
14335 -22206457 -27975018 -34787478 -29920011 -16676221 -7045280 -3901278 -963594 3869509
14327 3869509 6109265 4637152 3715910 3318396 -3010029 -16360460 -26616735 -24861857
14319 -24861857 -16136288 -12920960 -19474550 -29293317 -35546394 -37057298 -34864256 -29480298
14311 -29480298 -22767438 -18304475 -18560191 -23336953 -30128527 -34580291 -33052326 -26850199
14303 -26850199 -21168244 -18245532 -15732042 -13364468 -14796929 -19664576 -21570217 -18823430
14295 -18823430 -18340035 -21822510 -18059313 -54153 18634894 18801007 1751879 -13739219
14287 -13739219 -17268767 -14824378 -12731176 -9130948 -2972120 1914595 4200735 5851880
14279 5851880 5196895 -60484 -4481431 -2081669 526470 -6782280 -17805829 -17572261
14271 -17572261 -8798040 -8840469 -17687135 -14120647 7350992 20867511 6087243 -20435021
14263 -20435021 -29911793 -20460274 -10570094 -6996296 -2673431 1424747 -3757470 -15263743
14255 -15263743 -18374205 -9011651 -371974 -4223651 -16774969 -25128889 -20109548 -3444200
14247 -3444200 11761894 11680193 -1261418 -9450306 -5097827 -2536806 -13907710 -26123753
14239 -26123753 -20778646 -6413036 -7033053 -23301439 -30921391 -18873240 -4310406 -3185653
14231 -3185653 -8696974 -9100961 -7750307 -12501973 -19629951 -21195608 -17966087 -14172814
14223 -14172814 -8441766 613096 7912610 9153404 6899423 3382095 -3543757 -11532550
14215 -11532550 -12054251 -4685261 -1133903 -6683502 -10742876 -6510843 -6014566 -20704748
14207 -20704748 -39200329 -42456999 -32434475 -26342557 -28269351 -27176638 -20696276 -19617195
14199 -19617195 -26511847 -29285902 -21268349 -11281427 -7628602 -6836088 -4916942 -5675833
14191 -5675833 -9701866 -7960564 4011029 16111401 17761486 13266801 13529116 19837454
14183 19837454 25132127 25153162 20064942 11053626 2810752 2670360 9657696 11736103
14175 11736103 1902671 -11380517 -18706627 -24382012 -34344701 -39956673 -30788455 -16036662
14167 -16036662 -13370539 -20203057 -17468413 -2030102 7381297 1639175 -3490095 6124578
14159 6124578 20109926 20937727 9010731 -4670916 -18433335 -35503700 -48431143
14152 -48431143 -46121937 -32971403 -25174941 -28611357 -33111747 -28431067 -14875878 1574428
14144 1574428 14604500 18555195 13597879 9042088 12251804 16124875 8273988 -8809752
14136 -8809752 -19238135 -16110749 -9801079 -11006846 -17527995 -22746205 -26433628 -30221900
14128 -30221900 -30222384 -21247660 -3978479 15852089 30846514 33502388 22151112 7535756
14120 7535756 4563565 13818071 20083590 13242144 635861 -6908731 -10275632 -14494898
14112 -14494898 -16076656 -9926481 -2227683 -3478633 -11824702 -15147588 -8767373 -894348
14104 -894348 -381766 -7490141 -17031309 -23807266 -25582476 -26469657 -34278434 -47167005
14096 -47167005 -47889103 -23314068 12426563 28694070 15017577 -6012039 -8263128
14089 -8263128 6803482 17129203 10234595 -4021285 -8435865 1800059 15600806
14082 15600806 19110926 11078933 3675751 6360825 13088447 11768775 2345611 -5179913
14074 -5179913 -8632184 -14938298 -21531757 -13893104 9597715 26420229 17923483 -3156758
14066 -3156758 -9797363 3019622 16931131 19115897 12557994 -151859 -21013934 -40999313
14058 -40999313 -41470288 -20552431 -1164680 -1487340 -11537960 -11859918 -3295986 -2390876
14050 -2390876 -14469876 -27315140 -29592988 -22846206 -15156473 -12427699 -16248917 -23440381
14042 -23440381 -28086692 -28429233 -28549010 -29257903 -24222324 -12058106 -4153633 -9765988
14034 -9765988 -19901007 -18701468 -6167010 3899843 4831082 1425727 -3694120 -11497722
14026 -11497722 -15094439 -4917021 12295623 17740395 8435505 2664324 10471098 17489034
14018 17489034 9406806 -4709508 -8388425 -2872175 472981 1556467 7163748 13214599
14010 13214599 10160539 1335050 -2012515 -958019 -6188343 -16102492 -16017931 -1697950
14002 -1697950 12842190 15406379 9279835 2511809 -2529586 -3673807 2971578 12161504
13994 12161504 9761891 -6870447 -20129347 -14574707 1372423 8084278 1363709 -6986723
13986 -6986723 -9918744 -11306377 -12425821 -7425833 3707413 9893971 3795192 -6425506
13978 -6425506 -8373960 -3403884 -4613669 -18271563 -34832364 -39902133 -29024036 -9728293
13970 -9728293 6869990 13931619 11873848 7166290 6529917 9642709 9445676 2223133
13962 2223133 -5823825 -6845987 -3565007 -6076696 -16549958 -24909305 -22307464 -11953042
13954 -11953042 -2505505 3065920 6573681 7782006 5429026 2091118 1067239 -408214
13946 -408214 -8346712 -21812699 -30839126 -27007857 -13990049 -5316983 -10413968 -22535664
13938 -22535664 -23959730 -7604559 9970044 6394385 -16196590 -31312551 -22756512
13931 -22756512 -5199827 -646116 -7780981 -10359722 -6320586 -7883988 -15474128 -13339711
13923 -13339711 4132238 20293992 19647297 9264512 5646293 10512443 12113716 4537995
13915 4537995 -6405683 -14118293 -17459868 -16056079 -8506073 2048238 7186874 2370266
13907 2370266 -6831107 -12156507 -14114350 -19956328 -29687103 -32191067 -21560829 -10409673
13899 -10409673 -14911035 -29301637 -31430138 -16845724 -8719332 -22744775 -39749204
13892 -39749204 -32462345 -7380659 4339076 -7147898 -19161307 -13189209 1535143
13885 1535143 8451837 6164661 -191664 -11349480 -24305620 -25757128 -10017387 8210311
13877 8210311 12822791 7385401 3664739 627427 -8563819 -18355139 -18960335 -16492498
13869 -16492498 -24369326 -37296316 -35354304 -15868721 -98867 -1647109 -7492458 -1341113
13861 -1341113 10639504 12681080 6429714 6795377 15410448 16419846 1058076 -18312330
13853 -18312330 -25316662 -20246951 -14746445 -12364358 -5301906 10147216 24309324 24246071
13845 24246071 8530830 -11828779 -24865068 -27094766 -23042565 -18450146 -14768099 -10019605
13837 -10019605 -4553072 -3280730 -9231141 -17018027 -18060040 -11638873 -4316478 1538984
13829 1538984 9563452 17319650 13698602 -4027954 -20322015 -19777848 -8625533 -4873688
13821 -4873688 -11270264 -13161055 -3330960 6313724 3213446 -7568255 -12011652 -7409431
13813 -7409431 -5271293 -15140440 -31069914 -36796577 -24387334 -5170335 2606278 -3814748
13805 -3814748 -10199199 -8244023 -7609991 -17225720 -27489158 -25093763 -15982688 -16670127
13797 -16670127 -28891650 -40233771 -45208095 -47298121 -43773816 -28822848 -10533594
13790 -10533594 -4095563 -7977932 -7722479 -3209487 -8186161 -20824012 -21931435 -8987014
13782 -8987014 -4057697 -16783109 -26648843 -17188665 -2371600 -495996 -4707351 -188679
13774 -188679 9254890 13047701 14150574 16356706 9331116 -10970582 -24475614 -14436695
13766 -14436695 3366154 4995867 -3846122 -3434336 1328140 -8367642 -26070247 -28123084
13758 -28123084 -16642118 -17914315 -36858098 -48352459 -39497236 -27307896 -25073616
13751 -25073616 -22051877 -9926730 -2459703 -12366358 -29385344 -37037723 -35258129 -33498418
13743 -33498418 -34811703 -36664125 -35478304 -24807012 -3131484 13553864 5363630 -21051570
13735 -21051570 -36473855 -29388994 -19390759 -22080703 -26072566 -18683428 -9642650 -10212057
13727 -10212057 -10389851 662005 9444919 -1675565 -22380918 -28333063 -18573765 -13519231
13719 -13519231 -19961113 -22736242 -11954143 2839536 9656265 8465642 4123674 -1672688
13711 -1672688 -6904951 -8163840 -6596573 -6726321 -7704338 -3847248 4757114 10056243
13703 10056243 6506257 -2465778 -10148783 -13744126 -14659791 -15382268 -16929778 -17566086
13695 -17566086 -14799518 -9457923 -5242336 -4053315 -6005335 -13134041 -25291025 -32483852
13687 -32483852 -22995885 -2618454 7321265 -1805762 -12968860 -9205320 715882 -2611029
13679 -2611029 -18377081 -27905050 -22947951 -13776888 -10100945 -10073047 -9428443 -7543510
13671 -7543510 -2916241 4324138 4366976 -13321807 -39817242 -50351496 -34626794 -10758085
13663 -10758085 -882830 -4079814 -3414934 9225704 26775495 39170576 40254450 26771900
13655 26771900 2949121 -15456056 -14831493 -3669597 -6428880 -31709631 -57766844
13648 -57766844 -59435062 -40652569 -26385891 -26839945 -27181275 -15307996 -1966540 -2772182
13640 -2772182 -13570005 -18394568 -13854149 -9741937 -9733217 -7842437 -2942853 -647678
13632 -647678 269810 6961786 15205035 10573530 -6933146 -17367452 -10347509 -3246263
13624 -3246263 -14935462 -35256820 -39731417 -26061367 -15088745 -17954287 -22597245 -16511017
13616 -16511017 -5997442 -4247298 -10837933 -12893146 -2960037 11135158 14804388 2863909
13608 2863909 -14356332 -22663108 -20314053 -17460152 -19492698 -20126878 -15128112 -12560947
13600 -12560947 -20275374 -31067406 -31764433 -22173514 -13185686 -9181498 -4795885 1534514
13592 1534514 3231426 -2564695 -8222589 -4448748 9666803 26779065 36959471 34366899
13584 34366899 23711906 18006905 23690223 30945702 26196209 10625352 -2971553 -8401361
13576 -8401361 -9879221 -9895793 -6575579 -3648298 -9310368 -21539899 -26718993 -17933460
13568 -17933460 -4168537 3766483 6176079 7490424 6528254 1508571 -3564027 -5874624
13560 -5874624 -10389068 -21065871 -31172269 -31199511 -22418817 -14188259 -10918906 -10086474
13552 -10086474 -10899052 -15701564 -22375639 -23741928 -17658961 -11995174 -15130519 -23952054
13544 -23952054 -25487084 -11441742 10659480 23380895 17652047 2999079 -3768611
13537 -3768611 1350481 6527813 2452690 -3309837 3239810 20966144 31255166 20324406
13529 20324406 -1866787 -11659898 236676 17995345 21628050 12080474 6523765 11786491
13521 11786491 15777755 8965242 552910 2576249 8417333 2815567 -11994310 -18091277
13513 -18091277 -10070962 -3307061 -8581502 -15500644 -11845591 -5216843 -9875503 -20921989
13505 -20921989 -20004034 -5049341 3518558 -8455092 -27552751 -30126637 -13195337 3481192
13497 3481192 4323118 -4059116 -5492212 3281228 10909939 9182446 2860217 -426126
13489 -426126 -1595707 -5067691 -7914263 -2981040 8371253 14847425 8518839 -5679424
13481 -5679424 -15800894 -15090006 -7611787 -4083812 -11311091 -23517546 -26928400 -16172348
13473 -16172348 -1481604 5551725 6850388 9613468 10094660 -307115 -16363652 -23494318
13465 -23494318 -21456202 -25409649 -39113742 -45965431 -35512340 -21053365 -18246951 -21878996
13457 -21878996 -19092838 -12016507 -9555638 -7848750 1573424 12406442 12465928 5587222
13449 5587222 3826167 3194562 -9489909 -28429516 -33502341 -24381236 -22650321 -34055142
13441 -34055142 -37238173 -22000746 -10403481 -20213861 -32065532 -19371460 7038904
13434 7038904 14577714 -708658 -10806068 -1093722 10607337 6151477 -6708283 -11255580
13426 -11255580 -6775966 -4012340 -7501316 -13664288 -19414195 -24479009 -29261908 -34074651
13418 -34074651 -36682936 -31794875 -20082379 -13945417 -22130037 -31816606 -23004946 -440319
13410 -440319 9523933 -1854435 -12755278 -7117414 33379 -8906007 -21582722 -16044858
13402 -16044858 1490449 6953290 -2216509 -6651170 -583315 1174449 -6298448 -8944705
13394 -8944705 -2429479 -3401259 -19521788 -31284380 -20576365 573472 8497897 1805709
13386 1805709 -2719091 828712 2418254 -3402697 -9403006 -8676795 -2873685 3627644
13378 3627644 7976035 7010484 -533030 -10119964 -16433551 -20725256 -26733257 -32113855
13370 -32113855 -31221888 -23563882 -12123706 2959206 20212753 30088060 23600833 6801025
13362 6801025 -4073638 -2601568 2128199 553399 -6486278 -14092550 -21025090 -26653587
13354 -26653587 -27139238 -19704051 -7434759 2489963 3337905 -6950711 -21773047 -28529719
13346 -28529719 -21518163 -9971925 -6392725 -10262232 -12523177 -12292700 -15805278 -20256685
13338 -20256685 -15158480 -2780880 -171019 -13347615 -25415711 -21356954 -10393922
13331 -10393922 -9550139 -17131100 -19995703 -18213747 -21922129 -27763484 -20926727 -3109393
13323 -3109393 2932753 -14650365 -37796188 -43702779 -35300861 -31203765 -34306835 -28810079
13315 -28810079 -7579414 13672613 15120090 -3581215 -24201407 -29499991 -17979318
13308 -17979318 -2246121 4883556 4037455 7886169 22906489 36501351 31135821 9926801
13300 9926801 -4395196 396945 10654864 10768576 9318975 24551507 50653356 59449020
13292 59449020 38088913 6733130 -8978745 -8248393 -7281379 -13154550 -19622868 -22291412
13284 -22291412 -23299701 -22336716 -15152239 -2315758 9343909 15150901 15358880 9837795
13276 9837795 -1672639 -13115339 -14781720 -5837109 2855115 2564462 -2512787 -3209504
13268 -3209504 654379 937448 -5771231 -12417288 -11104081 -4357732 -2035165 -7278372
13260 -7278372 -10868282 -3396494 10757540 18574379 16457685 14407947 19922485 26973317
13252 26973317 26829748 21882765 20200918 21725418 19227016 10146834 -832418 -8934251
13244 -8934251 -11732173 -7324491 1991442 6962958 853775 -10505182 -16474348 -16517151
13236 -16517151 -17828070 -21014163 -19637174 -12968927 -7708694 -7043794 -8769752 -13333424
13228 -13333424 -21742670 -26730196 -20261451 -9724762 -10578588 -21543556 -25245767 -17203722
13220 -17203722 -13807507 -23657676 -32054404 -26766741 -19519865 -24667755 -33348116 -29361658
13212 -29361658 -17640483 -14449412 -18587544 -15873357 -6801324 -5983826 -15596886 -21794008
13204 -21794008 -18630642 -14808814 -14455875 -11551047 -6883045 -9896912 -18366179 -17391114
13196 -17391114 -6646612 -6964448 -27462572 -46595129 -42920375 -27348487 -23834017 -31129769
13188 -31129769 -28343780 -12012816 -1731562 -7359056 -13740755 -5906952 8280300 11555337
13180 11555337 1044790 -12823893 -22963833 -29364789 -30404963 -22141856 -7371763
13173 -7371763 2736807 -205623 -12578472 -23455288 -26623838 -25098847 -23984786 -22350723
13165 -22350723 -15465776 -3946296 4406676 4115679 -932163 -3854528 -4334390 -5978824
13157 -5978824 -6997766 -1764989 8158996 13206801 9078608 3282556 3622520 6857390
13149 6857390 5533049 890570 515060 5791814 10473300 11203007 10978559 11202591 8903434
13140 8903434 4812260 5847540 13958539 19137307 11187563 -5334566 -16083181 -15739089
13132 -15739089 -14091191 -21687505 -35681859 -43973710 -40268600 -30491943 -24046758 -22037050
13124 -22037050 -17454356 -7088938 1253134 -1876239 -13125934 -18517760 -11323314 -330717
13116 -330717 3238363 -565416 -5473931 -9720839 -12511828 -6646151 12153270 31402170
13108 31402170 32089385 14324387 -1151603 -1304411 3055026 -3007727 -15546415 -20358690
13100 -20358690 -15559078 -11373686 -11845116 -10945736 -6369369 -3946620 -5404397 -2964540
13092 -2964540 8082804 19392184 19193654 7623744 -3849697 -6371463 -1853818 2498674
13084 2498674 3599860 4729334 9933881 17880922 22117361 17686837 6810981 -2851874
13076 -2851874 -5195124 -318056 6533750 8944266 3167953 -9178714 -21334471 -26041621
13068 -26041621 -21499441 -12518543 -5420820 -2320732 -796545 1594279 3839220 3064106
13060 3064106 -1220463 -5696628 -6071567 -440728 9675565 19874586 24891874 23040983
13052 23040983 18900562 17865229 17606317 10792032 -1595055 -7808171 -2365064 2636461
13044 2636461 -6165813 -21713105 -25180468 -13875670 -4379667 -6218741 -9527792 -5105719
13036 -5105719 97144 -1580467 -2548817 5324827 11499767 926374 -18789420 -24263964
13028 -24263964 -9908468 3693531 -1252264 -18020226 -29083441 -28760240 -23374865 -17733031
13020 -17733031 -11243412 -3827018 1394520 660814 -7225337 -17795515 -21222915 -11404651
13012 -11404651 4276634 10977697 4318530 -4887186 -7030362 -6754383 -13392784 -24861756
13004 -24861756 -29826721 -23574664 -13903095 -10571791 -14191968 -17428041 -14671649 -8727197
12996 -8727197 -7477268 -13653013 -20018176 -18273694 -11181937 -9212901 -14219004 -15103749
12988 -15103749 -5126223 4318760 -2733460 -22826162 -34375253 -25046490 -7645989 -2381148
12980 -2381148 -10519296 -15514019 -8099408 988222 -2439256 -15498985 -23313411 -20710160
12972 -20710160 -17701701 -21824733 -25798488 -19289086 -5231252 4620499 6068276 4805055
12964 4805055 4380088 1823962 -4003611 -8799390 -10181676 -11393620 -14839022 -18234933
12956 -18234933 -19672935 -20205186 -18966595 -12464828 -1706437 6700570 9541359 9691793
12948 9691793 6805446 -5079002 -24860688 -39156959 -38289298 -28885379 -21001935 -12228273
12940 -12228273 1963473 10728023 -42549 -20752618 -24396029 -4265167 13696234
12933 13696234 5683494 -18488180 -31421157 -23810901 -9134059 -125382 3464048 5797140
12925 5797140 7797059 10605712 15673055 19286603 15291412 4957598 -3299792 -5533219
12917 -5533219 -6321493 -9387916 -11348991 -7802450 61102 7527531 10211612 4745733
12909 4745733 -8152849 -19819207 -20161800 -10888633 -5003081 -9842470 -18724857 -23891135
12901 -23891135 -27984259 -34459070 -35584466 -22560978 -3001910 5139045 -3395731 -16161164
12893 -16161164 -21977876 -22642838 -22088105 -16384222 -3250314 7341084 3866391 -8768159
12885 -8768159 -13621417 -5300680 1555966 -6595457 -20681901 -19738191 -1234927 12416690
12877 12416690 2998118 -19352670 -31990704 -30816570 -29112431 -30130498 -22883602 -8611019
12869 -8611019 -7368776 -25458850 -37738881 -22496890 2748880 5428159 -13360249
12862 -13360249 -22914080 -10632818 4617701 7887177 6481963 6267257 -803994 -13464357
12854 -13464357 -12912640 5815552 19087133 10876388 756246 11791468 30271319
12847 30271319 26183709 342828 -19227460 -20621074 -18164808 -21585638 -22970779 -16813451
12839 -16813451 -9287456 -3985778 1111717 481471 -13952382 -32064740 -32063230 -13037723
12831 -13037723 665058 -5175613 -16106519 -15584530 -9825806 -12668552 -22102160 -26812674
12823 -26812674 -24338142 -19452056 -13615956 -6762202 -1245612 3984778 13437306 22674037
12815 22674037 18362985 -1121984 -18689438 -21766927 -18233768 -17790470 -13331666 2992425
12807 2992425 19005894 17497852 2507079 -8938699 -13589977 -19773037 -24297303 -14976597
12799 -14976597 4021983 11589346 -1066785 -18717273 -24882400 -20073532 -11622644 -1357265
12791 -1357265 8143552 8832266 -554395 -7453987 -1339448 10240524 11318037 -1227591
12783 -1227591 -14797569 -17387992 -10038581 -3392930 -5767568 -14632317 -19160191 -12716580
12775 -12716580 -1440433 3739362 1637445 139550 1853908 442901 -6288884 -10254406
12767 -10254406 -5944112 -246791 -1300346 -4944699 -2208700 4692809 4850656 -4726961
12759 -4726961 -15352230 -19748146 -19484558 -17723495 -13575762 -7433630 -4413283 -7304057
12751 -7304057 -11487410 -12027324 -11343298 -14307501 -19370278 -20785733 -17411859 -13173199
12743 -13173199 -10271767 -8174049 -8352856 -13140706 -19687440 -21923135 -19242092 -16065186
12735 -16065186 -12098251 -2281017 10909411 15831182 8275517 -635862 -1296625 252053
12727 252053 -3607568 -4628540 7712752 22459436 18423192 -1942451 -12702408 -3355565
12719 -3355565 5049184 -5955443 -22365802 -19906896 -1828898 6857987 -3934536 -19160834
12711 -19160834 -23790534 -19649145 -14478350 -10042844 -7126769 -10443045 -21020455 -31182171
12703 -31182171 -33513511 -29843135 -26495463 -24900774 -21599218 -14837138 -7158051 -2497768
12695 -2497768 -2809761 -6465356 -8702844 -4958989 4599984 13807044 14745360 5124387
12687 5124387 -7290440 -9951425 901433 13545185 13460438 1899566 -6488585 -5659337
12679 -5659337 -6768324 -18975470 -32325280 -30520489 -14352481 -688792 -851816 -10276188
12671 -10276188 -18370596 -19522763 -14748482 -10111695 -12817664 -22226513 -26779456 -17032635
12663 -17032635 986528 13548880 17308866 20170736 26704658 33511309 37774763 39200463
12655 39200463 34140703 19919143 5279901 3216773 11217389 12526590 1367596 -7547074
12647 -7547074 -2277124 7258613 5187549 -5408656 -7795925 2900235 13384424 11671119
12639 11671119 1681014 -5271574 -5826690 -5157116 -5123962 654114 15948765 30480297
12631 30480297 28310951 9395338 -7144655 -7701950 -2094706 -5553725 -12304132 -5066002
12623 -5066002 13552510 21092805 9290632 -3643308 -2800091 1951769 -2687326 -9092557
12615 -9092557 -4376382 2682899 -7593045 -33466587 -50740118 -44279129 -24067156 -7468315
12607 -7468315 405518 3771781 4368631 -83463 -9442387 -17748603 -17471694 -8873914
12599 -8873914 -3605269 -11778437 -24956369 -23679202 -6242706 5215117 -2380026 -10536582
12591 -10536582 2436494 24274953 24726423 1376470 -18355196 -20133923 -18092093 -21107208
12583 -21107208 -13551732 14425831 41342196 40759278 18011780 -518724 -4430225 -5120298
12575 -5120298 -11186545 -18014575 -20214213 -18330565 -13574179 -8291339 -9009618 -16497419
12567 -16497419 -17295333 -629673 19706258 18782024 -4295707 -24168814 -25442280 -20634301
12559 -20634301 -23923684 -27093576 -16313351 2048397 10130827 4431658 -3615894 -7349754
12551 -7349754 -9318019 -9303184 -3625404 3847874 4064787 -2587409 -6601123 -5636671 -7328068
12542 -7328068 -12929226 -12167338 -897636 8646532 4855553 -5287298 -6049113 5337305
12534 5337305 17620050 22638015 22781627 21846130 17803573 7458075 -6932182 -18409204
12526 -18409204 -21128552 -15470082 -8237230 -5900793 -6998199 -4854118 1620155 6311533
12518 6311533 7559319 12771882 24837297 31963441 21610996 211568 -12266702 -6387671
12510 -6387671 7752916 15306750 11344226 215318 -10932200 -15796855 -12763021 -7164893
12502 -7164893 -5403639 -7336941 -8903720 -9210913 -8643231 -4380071 3133746 4001350 -8544222
12493 -8544222 -22908446 -21650232 -7964806 -2172846 -9961411 -13700718 -2127595 10874473
12485 10874473 9301504 301540 550958 9200990 11502510 2503268 -8382268 -12726715
12477 -12726715 -10612424 -6035059 -4603493 -11373155 -22529872 -25981883 -18850544 -14550491
12469 -14550491 -20999949 -23704815 -7698133 13630276 13777350 -7208971 -21572123 -13280502
12461 -13280502 3235407 8418867 1846770 -6596907 -13274281 -19003193 -22641844 -24305623
12453 -24305623 -25900520 -24551681 -16042706 -6928481 -9793491 -23339417 -32163971 -30557113
12445 -30557113 -29811984 -35683914 -37049223 -27052576 -17544024 -18940644 -21880387 -14739815
12437 -14739815 -5100259 -5976930 -12831406 -13547261 -11201676 -16223578 -23657955 -20377178
12429 -20377178 -10378761 -10472460 -22348583 -30887699 -30736653 -32415944 -39024848 -39331470
12421 -39331470 -30526192 -26276533 -32211256 -33212315 -18199156 -263247 3648532 -1025689
12413 -1025689 1711769 10987787 13004874 6669191 5598498 14863295 22982066 20693187
12405 20693187 14003509 12673176 15404600 13047369 1002442 -16439117 -30700516 -34931933
12397 -34931933 -28426373 -17407722 -9732048 -7984464 -8948723 -8553102 -4877657 1846465
12389 1846465 8678369 11109611 8553021 6394151 7675936 5445124 -9111727 -31292044
12381 -31292044 -43893125 -36231592 -15784552 2268477 11295560 14873709 17295333 18406257
12373 18406257 16174583 9966246 1665986 -4321936 -3861250 1902055 6280879 4166221
12365 4166221 -2695969 -9911821 -16899878 -25029360 -31506836 -30832223 -22791158 -13994191
12357 -13994191 -9318079 -5599661 2714829 13626163 17616695 8807174 -6536358 -15434283
12349 -15434283 -11927089 -2728054 2068575 1111844 1137519 5776979 10503381 10071288 5609384
12340 5609384 560118 -5998782 -16019065 -24896632 -24841431 -16945865 -12760446 -19296962
12332 -19296962 -27093114 -19954738 3861254 26179448 27451380 7578916 -15132568
12325 -15132568 -23729226 -16681701 -2892976 10145195 18655604 18567548 8063898 -6077716
12317 -6077716 -12713918 -9346106 -4647844 -5671036 -9581757 -11660555 -13306746 -15685419
12309 -15685419 -13338764 -3721587 2807376 -5649758 -24016102 -35334674 -33867927 -30721223
12301 -30721223 -34582511 -39075047 -34316284 -21613327 -10871656 -9771532 -19022033 -32040430
12293 -32040430 -37595905 -30445185 -20186572 -19926428 -26008932 -22452571 -7416146 2034730
12285 2034730 -2238643 -6101734 693628 4283707 -9387510 -26709873 -25463456 -10607736
12277 -10607736 -5887902 -16133879 -23979122 -21823455 -20295459 -22516302 -16163703 1483383
12269 1483383 13784839 10019215 725519 -2354849 -3257984 -7912950 -10864585 -7968663
12261 -7968663 -6488728 -10576402 -12150580 -7996791 -9112578 -19462911 -23382369 -11254774
12253 -11254774 -408948 -9467009 -26795941 -28334315 -15117201 -7624260 -11717216 -17074213
12245 -17074213 -23084379 -37040285 -48736538 -37669838 -9326319 4950407 -7589522
12238 -7589522 -23672890 -21781810 -11318328 -8658159 -7631932 4939369 20713094 19753399
12230 19753399 938644 -16486735 -17974613 -6590450 5462531 7537590 -3061572
12223 -3061572 -16937887 -20096464 -11728479 -5949215 -9549334 -10816364 -962863 7337329
12215 7337329 -1241232 -18513219 -24354423 -16887085 -11010951 -11366721 -8221107 13770
12207 13770 1418829 -7895834 -15045382 -9808188 1723688 8959067 8905665 1002997 -15849584
12198 -15849584 -33612357 -36130194 -19678091 -1365255 2606884 -3589873 -7732463 -9608127
12190 -9608127 -14877116 -18356196 -10560973 3635983 9732286 5431726 1336447 -600293
12182 -600293 -11359991 -32208852 -44897445 -35896122 -18233153 -15078931 -28450649 -38586912
12174 -38586912 -31789677 -15063466 -1855251 4307317 7040431 7496816 4802833 681309
12166 681309 -3374939 -10872799 -26159963 -46141506 -60696736 -61937565 -50907680 -35629307
12158 -35629307 -24292969 -19321306 -16325007 -9661126 432473 8387764 11298357 12222222
12150 12222222 13797866 13828233 10970475 9491933 12664831 16005134 14029030 9704467
12142 9704467 8842619 8444853 798151 -12516148 -21943862 -25145477 -28592023 -32516334
12134 -32516334 -28373282 -16327085 -10789245 -19181602 -27722393 -20683896 -3755520 6037293
12126 6037293 5676520 4552712 2331561 -11790782 -35722458 -48645894 -36463119 -10341882
12118 -10341882 8589468 13032342 9318024 2604896 -5993772 -12159777 -10201979 -2266472
12110 -2266472 3184906 3597292 5718910 14004556 21800871 19205540 6740411 -4243147
12102 -4243147 -4798780 2251996 7771810 7692501 5652386 6002463 8331038 9338125 6927617
12093 6927617 1712146 -2687991 -681812 9704278 21038161 21407477 8414569 -6106833
12085 -6106833 -9631900 -3539198 800339 -2662107 -9514750 -13574207 -14044068 -13040559
12077 -13040559 -11033185 -6962092 -616525 6027639 8928820 4749002 -4839473 -13728969
12069 -13728969 -18266896 -20393739 -21126341 -15694082 -1055900 15091597 20359177 11991006
12061 11991006 -1361531 -11730495 -18682450 -23204033 -22049661 -12291197 2177764 12467412
12053 12467412 12581670 4870412 -1872599 -887084 5012630 6636568 119581 -8967786
12045 -8967786 -15560927 -22878250 -34632095 -44937054 -43868428 -30100527 -11082883 6100655
12037 6100655 16970376 17125264 6999860 -3328236 -3606646 3716543 8424742 7452109
12029 7452109 5236900 2717516 -1746642 -2417615 9001623 27720834 37880277 32134628
12021 32134628 17929527 3915922 -6945104 -10188423 -942940 14422851 21780783
12014 21780783 18028495 13138986 11717895 8792465 6507377 15229053 31694985 36701314
12006 36701314 24282218 12750241 14423183 15398686 1851241 -13531569 -12077994 490446
11998 490446 6720239 6490372 9485993 10700620 -17175 -12346085 -7373466 8884303
11990 8884303 11385523 -4808471 -17717194 -13617681 -4380506 -4075597 -10187273 -15114024
11982 -15114024 -17532200 -16054050 -8853412 -4193674 -13143554 -27494775 -25081313 -3397121
11974 -3397121 13069945 8031640 -4888046 -7549194 -4582998 -9575534 -20082965 -23944005
11966 -23944005 -19388500 -13282251 -8379595 -5751202 -10492754 -21415500 -24119378 -8888756
11958 -8888756 11907358 18882990 12273611 9040596 17277697 27493613 28186309 18614761
11950 18614761 5990430 -2030437 -2959997 -2830175 -10230446 -22739446 -26745817 -17071949
11942 -17071949 -7187023 -10013512 -17807020 -14507453 -1657197 3255874 -7552512 -21622181
11934 -21622181 -22565973 -7683022 11362125 19159861 9552137 -6636815 -10780043 1479523
11926 1479523 13883234 11546415 -19396 -7448257 -10794089 -18181878 -27145516 -27872573
11918 -27872573 -20607283 -13698342 -7616200 2613096 11603940 8315413 -3418810 -7163638
11910 -7163638 1064260 7625168 5013501 2859915 7964983 9714184 -3726093 -26250539
11902 -26250539 -41650362 -43044607 -35989911 -27973335 -21536313 -14263589 -2822556 9118736
11894 9118736 8965803 -9977427 -33565555 -39264824 -24270096 -7821337 -3821879 -6297439
11886 -6297439 -5835746 -3854301 -2904188 2153688 13450990 22648628 22949125 17480563
11878 17480563 9131790 -4127149 -16207347 -11785427 10034784 26463491 19460880
11871 19460880 -453634 -13121240 -16574228 -18853869 -16833229 -4741554 7290012
11864 7290012 6136173 -771456 2703178 13084072 14570916 8643548 10143260 16974897
11856 16974897 12135938 -2798626 -5187083 11601293 25965428 22588816 13908401 14556734
11848 14556734 17259001 9452589 -5126000 -16830293 -25505883 -31022020 -24614109 -5044322
11840 -5044322 11424015 12565551 7545681 7860535 6693595 -5174096 -18383063 -20594107
11832 -20594107 -19446247 -27168095 -34193272 -23844335 -4813666 -1216523 -14125157 -20781403
11824 -20781403 -12235531 -4777776 -10122664 -19411763 -23290623 -24735467 -23912186 -12224454
11816 -12224454 8281590 19076060 10017249 -6435550 -15319616 -16248495 -11256399 4261390
11808 4261390 25150593 31035245 15136414 1370997 12139262 33899470 38469050
11801 38469050 26618964 22430929 30044963 26803016 3180941 -18419878 -16246891 759644
11793 759644 10251591 8291700 7108616 10520670 9238163 -1310958 -12727387 -15721789
11785 -15721789 -10818995 -3302187 5359975 15483893 22622216 20008020 7983609 -4404769
11777 -4404769 -9706901 -9594545 -8458862 -4576258 4731519 11966013 4466078 -16941663
11769 -16941663 -34196835 -32804744 -19151636 -10342752 -12534126 -17151292 -15219506 -7742788
11761 -7742788 -2300776 -4018346 -9759306 -10129603 -324388 10953414 10152560 -2063446
11753 -2063446 -9744837 -3682210 6215486 7498461 2822360 746161 -321178 -5175549
11745 -5175549 -7579332 413926 10353456 6406191 -9675292 -20197806 -18208934 -14849511
11737 -14849511 -17530431 -18484039 -11265499 -3320502 -3844118 -11139739 -19704617 -28986909
11729 -28986909 -37496925 -38558760 -30448671 -22228736 -21307257 -22445103 -16529467 -3693294
11721 -3693294 8757932 14943676 11575120 -1505054 -15883487 -18274868 -6999763 3371348
11713 3371348 1396089 -6182754 -7913929 -6532427 -11334707 -18593516 -15349322 -1115662
11705 -1115662 8889454 4626685 -6292512 -11319116 -9273206 -8114609 -11617673 -14426101
11697 -14426101 -10025623 -573895 3431264 -5254953 -20722320 -29637984 -26864153 -19689768
11689 -19689768 -15339633 -12058140 -6810909 -3812046 -7723436 -13886365 -13921099 -7902279
11681 -7902279 -3137346 -3196583 -5645832 -8780946 -12946177 -15940110 -14259456 -9040008
11673 -9040008 -4728793 -1796017 3547172 12028080 19001956 20485583 17410486 12734832
11665 12734832 7225767 -504463 -10224730 -16445854 -11234910 4380317 13827826 -43554
11657 -43554 -30520500 -48768745 -37303085 -11569169 1735444 -2145483 -8324944 -9328798
11649 -9328798 -10915526 -13389153 -7664914 5494335 10099152 -2401130 -18760444 -22423399
11641 -22423399 -15188597 -8731692 -3711955 7592946 21478611 21673799 2108689 -20267418
11633 -20267418 -23371503 -6022291 11387788 11686434 -285917 -7102173 -2219735 3681164
11625 3681164 243675 -7499309 -8053469 -1748624 -395326 -9838623 -22548821 -29598080
11617 -29598080 -31095161 -30138096 -24258718 -10764119 3560472 7037764 -2010572 -11278934
11609 -11278934 -8037679 6406364 17906859 13736118 -5033108 -23634602 -25625949
11602 -25625949 -7529107 16459571 26292045 15308750 -3661392 -14350353 -16586235
11595 -16586235 -22905414 -35887986 -39963912 -23403179 246540 6204820 -8458421
11588 -8458421 -20353356 -11340679 8970185 19524084 15260181 7388844 3852853 2583843
11580 2583843 1821725 4653466 10807835 12975689 6180042 -4038867 -7734673 -3383532
11572 -3383532 -393318 -6932356 -17717592 -19296889 -8968679 -1110107 -7725921 -19319090
11564 -19319090 -17510507 -3476298 2544827 -7797798 -18155746 -13204017 -700028
11557 -700028 4044546 1586688 1389296 2949109 914255 563033 9928555 21943314
11549 21943314 22942670 15886888 16352263 26049496 29292473 18355295 4572105 -907727
11541 -907727 -1510984 -3477328 -3610423 2236635 8473211 6418195 -4293043 -16509463
11533 -16509463 -22784133 -19128324 -7494677 3951517 9165121 12256884 19362821 24960573
11525 24960573 18556819 4475970 -409797 7653372 11678252 -95207 -14709806 -12970867
11517 -12970867 2229442 9735846 -1507917 -19462342 -24820905 -12617889 3971836
11510 3971836 8639077 -909480 -12225574 -15043216 -13940138 -18944833 -28844773 -33440658
11502 -33440658 -29786242 -25193916 -24345556 -24042626 -21478866 -17720797 -12436122 -5112513
11494 -5112513 -1265966 -6526759 -15212008 -17047903 -14383960 -18392974 -28368321 -31459632
11486 -31459632 -24844727 -20285280 -22568458 -21814932 -13458280 -7579541 -10283851 -13411708
11478 -13411708 -11598319 -11649541 -15154594 -10825612 3617891 11248316 2774016 -4739792
11470 -4739792 6282082 25848059 33387689 27702283 19321326 7288166 -12755781 -28521249
11462 -28521249 -24480714 -8609507 -2152841 -8075253 -12492758 -12083581 -15283682 -19100178
11454 -19100178 -10668926 6819489 13873167 3928355 -8787585 -14071197 -16900099 -19472773
11446 -19472773 -14509194 -4040906 -3665840 -17323752 -26055631 -14259364 7804448 20302506
11438 20302506 20133171 18025838 18987713 18874297 15390675 11839551 11372562 13025616 12221987
11429 12221987 4560096 -7179651 -12195915 -5208065 2632080 -2437486 -14990366 -17157056
11421 -17157056 -6218948 2024893 -312794 -2469943 3071143 6750307 9348 -9307657
11413 -9307657 -11278128 -8869236 -6451778 1650928 16316079 21243702 3686936 -22615898
11405 -22615898 -34315136 -30653574 -28754270 -31996062 -25725170 -5293211 13098737 15743773
11397 15743773 8258347 1056065 -6815813 -18478235 -26028995 -20647548 -9482389 -8121636
11389 -8121636 -17308716 -20092435 -5799674 13286095 16689723 1471623 -16025179 -22532566
11381 -22532566 -21572568 -21568515 -20567263 -12383383 -1869178 -862231 -9102771 -12290607
11373 -12290607 -3408912 5756010 1965170 -10477236 -18505460 -20745016 -26112675 -35135688
11365 -35135688 -36701073 -25459514 -10827591 -3963421 -4743675 -7179356 -9896472 -13816438
11357 -13816438 -15063587 -9033677 674849 5335320 2828872 -328061 1073701 5305498
11349 5305498 8713526 9722813 6355094 -2854449 -12297306 -11350343 1655513 14554546
11341 14554546 17277671 15811859 21124917 30193747 30114398 17911830 3334739 -6831830
11333 -6831830 -13591485 -14927199 -6035505 6156896 5125264 -11209336 -23551640 -17969897
11325 -17969897 -5419615 -2523615 -6182189 -2902497 6940447 12023008 11025511 12936322
11317 12936322 19283490 22305205 19738077 16651343 13152951 4678725 -5279596 -6993357
11309 -6993357 -478958 3744093 1920039 2033729 8427564 13776516 10918191 2518697
11301 2518697 -5150911 -9311348 -8686665 -3260857 1255567 -2810764 -14147426 -22495120
11293 -22495120 -20821278 -10429231 4952337 20735376 27970394 19467451 713993
11286 713993 -14887144 -21881629 -24378877 -23729219 -17087348 -7690674 -3009241 -1804066
11278 -1804066 3764232 12509760 14699149 8927851 3711647 1314423 -4033065 -10621021
11270 -10621021 -9714409 -3716235 -4697005 -11505735 -9473975 1929522 4551752 -6834646
11262 -6834646 -12906153 -2377177 8257897 4600051 818999 14442915 33963561 36309955
11254 36309955 22377223 10509794 5660738 -601303 -7872752 -8802480 -7569727 -14184726
11246 -14184726 -24424415 -25589283 -17857302 -10819946 -4569484 5725982 13114347 9105100
11238 9105100 4290958 13546835 25477137 15478857 -11623538 -23614936 -10695114 -1209641
11230 -1209641 -15459702 -33621452 -29054544 -9489068 -725761 -5402806 -3953030 10663652
11222 10663652 22816912 18859948 4254249 -7228234 -9419834 -5133327 251778 2510167
11214 2510167 15779 -5225432 -8282118 -3871940 9665915 26373507 34804512 29137465
11206 29137465 17048725 10913877 12476941 13228728 8910857 4716767 5233422 8332662
11198 8332662 11388214 14942320 17053255 12299714 745012 -8926148 -9551164 -3634359
11190 -3634359 1099604 -1198434 -12601800 -28591740 -35532967 -21129088 7697927 26582313
11182 26582313 20319528 495108 -10725088 -7694193 -2838158 -5304870 -9196418 -4776237
11174 -4776237 6453367 12989515 7469738 -4618887 -11938900 -10822311 -7731114 -7982962
11166 -7982962 -8120154 -3636262 1523436 834815 -2827709 -147751 10347392 19351554
11158 19351554 18785513 9389155 -4328419 -19253366 -32031189 -38417188 -36340698 -26467431
11150 -26467431 -11455905 1397083 2101701 -9516966 -18822337 -14546205 -5991094 -7707182
11142 -7707182 -12809851 -2027248 21785195 32418107 19352812 3805072 4262570 9359048
11134 9359048 2703003 -6168312 145122 12848087 9315875 -7604089 -11682683 5173564
11126 5173564 20972824 19450339 13060480 18296056 28376259 26970558 15300485 7686841
11118 7686841 7729771 5918966 -1695974 -7295833 -4910663 958337 2961689 -593809
11110 -593809 -6606476 -10301937 -7216855 1186974 4376446 -6078779 -21804615 -25100783
11102 -25100783 -14098041 -7617889 -17626702 -30051708 -25944365 -10786324 -4624260
11095 -4624260 -9420480 -7972610 4894259 13073614 7197444 57181 2851224 6078722
11087 6078722 -161668 -4747063 4860655 15467789 5656487 -16988437 -22513914 -1712718
11079 -1712718 21785261 25898369 14304071 82450 -13864936 -27678082 -34751979
11072 -34751979 -31479478 -25276781 -22942939 -21001991 -15622676 -11355188 -11509148 -10553436
11064 -10553436 -5514531 -4828970 -15156741 -27865018 -30018353 -22568142 -16620110 -15949695
11056 -15949695 -13547885 -3828510 9225064 15459926 6949603 -13633221 -31391778 -32191013
11048 -32191013 -19233505 -8884605 -8521951 -9570226 -5549826 -2846900 -6396971 -9119944
11040 -9119944 -6306872 -7013082 -17406274 -24679020 -14400668 4497640 10134764 -1552223
11032 -1552223 -13816674 -14821875 -9786365 -7025757 -7101833 -8884815 -14139196 -21954203
11024 -21954203 -27042381 -26152257 -20300503 -11295245 -2055886 2605069 2505138 4457551
11016 4457551 9667072 6422618 -11472016 -26497179 -16702511 9579656 20093290 2920315
11008 2920315 -17139046 -14885246 2391629 11742951 7838680 1618115 -3401166 -13139779
11000 -13139779 -24955691 -26699251 -16144350 -6256027 -6031181 -8445908 -4713535 -224965
10992 -224965 -5564261 -17492102 -21297280 -11685536 -109275 1813376 -3646846 -8508344
10984 -8508344 -12299278 -17975276 -21209029 -15422262 -4407794 1847989 2230919 2827819
10976 2827819 1629263 -8841683 -21386375 -15660476 11163654 32429709 24518324 -1976472
10968 -1976472 -19164444 -18852385 -14631744 -15036906 -15151421 -12727416 -13458209 -18075928 -19687520
10959 -19687520 -16980342 -17056578 -22255110 -25918170 -24123145 -20805917 -18371280 -13288921
10951 -13288921 -4173357 4300477 7800230 5333932 -3877765 -17554390 -25196405 -16910268
10943 -16910268 1329526 11551024 4679499 -11317812 -24017094 -27083273 -19038171
10936 -19038171 -3891600 6156047 1108531 -12314298 -18704381 -16473442 -17364280 -22702619
10928 -22702619 -18961269 -2695693 9037988 3576183 -8217777 -10342719 -5621798 -7097529
10920 -7097529 -15914201 -22230818 -20784561 -12496462 2954460 23184237 36606411 32507033
10912 32507033 15371464 -305025 -6408558 -4314887 3186409 12858638 17620832 12853779
10904 12853779 4814276 4138571 11930267 19316065 19347626 13232606 6736718 5738347 12564398
10895 12564398 21768614 23062999 13119537 212930 -6849749 -8137610 -6335876 302430
10887 302430 11116565 17385350 13202900 5222561 1700815 -996446 -9361774 -17012238
10879 -17012238 -12134712 3280050 15853374 20203737 21816384 21858282 14411655 682154
10871 682154 -8178339 -6650046 -1888971 -1303834 -3368463 -4442515 -4724276 -3494489 1806281
10862 1806281 7404532 3705805 -10768433 -24710595 -28771831 -26489288 -24522108 -20845442
10854 -20845442 -11003874 835341 6713727 6716571 7160893 9564517 9774762 6812712 4604589
10845 4604589 4527825 3041219 -2013035 -8616418 -15874184 -26473103 -40348196 -50056143
10837 -50056143 -47364424 -33098742 -16457661 -4981506 1056958 4244474 4834421 2520165
10829 2520165 -309637 -1024860 -213547 1219275 5884790 15306842 23273319 21365273
10821 21365273 11835125 6900546 11939691 16942646 10466259 -3595763 -10593351 -3887840
10813 -3887840 7754471 11384500 3694944 -7271873 -11818488 -9029066 -6871376 -10693220
10805 -10693220 -14431843 -8834742 3177702 8265062 1557406 -5740963 -2384742 7867946
10797 7867946 13699988 11389979 5257448 -917356 -5511271 -7045089 -6853258 -8686938
10789 -8686938 -10971337 -7221752 441658 -868616 -14405622 -22932963 -11606062 8384944
10781 8384944 15444429 9013851 6399134 12715562 14806186 5477286 -5809360 -10112680
10773 -10112680 -9697034 -6712055 2895543 17638708 26376254 23202693 15515011 11439489
10765 11439489 9595913 6445311 3497906 2014202 -215069 -2735834 -1959635 946958
10757 946958 1592946 2430663 8991841 15821307 11722508 762665 -283070 10093080
10749 10093080 13016036 290741 -10424022 -4079326 8083772 9703333 6156330 10369455
10741 10369455 16598497 11006874 -1722978 -5235470 1317737 4549598 1074583 -419421
10733 -419421 1231204 -1362013 -6175007 -2904982 6575463 8201906 -710984 -6205624
10725 -6205624 -760996 5637463 4025338 235609 1950484 5717531 6205314 7005010
10717 7005010 12285242 16511623 12232086 1917463 -6247664 -9569797 -10925987 -11804446
10709 -11804446 -11447379 -9904069 -7139653 -1692389 6181539 12429286 12905478 7288825
10701 7288825 -1489410 -9287275 -12906979 -13755979 -17662173 -26252964 -31388700 -25510446
10693 -25510446 -14967979 -13139456 -21065893 -26443293 -23379298 -20514460 -24561953 -27786796
10685 -27786796 -20441724 -6864039 665965 -1310035 -5983874 -8197864 -9204578 -10813940
10677 -10813940 -12210556 -13328853 -16276955 -21863990 -27339588 -28694534 -24376249 -16553229
10669 -16553229 -8752113 -2372648 2999720 5756428 2896061 -3126818 -3849598 3273103
10661 3273103 7853348 -77172 -14035928 -19143324 -13618364 -9780949 -13963336 -19038089
10653 -19038089 -19494899 -20513474 -26724823 -33483613 -35392497 -33614716 -29634223 -22117431
10645 -22117431 -14591506 -13966698 -15637409 -4517192 19970488 35021337 24007892 1732572
10637 1732572 -6408581 232142 2404678 -6138831 -12398923 -9114497 -4852652 -5909452
10629 -5909452 -6569009 -3594080 -4666068 -13630245 -19452888 -10181230 9299253 22382086
10621 22382086 20036893 9091170 3301401 9207904 19399271 20040215 7553591 -5488610
10613 -5488610 -6649067 -1119044 -3127346 -13149194 -17110157 -8963074 121000 -523835
10605 -523835 -6890371 -10107705 -9134027 -6434397 -1237931 5004608 5896996 863175 -1165102
10596 -1165102 2352001 -697298 -16883135 -29394177 -17786665 10418613 27072573
10589 27072573 21164265 10068359 9880813 13275810 5890786 -10008321 -20735772 -21004480
10581 -21004480 -16301372 -10682749 -3631840 2788704 3415249 -2307827 -8284828 -8814272
10573 -8814272 -4442031 -723158 -2857440 -9996576 -13972257 -7435242 5326491 11415833
10565 11415833 6030360 -1217355 -1932455 -2187244 -10463154 -19616644 -14821948 3180501
10557 3180501 17541713 19034589 16023316 17057526 17811516 12804348 7727864 9740910
10549 9740910 14636008 14826122 13336289 18249730 27790688 32557015 30192703 26906600
10541 26906600 25310754 21070816 12333299 3458552 -2314752 -6617336 -10743186 -12796232
10533 -12796232 -11475823 -8029434 -4092827 -1432539 -2401470 -6414634 -8760307 -7908828
10525 -7908828 -9791326 -18059489 -24866460 -20324512 -7453568 1880130 2800969 -97498
10517 -97498 -1859397 1274098 13383619 29679158 33332226 17395912 1726713 7501805
10509 7501805 22720137 19754420 2001006 -375046 18049380 28885799 20720361 18218361
10501 18218361 33999262 43265999 31299069 24404001 40384012 50418579 33589755
10494 33589755 26744118 62206593 96356067 79383139 66651925 153482661 293814346
10487 293814346 303154789 97632523 -165746368 -270853038 -198247781 -104943035 -93769092
10480 -93769092 -116150978 -99951942 -61718469 -50839540 -61452864 -57679650 -40642339
10473 -40642339 -36636765 -44993836 -44269573 -35553088 -39583131 -57452387 -67703045 -61110879
10465 -61110879 -51202198 -49223322 -51102394 -51343269 -50451296 -45195558 -28449134 -3992773
10457 -3992773 11917511 9864511 -1084222 -5708055 186637 7882095 5818273 -9233331
10449 -9233331 -26254886 -27125839 -6600996 17029092 19916991 -113139 -23673958 -35341854
10441 -35341854 -36784211 -34149194 -27694295 -20017114 -20686331 -31948292 -39483723 -29411099
10433 -29411099 -8379188 4850845 3351836 -4381444 -11603191 -20217098 -29589361 -31967229
10425 -31967229 -24706372 -17390494 -19614206 -27744477 -30479903 -23698366 -14010090 -10073092
10417 -10073092 -15256461 -27156119 -39771568 -46262201 -42664992 -30266044 -14827698
10410 -14827698 -3909685 -2254915 -6006247 -3856511 9674186 23381143 20541062 1838841
10402 1838841 -13379643 -12811659 -6915343 -11048774 -22429140 -27229307 -23608698 -22685029
10394 -22685029 -28543838 -31963407 -26523077 -18901011 -18228944 -23893533 -29063420 -30065096
10386 -30065096 -27529572 -22502984 -15286114 -6199081 3361592 8950090 4976892 -6849765
10378 -6849765 -15034430 -11927274 -5920700 -9245015 -16696240 -11739388 4989828 10935558
10370 10935558 -6814782 -30817227 -36693371 -25439150 -16886657 -18555324 -18809013 -9824677
10362 -9824677 -723218 -2873802 -13509295 -20837724 -19110825 -12730426 -8772652 -9999838
10354 -9999838 -14076709 -17036568 -17490109 -17607042 -19353016 -21012572 -19651945 -16130260
10346 -16130260 -14374952 -15133740 -13862624 -7629925 -2319819 -8015847 -24974947 -38704164
10338 -38704164 -35414776 -20790218 -14539990 -24485843 -36396649 -35128008 -24584146 -16405772
10330 -16405772 -9666303 2395259 13130873 9891094 -2149397 -4854982 3179244 4034572
10322 4034572 -7992727 -15832442 -9739006 -4369695 -11737740 -19240048 -13120638 -4127359
10314 -4127359 -7738285 -15661926 -11842777 -2640433 -3363381 -6151601 7265530 27425076
10306 27425076 26018617 2680033 -11927950 -5720151 -3284185 -21445470 -39273568
10299 -39273568 -33264269 -15933801 -13153646 -21529311 -16697364 5854321 25107306 26639325
10291 26639325 17440916 7320666 -4963384 -21327083 -34101866 -34211964 -23171959
10284 -23171959 -11582903 -7935916 -10764889 -11506255 -5864237 -534245 -3552790 -10024601
10276 -10024601 -7757384 1897489 2571902 -11777085 -24236467 -18462971 -2564253 4665070
10268 4665070 1635364 1196333 5915972 4465746 -8006079 -22066683 -28580845 -27866642
10260 -27866642 -22254276 -12084396 -2211993 -929820 -8164048 -14210285 -13570891 -10809671
10252 -10809671 -9866687 -7987236 -4316468 -3489797 -4531733 2717118 20577896 32039293
10244 32039293 19246736 -10459664 -30071095 -25438869 -11462751 -11450472 -28203842 -42826677
10236 -42826677 -38963684 -20243412 -1925700 8259899 14544021 20833905 23010463 17222719
10228 17222719 8892423 6329679 9305994 11797855 13244016 17344483 20484472 13269940
10220 13269940 -2895798 -12248556 -5225842 6369485 4715428 -9649664 -20272424
10213 -20272424 -18655262 -13408092 -14553910 -19896373 -21425657 -16869564 -9152707 -447337
10205 -447337 7142349 9472736 5621024 2730766 8893281 21495031 28280507 21199088
10197 21199088 5302993 -7437209 -10250081 -6154801 -2675624 -3852251 -7391361 -9322986
10189 -9322986 -10185762 -13721360 -19269208 -20726519 -16472219 -14513224 -20504255 -25047786
10181 -25047786 -14010560 8775276 21547025 11722420 -8246775 -19456549 -20511150
10174 -20511150 -21706736 -23596960 -17266026 -3911737 2459918 -3820422 -9944384 -3470623
10166 -3470623 9273338 13939031 9904711 8700462 13656581 14687266 5984823 -2995802
10158 -2995802 -1561371 5558363 5857732 -978050 -3132956 2720332 3925798 -8529996
10150 -8529996 -23699613 -24892403 -13089232 -2911040 712913 6089967 14892689 16050998
10142 16050998 5131832 -6058903 -8526552 -10457755 -20224360 -27708345 -18549020 1937590
10134 1937590 16195575 19482994 19806089 17820655 7117703 -6632798 -8294053 1554556
10126 1554556 4311677 -7282503 -16824677 -11098597 -1439178 -4706159 -17266870 -23929798
10118 -23929798 -22874787 -25007543 -33678463 -40166851 -37918147 -29722600 -21311125 -16583202
10110 -16583202 -18017759 -24299807 -28856675 -26778100 -21015235 -16903365 -14714027 -13031194
10102 -13031194 -13998049 -18260139 -20194332 -16208574 -12604493 -16271228 -22495226 -22253512
10094 -22253512 -17565215 -17915266 -23552546 -24757782 -18205373 -12204334 -12765596 -14691713
10086 -14691713 -11137368 -4027021 498158 1526042 3056433 7482737 13392817 17835382
10078 17835382 17892307 11668555 751106 -8328942 -7726223 3784487 16281308 16240080
10070 16240080 2407372 -9679533 -6095827 5393015 4651120 -11049409 -20664418 -9026636
10062 -9026636 10690042 15746720 4937274 -3908895 -1998802 901135 -4736515 -13546584
10054 -13546584 -14168759 -4962340 3925616 1760651 -10698443 -20644181 -18372645 -12061598
10046 -12061598 -17761048 -32595020 -32992934 -8937399 15948632 15537478 -227244 -709547
10038 -709547 18451783 30253964 18984418 1635637 -1659570 3808385 1607078 -9828588
10030 -9828588 -20686946 -27760180 -33688222 -35029499 -25164663 -7189786 5967206 4274964
10022 4274964 -11534199 -32624622 -48428702 -52785278 -47059487 -36024985 -21475683
10015 -21475683 -4210378 9692732 12681128 6052097 -1480769 -5423635 -6761622 -2820213
10007 -2820213 10239506 24258251 23293879 6837438 -4733011 3885130 23127950 33656412
9999 33656412 30522585 22389937 16464425 15389075 21066189 29897125 30532570 17654726
9991 17654726 2574958 -1065726 2821946 -692485 -14306141 -24406828 -20682212 -9750293
9983 -9750293 -6629279 -17793992 -33427064 -34899168 -14270162 11479622 14596019 -8997698
9975 -8997698 -30340928 -23749903 -1994861 1830480 -19098380 -38564205 -37638268 -28998522
9967 -28998522 -31720074 -40688652 -37383027 -20261517 -6162848 -4469198 -6676253 -4720347
9959 -4720347 -5415959 -17663895 -34127264 -38070784 -26619738 -15399759 -16897888 -24371354
9951 -24371354 -24048169 -14994454 -6772491 -3093532 -590151 -1480972 -12698975 -29993202
9943 -29993202 -36892695 -25769167 -8889000 -1688645 -4865108 -9952177 -12515219 -11323719
9935 -11323719 -3882786 7414971 12771077 8290597 3863566 8071716 14387744 13968506
9927 13968506 12343777 18354613 24787262 17933043 1303020 -8911121 -9249002 -10722331
9919 -10722331 -16364074 -17519592 -13962653 -16106480 -22269174 -15902158 5075038 17330950
9911 17330950 4947846 -14235331 -12733303 8669925 25474871 23579367 10977835
9904 10977835 289508 -3766015 -1294985 4552805 7104984 4234474 3551463 9748725
9896 9748725 13912388 8942282 6624172 18745996 27061110 -184567 -58151192 -100273822
9888 -100273822 -95841746 -67839315 -55100783 -59189072 -54831284 -36901506 -24491944
9881 -24491944 -23674666 -18960256 -5550582 -403312 -11231945 -20716172 -16225799 -12278709
9873 -12278709 -24160493 -38087832 -31299777 -9195201 2998859 -941953 -3058197 6291244
9865 6291244 14873356 11838861 4086770 1847176 3672884 3621624 1250560 -1782367 -4767257
9856 -4767257 -4064849 2549810 5927654 -5465322 -23317483 -23298967 1730557 28622938
9848 28622938 33387109 18601798 1286433 -10854771 -18169534 -18786425 -14999249 -17723505
9840 -17723505 -29201973 -33176838 -18674802 -1114405 -207885 -8333502 -4322824 9669710
9832 9669710 11867581 -1786395 -11933376 -10011279 -11147818 -24759434 -36406882 -31738851
9824 -31738851 -19329744 -14853765 -16848921 -13467641 -3646479 2626001 -168442 -7877899
9816 -7877899 -13365893 -11687200 -3263035 3385926 -1408564 -14109426 -18255316 -4747203
9808 -4747203 15523756 25123919 18933299 4063701 -10791437 -18789167 -15418696 -4346645
9800 -4346645 2237211 -3393969 -15355400 -23632478 -26853195 -29042694 -30032105 -27650588
9792 -27650588 -24713190 -24744582 -23824730 -15610499 -2993441 3425172 -1540829 -12466666
9784 -12466666 -21002464 -22897483 -17628047 -7332863 2371982 5566801 2775242 1564831
9776 1564831 7408778 15197046 13483172 -960107 -15535016 -13890729 4160020 21524664
9768 21524664 25722436 23544392 26408185 29803517 21119214 3451672 -5683081 -600041
9760 -600041 5071931 2706008 3143332 15900342 28524303 22525848 1578327 -12248388
9752 -12248388 -7003159 8385835 20639175 26223053 27100826 23709268 17307603 12646407
9744 12646407 13114463 16074578 16402553 13651364 13431311 20494833 30775764 33466802
9736 33466802 24137375 12669329 12067367 21310819 27309095 23021435 13755468 5005540
9728 5005540 -3855419 -10642047 -8469445 690877 3323615 -5932820 -13924996 -8908986
9720 -8908986 1014544 2475841 -1447578 -546581 866221 -8198658 -20960389 -18531074
9712 -18531074 -815290 9577404 -38075 -14685815 -15763346 -6884920 -3281271 -7005478
9704 -7005478 -7310947 -103803 6698463 6859732 4497402 6223689 10761695 10537671 1943904
9695 1943904 -9284365 -14630932 -13305276 -12194450 -14584821 -15075371 -10195523 -7598061
9687 -7598061 -15815132 -28794228 -32013396 -23596319 -17296039 -21351793 -25790961 -17423430
9679 -17423430 1263423 16542709 21010278 18127234 12757614 6206301 479541 -136770
9671 -136770 5589077 12808419 14845882 8446215 -5289222 -21792961 -33572880 -33464263
9663 -33464263 -21145178 -5558346 2602341 1165589 -3749374 -8142483 -14636629 -23633849
9655 -23633849 -27013653 -18996793 -8837669 -10596816 -20536825 -18943164 499188 17486798
9647 17486798 12121454 -6352668 -13255107 -4052124 2072988 -6391731 -16786930 -13270263
9639 -13270263 602383 10744439 14079484 18646967 26486571 28875896 20092584 6698146
9631 6698146 -1499301 -4018018 -6934558 -10136238 -5653938 8510882 20288452 17094686
9623 17094686 4099485 -825208 9123879 20806331 19272453 5497787 -9094785 -16860063
9615 -16860063 -15720848 -5371865 8920218 15644853 10800129 6973081 17356878 34925121
9607 34925121 40069243 26896172 9367935 1682951 4677461 12282185 19164668 19604405
9599 19604405 10243416 -2365055 -6634024 -1341658 3448780 3198658 5125543 13204012
9591 13204012 18982891 15044952 7322447 4095527 612747 -13343279 -34029279 -43562981
9583 -43562981 -30780181 -5022343 13444645 12932854 -1340492 -15525068 -20949736 -19255262
9575 -19255262 -15677666 -11318744 -4587209 3047789 7718942 8351441 6549703 2299709
9567 2299709 -5186710 -12765252 -14601993 -8736371 900341 8176899 7623649 -3160456
9559 -3160456 -19139087 -29343306 -28620352 -24164681 -23942522 -24123642 -17443031 -8522645
9551 -8522645 -7665288 -12270229 -9619664 1272418 6006906 -3273151 -16325497 -20838989
9543 -20838989 -17735568 -14017566 -11500210 -10105045 -12912946 -20129100 -25208803 -23223364
9535 -23223364 -16465469 -7352597 5925557 21477748 30051864 25860157 14207178 2832726
9527 2832726 -7426097 -18088076 -26164344 -27729374 -23417402 -16759980 -11761223 -12580722
9519 -12580722 -18420809 -19667257 -9309264 3170286 3032410 -5264857 -2832079 11901762
9511 11901762 17354844 2514152 -14862414 -16225737 -8493296 -6491253 -7600137 -3451528
9503 -3451528 -1458915 -12471111 -28155095 -32829223 -29025541 -29290180 -30579553 -21058559
9495 -21058559 -7312880 -8634582 -24015736 -29927330 -15755237 786556 1489412 -7850064
9487 -7850064 -10690502 -2938047 7744275 15612019 19911029 20075630 15134478 5834607
9479 5834607 -4586811 -9815001 -3816150 9876338 17027724 9084933 -4276037 -9137003
9471 -9137003 -8304776 -14721416 -27629807 -31493259 -19346841 -2470310 6128448 5650456
9463 5650456 2125796 -213554 87421 239123 -7338474 -24440480 -37731279 -32033811
9455 -32033811 -11854002 3463156 5412021 2883836 2952877 1126013 -6062985 -13555272
9447 -13555272 -17652640 -20997862 -23937275 -22728494 -18966433 -18494569 -19155722 -13291302
9439 -13291302 -4202838 -4683034 -16067897 -24995458 -25239248 -25498052 -29384833 -25783274
9431 -25783274 -8678385 9468628 15202311 11556642 7950551 5389862 1583040 -1599915
9423 -1599915 -5290735 -15855749 -31120349 -37843268 -31911521 -25825062 -25820302 -19054623
9415 -19054623 2291412 21548768 20406590 6475189 -1753745 -3940317 -9607606 -12985915
9407 -12985915 -2936104 8868128 -1339052 -30207295 -45831586 -31332833 -6761575
9400 -6761575 1382830 -6995280 -14406667 -12015986 -4168083 3452412 8457374 9622647
9392 9622647 8015084 6939119 6779090 4134130 -1979696 -8886711 -16408613 -26569902
9384 -26569902 -35037988 -31788263 -15045374 2691040 7943273 246311 -11129544 -18298799
9376 -18298799 -17967618 -10118563 -266867 1856944 -6488288 -14369170 -9772320 2960607
9368 2960607 7553163 -1615094 -11373877 -8818651 781242 3954866 57655 -574904
9360 -574904 2751270 -2132280 -18443083 -29911530 -22152196 -4022892 4731055 -120356
9352 -120356 -6413548 -6130085 -3218245 -3541935 -9237344 -20278030 -30263309 -26255979 -7147223
9343 -7147223 4954403 -8842755 -32313044 -33278820 -11768050 919251 -6221216 -8132638
9335 -8132638 8604710 17965210 -2823022 -32998044 -40166031 -28992929 -25329084 -29836305
9327 -29836305 -23417025 -7605397 -2565832 -9227561 -8633832 1151496 1731845 -8445510
9319 -8445510 -7725335 8614614 13944866 -8298824 -35404137 -37075546 -16448954 583218
9311 583218 2374976 -2135482 -4638642 -5959114 -6747430 -4384700 730422 4863377 6813025
9302 6813025 8750915 12437677 17847853 23519535 26657314 25529007 21784553 17247445
9294 17247445 10533690 1533701 -4601140 -4944818 -5810905 -13199368 -20815077 -18719640
9286 -18719640 -9673724 -3909186 -1298990 6389425 17846417 23049441 21062616 20634098
9278 20634098 22965687 20680688 14286226 11769729 11070615 2505384 -9812748 -10879749
9270 -10879749 -2663091 -4990631 -21694354 -31072571 -21021130 -8547757 -9565064 -13756838
9262 -13756838 -8295151 -3355231 -10502305 -15733616 -1795695 17649232 16313971 -1620510
9254 -1620510 -7659268 5281271 13845785 3764756 -9531037 -8534881 828040 3558814
9246 3558814 -1074295 -3756932 -2102746 -1329336 -3541760 -5554530 -5030204 -3026713 -1528648
9237 -1528648 -1446611 -2393375 -3408861 -4216324 -5112822 -5725750 -6186191 -8770101 -13719165
9228 -13719165 -14375612 -4243637 10539826 15678740 8262953 924031 2333834 5733219
9220 5733219 3206558 -1350006 -2058527 -1567679 -2243791 424076 5048078 -832771 -19694539
9211 -19694539 -32260447 -23548867 -7232902 -4715551 -12792603 -15010014 -13725001 -23056078
9203 -23056078 -36702145 -33652654 -15722430 -8857720 -21855028 -32595355 -24913154 -12424159
9195 -12424159 -11744247 -15234272 -7980420 5959777 12821754 11821123 11180799 10851648
9187 10851648 5332930 -2532257 -4672917 -827239 2431830 2093460 -458462 -4594800
9179 -4594800 -8635317 -7530081 473001 9313617 13138855 13367442 12390348 7349146 -2993322
9170 -2993322 -12170954 -14617837 -14298689 -17143299 -21164291 -22550598 -25354926 -34667169
9162 -34667169 -44162248 -41586390 -25850786 -9325507 -2514266 -4176904 -8037747 -12278240
9154 -12278240 -18506806 -25000437 -25958546 -19079954 -11811077 -15353074 -30079808 -41798781
9146 -41798781 -38252551 -25133697 -17221216 -16950586 -13638260 -3471796 3787941 1819954
9138 1819954 -1907311 372614 4340361 3065402 -609257 57681 5133703 11118560
9130 11118560 17030948 20237945 15010884 3569152 -499309 10348481 25017504 28597398
9122 28597398 21218675 11332045 -64221 -14389132 -22938999 -15987665 329763 11744050
9114 11744050 15842199 18278311 14618012 -3479612 -25813585 -30181552 -14895232 -3261174
9106 -3261174 -9151945 -19191390 -18887920 -15302205 -18579627 -19451780 -5597264 12164695
9098 12164695 12687117 -2679184 -11979059 -5867606 1924456 189409 -3026203 2878695
9090 2878695 12817886 15098077 8464690 -573362 -10142063 -21588998 -29568231 -24537022
9082 -24537022 -5883717 14506173 23360619 17265559 3899189 -4017921 1981429 17307824
9074 17307824 25638020 14794746 -8592846 -25620160 -26025212 -16113178 -5736157 3403058
9066 3403058 12410774 17053728 13119799 4877226 -165589 -1888593 -4925821 -8023409
9058 -8023409 -5454009 1421344 3757702 -1702015 -7852260 -8511919 -6420634 -6073267 -6271264
9049 -6271264 -4828270 -3666230 -3517719 -481671 5246294 4329600 -8372753 -20863032
9041 -20863032 -16677799 1194951 11901330 4308274 -8916391 -10143693 527360 9807524
9033 9807524 11108487 9233023 8465194 7342250 6473204 11331061 22183667 28698917
9025 28698917 21901799 7200443 -2369280 -3403821 -3645079 -6693408 -6080008 1514314
9017 1514314 7475787 3689076 -3901598 -4085192 2545389 6190823 3776242 179810
9009 179810 -4202064 -13073167 -20851956 -14890861 4312055 18892201 16309746 4167548
9001 4167548 -4325511 -6564050 -3836207 6857403 21424339 22746564 3290672 -16679645
8993 -16679645 -13172907 6106942 11739820 -5226516 -23516758 -25029711 -15635606 -7558063
8985 -7558063 -2473138 -1360127 -11764711 -32045118 -43475819 -32433820 -9319718 7542471
8977 7542471 15930301 23519902 27928755 20591713 5402580 -3604785 -2093354 1287197
8969 1287197 1111985 1247773 3537474 2963588 -2570655 -7654342 -8284647 -7487529 -8918543
8960 -8918543 -11635187 -13905631 -16251760 -18442878 -18523545 -16116570 -12153241 -5854743 2261461
8951 2261461 5907903 -308539 -10352187 -12715671 -7999527 -9300389 -20981262 -28497333
8943 -28497333 -17640682 4409579 17257970 11886970 -2169178 -11595948 -12441333 -9089314
8935 -9089314 -7831246 -12630477 -21544729 -25924747 -17912215 -714935 12255177 11173091
8927 11173091 838112 -4604127 2404395 14392000 17694950 8405600 -3746041 -8196762
8919 -8196762 -5996786 -6017488 -12630967 -22901711 -33067078 -40022900 -37976484 -23627630
8911 -23627630 -5969174 -441310 -9515758 -19105483 -19122225 -16048718 -16853279 -12759643
8903 -12759643 6413383 29603836 34076171 16423835 -2387878 -5482135 1280046 4588635
8895 4588635 4069716 7472010 14160124 14923238 5743161 -6791727 -14038290 -14028654 -11081220
8886 -11081220 -10142265 -12727704 -17015438 -20260722 -19896928 -13383151 -1275994 8172257
8878 8172257 3746499 -14029762 -28386058 -24683272 -9709027 -3056730 -11238401 -21006925
8870 -21006925 -18405125 -3729999 13799927 25739312 26647938 17176205 7775674 9130197
8862 9130197 16513760 15133127 3399624 -3503881 1727960 6420217 -512942 -10535683
8854 -10535683 -11520906 -7684486 -8321101 -8921119 -1032321 9042790 10468123 8642192
8846 8642192 14929221 22005415 13378251 -4828140 -7813610 8509363 17973883 3888106
8838 3888106 -14915148 -13130951 4156632 12542115 4253742 -6734724 -9635063 -8041050
8830 -8041050 -6297094 -532865 11678184 22664453 22320933 10806497 -817593 -2351053
8822 -2351053 4979245 10969831 9182418 3848082 1550457 793340 -3467417 -8400772
8814 -8400772 -6277238 1559822 4322106 -2368249 -10017279 -9989420 -3627697 3739690 9294376
8805 9294376 9147855 -1163810 -16425161 -21942958 -11665936 2523148 7202494 4134937
8797 4134937 2057806 1285399 -2230428 -5321923 -2920073 799669 -121069 557334 12768829
8788 12768829 29576427 31451526 13928145 -3656638 -3518868 7975721 11708104 1851836
8780 1851836 -9481502 -10212361 -1533559 7487912 11266138 9763827 3517724 -6791011
8772 -6791011 -15243292 -11894169 5441807 24312849 29730211 21731093 13180331 10842159
8764 10842159 8582723 1245959 -5788631 -6430284 -3838890 -3493371 -3932146 -1444698 2942019
8755 2942019 7630976 13848131 18232228 11683491 -5362757 -16687478 -11181605 -475789
8747 -475789 -1329801 -9268027 -7959675 1087076 -87867 -14926463 -24448510 -16030241
8739 -16030241 -1653756 1624052 -5085575 -9244701 -6216214 -1353679 370125 -1886698
8731 -1886698 -7115813 -12595877 -15242469 -15637599 -16154286 -14522709 -6617603 3623491
8723 3623491 6502281 815888 -4456670 -5725812 -10610859 -23083642 -34180790 -34826688
8715 -34826688 -28106806 -21209684 -14722058 -8304579 -7365968 -13659678 -17233106 -9155044
8707 -9155044 3833905 8741587 5250355 3225499 4890480 2346389 -7382226 -16079875
8699 -16079875 -15282440 -5833152 4918877 9835190 6110407 -2021898 -5714996 -1310125
8691 -1310125 4970440 7243123 10051561 20071758 31832642 32348825 18734521 1060007
8683 1060007 -11896484 -19360275 -20990839 -14746867 -5544543 -4514069 -13512565 -19732624
8675 -19732624 -13190759 -2098056 -2041440 -14684089 -26391724 -26251540 -17329112 -9522283
8667 -9522283 -7754241 -9575528 -10388716 -8069056 -3855853 -843961 -1785510 -7346217 -15347761
8658 -15347761 -21350413 -21175758 -14172076 -3582120 6678927 13847128 14455961 4996974
8650 4996974 -11633280 -23851140 -21940230 -10003948 -1292164 -1739389 -4712138 -3078745
8642 -3078745 657439 -528473 -8510934 -18992789 -25832261 -23752498 -11594972 4074520
8634 4074520 13285186 13440075 10812932 9144402 4147882 -6351182 -15118630 -15478392
8626 -15478392 -11326638 -8858887 -5625773 1438857 3885200 -7947403 -25819391 -30553946
8618 -30553946 -18429772 -5380696 -2623707 -3793734 -1122616 1660576 946429 2945710
8610 2945710 10511162 13060981 3136932 -7471993 -3278660 11150951 18944896 16676873
8602 16676873 15483247 19536337 20782789 15460981 9846962 7266174 3874491 493989
8594 493989 4747185 16812577 25571232 24320265 19441353 18431692 19674243 19122412
8586 19122412 17358450 15132822 10917171 6551682 5905307 5769187 -301696 -7187969
8578 -7187969 -2115571 12577104 17469627 4158375 -11727227 -15083190 -11295075 -9730209
8570 -9730209 -5968671 3105602 4148744 -11762173 -27300684 -21217733 -1773336 6272902
8562 6272902 -246121 -3039551 5215651 14564361 20644274 27710337 30288536 18760764
8554 18760764 3678818 6286245 21948086 22835621 3265376 -9105323 1437682 13934372
8546 13934372 8514454 -1071822 3954280 12084667 3195356 -13956978 -16621886 -7461046
8538 -7461046 -8287741 -21594531 -27599371 -17314515 -2326231 8303856 16626411 19899090
8530 19899090 9897372 -6948725 -9960909 7463148 26557510 27495783 11388360 -7258651
8522 -7258651 -16661934 -11602473 5192780 19851623 17816324 2456426 -8578569 -8616170
8514 -8616170 -8597775 -13860122 -12490107 2538971 16023712 10661370 -6993757 -16929660
8506 -16929660 -13951381 -8926890 -6904513 -1567685 8630230 14401619 9474107 -620068
8498 -620068 -7502236 -9196327 -7291884 -2522219 3230513 6330057 5593277 2623838 -2568958
8489 -2568958 -10246256 -15216020 -11014999 -1989062 -1572497 -13234732 -22076900 -13646475
8481 -13646475 5558043 16328266 11606382 2735973 2179497 9993391 18480922 21502180
8473 21502180 16687542 5337628 -7335018 -16966618 -25260546 -34250474 -37124947 -25373611
8465 -25373611 -5643023 3771129 -2483881 -9593623 -7048791 -4959095 -13551778 -21264281
8457 -21264281 -12444955 3072436 1352952 -17931211 -29054070 -18273387 -1837308
8450 -1837308 1560935 -3962488 -5509325 -3867741 -7132413 -13867090 -17908508 -21672791
8442 -21672791 -29851385 -35538475 -27473110 -8955533 3532683 1033129 -8795449 -14452185
8434 -14452185 -14118130 -14104458 -19106636 -26178232 -26927486 -16922348 -3520491 305341
8426 305341 -7957765 -16693900 -16060779 -9945471 -6272644 -3596411 3347884 10607335 8583573
8417 8583573 -3416272 -15415191 -18784711 -12921744 -1707517 9120273 12141865 3525752
8409 3525752 -10722703 -18573276 -12818491 3514860 19818724 24009837 11387817 -8420864
8401 -8420864 -18580540 -13578148 -5077943 -5282303 -12247028 -17339347 -18104762 -15734019
8393 -15734019 -8969568 -182715 1786871 -4167337 -4604830 7625446 16836344 6717182
8385 6717182 -10704172 -11134638 2899543 5765696 -8369853 -14939085 661049 18493301
8377 18493301 15044256 -1659102 -6576824 6141710 19897905 20746334 9958289 -3799268
8369 -3799268 -12020621 -9477603 84753 4724306 -1336312 -9078019 -8035904 -1759777
8361 -1759777 -603458 -5215217 -8060666 -6871448 -5385952 -3906669 -524829 103208
8353 103208 -9128375 -24698792 -34326852 -33548441 -30604216 -32181356 -33790857 -29099801
8345 -29099801 -21020191 -16841701 -16853564 -14282428 -4886853 8031577 17443578 18203107
8337 18203107 9854076 -2804567 -12091776 -13282225 -8602972 -3461003 915009 7704876
8329 7704876 16895283 22439331 20588027 16745154 17920963 21225393 18136031 9292080
8321 9292080 4559585 6170424 3862100 -6611469 -12387537 -2937587 9061981 3168339
8313 3168339 -16771806 -25041641 -10726155 6214982 3736887 -12036774 -17959648 -6486411
8305 -6486411 6950462 7149323 -2038411 -5331836 3816587 15470979 15313809 2086822
8297 2086822 -10304666 -9606908 -75928 4489952 -586533 -6930785 -7018574 -3179008 -981213
8288 -981213 -1818803 -5199942 -11106731 -16260149 -14568043 -5457829 3811738 7503109 6869217
8279 6869217 3052838 -7275446 -22754509 -30966410 -20859954 967529 14854917 9513820
8271 9513820 -6432748 -15115537 -8222360 5461388 9601429 -2511437 -20132783 -26025372
8263 -26025372 -14768209 3515130 17615980 27086411 36117560 41538416 35031400 17122806
8255 17122806 1577636 794529 9558598 10108188 -4793249 -21039734 -22367779 -14314893
8247 -14314893 -15956852 -29066131 -32990234 -16482101 3109223 5407367 -3677473 -6067605
8239 -6067605 -2293645 -5712505 -14347132 -14253539 -8159781 -14123966 -33455057 -45541821
8231 -45541821 -39817016 -28178180 -19114584 -6023639 8482502 4879695 -19538501 -34722769
8223 -34722769 -17968793 10689383 17586883 2707029 -8788397 -8688409 -9858654 -15535177
8215 -15535177 -14004743 -3457129 3338946 1860932 1795790 6503124 5539713 -7117064
8207 -7117064 -22714881 -30442988 -28590634 -20594847 -10907618 -5604314 -6939039 -8597347
8199 -8597347 -6343903 -8504627 -22476391 -36651474 -33433945 -16573746 -5662441 -5008295
8191 -5008295 -243273 12222778 16424809 5056426 -5693121 -1455900 8455701 8383713
8183 8383713 609436 -2888763 -1716306 -4303998 -10687348 -12542904 -7643582 -3079049
8175 -3079049 -4699910 -10576266 -14378731 -11508532 -3943370 -398278 -7171456 -18216529
8167 -18216529 -21096705 -13679650 -6409660 -6530546 -10212154 -13014799 -16516875 -19596874
8159 -19596874 -15032442 -2108519 8150001 8724079 7414800 12306819 16253062 8305972
8151 8305972 -6122919 -10041240 2527960 19628893 26344471 18560810 2969721 -9477486
8143 -9477486 -10872786 -2558796 6933716 12764800 17988271 23573635 22163499 9333962
8135 9333962 -5764490 -10908201 -7256719 -5000637 -6248875 -3885644 3832544 9415490
8127 9415490 8362249 5044570 3721846 2592600 230342 -18649 3422328 5677309
8119 5677309 1993968 -5557253 -11767739 -14411910 -13310362 -8069490 -1146951 1144544
8111 1144544 -4007990 -10932057 -13261985 -12960709 -14267876 -12274014 918920 18127163
8103 18127163 19237681 -1382183 -22286855 -22551895 -12142526 -16335874 -34513544 -38037407
8095 -38037407 -13998448 12302534 12382455 -6556025 -16706220 -9808946 371675 6997037
8087 6997037 15849725 23763519 16993724 -3937369 -20011667 -22062979 -23229137 -33397305
8079 -33397305 -40751275 -32305532 -15849811 -5073946 3212702 18238120 31924124 27440432
8071 27440432 7281035 -6296485 182530 16887049 26204488 21220890 7686247 -2477820
8063 -2477820 814202 15303860 24283637 13771225 -9226299 -24513244 -22933466 -12623270
8055 -12623270 -2785982 6337365 15941884 22734618 24122964 20787802 12211666 -1730891
8047 -1730891 -13942548 -15229360 -8007461 -3783508 -4482072 876662 15869407 26895207
8039 26895207 23082900 14208002 16228564 27230726 31636548 23537811 11779072 3609948
8031 3609948 -2845732 -8383728 -7707579 790524 10013882 14382914 17106174 21106008
8023 21106008 19678073 4599399 -19784403 -38419051 -40896474 -29565557 -13645765
8016 -13645765 -1394285 2215059 -2973324 -10609956 -12670256 -8563370 -5269726 -6504037
8008 -6504037 -7510493 -4422824 -2139346 -5318844 -6469528 5864884 27378039 38203834
8000 38203834 27370075 7694513 -669272 5678044 14406299 17229235 17564454 19576472
7992 19576472 20639880 17786814 13218919 8753242 1251931 -10751516 -20576878 -20142384
7984 -20142384 -11013012 -2777882 -1204085 -3275006 -3875652 -2095182 254171 1683999
7976 1683999 706001 -3288220 -6321743 -1214967 13292117 27617099 30027385 18922909
7968 18922909 3008629 -8605021 -12147146 -7769785 640661 4695862 -1765837 -13300574
7960 -13300574 -17200988 -10102378 -3197500 -6451456 -14450795 -14516977 -3759104 9290852
7952 9290852 16389440 15545755 8196497 -1683053 -7130597 -4251606 1946986 3905982
7944 3905982 1782835 527025 -420684 -5172505 -10682815 -8889388 -375520 4851561
7936 4851561 2387140 -1424333 -2395335 -5126541 -11603816 -14461124 -9209888 -3399963
7928 -3399963 -4788230 -9075268 -9315147 -9444334 -16241949 -23686326 -19420482 -4956220
7920 -4956220 4022125 -1170494 -12282878 -18241693 -18884499 -19599641 -20468225 -17846869 -12618770
7911 -12618770 -10080973 -11884198 -12429604 -5384825 7163350 14872052 11209424 3636972
7903 3636972 5766775 18455596 26822623 20768752 9699235 7491155 9976504 1516770
7895 1516770 -18095532 -29218795 -18983334 1240026 12741925 13004332 12159105 14158837
7887 14158837 14408670 12596629 14413289 19258448 17987282 7415704 -2397543 -1979585
7879 -1979585 3827459 4373275 61112 129317 5855455 8055778 3025923 -1288832 -513707
7870 -513707 -3273518 -15426018 -24928471 -17135771 259306 4635258 -9398669 -22244029
7862 -22244029 -17890795 -4453897 1486399 -2983868 -10942636 -19406799 -26494327 -24450227
7854 -24450227 -10122918 3962397 3785796 -5064152 -5217377 6285731 15250002 13278326
7846 13278326 7210341 3112873 -3090415 -12947057 -17667223 -11822963 -3844549 -3393449
7838 -3393449 -7126612 -6771688 -3850397 -5488690 -10713825 -12195289 -9312032 -9132820 -14584210
7829 -14584210 -20408850 -21637829 -18460944 -11642355 -935981 9156889 9528271 -1902625
7821 -1902625 -13307449 -10846145 3480112 12500000 4454312 -12450993 -20777018 -15831377
7813 -15831377 -9793046 -13539689 -22171174 -23256348 -13650701 -1072433 7714492 12260779
7805 12260779 13166572 9874598 4887054 2737367 2626610 -1117327 -8856851 -13187958
7797 -13187958 -10342426 -6907226 -9887919 -16083805 -17325522 -11349800 -1744910 7634917
7789 7634917 11708998 3635658 -15439708 -30030299 -24289627 -1342139 20361884 28436592
7781 28436592 24317069 11682844 -8598094 -29020267 -35368489 -24156053 -9525294
7774 -9525294 -4206746 -3253658 3526246 12584742 13173957 5826473 -621520 -6059847 -16842932
7765 -16842932 -28366268 -28071813 -18127738 -16623545 -29746382 -40575968 -35707138 -25946670
7757 -25946670 -25863026 -27936939 -17126307 -847872 -491599 -15876985 -21868797 -4225332
7749 -4225332 21542080 34268582 32568792 26717816 20347428 12717947 8575181 12906905
7741 12906905 21868333 28292001 30419182 27955351 17862436 3452154 -898719 13260245
7733 13260245 31955439 32253550 10494213 -13565555 -20040670 -7840749 8355695 12615235
7725 12615235 1213970 -12251600 -9274899 10036658 23425227 15573976 1044591
7718 1044591 3440695 19844572 26097192 14360723 2969692 6139806 15644189 19899214
7710 19899214 21272586 23654189 20540077 9050842 1131462 5921290 13115900 9261261
7702 9261261 -229910 -2153430 673036 -4266122 -14953326 -17047798 -8451502 -2298725
7694 -2298725 -4224312 -4890802 1011375 5082049 610883 -6747604 -10446235 -12060347
7686 -12060347 -11536737 -1516316 18685978 34204346 31121293 14499066 -61941 -6066085
7678 -6066085 -7373760 -6695938 -4931984 -7788992 -20361697 -35711147 -39552380 -27669266
7670 -27669266 -10900231 -1854824 -2803649 -6891799 -6150011 1129499 7125094 1556530
7662 1556530 -13808731 -23545163 -18190347 -8148665 -7654514 -12251740 -7092401 7306159
7654 7306159 16031335 15692772 19234781 30822195 35881033 24936557 9679337 3625432
7646 3625432 1989145 -5764385 -16354744 -20511927 -19935305 -21423545 -22534101 -17783092
7638 -17783092 -11948756 -13064457 -18648417 -21781057 -22926708 -22539573 -12600041 7613187
7630 7613187 18444972 4026247 -19386424 -23900861 -12393033 -12262543 -29173776 -38188914
7622 -38188914 -25269475 -7069618 171178 3110173 9642363 11039370 2148496 -3534775
7614 -3534775 3101619 8983564 2310619 -5566643 -1437390 4931238 -764145 -10056958
7606 -10056958 -6293951 6585279 13127824 12398063 11487308 4950433 -13046109 -25966164
7598 -25966164 -13480249 12578961 20260171 4007225 -9442059 -3186981 9499930
7591 9499930 11775214 4771046 -4260304 -12815874 -15479135 -6520939 4073142 -959347
7583 -959347 -15957997 -15023393 6395785 18834267 2064473 -23657495 -29152197 -18269893
7575 -18269893 -14756602 -22667166 -25936497 -19040382 -12816220 -11966225 -9057552 -2913728
7567 -2913728 -4020114 -16147921 -27209764 -25862570 -17248878 -14281608 -18984464 -20211925
7559 -20211925 -8855661 10190877 23526897 24321052 17838314 11582042 5897868 -1101588
7551 -1101588 -5258422 -1930987 3452817 1146062 -7392103 -10951982 -6305362 -2548016
7543 -2548016 -5190900 -8254671 -6882746 -5839027 -8811083 -10272628 -6307637 -4100245
7535 -4100245 -11194966 -22597396 -28019585 -26244686 -22853773 -17905816 -6027604 11551200
7527 11551200 22890301 16636226 -3955717 -20238662 -15179760 6245237 19225575
7520 19225575 8381541 -11732675 -17051304 -8683087 -8836461 -23261227 -30211187 -13971567
7512 -13971567 11179069 22983343 20426949 16008895 12350558 3656596 -8211273 -15384557
7504 -15384557 -16474954 -14254688 -6495745 7984583 19528331 17429639 5963368 -1794322
7496 -1794322 -2857300 -4565507 -8524845 -7609709 601777 8801467 10419349 6595787
7488 6595787 1015039 -5039234 -10328108 -11582430 -6549689 2149331 6753070 -327396
7480 -327396 -17163362 -30015278 -27339485 -15150810 -9257780 -13086569 -16095355 -15174549
7472 -15174549 -20795280 -35933608 -46009731 -39804998 -25074445 -12306275 1258004
7465 1258004 18066493 26906743 20098575 9900519 9161653 8947567 -3568045 -17510844
7457 -17510844 -13683743 1416984 4370893 -6996649 -12547007 -6442994 -5692633 -16896380
7449 -16896380 -22060493 -8615259 9168779 12368573 3130099 -5743797 -12303926 -21554689
7441 -21554689 -30101581 -29227360 -18655135 -6966310 -1135727 -1829409 -5311831 -5339387
7433 -5339387 2780600 16368017 27338939 31804868 33103601 34337978 33616656 28246063
7425 28246063 18712353 7621747 -1157567 -3197850 1844389 7961006 10021697 10386981
7417 10386981 13231568 16863007 17928478 17699368 17255856 13561601 8145497 9860986
7409 9860986 18486342 17943847 1304089 -10601731 2418433 23252765 16882700 -18011612
7401 -18011612 -46693555 -48482344 -38183984 -31158627 -19240473 3485469 19009170
7394 19009170 11247838 -6153674 -10024201 -1542321 1505991 -3869567 -3928160 6469331
7386 6469331 15480087 12541286 2419692 -1932825 5490894 17104398 19297585 8846532
7378 8846532 -941382 2152846 9524935 3272672 -14086788 -19482596 -2195391 21634931
7370 21634931 33614591 33460597 26543831 11312328 -8099300 -15493292 -5014028 5758115
7362 5758115 1741690 -5849845 -568575 8789583 2206826 -16378455 -23177528 -11069111
7354 -11069111 1401622 14704 -5766947 87438 17216293 30358056 27134377 10614096
7346 10614096 -2819771 873409 17358408 28134200 23612890 13739969 10605346 11416472
7338 11416472 7790445 1486464 -841201 96661 1320373 6751919 18603821 27506608
7330 27506608 24690317 16532291 13110687 10377030 -364179 -12719221 -13235009 -4057578
7322 -4057578 1310994 1455870 6432463 14914820 12682733 -3249650 -17703631 -19523049
7314 -19523049 -14569903 -11273355 -8456245 -4435045 -4856237 -12852728 -20777852 -19318015
7306 -19318015 -8837519 2607339 7262193 2386172 -6830017 -9459237 -897845 9694134
7298 9694134 12656580 13750767 23555450 34932623 29509037 7979147 -5589920 3340112
7290 3340112 19643079 21328226 8193879 -4444167 -9353624 -10642491 -10186584 -4929069
7282 -4929069 3582348 7523905 2262534 -8019410 -14956153 -13665525 -6546401 -741616
7274 -741616 -407057 -2085218 -875787 833925 -2965540 -10640367 -13779537 -10586570 -9619754
7265 -9619754 -16676878 -25695685 -27548581 -21810798 -14730712 -10284406 -8415703 -9136358
7257 -9136358 -13776282 -22691569 -33015263 -37902477 -30039911 -10120118 9595563 15892787
7249 15892787 8733662 -263152 -2506323 597718 4565129 8170961 11693746 15033875
7241 15033875 18673241 21673511 19840413 11935789 5353017 7275556 12388427 9959996
7233 9959996 1869958 303808 5896429 3236841 -15198878 -33950808 -34005271 -18238601
7225 -18238601 -5846051 -6769608 -13305079 -15465322 -13872869 -14412702 -16757612 -13609622
7217 -13609622 -792134 15042463 21367853 12456575 -5633965 -23136293 -34682467
7210 -34682467 -37183515 -27269792 -8210638 6187120 4402271 -8359459 -16895881 -14491264
7202 -14491264 -6273079 1805539 6389938 2354445 -12070245 -26671209 -28220001 -17824630
7194 -17824630 -7477292 -1090024 6627744 13723451 11093528 1036492 -2342127 4302625
7186 4302625 8473783 5117057 5903286 16142760 21367472 10404519 -3834665 -2061733
7178 -2061733 14463355 29047925 31872518 24095076 9243562 -5924193 -10059793 143246
7170 143246 12289142 13729096 6999200 520424 -5436283 -11866351 -11468415 -382625
7162 -382625 10023311 7838438 -1648837 -7120703 -9735749 -13782023 -9631353 12829844
7154 12829844 40695670 50226693 39253389 26415877 20605380 13439325 2340425 -1994476
7146 -1994476 3780591 7290639 -406014 -13056681 -22153752 -27018903 -27219292 -19448008
7138 -19448008 -7228228 -485393 -881673 -48210 4793861 7360485 6801721 9770191
7130 9770191 14582369 10836852 297689 -456744 13236241 22975049 14393636 -1153069
7122 -1153069 -5697783 -823638 1044576 -352084 3684902 11921229 14143539 7777481
7114 7777481 240376 -3571470 -5805916 -8891757 -11600817 -10605693 -3055640 7600308
7106 7600308 8105842 -11158153 -36776123 -41914862 -22162633 -4296342 -8136277 -18528956
7098 -18528956 -12479346 3752174 8555290 2798427 5384092 17033493 17689462 976190
7090 976190 -15367782 -18672851 -17678482 -22401647 -28219629 -28697383 -26400980 -22234371 -10502688
7081 -10502688 6738880 16423758 14577287 13695692 20043975 20093975 2707656 -19707453
7073 -19707453 -27486923 -20117698 -11686603 -9274395 -10191530 -12738903 -15810151 -14443294
7065 -14443294 -8026058 -5373994 -9845524 -9295779 4808235 18932136 16297323 4939877
7057 4939877 5108336 14581674 11471788 -8859898 -24996426 -22605244 -13295312 -11497375
7049 -11497375 -12730776 -6655430 4593179 13580241 19851009 23345843 17532206 940973
7041 940973 -14959373 -20677920 -21270760 -23022652 -19272129 -3766589 11911693 11335800
7033 11335800 -2263018 -11011777 -8392590 -4293113 -5757046 -8347649 -7638551 -5542890
7025 -5542890 -3165783 741209 2594763 -2911165 -10513845 -7449288 7423557 18967245
7017 18967245 15492037 3388962 -3631614 -1247200 5723056 12544710 16250343 13571409
7009 13571409 4513891 -4591854 -6644317 -773146 8365004 15141116 15425332 9075240
7001 9075240 1695594 -1018984 -1933412 -8882098 -20487366 -24239930 -13893355 -515037
6993 -515037 1961513 -3949691 -4549562 3604523 8719040 1440682 -12128314 -19669035
6985 -19669035 -18333769 -14928361 -13808058 -11971724 -7137412 -4314325 -9295630 -18390895
6977 -18390895 -21030217 -13203626 -2460903 2706544 2428116 251444 -5314172 -16529352
6969 -16529352 -27581051 -29003611 -20254768 -10319286 -5978209 -6385904 -8472040 -9663234
6961 -9663234 -5486978 6329486 18151946 18280120 7090301 -1783653 235193 6303628
6953 6303628 6301219 29679 -7105765 -12308767 -12561724 -2951742 13197101 20837322 11166123
6944 11166123 -2763919 -953775 16087901 27964953 22684093 11296684 9788493 17081077
6936 17081077 19590016 12032783 3839120 4566286 10861429 12676956 8120340 4702991
6928 4702991 5875499 4756295 -4307333 -15499579 -20693458 -22684349 -28416923 -33228629
6920 -33228629 -25921947 -9291579 -510606 -7257597 -17298012 -17525946 -9953436 -1148544
6912 -1148544 10771455 27417597 39078885 35307708 20115622 5949833 -1815922 -5381662
6904 -5381662 -6157920 -5091722 -4915445 -3911721 4512203 17743121 20312064 5801947
6896 5801947 -8753531 -4992445 10111258 16155895 8983327 33365 -6145783 -12717056
6888 -12717056 -14144956 -1717200 16221156 21692776 14648207 11233626 14522102 11326721
6880 11326721 635470 -1722903 5840569 2169806 -21295840 -41770722 -38608798 -23401064
6872 -23401064 -16723591 -14463206 -1454771 15799895 16909093 1099856 -11889318 -12348744
6864 -12348744 -10239318 -13520380 -16183830 -11675617 -2867419 5794564 13758530 17838857
6856 17838857 10904174 -7745032 -27884443 -38311252 -36886447 -29325326 -22280000 -18419659
6848 -18419659 -15669973 -11945490 -10910556 -17752000 -27713982 -27907013 -15592818 -4465968
6840 -4465968 -4815575 -8469007 -4591732 1218778 -515188 -1730179 11049106 28685765
6832 28685765 27416337 5425015 -12205149 -10468939 -3645932 -7584256 -14020485 -8273859
6824 -8273859 3872627 6349079 54112 446303 11865830 21566945 19397748 9325119
6816 9325119 -390289 -6650015 -8268871 -3576358 4068001 6025040 -934926 -8583122
6808 -8583122 -6932007 2897848 10146978 7836965 815877 -930725 4910454 9503686
6800 9503686 3128095 -12998284 -27614668 -31158990 -23555148 -11144113 -451304 4481224
6792 4481224 3739977 2455650 5337943 8561332 3351291 -9142480 -14332223 -2500449
6784 -2500449 15619743 20997374 10386489 -2043037 -5532724 -3870889 -4288455 -6212098
6776 -6212098 -5752554 -3012329 489865 5301905 10295346 11625093 9794226 10836750
6768 10836750 15373340 14405660 3093602 -9377849 -13190885 -13527561 -20419695 -29051361
6760 -29051361 -25774626 -11240764 -565137 427651 1535921 7051458 7205594 -908412
6752 -908412 -2603518 10531465 22501123 16918440 6128745 13838628 36278667 45634809
6744 45634809 31156243 12307930 6532198 6947583 1598946 -5369502 -5574302 -3718511
6736 -3718511 -7411271 -11160886 -6520398 426490 -1570298 -7740055 -3004053 12662397
6728 12662397 21577775 14031069 2294393 2687594 13808680 20147574 11646908 -6598000
6720 -6598000 -21170465 -22632747 -12829071 -2490512 -437278 -4578800 -5572064 892590
6712 892590 8911924 10385448 5012295 -6435 905386 4941979 4548572 -2091596 -6785830
6703 -6785830 -1161368 10710659 15911668 10020038 3082179 3958293 6693950 714073
6695 714073 -11176789 -15960470 -9726412 -2569699 -2359023 -3702036 1665313 10603434
6687 10603434 12146595 3069716 -6705493 -6219895 2324724 5760168 -2633948 -12516260
6679 -12516260 -9098982 6019495 16293318 14294523 12539339 22540163 33709733 26757477
6671 26757477 2832084 -15901331 -14877157 -3040681 2606375 -2822049 -11672765 -14752220
6663 -14752220 -8338964 3276480 9409382 3154973 -8847029 -13644077 -8917544 -3772500
6655 -3772500 -2691403 -693799 3026076 187249 -11612723 -21484049 -21302731 -18196864
6647 -18196864 -21340175 -26637014 -25993046 -22551814 -23411889 -24927278 -20334789 -16117617
6639 -16117617 -23444528 -35836305 -34169568 -16222701 -3058526 -8921025 -20570740 -17887329
6631 -17887329 -3344931 3598640 -3899700 -10999226 -3425733 12275029 17324125 4992426
6623 4992426 -10996728 -13700423 -3276289 5805080 6163053 6809460 16547891 27029067
6615 27029067 23072633 5575529 -8825837 -11265684 -10957653 -18102974 -28566803 -33219151
6607 -33219151 -32968993 -34159356 -34690848 -25926435 -7357381 9614627 14334658 8329747
6599 8329747 2739141 6717234 18186097 25144046 18357716 3123661 -6400898 -5658257
6591 -5658257 -4798750 -11500039 -18087565 -14198417 -4230686 -349596 -3359614 -4028899 -690091
6582 -690091 -625963 -3845420 -1441802 6174602 5417683 -8354967 -19404961 -13790918 -1304291
6573 -1304291 -947240 -12332313 -17437846 -7720310 5835649 10591805 7079404 2639322
6565 2639322 711014 1100261 3394997 5805112 5970980 5523834 8348396 12385411 9793716
6556 9793716 -1372368 -11860553 -12397425 -5721848 -2412851 -7437837 -15434174 -18197908
6548 -18197908 -13439036 -6155792 -2927560 -5045785 -7769205 -6932681 -3837671 -1107671
6540 -1107671 2535427 7715169 7901889 -3565116 -20213612 -26079574 -15288584 920312
6532 920312 10223873 12784984 13669554 12144979 7506758 6816536 14748263 21187294 12603886
6523 12603886 -5906387 -13936070 -3618007 8472940 3940749 -11885160 -16357677 1636735
6515 1636735 27117247 34751105 15838573 -12367249 -24571402 -14123918 797929
6508 797929 -430028 -16314321 -27244794 -22174386 -11778475 -11377148 -19362910 -21474132
6500 -21474132 -12750456 -4515539 -7392638 -16329395 -19085368 -14363010 -12350568 -17683540
6492 -17683540 -21308343 -13830586 -113152 6736392 2458157 -5104428 -8602146 -8856970
6484 -8856970 -8727567 -6945140 -1827935 3939942 6091141 3314634 -3084365 -10827396
6476 -10827396 -16597294 -17850842 -15480899 -11189146 -3528448 7511359 14152110 9008850
6468 9008850 -401665 2083551 17143364 25554644 14468001 -5236421 -16906837 -19878363
6460 -19878363 -21164827 -18929839 -10781850 -7277903 -16986086 -25890649 -14236787 10181415
6452 10181415 19806642 8260224 -2037094 2241402 6202741 -3403633 -13664357 -8450150
6444 -8450150 3243187 3076671 -5690158 -5521951 4721493 8853850 898874 -7286918
6436 -7286918 -8390254 -11347515 -23852462 -36958316 -36492069 -21718857 -4114559 7768823
6428 7768823 14372025 17558713 14177147 864526 -16812686 -25179707 -16280943 1005576
6420 1005576 9223520 1986569 -10879584 -19179797 -24805494 -32975121 -38912168 -32937704
6412 -32937704 -15725602 692441 6974183 4435811 -1321824 -8116768 -16284786 -24239746
6404 -24239746 -27788407 -23678347 -14266796 -7972508 -10938097 -17009298 -12229535 6274903
6396 6274903 21970659 16803342 -6368829 -27093843 -30652023 -19937944 -5838465 4394730
6388 4394730 7776494 3824824 -3247127 -6271842 -3273792 -32151 -1431685 -4191093
6380 -4191093 -2006513 4821166 9010785 4703775 -6654936 -18548220 -25106006 -24065132
6372 -24065132 -16099709 -3895583 7294749 10849969 4481336 -5274639 -8624959 -4401439
6364 -4401439 -2222722 -9514971 -20067797 -20609051 -7225252 9794227 17666562 13784115
6356 13784115 5818444 1985390 2806903 2070282 -4339904 -11605339 -10574693 420491
6348 420491 12103714 14849321 9416922 3862299 2361926 1201537 -4887853 -15395464
6340 -15395464 -23214397 -20660509 -7816977 5428485 9119955 4867855 2471047 4529968
6332 4529968 2606998 -7598886 -16300237 -12844298 -2267254 1530126 -4395825 -9591348
6324 -9591348 -6653434 11810 3331340 2667055 506829 -3195465 -9023463 -14305026
6316 -14305026 -14992345 -9976262 -2323859 2691868 1476285 -4040281 -7739426 -6758543
6308 -6758543 -5523085 -9372927 -16645908 -20992078 -19419922 -13967751 -7508876 -2233459
6300 -2233459 -380621 -2231980 -5100607 -7633631 -12096451 -18824542 -22728298 -20049447
6292 -20049447 -14020131 -8749625 -3261414 2209661 1277384 -8304619 -16473879 -14093545
6284 -14093545 -7802784 -8512405 -11486871 -4646095 7422726 7612731 -5624389 -15117995
6276 -15117995 -13297112 -12254591 -18343213 -18626400 -5190544 7021124 3947048 -2397020
6268 -2397020 6617396 23121711 22582978 1807919 -15719162 -13560876 -1886004 1341777
6260 1341777 -6925474 -17465353 -22431081 -19525991 -10751886 -2608434 -1515996 -5271532
6252 -5271532 -4596416 4232504 14269610 18099127 17214549 17725787 21408294 24605072 23037776
6243 23037776 15419051 4634149 -3807672 -6990839 -8002268 -11281078 -16252961 -19961249
6235 -19961249 -23642519 -29764546 -33521002 -25812713 -6575853 12213500 19684268 16301662
6227 16301662 9103159 3560378 2682391 6799749 10543800 7215763 100462 1117891
6219 1117891 12558541 19416844 9169982 -8393905 -12973398 -747313 13063850 16182909
6211 16182909 10412597 1075447 -10031446 -17657174 -13214082 913842 8802190 1469993
6203 1469993 -9976908 -11341050 -5809293 -4950138 -7330765 -2363939 7960462 8957363
6195 8957363 -2805340 -11454852 -4452581 9205126 12476714 3418944 -4621471 -982926
6187 -982926 12394633 26424934 33843743 33758164 30845421 28942856 25170141 14658652
6179 14658652 714580 -7650938 -9908851 -15616836 -27334948 -33085008 -24240743 -10902753
6171 -10902753 -8003508 -13912599 -16220646 -13190703 -14061919 -19978857 -20635361 -12477806
$$ [...]
##END NTUPLES=NMR SPECTRUM
##END=
