##TITLE=31Pdec_CPA3006
 D2O, 24 sc
 1.07.2021
##JCAMPDX= 6.0         $$ Bruker NMR JCAMP-DX V2.0
##DATA TYPE= NMR SPECTRUM
##DATA CLASS= NTUPLES
##ORIGIN= UXNMR, Bruker Analytische Messtechnik GmbH
##OWNER= root
$$ XWIN-NMR		Version 3.5
$$ Thu Jul  1 09:54:48 2021 Russian Standard Time (UT+4h)  she@DPX200
##.OBSERVE FREQUENCY= 81.013821
##.OBSERVE NUCLEUS= ^31P
##.ACQUISITION MODE= SIMULTANEOUS
##.ACQUISITION SCHEME= undefined
##.AVERAGES= 24
##.DIGITISER RES= 16
##SPECTROMETER/DATA SYSTEM= spect
##.PULSE SEQUENCE= zgpg30
##.SOLVENT NAME= D2O
##.SHIFT REFERENCE= (INTERNAL, D2O, 0, 248.564)
##AUDIT TRAIL= $$ (NUMBER, WHEN, WHO, WHERE, WHAT)
$$ ##TITLE= Audit trail, XWIN-NMR		Version 3.5
$$ ##JCAMPDX= 5.01
$$ ##ORIGIN= Bruker BioSpin GmbH
$$ ##OWNER= she
$$ F:/spectra/data/she/nmr/P31/1/pdata/1/auditp.txt
$$ ##AUDIT TRAIL=  $$ (NUMBER, WHEN, WHO, WHERE, WHAT)
(   1,<2021-07-01 09:52:53.56 +0400>,<she>,<DPX200>,
      <created by zg, POWCHK disabled, PULCHK disabled
       configuration hash MD5:
       00 E9 B6 7A A2 85 ED C7 34 08 36 98 17 FE 4E 26
       data hash MD5: 32K
       D8 FA A1 1F 7C 85 2F B1 E9 BE 35 F5 65 A3 0B 03>)
(   2,<2021-07-01 09:52:56.31 +0400>,<she>,<DPX200>,
      <Start of raw data processing
       efp BC_mod = 2 LB = 1 FT_mod = 6 PKNL = 1 PHC0 = -7183.631 PHC1 = 459.0858 SI = 64K 
       data hash MD5: 64K
       33 DD B2 97 46 48 83 08 54 37 FF A0 4E 19 95 89>)
(   3,<2021-07-01 09:53:28.32 +0400>,<she>,<DPX200>,
      <pk PHC0 = -257.4328 PHC1 = 468.6001 
       data hash MD5: 64K
       CD 0F 0C 0A EA 4B 4B 78 0B DC F7 E5 E4 4D C4 08>)
(   4,<2021-07-01 09:54:04.10 +0400>,<she>,<DPX200>,
      <pk PHC0 = 416.4097 PHC1 = -870.3998 
       data hash MD5: 64K
       82 DF DE B8 A0 3A 2B 86 58 08 0F 7D 54 AA 86 E2>)
(   5,<2021-07-01 09:54:17.79 +0400>,<she>,<DPX200>,
      <abs ABSG = 5 
       data hash MD5: 64K
       62 22 8C 23 43 B9 E1 8F 31 47 AD E5 2F 5C 41 DD>)
$$ ##END=
$$ 
$$ hash MD5
$$ 9B BE B6 BD A7 6C 9C EF 00 F2 D6 D1 E1 20 00 36
##$RELAX= 
##$RELAX= 
##$RELAX= 
##$RELAX= 
##$RELAX= 
##$RELAX= 
##$RELAX= 
##$RELAX= 
$$ Bruker specific parameters
$$ --------------------------
##$DU= <F:/spectra>
##$EXPNO= 1
##$NAME= <P31>
##$PROCNO= 1
##$TYPE= <nmr>
##$USER= <she>
##$AMP= (0..31)
100 100 100 100 100 100 100 100 100 100 100 100 100 100 100 100 100 100 
100 100 100 100 100 100 100 100 100 100 100 100 100 100 
##$AQSEQ= 0
##$AQ_mod= 1
##$AUNM= <au_zg>
##$AUTOPOS= <>
##$BF1= 81.014009
##$BF2= 200.13
##$BF3= 200.13
##$BF4= 200.13
##$BF5= 200.13
##$BF6= 200.13
##$BF7= 200.13
##$BF8= 200.13
##$BYTORDA= 1
##$CFDGTYP= 0
##$CFRGTYP= 5
##$CHEMSTR= <none>
##$CNST= (0..31)
1 1 145 1 1 1 1 1 1 1 1 1 1 1 1 1 1 1 1 1 1 1 1 1 1 1 1 1 1 1 1 1 
##$CPDPRG= <waltz16>
##$CPDPRG1= <>
##$CPDPRG2= <waltz16>
##$CPDPRG3= <>
##$CPDPRG4= <mlev>
##$CPDPRG5= <mlev>
##$CPDPRG6= <mlev>
##$CPDPRG7= <mlev>
##$CPDPRG8= <mlev>
##$CPDPRGB= <>
##$CPDPRGT= <>
##$D= (0..31)
0 1 0 0 0 0 0 0 0 0 0 0.03 2e-05 3e-06 0 0 0 0 0 0 0 0 0 0 0 0 0 0 0 0 
$$ [...]
##$SUBNAM3= <"">
##$SUBNAM4= <"">
##$SUBNAM5= <"">
##$SUBNAM6= <"">
##$SUBNAM7= <"">
##$SUBNAM8= <"">
##$SUBNAM9= <"">
##$SW= 501.771253377433
##$SWIBOX= (0..15)
0 1 3 0 0 0 0 0 0 0 0 0 0 0 0 0 
##$SW_h= 40650.406504065
##$TD= 32768
##$TD0= 1
##$TE= 0
##$TE2= 300
##$TE3= 300
##$TEG= 300
##$TL= (0..7)
0 120 53 12 22 120 120 120 
##$TP= (0..7)
150 150 150 150 150 150 150 150 
##$TP07= 0
##$TPNAME0= <>
##$TPNAME1= <>
##$TPNAME2= <>
##$TPNAME3= <>
##$TPNAME4= <>
##$TPNAME5= <>
##$TPNAME6= <>
##$TPNAME7= <>
##$TPOAL= (0..7)
0.5 0.5 0.5 0.5 0.5 0.5 0.5 0.5 
##$TPOFFS= (0..7)
0 0 0 0 0 0 0 0 
##$TUNHIN= 0
##$TUNHOUT= 0
##$TUNXOUT= 0
##$USERA1= <user>
##$USERA2= <user>
##$USERA3= <user>
##$USERA4= <user>
##$USERA5= <user>
##$V9= 5
##$VALIST= <valist>
##$VCLIST= <CCCCCCCCCCCCCCC>
##$VD= 0
##$VDLIST= <DDDDDDDDDDDDDDD>
##$VPLIST= <PPPPPPPPPPPPPPP>
##$VTLIST= <TTTTTTTTTTTTTTT>
##$WBST= 1024
##$WBSW= 4
##$XGAIN= (0..3)
0 0 0 0 
##$XL= 0
##$YL= 0
##$YMAX_a= 11363
##$YMIN_a= -11154
##$ZGOPTNS= <>
##$ZL1= 120
##$ZL2= 120
##$ZL3= 120
##$ZL4= 120
##$ABSF1= 248.5645
##$ABSF2= -253.2056
##$ABSG= 5
##$ABSL= 3
##$ALPHA= 0
##$AQORDER= 0
##$ASSFAC= 0
##$ASSFACI= 0
##$ASSFACX= 0
##$ASSWID= 0
##$AUNMP= <proc_1d>
##$AZFE= 0.1
##$AZFW= 0.5
##$BCFW= 0
##$BC_mod= 2
##$BYTORDP= 0
##$COROFFS= 0
##$CY= -3
##$DATMOD= 1
##$DC= 0
##$DFILT= <>
##$DTYPP= 0
##$F1P= 0
##$F2P= 0
##$FCOR= 1
##$FTSIZE= 65536
##$FT_mod= 6
##$GAMMA= 0
##$GB= 0
##$INTBC= 1
##$INTSCL= 5.30512e-09
##$ISEN= 30
##$LB= 1
##$LEV0= 0
##$LPBIN= 0
##$MAXI= 10000
##$MC2= 0
##$MEAN= 0
##$ME_mod= 0
##$MI= 50
##$NCOEF= 0
##$NC_proc= -7
##$NLEV= 6
##$NOISF1= 182.463
##$NOISF2= 159.3651
##$NSP= 0
##$NTH_PI= 0
##$NZP= 0
##$OFFSET= 248.5645
##$PC= 4
##$PHC0= -7024.653
##$PHC1= 57.28613
##$PH_mod= 1
##$PKNL= yes
##$PPARMOD= 0
##$PSCAL= 0
##$PSIGN= 0
##$REVERSE= no
##$SF= 81.014009
##$SI= 65536
##$SIGF1= 159.3651
##$SIGF2= -187.1042
##$SINO= 113.3802
##$SIOLD= 16384
##$SREGLST= <1H.CDCl3>
##$SSB= 0
##$STSI= 65536
##$STSR= 0
##$SW_p= 40650.406504065
##$SYMM= 0
##$S_DEV= 0
##$TDeff= 32768
##$TDoff= 0
##$TI= <>
##$TILT= no
##$TM1= 0
##$TM2= 0
##$TOPLEV= 0
##$USERP1= <user>
##$USERP2= <user>
##$USERP3= <user>
##$USERP4= <user>
##$USERP5= <user>
##$WDW= 1
##$XDIM= 65536
##$YMAX_p= 341992108
##$YMIN_p= -101850899
$$ End of Bruker specific parameters
$$ ---------------------------------
##NTUPLES= NMR SPECTRUM
##VAR_NAME=  FREQUENCY,     SPECTRUM/REAL,   SPECTRUM/IMAG
##SYMBOL=    X,             R,               I
##VAR_TYPE=  INDEPENDENT,   DEPENDENT,       DEPENDENT
##VAR_FORM=  AFFN,          ASDF,            ASDF
##VAR_DIM=   65536,         65536,           65536
##UNITS=     HZ,            ARBITRARY UNITS, ARBITRARY UNITS
##FACTOR=    0.620285442955139, 1,           1
##FIRST=     20137.2065510759, 0,            0
##LAST=      -20513.1999529892, 0,           0
##MIN=       -20513.1999529892, -101850899,  0
##MAX=       20137.2065510759, 341992108,    0
$$ Real data points
##PAGE= N=1
##DATA TABLE= (X++(R..R)), XYDATA
$$ [...]
$$ plain form
36490 -2115745 -1171854 -957679 375277 2658570 3229492 1705087 1286230 3317501 4286050
36481 4286050 1164575 -3334496 -4396642 -1814107 644107 1087538 966187 1457342 2005333
36472 2005333 2323551 2699107 2272947 -88722 -3151985 -4389988 -3792894 -3637419 -4212590
36463 -4212590 -3071657 581106 3954617 4572914 3348687 2124445 750982 -1347390
36455 -1347390 -2930118 -2659566 -1527619 -1349153 -1999662 -2115720 -1452655 -642259 370672
36446 370672 1737443 2492797 1861225 917587 1016842 1473298 939520 217290 1139723 3141249
36436 3141249 3715868 2297951 905562 540385 -170174 -1796087 -2410486 -759231 1232322
36427 1232322 1292504 382377 988085 2968508 3743947 2303282 577471 439975 1270696
$$ packed form
36490b115745R43891K14175J332956K283293N70922j524405m18857K031271R68549
36481D286050l121475m499071j062146K582535K458214M43431j21351M91155N47991
36472B005333L18218L75556m26160k361669l063263j238003N97094J55475n75171
36463d212590J140933L652763L373511O18297j224227j224242j373463k098372
36455a347390j582728K70552J131947J78466o50509j16058O63065Q10396J012931
36446C70672J366771P55354o31572r43638R9255M56456n33778p22230R22433K001526
36436C141249N74619j417917j392389l65177p10559j625913o14399J651255J991553
36427A232322O0182r10127O05708J980423P75439j440665j725811j37496Q30721
$$ plain form
36418 1270696 1263529 -178802 -2155469 -3486122 -3528240 -2355709 -702728 482014 626589
36409 626589 -362151 -2147001 -3622397 -3244100 -893256 998504 -181632 -3602965 -5433846
36400 -5433846 -3465479 362067 2910422 3541437 3411574 2731778 1015218 -805878 -1075581
36391 -1075581 -230067 -577986 -2718979 -4237106 -2938981 263127 2869031 3847738 3857549
36382 3857549 3439147 2511543 1287729 511745 799911 2211543 4039362 4769619 3295535
36373 3295535 810454 180602 2238598 3974023 2210865 -1781117 -3544266 -1084411
36365 -1084411 2901192 4681728 3298804 130405 -3233918 -5425593 -5307469 -3317033
36357 -3317033 -1887194 -2862741 -4957130 -5272230 -3089143 -592889 308983 322027 1153490
$$ packed form
36418A270696p167j442331j976667j330653m2118J172531J652981J184742J44575
36409F26589r88740j784850j475396L78297K350844J891760j180136l421333j830881
36400e433846J968367L827546K548355O31015j29863o79796j716560j821096k69703
36391a075581Q45514l47919k140993j518127J298125L202108K605904R78707R811
36382C857549m18402r27604j223814p75984K88166J411632J827819P30257j474084
36373C295535k485081o29852K057996J735425j763158l991982j763149K459855
36365a084411L985603J780536j382924l168399l364323k191675J18124J990436
36357c317033J429839r75547k094389l15100K183087K496254R01872J3044Q31463
$$ plain form
36348 1153490 2751730 3488563 2724488 1769832 1815772 1976435 502792 -2447227 -4586924
36339 -4586924 -4354039 -2807177 -1913108 -1932951 -1718563 -986838 -732840 -1328142 -1660590
36330 -1660590 -780029 562046 785204 -538164 -2116012 -2246610 -580036 1353843 1691342
36321 1691342 562281 124501 1548196 3026300 2381265 805466 1516505 4681272 6558816
36312 6558816 4769363 1732107 930774 1967154 1935692 268776 -736274 293356 2171406
36303 2171406 3317358 3307576 2216617 578613 80865 1964403 4436547 4194193 1183620
36294 1183620 -866132 117383 1392242 -203060 -3141717 -3475354 -664459 2183413
36286 2183413 3238965 3689650 4368640 4029382 2189152 875773 1656188 2958993 2453838
$$ packed form
36348A153490J598240P36833p64075r54656M5940J60663j473643k950019k139697
36339d586924K32885J546862Q94069j9843K14388P31725K53998n95302l32448
36330a660590Q80561J342075K23158j323368j577848j30598J666574J933879L37499
36321A691342j129061m37780J423695J478104o45035j575799P11039L164767J877544
36312F558816j789453l037256q01333J036380l1462j666916j005050J029630J878050
36303B171406J145952r782j090959j638004m97748J883538K472144k42354l010573
36294A183620k049752R83515J274859j595302k938657l33637K810895K847872
36286B183413J055552M50685O78990l39258j840230j313379P80415J302805n05155
$$ plain form
36277 2453838 652140 -54742 1009412 2385870 3088018 3370096 3062723 1467561 -730767
36268 -730767 -1640810 -1022136 -940665 -2443858 -3517988 -2058253 656753 1602810 235290
36259 235290 -1160525 -1001957 -86384 408636 537029 617720 446358 325061 1357038
36250 1357038 3630623 5290810 4618701 2264680 363222 1391 474933 607001 31628
36241 31628 -553437 -59066 1557643 2510958 1040645 -1638389 -1920409 1665780 6145647
36232 6145647 7760806 6415165 4592367 3273188 1522795 -589171 -1502550 -727795
36224 -727795 465735 1178753 1567361 1278787 -403255 -2478470 -2824546 -1555448 -1216073
36215 -1216073 -2686751 -3607775 -2243108 -147940 841810 1507276 2739871 2838880 523852
$$ packed form
36277B453838j801698p06882J064154J376458P02148K82078l07373j595162k198328
36268g30767r10043O18674Q1471j503193j074130J459735K715006R46057j367520
36259B35290j395815J58568R15573M95020J28393Q0691j71362j21297J031977
36250A357038K273585J660187o72109k354021j901458l61831M73542J32068n75373
36241C1628n85065M94371J616709R53315j470313k679034k82020L586189M479867
36232F145647J615159j345641j822798j319179j750393k111966r13379P74755
36224g27795J193530P13018L88608k88574j682042k075215l46076J269098L39375
36215a216073j470678r21024J364667K095168R89750O65466J232595R9009k315028
$$ plain form
36206 523852 -1517237 81046 3847074 5226489 3190883 1084094 1000630 1452990 1202910
36197 1202910 1312740 2026280 1345484 -1310162 -3161586 -1997250 543522 1707682 1197266
36188 1197266 -53355 -2005702 -3917348 -3259733 592470 3772885 2574566 -1012513
36180 -1012513 -2170571 -235862 1414276 1539059 2279546 4078440 4259743 1995568 294415
36171 294415 1023748 1846351 616109 -728449 189059 1634409 640785 -1646805 -1586393
36162 -1586393 1063272 2830568 1890685 60954 -983129 -2103983 -4170241 -5882322
36154 -5882322 -5743308 -4314609 -2989189 -1927293 -640025 434887 349717 -911557 -2408907
36145 -2408907 -3242203 -2939001 -1501105 193748 638968 -788682 -2883792 -3866136 -3331811
$$ packed form
36206E23852k041089J598283L766028J379415k035606k106789q3464M52360k50080
36197A202910J09830P13540o80796k655646j851424J164336K540772J164160n10416
36188A197266j250621j952347j911646O57615L852203L180415j198319l587079
36180a012513j158058J934709J650138J24783P40487J798894J81303k264175j701153
36171B94415P29333Q22603j230242j344558R17508J445350r93624k287590O0412
36162a586393K649665J767296r39883j829731j044083j120854k066258j712081
36154e882322J39014J428699J325420J061896J287268J074912q5170j261274j497350
36145b408907q33296L03202J437896J694853M45220j427650k095110r82344N34325
$$ plain form
36136 -3331811 -2400064 -2180809 -2646752 -2875319 -2010556 -177234 1261750 738247 -1727907
36127 -1727907 -4062039 -4115427 -2079955 -342861 -807967 -2862739 -4285607 -3757804 -1969239
36118 -1969239 -410267 222570 137057 -380017 -1132402 -1614962 -1381598 -934032 -1314478
36109 -1314478 -2455103 -2923535 -1989527 -935382 -1161307 -1773693 -687198 2069235 3903885
36100 3903885 2993600 607063 -763389 -488217 104127 36108 -205353 206095 1263562
36091 1263562 2426419 3406572 4106005 4079424 2745236 351106 -1753414 -2351406 -1696085
36082 -1696085 -1037403 -958139 -1022434 -1048658 -1441990 -1809058 -799561 1502003 2500276 295112
36072 295112 -3060848 -3863117 -1809557 -76350 -299124 -533621 785496 1871748 656914
$$ packed form
36136c331811R31747K19255m65943k28567Q64763J833322J438984n23503k466154
36127a727907k334132n3388K035472J737094m65106k054772j422868N27803J788565
36118a969239J558972O32837q5513n17074p52385m82560K33364M47566l80446
36109a314478j140625m68432R34008J054145k25925o12386J086495K756433J834650
36100C903885r10285k386537j370452K75172N92344o8019k41461M11448J057467
36091A263562J162857R80153O99433k6581j334188k394130k104520n97992O55321
36082a696085O58682P9264o4295k6224l93332l67068J009497K301564R98273k205164
36072B95112l355960q02269K053560J733207k22774k34497J319117J086252j214834
$$ plain form
36063 656914 -1450347 -1553275 323472 1509231 717761 -733599 -1554757 -1969247 -2315987
36054 -2315987 -2220712 -1685362 -1309738 -912296 445933 2414226 2942174 977424 -1592425
36045 -1592425 -1843254 994575 5019242 7648412 7476232 4975100 2217289 1264376 2000192
36036 2000192 2157814 311163 -1938945 -2005430 -8912 1206911 -93772 -2227285 -2357815
36027 -2357815 9612 2799048 3960690 3225663 1609623 334917 341174 1787757 3536931
36018 3536931 3887818 2446081 727541 286987 791144 783313 -71846 -648569 -226969
36009 -226969 483523 555429 85091 -360218 -758442 -1410632 -2255424 -3031442 -3650493 -3846676
35999 -3846676 -2997526 -995819 1134268 2208268 2112584 1429768 360401 -1066113 -2089987
$$ packed form
36063F56914k107261j02928J876747J185759p91470j451360q21158m14490l46740
36054b315987R5275N35350L75624L97442J358229J968293N27948j964750k569849
36045a592425k50829K837829M024667K629170j72180k501132k757811r52913P35816
36036B000192J57622j846651k250108o6485J996518J215823j300683k133513j30530
36027b357815K367427K789436J161642p35027j616040j274706O257J446583J749174
36018C536931L50887j441737j718540m40554N04157p831q55159n76723M21600
36009b26969P10492P1906m70338m45309l98224o52190q44792p76018o19051j96183
35999c846676Q49150K001707K130087J074000r5684o82816j069367j426514j023874
$$ plain form
35990 -2089987 -1674313 68616 1733524 1999838 613616 -1706110 -3511537 -3159361 -410828
35981 -410828 2443626 2441203 -570905 -3466907 -3540879 -1638860 -629597 -1518814 -2404833
35972 -2404833 -1290054 1117277 2021244 -223975 -3941654 -5637575 -3799830 -628797
35964 -628797 616854 -568689 -1917690 -1876912 -1417941 -1876490 -2667796 -2387654 -1019286
35955 -1019286 419927 1627481 2839938 3492005 2873011 1950521 2566578 4468287 5112267
35946 5112267 3351167 1512207 2239615 4563032 5121729 2744133 -283899 -1617150
35938 -1617150 -1511633 -1345972 -1202398 -311795 1112766 2065733 2409346 2935252 3766865
35929 3766865 3976829 3126936 2120772 1934263 2247131 1980976 701305 -1085930 -2616612
$$ packed form
35990b089987M15674J742929J664908K66314j386222k319726j805427L52176K748533
35981d10828K854454k423l012108k896002p3972J902019J009263q89217q86019
35972b404833J114779K407331R03967k245219l717679j695921J837745L171033
35964f28797J245651j185543j349001M0778M58971m58549p91306K80142J368368
35955a019286J439213J207554J212457O52067o18994r22490O16057J901709O43980
35946E112267j761100j838960P27408K323417N58697k377596l028032j333251
35938a617150J05517J65661J43574Q90603J424561R52967L43613N25906Q31613
35929C766865K09964q49893j006164j86509L12868k66155j279671j787235j530682
$$ plain form
35920 -2616612 -3275343 -2694695 -1143823 312818 672911 71507 -428638 -162252 415148
35911 415148 467545 -28023 -105367 1047027 2809131 3390700 1840198 -455178 -1139306
35902 -1139306 105800 933127 -694141 -3784904 -5499714 -4433744 -1708450 722275
35894 722275 1668241 915406 -747680 -1594511 -379378 1857923 2502823 480045 -2228666
35885 -2228666 -2841341 -845487 1857341 3300422 3222383 2799479 3175622 4157728 4253573
35876 4253573 2396895 -390590 -1871845 -1316122 -283172 -170400 -218583 947671 2845742
35867 2845742 3788582 3437145 2897020 2370513 690823 -2221267 -4261239 -3739459 -1781899
35858 -1781899 -649801 -612109 -305439 320648 -278697 -2152209 -2752253 -422756 2623528
$$ packed form
35920b616612o58731N80648J550872J456641L60093o01404n00145K66386N77400
35911D15148N2397m95568p7344J152394J762104N81569j550502k295376o84128
35902a139306J245106Q27327j627268l090763j714810J065970K725294K430725
35894G22275R45966p52835j663086q46831J215133K237301O44900k022778k708711
35885b228666o12675J995854K702828J443081p8039m22904L76143R82106R5845
35876D253573j856678k787485j481255N55723J032950J12772m8183J166254J898071
35867B845742R42840l51437n40125n26507j679690k912090k039972N21780J957560
35858a781899J132098L7692L06670O26087n99345j873512o00044K329497L046284
$$ plain form
35849 2623528 2950802 764714 -258605 1893275 4942489 5686304 3938014 1687949
35841 1687949 79551 -787160 -306703 1868220 3978712 3627697 1285502 -40576 836152
35832 836152 1663566 491378 -1402063 -2021283 -1912502 -2484822 -2675175 -356562 3473252
35823 3473252 5015449 2641546 -1015562 -2794277 -2592742 -2021586 -1484148 -430694 724996
35814 724996 938742 395096 475468 1880370 3836144 5128514 5127088 3958724 2434045
35805 2434045 1617561 1765929 1927262 1221445 56178 -742939 -1408842 -2615128 -3786521
35796 -3786521 -3547802 -1861812 -194280 719078 1739626 3431434 4799631 4778996 3742981
35787 3742981 2639938 1795978 1463561 2218633 3634073 3919754 2394513 1029581 1690061
$$ packed form
35849B623528L27274k186088j023319K151880L049214P43815j748290k250065
35841A687949j608398q66711M80457K174923K110492l51015k342195j326078Q76728
35832H36152Q27414j172188j893441o19220J08781n72320j90353K318613L829814
35823C473252J542197k373903l657108j778715K01535N71156N37438J053454J155690
35814G24996K13746n43646Q0372J404902J955774J292370j426j168364j524679
35805B434045q16484J48368J61333p05817j165267p99117o65903j206286j171393
35796c786521K38719J685990J667532R13358J020548J691808J368197k0635j036015
35787C742981j103043q43960l32417P55072J415440K85681j525241j364932O60480
$$ plain form
35778 1690061 3047527 2562972 652248 104758 1674385 3201999 3367635 3324649 3831552
35769 3831552 3710737 2494084 1889325 2858683 3636975 2664298 1331879 1585242 2764919
35760 2764919 3294883 3716293 5246921 6793168 6433528 4832152 4147026 4405351 4094170
35751 4094170 3571731 4377187 5565490 4583638 1972689 1234796 3227728 4611593 3274349
35742 3274349 1556027 2049064 3515356 3454547 2001264 708194 -236861 -1083685 -940083
35733 -940083 386719 998729 -90864 -599804 1572185 4477166 4855498 3045162 1716609
35724 1716609 1156148 -275036 -1834494 -786810 2806685 5549596 5545927 4332838 3326882
35715 3326882 1871462 10537 -164889 2194743 4709049 5006757 3826593 3091230 2867648
$$ packed form
35778A690061J357466m84555j910724n47490J569627J527614J65636m2986N06903
35769C831552j20815j216653o04759R69358P78292r72677j332419K53363J179677
35760B764919N29964M21410J530628J546247l59640j601376o85126K58325l11181
35751D094170n22439Q05456J188303r81852k610949p37893J992932J383865j337244
35742C274349j718322M93037J466292o0809j453283j293070r45055q46824J43602
35733i40083J326802O12010j089593n08940K171989K904981L78332j810336j328553
35724A716609n60461j431184j559458J047684L593495K742911l669j213089j005956
35715C326882j455420j860925j75426K359632K514306K97708j180164p35363k23582
$$ plain form
35706 2867648 2184056 1214343 630744 25529 -1138572 -1997614 -1475534 -236299 176657
35697 176657 -432065 -989297 -963701 -750707 -603523 -368948 -55765 279994 944705 2086106
35687 2086106 3055293 3007417 1916671 577188 5302 1019399 3519421 5785618 5654028
35678 5654028 3198677 1178727 1796067 3974959 5078503 4476181 3872910 4476782 5380847
35669 5380847 4955717 2830883 213889 -1200133 -589800 1287097 2765081 2831467 1784751
35660 1784751 377435 -984077 -2029757 -2547027 -2877975 -3526105 -3901885 -2729713 -328087
35651 -328087 1021490 83079 -1398645 -1263591 -163694 -349874 -2129974 -3616363 -3589219
35642 -3589219 -2620412 -1461724 -179432 971666 1441601 1393061 1512407 1803185 1836186
$$ packed form
35706B867648o83592r69713n83599o05215j164101q59042N22080J239235M12956
35697A76657o08722n57232K5596K12994J47184K34575L13183L35759O64711J141401
35687B086106R69187m7876j090746j339483n71886J014097K500022K266197j31590
35678E654028k455351k019950O17340K178892J103544o02322o03271O03872R04065
35669E380847m25130k124834k616994j414022O10333J876897J477984O6386j046716
35660A784751j407316j361512j045680n17270l30948o48130l75780J172172K401626
35651c28087J349577r38411j481724J35054J099897j86180j780100j486389K7144
35642c589219R68807J158688J282292J151098M69935m8540J19346K90778L3001
$$ plain form
35633 1836186 1932890 2531073 2669151 1064827 -1315364 -1933805 -249566 1620533 2383520
35624 2383520 3282099 5209593 6545543 5747983 4218383 4292445 5537200 5335436 2606631
35615 2606631 -1042843 -3613512 -4440434 -3812150 -2499858 -1711274 -2107333 -2702518 -1851110
35606 -1851110 625594 3268864 4792984 5018905 4222109 2777166 1396229 565394 -185727
35597 -185727 -1363894 -2213813 -1787498 -932123 -1238971 -2068806 -1072595 1725233 3036009
35588 3036009 978559 -1787052 -1816855 181430 965923 -55507 -580561 163875 351318
35579 351318 -559405 -322410 2183287 4440965 3904720 1922294 1505901 2823923 3781472
35570 3781472 4033534 5181758 7152577 7648309 5953454 4395206 4647885 5089792 3757572
$$ packed form
35633A836186R6704N98183J38078j604324k380191o18441J684239J870099P62987
35624B383520Q98579J927494J335950p97560j529600P4062J244755k01764k728805
35615B606631l649474k570669q26922O28284J312292P88584l96059n95185Q51408
35606a851110K476704K643270J524120K25921p96796j444943j380937q30835p51121
35597a85727j178167q49919M26315Q55375l06848q29835R96211K797828J310776
35588C036009k057450k765611k9803J998285P84493j021430n25054P44436J87443
35579C51318r10723K36995K505697K257678n36245j982426m16393J318022R57549
35570C781472K52062J148224J970819M95732j694855j558248K52679M41907j332220
$$ plain form
35561 3757572 1884541 2014225 3876262 4862034 4101033 3353021 3652680 3668616 2369897
35552 2369897 1172365 1847834 3670939 4332518 2942061 621538 -1382709 -2660916
35544 -2660916 -2930338 -1957069 -478680 147941 -177762 113525 1943409 3724835 3034423
35535 3034423 -143788 -3056506 -3292045 -1281709 837796 2018790 2887269 3806995 3772529
35526 3772529 2007836 -205930 -622441 1113076 2953123 3198788 2552616 2517482 2818607
35517 2818607 1992013 86195 -1085828 -649872 161396 329439 854550 2832330 5020702
35508 5020702 5236501 3560529 2159864 2026855 1915835 962636 434728 1746447 4038889
35499 4038889 5077323 3932178 1730225 133686 -133358 441294 735060 67031 -1036245
$$ packed form
35561C757572j873031J29684J862037R85772p61001p48012K99659J5936j298719
35552B369897j197532O75469J823105O61579j390457k320523k004247j278207
35544b660916k69422R73269J478389O26621l25703K91287J829884J781426o90412
35535C034423l178211k912718k35539K010336K119505J180994Q68479R19726l4466
35526C772529j764693k213766m16511J735517J840047K45665o46172l5134L01125
35517B818607q26594j905818j172023M35956Q11268J68043N25111J977780K188372
35508E020702K15799j675972j400665j33009j11020r53199n27908J311719K292442
35499D038889J038434j145145k201953j596539k67044N74652K93766o68029j103276
$$ plain form
35490 -1036245 -1611453 -1839288 -2863638 -4702852 -5610008 -4315728 -1755409 408496 1796472
35481 1796472 2638102 2381461 724950 -923452 -1037446 -398006 -782820 -1662137 -686853
35472 -686853 2441581 5171501 5789941 5413849 5239858 4304249 1806230 -345120 281120
35463 281120 2992431 4850912 4686757 4029862 4095262 4034765 2901686 1644717 1822718
35454 1822718 3143924 3661256 2401467 675633 211557 813339 1044074 916845 2148395
35445 2148395 5070039 7099022 5949854 3025853 1392736 1335029 732192 -580612 -286733
35436 -286733 1985917 3261994 1853363 209240 845371 2236435 1702125 141590 438693
35427 438693 2570123 3835570 3241993 2315185 1854299 1082928 73387 -15645 576495
$$ packed form
35490a036245n75208k27835j024350j839214r07156J294280K560319K163905J387976
35481A796472Q41630k56641j656511j648402j13994O39440l84814q79317R75284
35472f86853L128434K729920O18440l76092j73991r35609k498019k151350O26240
35463B81120K711311J858481j64155o56895O5400o0497j133079j256969J78001
35454A822718J321206N17332j259789j725834m64076O01782K30735j27229J231550
35445B148395K921644K028983j149168k924001j633117n7707o02837j312804K93879
35436b86733K272650J276077j408631j644123O36131J391064n34310j560535K97103
35427D38693K131430J265447n93577r26808m60886p71371j009541q9032N92140
$$ plain form
35418 576495 324166 -575162 -96365 2083007 3669397 3252926 2199706 2047929 2386554
35409 2386554 2406010 2302333 2032174 893699 -538042 -378310 1420680 2295496 880116
35400 880116 -905781 -1253374 -1271639 -2202968 -2506062 -629873 1511955 1175262 -755014
35391 -755014 -1383631 -534298 -145978 46934 2040720 5034154 5783692 4145392 3988992
35382 3988992 7050987 9782522 8666872 5428468 4016937 4815087 5074239 3621855
35374 3621855 1957491 1290984 1213077 1154448 966743 135865 -1642549 -3155192 -2751774
35365 -2751774 -748503 928674 1454251 1671851 1945130 1510119 460034 384450 2102741
35356 2102741 4379992 5854543 6687371 7212178 6592499 4420873 2368010 2347584 3805233
$$ packed form
35418E76495k52329q99328M78797K179372J586390m16471j053220j51777L38625
35409B386554J9456j03677k70159j138475j431741J59732J798990Q74816j415380
35400H80116j785897l47593j8265r31329l03094J876189K141828l36693j930276
35391g55014o28617Q49333L88320J92912J993786K993434P49538j638300j56400
35382C988992L061995K731535j115650l238404j411531P98150K59152j452384
35374C621855j664364o66507p7907n8629j87705q30878j778414j512643M03418
35365b751774K003271J677177N25577K17600K73279m35011j050085p5584J718291
35356B102741K277251J474551Q32828N24807o19679k171626k052863k0426J457649
$$ plain form
35347 3805233 4634956 4225517 3766671 3925574 4158389 4191915 4236080 3719702 1914519 24569
35337 24569 277280 2248456 2601559 -189842 -3240481 -3280440 -1193222 -81257 -480980
35328 -480980 -530883 37003 -548190 -2456515 -3266958 -1502204 1256023 2846909 3135909
35319 3135909 3038890 2730355 2117239 1681397 1579847 1059409 -95862 -659408 302307
35310 302307 1813885 2406128 2311462 2852592 4143492 4758968 3655693 1490364 -111921
35301 -111921 -208169 539839 636078 -279382 -754913 250362 1233516 180216 -1626473
35292 -1626473 -673626 3241504 5718058 3881787 931213 1623248 5301516 7025708
35284 7025708 4673904 1256160 104510 993241 1789398 1441022 348867 -462009 126968
$$ packed form
35347C805233Q29723m09439m58846J58903K32815L3526M4165n16378j805183j889950
35337B4569K52711J971176L53103k791401l050639l9959K087218J111965l99723
35328d80980m9903N67886n85193j908325q10443J764754K758227J590886K89000
35319C135909r7019l08535o13116m35842j01550n20438j155271n63546R61715
35310C02307J511578N92243r4666N41130J290900O15476j103275k165329j602285
35301a11921r6248P48008R6239r15460m75531J005275R83154j053300j806689
35292a626473R52847L915130K476554j836271k950574O92035L678268J724192
35284G025708k351804l417744j151650Q88731P96157l48376j092155q10876N88977
$$ plain form
35275 126968 2198636 3988950 3679564 1888934 659414 311810 -449904 -1524099 -1259063
35266 -1259063 432569 1743284 2405060 4305198 7434435 8437298 5270207 613997
35258 613997 -1718876 -1450455 -438483 1016923 3285361 4618907 2932649 -400677
35250 -400677 -1917538 -928693 63086 -362329 -1011460 -1013272 -1084446 -1133967 379579 3459957
35240 3459957 5519550 4770303 2516331 688741 -734340 -2197863 -2544455 -664583
35232 -664583 2313604 4585657 6209012 8010400 9148342 8240791 6227094 5502105 6343415
35223 6343415 6662869 5477850 4170440 3735337 3241941 2185785 2141679 4291546 6913125
35214 6913125 7414832 5965652 5065121 5920232 7204286 7437360 6775611 5970990 5103387
$$ packed form
35275A26968K071668J790314l09386j790630j229520l47604p61714j074195K65036
35266a259063J691632J310715O61776J900138L129237J002863l167091m656210
35258F13997k332873K68421J011972J455406K268438J333546j686258l333326
35250d00677j516861R88845R91779m25415o49131j812p1174m9521J513546L080378
35240C459957K059593p49247k253972j827590j423081j463523l46592J879872
35232f64583K978187K272053J623355J801388J137942r07551k013697p24989Q41310
35223F343415L19454j185019j307410m35103m93396j056156m4106K149867K621579
35214F913125N01707j449180r00531Q55111J284054K33074o61749q04621q67603
$$ plain form
35205 5103387 4156392 3666688 3761747 3318038 1242265 -1637141 -2968655 -1421755 1678142
35196 1678142 3572723 2827100 730446 -142482 1208297 3061859 3041305 1057987 -550169
35187 -550169 101520 2287486 3865124 3887967 3237149 3059254 3493703 3985832 4180636
35178 4180636 4244681 4561303 5185941 5557420 5039898 3949063 3553713 4573605 6114097
35169 6114097 6736894 6195267 5311738 4514557 3614695 2955931 3494084 5315525 7108867
35160 7108867 7691023 7268020 6671589 6202212 5906139 6166868 7089962 7907938 8019539
35151 8019539 8205475 9727247 12431859 14859385 16227736 17230323 18685872 20458517
35143 20458517 22158252 24028460 26523857 29581650 32777496 35640145 37432134 37420478
$$ packed form
35205E103387r46995m89704R5059m43709k075773k879406j331514J546900L099897
35196A678142J894581p45623k096654q72928J350779J853562k0554j983318j608156
35187e50169O51689K185966J577638K2843o50818j77895M34449M92129J94804
35178D180636O4045L16622O24638L71479n17522j090835l95350J019892J540492
35169F114097O22797n41627q83529p97181q99862o58764N38153J821441J793342
35160G108867N82156m23003n96431m69377k96073K60729R23094Q17976J11601
35151H019539J85936J521772K704612K427526J368351J002587J455549J772645
35143B0458517J699735J870208K495397L057793L195846K862649J791989j1656
$$ plain form
35135 37420478 36080034 35328865 36575769 38911801 40192353 39598744 38078238 36524759
35127 36524759 34895109 33213242 31953227 30907449 29102229 26680102 25477988 26466907
35119 26466907 27819139 27211491 25193482 24250197 24970243 25483604 24853344 24500896 25294166
35110 25294166 25546550 23659041 21012599 20026977 20383833 19577727 16914220 14631046 14644961
35101 14644961 16118618 17093841 17070102 16874367 16952537 17005851 16944604 17174904 17836797 18356853
35091 18356853 18054231 17031051 16170213 16038003 15980899 14913858 13118497 12345891 13413573
35082 13413573 14484991 12996061 9077588 5793538 5753229 8482215 11482485 13016009
35074 13016009 13302897 13535499 14315011 15040653 14748443 13500826 12495419 12528494 13094603
$$ packed form
35135C7420478j340444p51169J246904K336032J280552n93609j520506j553479
35127C6524759j629650j681867j260015j045778j805220k422127j202114R88919
35119B6466907J352232o07648k018009r43285P20046N13361o30260l52448P93270
35110B5294166K52384j887509k646442r85622L56856q06106k663507k283174J3915
35101A4644961J473657R75223k3739j95735P8170N3314o1247K30300O61893N20056
35091A8356853l02622j023180q60838j32210n7104j067041j795361p72606J067682
35082A3413573J071418j488930l918473l284050m0309K728986L000270J533524
35074A3016009K86888K32602P79512P25642k92210j247617j005407L3075N66109
$$ plain form
35065 13094603 13715872 15285713 18736063 22866898 25175395 24905788 23799472 23656927
35057 23656927 24658097 26401408 29003502 32491350 36407515 40669680 45679642 51206908
35049 51206908 56611032 62524136 70312211 78981178 84904883 86393938 86568806 89285799
35041 89285799 93651800 95497398 93594523 91176696 90951284 91645820 90788845 88456308
35033 88456308 86263994 84255298 81175281 77240724 74307256 72962096 71401492 68186906
35025 68186906 64625648 62853229 62455698 61028497 57943377 55242332 54063786 52621326
35017 52621326 49569403 47262396 48694106 52351181 53705183 51804345 50634097 52866483
35009 52866483 55890751 56274144 55208977 56475667 60852946 65715440 69187803 71744580
$$ packed form
35065A3094603O21269J569841L450350M130835K308497k69607j106316j42545
35057B3656927J001170J743311K602094L487848L916165M262165N009962N527266
35049E1206908N404124N913104P788075Q668967N923705J489055J74868K716993
35041H9285799M366001J845598j902875k417827k25412O94536q56975k332537
35033H8456308k192314k008696l080017l934557k933468j345160j560604l214586
35025F8186906l561258j772419l97531j427201l085120k701045j178546j442460
35017E2621326l051923k307007J431710L657075J354002j900838j170248K232386
35009E2866483L024268L83393j065167J266690M377279M862494L472363K556777
$$ plain form
35001 71744580 74120987 76360119 79018267 83032693 87990978 92168788 94502079 95243122
34993 95243122 94825334 93450418 91628081 89882530 88216137 86845484 86557274 86982382
34985 86982382 85790690 81635855 76774461 74251681 73359476 70830186 66100030 62135658
34977 62135658 60822416 60700700 59968222 58782048 57600605 55968401 54134264 53412937
34969 53412937 53736233 53195013 51203386 49728360 50090156 50988803 51159344 51464437 52629146
34960 52629146 53438270 53246277 53813813 56248618 58512874 58877742 59744012 64504289 71909941
34951 71909941 77170340 78107225 76921990 76082587 75685963 75158045 74590215 73641666 71475620
34942 71475620 68496681 66154671 64521392 62062258 58339100 54928971 52973679 51701856
$$ packed form
35001G1744580K376407K239132K658148M014426M958285M177810K333291P41043
34993I5243122m17788j374916j822337j745551j666393j370653k88210M25108
34985H6982382j191692m154835m861394k522780q92205k529290m730156l964372
34977F2135658j313242j21716p32478j186174j181443j632204j834137p21327
34969E3412937L23296n41220j991627j475026L61796Q98647J70541L05093J164709
34960E2629146Q09124j91993N67536K434805K264256L64868Q66270M760277P405652
34951G1909941N260399R36885j185235q39403l96624n27918n67830r48549k166046
34942G1475620k978939k342010j633279k459134l723158l410129j955292j271823
$$ plain form
34934 51701856 50130206 48389918 46512187 43770938 40407062 38321839 38586976 39578888
34926 39578888 39168493 37776568 37543934 38998600 40262420 39627839 37564462 35766120
34918 35766120 35164659 35526072 36551122 38634685 42279954 46997802 51268333 53952589
34910 53952589 55610976 58003552 62212727 67623915 72965391 78054040 84000003 91418449
34902 91418449 98734766 103059353 103250810 101530575 101085545 102296805 102591405 100195657
34894 100195657 96575097 94341809 93932486 93574240 91836727 88940266 85767415 82653045
34886 82653045 79351773 75764390 72550036 70740778 70217758 69096400 66029357 62852848
34878 62852848 62763706 65457968 66736364 64269815 61050924 60895695 62979092 63877007 63085040
$$ packed form
34934E1701856j571650j740288j877731k741249l363876k085223K65137R91912
34926C9578888m10395j391925k32634J454666J263820o34581k063377j798342
34918C5766120o01461L61413J025050K083563L645269M717848M270531K684256
34910E3952589J658387K392576M209175N411188N341476N088649N945963P418446
34902I1418449P316317M324587J91457j720235m45030J211260K94600k395748
34894A00195657l620560k233288m09323l58246j737513k896461l172851l114370
34886H2653045l301272l587383l214354j809258n23020j121358l067043l176509
34878F2852848q9142K694262J278396k466549l218891j55229K083397Q97915p91967
$$ plain form
34869 63085040 62806404 63468589 63600098 63921373 67401083 74539240 82210510 88219861 93704252
34860 93704252 99855396 105608516 110239497 115160666 121105614 126258709 129338312 131924501
34852 131924501 135259641 137223118 135528215 132023600 130460803 131102063 130752438 127538975
34844 127538975 122657161 117645293 112824068 108606142 105689068 103314472 99451274 93480051
34836 93480051 87193068 82679677 80498784 79964861 79653372 77562402 72656607 66762447
34828 66762447 63236109 62991687 63237611 60936124 56338168 52322280 51232260 53034714
34820 53034714 55626964 56312933 53982029 50611792 49690305 52266920 55412595 55618668
34812 55618668 52925828 50284705 49276337 48318925 45612484 42159666 40310506 40071471
$$ packed form
34869F3085040k78636O62185J31509L21275L479710P138157P671270O009351N484391
34860I3704252O151144N753120M630981M921169N944948N153095L079603K586189
34852A31924501L335140J963477j694903l504615j562797O41260l49625l213463
34844A27538975m881814n011868m821225m217926k917074k374596l863198n971223
34836I3480051o286983m513391k180893n33923l11489k090970m905795n894160
34828F6762447l526338k44422K45924k301487m597956m015888j090020J802454
34820E3034714K592250O85969k330904l370237r21487K576615L145675K06073
34812E5618668k692840k641123j008368r57412k706441l452818j849160k39035
$$ plain form
34804 40071471 38869184 35360724 31616173 30165075 30240607 29071637 26314365 24599476
34796 24599476 25255887 26120645 25002430 23078413 22705304 23494024 23190222 21551435 20523448
34787 20523448 20724762 20505340 18979891 17535983 17413199 17902621 18114995 18662290 20161787
34778 20161787 21710828 22591803 24193294 28119673 33061256 35818940 35599278 35299344
34770 35299344 37720956 42069436 45642275 48188107 52661493 61085006 71116808 78341412
34762 78341412 81621080 84288529 89377474 95498020 99108181 99540054 99238336 99372068
34754 99372068 98144542 94355961 90071833 87908441 87370055 85960915 82870322 79442957
34746 79442957 76587865 73868737 71132808 69123399 68075818 67142460 65604718 63503146
$$ packed form
34804D0071471j202287l508460l744551j451098P5532j168970k757272j714889
34796B4599476O56411Q64758j118215j924017l73109P88720l03802j638787j027987
34787B0523448K01314k19422j525449j443908j22784M89422K12374N47295J499497
34778B0161787J549041Q80975J601491L926379M941583K757684k19662k99934
34770C5299344K421612M348480L572839K545832M473386Q423513J0031802P224604
34762G8341412L279668K667449N088945O120546L610161M31873l01718J33732
34754I9372068j227526l788581m284128k163392n38386j409140l090593l427365
34746G9442957k855092k719128k735929k009409j047581r33358j537742k101572
$$ plain form
34738 63503146 60907247 57870424 55334143 54581527 55223832 55110106 53016739 50222240
34730 50222240 48603931 48441827 49168964 51000001 54203461 57555799 59317360 59575283
34722 59575283 60159271 62282536 65554716 69234865 73054758 76720590 80002308 83506133
34714 83506133 87913680 92183543 94163129 93594732 92809147 93464773 94295582 93500437 91767544
34705 91767544 90931161 90743512 89319464 86280206 83069733 80172138 76410875 71515105
34697 71515105 67122635 64230217 61604726 58095251 54894368 53768910 54147974 53858382
34689 53858382 52222559 50575119 49659662 48138721 44383166 38926067 34460909 33483994
34681 33483994 35963384 39188120 40139390 38286739 35801198 34830164 35137108 34942738 33502308
$$ packed form
34738F3503146k595899l036823k536281p52616O42305j13726k093367k794499
34730E0222240j618309j62104P27137J831037L203460L352338J761561K57923
34722E9575283N83988K123265L272180L680149L819893L665832L281718L503825
34714H3506133M407547M269863J979586n68397p85585O55626Q30809p95145j732893
34705I1767544q36383j87649j424048l039258l210473k897595l761263m895770
34697G1515105m392470k892418k625491l509475l200883j125458L79064k89592
34689E3858382j635823j647440r15457j520941l755555n457099m465158r76915
34681C3483994K479390L224736R51270j852651k485541r71034L06944j94370j440430
$$ plain form
34672 33502308 31884903 31261712 31291991 30623539 28678060 26512845 25659371 26121754 26060012
34663 26060012 24051354 21261400 20267469 21653645 22989225 21700168 17933176 13936143
34655 13936143 11543181 11020737 11553829 12048854 12080249 12522152 14290178 16076509 14992853
34646 14992853 10561544 6347112 5849901 8182373 9917911 9936551 9738078 9792613 8871494
34637 8871494 7117663 6511444 7360133 7285063 5180899 3497279 4462708 6222124 5472748
34628 5472748 2658341 1543740 3810120 6788801 7334766 5944839 5627905 7667200
34620 7667200 10005514 9925959 7374521 4914816 4576642 5593485 5799962 4682329 3992320
34611 3992320 5335766 8165844 10533888 11081377 9916948 8202099 7278534 7611423 8212532
$$ packed form
34672C3502308j617405o23191L0279o68452j945479k165215q53474M62383o1742
34663B6060012k008658k789954r93931J386176J335580j289057l766992l997033
34655A3936143k392962n22444N33092M95025L1395M41903J768026J786331j083656
34646A4992853m431309m214432m97211K332472J735538J8640j98473N4535r21119
34637H871494j753831o06219Q48689p5070k104164j683620R65429J759416p49376
34628E472748k814407j114601K266380K978681N45965j389927l16934K039295
34620G667200K338314p9555k551438k459705l38174J016843K06477j117633o90009
34611C992320J343446K830078K368044N47489j164429j714849r23565L32889O01109
$$ plain form
34602 8212532 7648664 5904339 4604930 5069392 6826537 8443904 9117225 8980337 8567871
34593 8567871 8581900 9595443 11333003 12679959 12967321 12846335 13374833 14635326 15817372
34584 15817372 16404976 16759179 17549636 18842320 19841334 19833974 19612889 21271964 25713271
34575 25713271 30941361 34176111 35310227 36597312 39047859 41263056 42229016 42902974
34567 42902974 43982083 44371818 43402833 42432664 42310572 41360162 38463671 36280120 37949540
34558 37949540 41588886 41903585 37326483 31878198 29211687 28434967 27354529 26375857
34550 26375857 26565666 26472516 24125269 20676521 18852497 18632168 17674503 15734491 15275235
34541 15275235 17161108 19018731 19243755 19636185 21821872 23560463 21793145 17896724
$$ packed form
34602H212532n63868j744325j299409M64462J757145J617367O73321j36888m12466
34593H567871J4029J013543J737560J346956K87362j20986N28498J260493J182046
34584A5817372N87604L54203P90457J292684R99014p360k21085J659075M441307
34575B5713271N228090L234750J134116J287085K450547K215197R65960O73958
34567D2902974J079109L89735r68985r70169j22092r50410k896491k183551J669420
34558C7949540L639346L14699m577102n448285k666511p76720j080438r78672
34550B6375857J89809r3150k347247l448748j824024k20329r57665j940012m59256
34541A5275235J885873J857623K25024L92430K185687J738591j767318l896421
$$ plain form
34533 17896724 16201498 17499126 17787366 14516503 10698658 10563095 13508844 15204264
34525 15204264 13462765 10279690 8473233 8727360 10009981 10923449 10430052 8813650
34517 8813650 7881203 8696917 9562805 8256067 5778548 5145741 6464182 6534685 4232464
34508 4232464 2791180 4798048 8033027 9003804 8065203 7741582 7899861 6414658 3638967
34499 3638967 2282883 2935156 3379168 2829220 3273645 5434919 6705281 5100958 2709459
34490 2709459 2772245 5055442 6619386 6162284 5126401 4819268 4706669 3932270 2801165
34481 2801165 2006701 1501784 934718 526091 761459 1571533 2461942 3248553 4008202
34472 4008202 4381529 3771488 2551080 2222104 3602187 5487411 6172161 5817392 5871665
$$ packed form
34533A7896724j695226J297628K88240l270863l817845j35563K945749J695420
34525A5204264j741499l183075j806457K54127J282621R13468m93397j616402
34517H813650r32447Q15714Q65888j306738k477519o32807J318441P0503k302221
34508D232464j441284K006868L234979R70777r38601l23621J58279j485203k775691
34499C638967j356084O52273M44012n49948M44425K161274J270362j604323k391499
34490B709459O2786K283197J563944m57102j035883l07133j12599p74399j131105
34481B801165p94464n04917n67066m08627K35368Q10074Q90409P86611P59649
34472D008202L73327o10041j220408l28976J380083J885224O84750l54769N4273
$$ plain form
34463 5871665 6346875 5607550 3391436 2025710 3313443 5792861 6801032 6085894 5424286
34454 5424286 5448820 5034155 3659749 2373880 2132433 2742121 3737830 4968337 6090607
34445 6090607 6726108 7255241 8217041 8908555 8059370 6054472 4814333 4951329 4703502
34436 4703502 2625849 -66667 -1121175 -296642 581763 274471 -363847 278066 2402019
34427 2402019 4389031 4519974 2937640 1608769 2175628 4150228 5552576 5081165 3340308
34418 3340308 2177552 3012978 5444045 7407074 7295097 5831076 4831838 4318268 2725846
34409 2725846 310379 -212920 2170627 4483585 3901213 2050972 2257229 4140176 4406620
34400 4406620 2166567 -19074 -196395 961918 2093806 2258782 424096 -3139691
$$ packed form
34463E871665M75210p39325k216114j365726J287733K479418J008171p15138o61608
34454E424286K4534m14665j374406j285869k41447O09688R95709J230507J122270
34445F090607O35501N29133R61800O91514q49185k004898j240139J36996k47827
34436D703502k077653k692516j054508Q24533Q78405l07292o38318O41913K123953
34427B402019J987012J30943j582334j328871N66859J974600J402348m71411j740857
34418C340308j162756Q35426K431067J963029j11977j464021r99238n13570j592422
34409B725846k415467n23299K383547K312958n82372j850241K06257J882947K66444
34400D406620k240053k185641j77321J158313J131888J64976j834686l563787
$$ plain form
34392 -3139691 -5332665 -3410096 652909 2579431 2098919 2485007 3996098 3155189 -458714
34383 -458714 -2358277 -274740 2140492 1624619 302326 848630 1413157 -333975 -2284598
34374 -2284598 -1770786 -651299 -1445458 -1842547 1193233 4760839 3891743 58314 -973056
34365 -973056 1341093 2064620 -4178 -140869 3847462 7642050 7437771 5304008 4532464
34356 4532464 4524409 3680571 3218494 4429479 5401837 4073157 1964064 1563765 2264272
34347 2264272 2113973 1616531 2470508 4026130 4232050 3166099 2754784 3640715 4845459
34338 4845459 5947945 7186281 7790962 6516854 3798902 1507296 527584 95847 -532888
34329 -532888 -1135015 -1221491 -598085 655485 1878464 1831340 -72497 -2824337 -4855133
$$ packed form
34392c139691k192974J922569M063005J926522m80512L86088J511091q40909l613903
34383d58714j899563K083537K415232n15873j322293N46304N64527j747132j950623
34374b284598N13812J119487p94159l97089L035780L567606q69096l833429j031370
34365i73056K314149P23527k068798j36691L988331L794588k04279k133763p71544
34356D532464q055q43838m62077J210985R72358j328680k109093m00299P00507
34347B264272j50299m97442Q53977J555622K05920j065951m11315Q85931J204744
34338D845459J102486J238336O04681j274108k717952k291606r79712m31737o28735
34329e32888o02127q6476O23406J253570J222979m7124j903837k751840k030796
$$ plain form
34320 -4855133 -5607005 -5446165 -4667453 -3414032 -2062724 -936650 -45777 493085 497816
34311 497816 466128 1161968 2033783 1488650 -504532 -1659703 -314160 2396116 4530051
34302 4530051 5800518 6393875 5144732 1349102 -2769102 -4110926 -2707274 -1198709
34294 -1198709 -759344 -269668 525845 91306 -1901706 -3407563 -3175549 -2750080 -3621499
34285 -3621499 -4403878 -3051368 -499576 399142 -989896 -2374811 -1980198 -532643 680605
34276 680605 1700343 2730279 2731115 878294 -1471281 -2101133 -972700 -244040 -1166542
34267 -1166542 -2675915 -3523837 -3972320 -4278654 -3220516 -26278 3254736 3560250 825235
34258 825235 -1803925 -1972722 -508487 677163 1273669 2091387 3154854 3581800 2912465
$$ packed form
34320d855133p51872J60840P78712J253421J351308J126074Q90873N38862M731
34311D97816l1688O95840Q71815n45133j993182j155171J345543K710276K133935
34302D530051J270467N93357j249143l795630m118204j341824J403652J508565
34294a198709M39365M89676P95513m34539j993012j505857K32014M25469q71419
34285c621499p82379J352510K551792Q98718j389038j384915L94613J447555J213248
34276F80605J019738J029936Q36j852821k349575o29852J128433P28660r22502
34267a166542j509373q47922m48483l06334J058138L194238L281014L05514k735015
34258H25235k629160j68797J464235J185650N96506Q17718J063467M26946o69335
$$ plain form
34249 2912465 1737032 1162990 1856818 3200928 3486383 1694675 -1035277 -2692724 -2957106
34240 -2957106 -3161536 -3810013 -3858234 -2764062 -1445664 -594973 182578 812236 279800
34231 279800 -1209549 -1591881 19457 1452228 438906 -2108954 -3804120 -4335440 -4935368
34222 -4935368 -5333698 -3947733 -883450 1617522 1963436 735290 -611412 -1083744 -389543
34213 -389543 669077 398977 -1605633 -3047618 -1639321 1277612 2234238 654394 -316706
34204 -316706 1454637 4145739 4950312 3817002 2645388 2329826 2264878 1846355 1102314
34195 1102314 419157 499095 1862076 3702931 4170051 2583446 510676 -136097 812119
34186 812119 2345224 3868534 5163111 5610536 4716763 2979849 1245591 -375148 -2031621
$$ packed form
34249B912465j175433n74042O93828J344110K85455j791708k729952j657447k64382
34240b957106k04430o48477m8221J094172J318398Q50691P77551O29658n32436
34231B79800j489349l82332J611338J432771j013322k547860j695166n31320n99928
34222d935368l98330J385965L064283K500972L45914j228146j346702m72332O94201
34213c89543J058620k70100k004610j441985J408297K916933R56626j579844r71100
34204c16706J771343K691102Q04573j133310j171614l15562o4948m18523p44041
34195A102314o83157P9938J362981J840855M67120j586605k072770o46773R48216
34186H12119J533105J523310J294577M47425q93773j736914j734258j620739j656473
$$ plain form
34177 -2031621 -3085252 -2693731 -1296788 -472758 -1133871 -2493870 -2934584 -1507880 1307970
34168 1307970 3897638 4662387 3352546 1307690 206031 682739 2164889 3559914
34160 3559914 3865322 2693960 736664 -656484 -851825 -599069 -911128 -1682676 -1999861
34151 -1999861 -1482846 -574412 382541 1527200 2724030 3147576 2252974 893536 710164
34142 710164 2135871 3623441 3582213 2728817 3279897 5545211 6843609 5011622 1772842
34133 1772842 656327 2115873 3089001 1613332 -663198 -1609576 -1767772 -2409807 -2422332
34124 -2422332 46239 3766128 5281709 3643021 1556315 1234643 1713688 1473906 1253634
34115 1253634 2213387 3106584 1861142 -892460 -2466432 -2100658 -1807396 -2828624 -3609720
$$ packed form
34177b031621j053631L91521J396943Q24030o61113j359999m40714J426704K815850
34168A307970K589668P64749j309841k044856j101659M76708J482150J395025
34160C559914L05408j171362j957296j393148j95341K52756l12059p71548l17185
34151a999861N17015R08434R56953J144659J196830M23546q94602j359438j83372
34142G10164J425707J487570m1228q53396N51080K265314J298398j831987l238780
34133A772842j116515J459546R73128j475669k276530r46378j58196o42035j2525
34124b422332K468571L719889J515581j638688k086706l21672M79045k39782k20272
34115A253634R59753Q93197j245442k753602j573972L65774K93262j021228p81096
$$ plain form
34106 -3609720 -2395523 35194 1706603 2195471 2502871 3106881 3654728 3953831 3914930
34097 3914930 3155437 2000193 2013320 3777325 4981316 3105344 -369373 -1295180 1231765
34088 1231765 3363223 2175595 -74601 391687 3281203 5222255 4956950 4346970 4609555
34079 4609555 4616912 3475846 2335363 2499867 3302093 3002113 1071535 -1089360 -1413783
34070 -1413783 845633 4059006 5689409 5369076 5430962 7262254 8554281 6294011 1483567
34061 1483567 -1857113 -2040207 -1094341 -636088 353762 2540325 4124718 3685985 2754881
34052 2754881 3288037 4350374 3712808 1575392 363293 1412036 3775762 5912095
34044 5912095 6952695 6722756 5914007 5787240 6480571 6322316 4194289 1771920 1734814
$$ packed form
34106c609720J214197K430717J671409M88868L07400O04010N47847K99103l8901
34097C914930p59493j155244J3127J764005J203991j875972l474717r25807K526945
34088A231765K131458j187628k250196M66288K889516J941052k65305o09980K62585
34079D609555P357j141066j140483J64504Q02226k99980j930578k160895l24423
34070a413783K259416L213373J630403l20333O1886J831292J292027k260270m810444
34061A483567l340680j83094R45866M58253R89850K186563J584393m38733r31104
34052B754881N33156J062337o37566k137416j212099J048743K363726K136333
34044E912095J040600k29939q08749j26767O93331j58255k128027k422369l7106
$$ plain form
34035 1734814 4299508 7226279 8851101 9362823 9331600 8818464 8115632 7907277 8505253
34026 8505253 9986342 12798183 16945843 21064607 23985796 26869196 31823022 38552515
34018 38552515 44564856 48797480 52527781 56064369 57292522 55088556 51906741 50777677
34010 50777677 51233655 50505896 47779573 44822904 42740299 40528171 37300923 33995184
34002 33995184 31905934 30794045 29474250 27528657 25477809 23654197 21862767 20233633
33994 20233633 19638639 20631166 22089009 21644569 18121489 13375367 10899449 12281883
33986 12281883 15644993 17963181 18182289 17306568 16133618 14333811 11839778 9749811
33978 9749811 9066030 9364643 9609406 9719948 10251971 10767820 9881231 7402852 5347800
$$ packed form
34035A734814K564694K926771J624822N11722l1223n13136p02832k08355N97976
34026H505253J481089K811841M147660M118764K921189K883400M953826O729493
34018C8552515O012341M232624L730301L536588J228153k203966l181815j129064
34010E0777677M55978p27759k726323k956669k082605k212128l227248l305739
34002C3995184k089250j111889j319795j945593k050848j823612j791430j629134
33994B0233633n94994R92527J457843m44440l523080m746122k475918J382434
33986A2281883L363110K318188K19108q75721j172950j799807k494033k089967
33978I749811o83781K98613K44763J10542N32023N15849q86589k478379k055052
$$ plain form
33969 5347800 5779041 8126127 9713741 8863864 6451208 4229830 2749912 1627798
33961 1627798 1013056 1613287 3389936 5184630 5913422 5626253 5193788 5325070 6069524
33952 6069524 7008962 7730831 8128055 8192450 7583833 5861895 3414140 1587289 1218408
33943 1218408 1413186 713955 -609823 -521573 2160962 5968526 8230943 7829876 5980250
33934 5980250 4669894 4836258 5802764 6071086 4892396 3338639 3375903 5441819 7512907
33925 7512907 7389557 5542203 4592808 5915957 7935935 8412509 7485186 7317972 8974176
33916 8974176 10825330 10567476 8195708 6243953 7071475 10372907 13608802 14691061
33908 14691061 13909224 13172293 13775853 15438495 17462738 19994825 23405560 26828028
$$ packed form
33969E347800M31241K347086J587614q49877k412656k221378j479918j122114
33961A627798o14742O00231J776649J794694P28792k87169m32465J31282P44454
33952F069524R39438P21869L97224O4395o08617j721938k447755j826851l68881
33943A218408J94778o99231j323778Q8250K682535L807564K262417m01067j849626
33934E980250j310356J66364R66506K68322j178690j553757L7264K065916K071088
33925G512907j23350j847354r49395J323149K019978M76574r27323j67214J656204
33916H974176J851154k57854k371768j951755Q27522L301432L235895J082259
33908A4691061p81837p36931O03560J662642K024243K532087L410735L422468
$$ plain form
33900 26828028 28468214 27800036 26672343 27546149 31125254 36496067 43158640 51710958
33892 51710958 62415655 74406197 87300102 103118605 125597617 157149180 196213159
33885 196213159 236943084 271304228 292642328 298901724 293171538 280977856 266789441
33878 266789441 252652178 238991887 225607437 212095596 198367095 185006942 172535762
33871 172535762 160397230 147625519 134667745 123386323 114615784 106740619 97740539
33864 97740539 87967427 79635022 73837285 69391163 64752610 59866757 55697886 52940151
33856 52940151 51766133 51997896 52899983 53637053 54695385 57959429 64224453 71254998
33848 71254998 75691054 76602913 75747212 74452503 72022140 67704833 62560189 58239120
$$ packed form
33900B6828028J640186o68178j127693Q73806L579105N370813O662573Q552318
33892E1710958J0704697J1990542J2893905J5818503K2479012L1551563L9063979
33885A96213159M0729925L4361144K1338100O259396n730186j2193682j4188415
33878B66789441j4137263j3660291j3384450j3511841j3728501j3360153j2471180
33871A72535762j2138532j2771711j2957774j1281422q770539p875165r000080
33864I7740539r773112q332405n797737m446122m638553m885853m168871k757735
33856E2940151j174018K31763R02087P37070J058332L264044O265024P030545
33848G1254998M436056R11859q55701j294709k430363m317307n144644m321069
$$ plain form
33840 58239120 54972597 51887223 48578952 45381838 42699957 40944406 40419614 40332738
33832 40332738 38736271 34692047 29858486 26593493 25000349 23289391 20616788 17900194
33824 17900194 16011225 14915972 14682908 15568571 16761606 16741865 15440878 14512329 14882180
33815 14882180 15541087 15339092 14310895 12504605 9420898 5827303 4242510 5827335
33807 5827335 8226180 8481568 6991698 6414844 7430741 8050145 7033774 5628608 5328896
33798 5328896 5796113 5925742 5631069 5518960 5602267 5298230 4389626 3364927 2911442
33789 2911442 3363368 4525458 5834609 6697860 6761681 6065378 5163697 4848857 5242045
33780 5242045 5402764 4590145 3604405 3704509 4422937 4154182 3014652 2914162 4061426
$$ packed form
33840E8239120l266523l085374l308271l197114k681881j755551n24792q6876
33832D0332738j596467m044224m833561l264993j593144j710958k672603k716594
33824A7900194j888969j095253k33064Q85663J193035j9741j300987r28549L69851
33815A4882180O58907k01995j028197j806290l083707l593595j584793J584825
33807E827335K398845K55388j489870n76854J015897O19404j016371j405166k99712
33798E328896M67217J29629k94673j12109Q3307l04037r08604j024699m53485
33789B911442M51926J162090J309151Q63251O3821o96303r01681l14840L93188
33780E242045J60719q12619r85740J00104P18428k68755j139530j00490J147264
$$ plain form
33771 4061426 3923024 1295493 -941411 414027 4131723 6347689 5842239 4529698
33763 4529698 3609260 2605600 1990728 3281722 5996522 7594196 7282015 7050531 7912032
33754 7912032 7946891 5619334 2569707 1235794 1601769 2157308 2514218 3211091 4088765
33745 4088765 4543578 4554318 4208270 3164276 1676890 1018621 1719371 2524486 2268309
33736 2268309 1574723 1457981 1562537 1340616 1777085 4043356 7097819 8415435 6916613
33727 6916613 3918288 1447544 602462 1165481 1940707 1877381 1381992 1695571 2560358
33718 2560358 2001185 -612810 -2934215 -2582240 -324554 1441624 2164559 3074696 4548570
33709 4548570 5684537 6085169 6209553 6259586 6263329 6737675 7712411 7822818 6154239 4249374
$$ packed form
33771D061426j38402k627531k236904J355438L717696K215966n05450j312541
33763D529698r20438j003660o14872J290994K714800J597674l12181k31484Q61501
33754G912032L4859k327557l049627j333913L65975N55539L56910O96873Q77674
33745D088765M54813J0740l46048j043994j487386o58269P00750Q05115k56177
33736B268309o93586j16742J04556k21921M36469K266271L054463J317616j498822
33727F916613k998325k470744q45082N63019P75226o3326m95389L13579Q64787
33718B560358n59173k613995k321405L51975K257686J766178P22935R10137J473874
33709D548570J135967M00632J24384N0033L743M74346R74736J10407j668579j904865
$$ plain form
33699 4249374 4261569 5737635 6423659 5751270 5117141 5022830 4622520 4259054 5752494
33690 5752494 9494805 13559386 16452304 18686639 21014337 23384729 26568468 32410506
33682 32410506 40873278 48652696 52503241 52716348 51800196 50883741 49184703 46414789
33674 46414789 43940234 43223366 43887125 43741564 40926671 36220788 32659396 32082391 32720228
33665 32720228 31512948 28193175 25184524 23780384 22773961 21108079 19394200 18018341
33657 18018341 16112493 13617545 12277276 13146390 14843155 15599463 15355415 14578613 12938057
33648 12938057 10716908 9638300 10394669 11026947 9751255 7804320 7290138 7679059 6934572
33639 6934572 4978709 3455645 2889405 2646228 3044466 4801939 6746734 6814243 5358701
$$ packed form
33699D249374J2195J476066O86024o72389o34129r4311m00310l63466J493440
33690E752494L742311M064581K892918K234335K327698K370392L183739N842038
33682C2410506Q462772P779418L850545K13107r16152r16455j699038k769914
33674D6414789k474555p16868O63759j45561k814893m705883l561392n77005O37837
33665C2720228j207280l319773l008651j404140j006423j665882j713879j375859
33657A8018341j905848k494948j340269Q69114J696765P56308k44048p76802j640556
33648A2938057k221149j078608P56369O32278j275692j946935n14182L88921p44487
33639F934572j955863j523064n66240k43177L98238J757473J944795O7509j455542
$$ plain form
33630 5358701 4917653 6401262 7877624 7611285 6181556 5028293 4765387 5416746 6571802
33621 6571802 6918106 5344001 2818963 1458170 1575808 1614267 1095835 1267668 2373964
33612 2373964 2890320 2397067 2622494 4244077 5110804 3513838 1145966 673243 2020465
33603 2020465 3243030 3630604 3594786 2711344 566831 -1141597 -172290 2615634 3798941
33594 3798941 2063059 -32120 31933 1083423 235814 -2590275 -4082870 -1656147 3117732
33585 3117732 6067119 5124308 2539381 1869872 3474289 4317406 2275198 -999567 -2434668
33576 -2434668 -1448107 12337 618538 1074920 2313489 3763372 4089658 2963483 1562302
33567 1562302 1479913 3206374 5567100 6865607 6670754 5992770 5588920 5009026 3803516
$$ packed form
33630E358701m41048J483609J476362k66339j429729j153263k62906O51359J155056
33621F571802L46304j574105k525038j360793J17638L8459n18432J71833J106296
33612B373964N16356m93253K25427J621583Q66727j596966k367872m72723J347222
33603B020465J222565L87574l5818q83442k144513j708428R69307K787924J183307
33594C798941j735882k095179O4053J051490q47609k826089j492595K426723M773879
33585C117732K949387r42811k584927o69509J604417Q43117k042208l274765j435101
33576b434668R86561J460444O06201M56382J238569J449883L26286j126175j401181
33567A562302q2389J726461K360726J298507j94853o77984m03850n79894j205510
$$ plain form
33558 3803516 2622765 2208030 2189688 1933833 1677758 1580859 636485 -1754787 -3871753
33549 -3871753 -3437550 -1066229 207462 -983975 -2815676 -3304037 -2801162 -2602540 -2926467
33540 -2926467 -3414075 -4042530 -4275385 -2759100 620704 3523500 3629709 1575301 -103646
33531 -103646 -332381 -242034 -966092 -2310346 -3594354 -4428082 -4504421 -3778704 -3014345 -3092100
33521 -3092100 -3621823 -3333535 -2125148 -1559398 -2686723 -4328840 -4478760 -2887423 -1228789
33512 -1228789 -777913 -913837 -340600 920359 1604328 1134758 589714 1330230 3253059
33503 3253059 4975729 5351860 4223472 2150043 225104 -246374 1002253 2425932
33495 2425932 2280998 899524 72556 297158 337109 -322961 -655291 -385943 -885949
$$ packed form
33558C803516j180751m14735j8342k55855k56075r6899r44374k391272k116966
33549c871753M34203K371321J273691j191437j831701m88361N02875J98622l23927
33540b926467m87608o28455k32855J516285L379804K902796J06209k054408j678947
33531a03646k28735R0347p24058j344254j284008q33728p6339P25717P64359p7755
33521c092100n29723K88288J208387N65750j127325j642117j49920J591337J658634
33512a228789M50876j35924N73237J260959O83969m69570n45044P40516J922829
33503C253059J722670L76131j128388k073429j924939m71478J248627J423679
33495B425932j44934j381474q26968K24602L9951o60070l32330K69348n00006
$$ plain form
33486 -885949 -2510612 -3248313 -1878223 -468726 -1310545 -3030881 -2698684 -635952 199793
33477 199793 -893767 -1617983 -960483 -668031 -1596555 -1981320 -811251 117417 -593396
33468 -593396 -1389914 -638888 346291 -249471 -1252438 -393718 1671823 2249898 731456
33459 731456 -996030 -1832310 -2494622 -3421614 -4094846 -4421882 -4581517 -3722131 -1236920
33450 -1236920 936148 207684 -2321011 -2646397 199839 2301298 518269 -3015824
33442 -3015824 -4272315 -2714747 -740541 273595 541022 -59321 -1517864 -2212794 -768090
33433 -768090 1166962 817998 -1361652 -2174541 -556378 1078636 928042 196289 224696
33424 224696 69272 -1195945 -2043703 -679582 1802834 2708940 1322929 -722836 -1974203
$$ packed form
33486h85949j624663p37701J370090J409497q41819j720336L32197K062732Q35745
33477A99793j093560p24216O57500K92452r28524l84765J170069R28668p10813
33468e93396p96518P51026R85179n95762j002967Q58720K065541N78075j518442
33459G31456j727486q36280o62312r26992o73232l27036j59635Q59386K485211
33450a236920K173068p28464k528695l25386K846236K101459j783029l534093
33442c015824j256491J557568J974206J014136K67427o00343j458543o94930J444704
33433g68090J935052l48964k179650q12889J618163J635014j50594p31753K8407
33424B24696j55424j265217q47758J364121K482416R06106j386011k045765j251367
$$ plain form
33415 -1974203 -2244725 -1685935 -508976 590194 1126268 1613096 2410363 2467945 864622
33406 864622 -1025538 -971883 733728 1571273 669422 87809 1482315 3587275 4203035
33397 4203035 3010194 1124884 -673702 -1849483 -1533740 318408 2098009 2438515
33389 2438515 2187358 2897004 4078514 3901983 2344822 1539889 2615971 4024013 3838924
33380 3838924 2326804 1154570 1005797 1165952 993606 659223 435127 170395 -180923
33371 -180923 -84203 963871 2525443 3524111 3605854 3589776 4091090 4326705 3280249 1703110
33361 1703110 1510360 2930951 3785062 2460753 336789 -12452 1841034 3975336 4714102
33352 4714102 4153847 3423362 3479413 4309961 4534602 2564209 -830777 -2287015 119807
$$ packed form
33415a974203k70522N58790J176959J099170N36074M86828P97267N7582j603323
33406H64622j890160N3655J705611Q37545r01851n81613J394506K104960O15760
33397D203035j192841j885310j798586j175781L15743J852148J779601L40506
33389B438515k51157P09646J181510j76531j557161q04933J076082J408042j85089
33380C838924j512120j172234j48773J60155j72346l34383k24096k64732l51318
33371a80923R6720J048074J561572R98668Q1743j6078N01314K35615j046456j577139
33361A703110j92750J420591Q54111j324309k123964l49241J853486K134302P38766
33352D714102n60255p30485N6051Q30548K24641j970393l394986j456238K406822
$$ plain form
33343 119807 3699359 4357890 2287548 1515998 3751488 5940114 5011001 2056687 -63473
33334 -63473 -820467 -1313418 -1255084 535218 3339349 4703961 3398021 528582 -2191461
33325 -2191461 -3852172 -4195274 -3480323 -2573156 -2127570 -1731272 -664425 848581 1988721
33316 1988721 2403425 2010292 559591 -1333769 -1606275 977112 4400674 5228693 2855907
33307 2855907 93901 -596562 481696 1969533 3433446 4630793 4634482 3232848 2051011
33298 2051011 2722365 4566317 5416140 4390774 2683992 1780948 1918682 2348203 2321684
33289 2321684 1652398 793133 465430 898188 1443650 1210435 39019 -1329545 -1957411
33280 -1957411 -1465394 -273773 762327 1109952 1017709 1052596 1270162 1217761 682463 -122180
$$ packed form
33343A19807L579552O58531k070342p71550K235490K188626r29113k954314k120160
33334f3473p56994m92951N8334J790302K804131J364612j305940k869439k720043
33325b191461j660711l43102P14951R07167M45586L96298J066847J513006J140140
33316A988721M14704l93133j450701j893360k72506K583387L423562Q28019k372786
33307B855907k762006o90463J078258J487837J463913J197347L689j401634j181837
33298B051011O71354J843952Q49823j025366j706782r03044J37734M29521k6519
33289B321684o69286q59265l27703M32758N45462k33215j171416j368564o27866
33280a957411M92017J191621J036100L47625r2243L4887K17566n2401n35298q04643
$$ plain form
33270 -122180 -1120999 -2388904 -3399033 -3143436 -1572309 -143303 -104116 -804090 -718744
33261 -718744 279295 984046 1115062 1899331 3706669 4556443 2480000 -1323148 -3437176
33252 -3437176 -2397498 -287123 398551 -42284 355567 2013205 3434437 3657741 3319251
33243 3319251 3007757 2105305 46847 -2300441 -3419699 -2781766 -1117975 444972 1067182
33234 1067182 565236 -407246 -948537 -895015 -636508 68873 1969482 4604089 5986404
33225 5986404 4856214 2212923 -212046 -1796497 -2323228 -983082 2072957 4289887
33217 4289887 3128658 -437090 -2985798 -3058563 -2275325 -1922556 -967856 1519837 4105782
33208 4105782 4776124 3748994 3014243 3777844 5484791 6795606 6624436 4811921 2660124
$$ packed form
33270a22180r98819j267905j010129K55597J571127J429006L9187o99974Q5346
33261g18744R98039P04751J31016P84269J807338Q49774k076443l803148k114028
33252c437176J039678K110375O85674m40835L97851J657638J421232K23304l38490
33243C319251l11494r02452k058458k347288j119258O37933J663791J562947O22210
33234A067182n01946r72482n41291N3522K58507P05381J900609K634607J382315
33225E986404j130190k643291k424969j584451n26731J340146L056039K216930
33217D289887j161229l565748k548708p2765P83238L52769R54700K487693K585945
33208D105782O70342j027130p34751P63601J706947J310815j71170j812515k151797
$$ plain form
33199 2660124 2263955 4387774 7312265 8533027 7395180 5530159 4970019 6267462
33191 6267462 8179143 8871901 7763473 6311573 6446155 8142797 9391167 8815742 7309024
33182 7309024 6583247 7189258 8662012 10427669 11488021 10368682 6979561 3793105
33174 3793105 3369697 5055982 6051558 5672173 6222099 8905931 11286857 10698423 8482233
33165 8482233 8160310 10010743 10460333 7526152 4103451 4002450 6655991 8294254 7382678
33156 7382678 6039391 6088753 6620408 6456184 6511327 7895260 9438483 9230384 7556365
33147 7556365 6264450 5915218 5587245 5066529 5083808 5387261 4675715 2906468 1867313
33138 1867313 2701898 4265195 4737333 3792106 2454059 1734815 2113511 3606276 5596766
$$ packed form
33199B660124l96169K123819K924491J220762j137847j865021n60140J297443
33191F267462J911681O92758j108428j451900J34582J696642J248370n75425j506718
33182G309024p25777O06011J472754J765657J060352j119339l389121l186456
33174C793105m23408J686285R95576l79385N49926K683832K380926n88434k216190
33165H482233l21923J850433M49590k934181l422701j01001K653541J638263r11576
33156G382678j343287M9362N31655j64224N5143J383933J543223k08099j674019
33147G556365j291915l49232l27973n20716J7279L03453p11546j769247j039155
33138A867313Q34585J563297M72138r45227j338047p19244L78696J492765J990490
$$ plain form
33129 5596766 6967118 6900503 5524213 3870080 3379483 4856725 7256181 8147353 6335117
33120 6335117 3416635 1692108 1354296 1176055 1049957 1766979 2787275 2587543 1218138
33111 1218138 314129 491119 929116 1519195 2860056 3982974 3083456 1128146 1456173
33102 1456173 4526919 6384441 4354603 1202504 904873 2778569 3067375 810922
33094 810922 -1146721 -420381 2274947 4573238 4696542 2554361 -30476 -783702 336509
33085 336509 1004044 -70136 -1386123 -1514992 -1413983 -2015626 -1932333 -104923 1551733
33076 1551733 1216794 739348 2474625 4371275 2652095 -1578641 -3207422 -654617
33068 -654617 2093443 1884752 511165 728341 1855654 1679072 139152 -1151015 -1375647
$$ packed form
33129E596766J370352o6615j376290j654133m90597J477242K399456Q91172j812236
33120F335117k918482j724527l37812j78241j26098P17022J020296j99732j369405
33111A218138r04009J76990M37997N90079J340861J122918q99518j955310L28027
33102A456173L070746J857522k029838l152099k97631J873696K88806k256453
33094H10922j957643P26340K695328K298291J23304k142181k584837p53226J120211
33085C36509O67535j074180j315987j28869J01009o01643Q3293J827410J656656
33076A551733l34939m77446J735277J896650j719180m230736j628781K552805
33068f54617K748060k08691j373587K17176J127313j76582j539920j290167k24632
$$ plain form
33059 -1375647 -823336 -74395 18479 -1084357 -2335103 -2003608 -389678 247796 -926407
33050 -926407 -2080668 -1683258 -666102 -579976 -1375236 -1997010 -1600784 461239 4049325
33041 4049325 7099146 7196030 4931491 3398076 3691606 3689838 2351892 1976254 4098598
33032 4098598 6083878 4751038 1371380 -81331 1487843 3334954 2920485 458753
33024 458753 -2344252 -4081628 -4133855 -2763551 -789430 1357442 3554691 4708937 3276876
33015 3276876 -16391 -1993361 -1108957 201614 -815224 -3099660 -3722688 -2368257
33007 -2368257 -1064734 -557779 60228 687094 120846 -1455695 -2486148 -2556826 -2531563
32998 -2531563 -2245342 -616910 1736991 2585932 1365935 27418 -118056 -131109 -1050462
$$ packed form
33059a375647N52311P48941R2874j102836j250746L31495J613930O37474j174203
33050i26407j154261L97410J017156Q6126p95260o21774L96226K062023L588086
33041D049325L049821R6884k264539j533415K93530j768j337946l75638K122344
33032D098598J985280j332840l379658j452711J569174J847111m14469k461732
33024D58753k803005j737376n2227J370304J974121K146872K197249J154246j432061
33015C276876l293267j976970Q84404J310571j016838k284436o23028J354431
33007b368257J303523N06955O18007O26866n66248j576541j030453p0678K5263
32998b531563K86221J628432K353901Q48941j219997j338517j45474j3053r19353
$$ plain form
32989 -1050462 -1915518 -1589550 -918789 -1527402 -3477967 -5379721 -6091631 -5401425 -3713642
32980 -3713642 -1819766 -347024 1074743 3323782 6033546 7327154 5992549 3079941
32972 3079941 615549 -526238 -762287 -577988 -88929 567531 1146222 1407000 967740
32963 967740 -446753 -2159723 -2604161 -1029848 1217801 1976857 738014 -919965 -1420113
32954 -1420113 -923381 -545106 -436052 464184 2674164 4975894 5624683 4412968 2760725
32945 2760725 1792248 1156859 39424 -1423705 -2336581 -2243356 -1588241 -1131181 -1196900
32936 -1196900 -1381682 -999881 -105052 190717 -884806 -2303113 -2310703 -947090 -23556
32927 -23556 -246710 -64569 1739066 3950573 4782455 4442829 4224903 4148896 3373436 2226999
$$ packed form
32989a050462q65056L25968O70761o08613j950565j901754p11910O90206J687783
32980c713642J893876J472742J421767K249039K709764J293608j334605k912608
32972C079941k464392j141787k36049J84299M89059O56460N78691K60778m39260
32963I67740j414493j712970m44438J574313K247649P59056j238843j657979n00148
32954a420113M96732L78275J09054R00236K209980K301730O48789j211715j652243
32945B760725r68477o35389j117435j463129r12876R3225O55115M57060o5719
32936a196900j84782L81801Q94829K95769j075523j418307p590J363613R23534
32927b3556k23154J82141J803635K211507Q31882l39626k17926p6007p75460j146437
$$ plain form
32917 2226999 1926937 2598436 3202090 3170800 2690526 1778311 589626 167691 1229095
32908 1229095 2595756 2523862 1186964 89845 -414077 -899547 -703491 1356380 4122338
32899 4122338 4783397 2897430 970847 306455 -758911 -3172971 -4709758 -3327059
32891 -3327059 -619472 543601 51060 -276244 -78568 -329057 -801800 -409409 445345
32882 445345 498976 389103 2067463 5158626 6579719 4793641 2228861 2001934 3866434
32873 3866434 5155857 4727589 4007500 4241608 4472411 3082305 473193 -979001 175369
32864 175369 2403077 2802399 554943 -2195007 -3185340 -2741566 -2764612 -3724934 -4011692
32855 -4011692 -2311302 509366 2340670 1930762 -327062 -2999837 -4440678 -3603409
$$ packed form
32917B226999l00062O71499O03654l1290m80274r12215j188685m21935J061404
32908A229095J366661p1894j336898j097119n03922m85470J96056K059871K765958
32899D122338O61059j885967j926583o64392j065366k414060j536787J382699
32891c327059K707587J163073m92541l27304J97676k50489m72743L92391Q54754
32882D45345N3631j09873J678360L091163J421093j786078k564780k26927J864500
32873C866434J289423m28268p20089K34108K30803j390106k609112j452194J154370
32864A75369K227708L99322k247456k749950r90333M43774k3046r60322k86758
32855d011692J700390K820668J831304m09908k257824k672775j440841Q37269
$$ plain form
32847 -3603409 -950430 1472364 1618340 -547660 -2956094 -3615711 -2602634 -1581943
32839 -1581943 -1717702 -2680300 -3595429 -4125219 -4294435 -3990498 -3239094 -2471905 -1910460
32830 -1910460 -1168464 -146455 243567 -800127 -2575827 -3742775 -4213753 -4800783 -5192204
32821 -5192204 -4051475 -1412957 850493 1669755 2116413 3019656 3028119 769420 -2394592
32812 -2394592 -3864487 -3323774 -2696541 -2997561 -3381040 -3320941 -3529481 -4175441 -4179171 -3191069
32802 -3191069 -2573895 -3263506 -4081594 -3528847 -2096749 -1265406 -1070311 -380012 861192
32793 861192 1429031 848717 40689 -317381 -619518 -1044885 -796518 595284 2270174
32784 2270174 3179372 3327360 3035222 1980412 196238 -824681 275173 2284353 2375163
$$ packed form
32847c603409K652979K422794J45976k166000k408434o59617J013077J020691
32839a581943j35759r62598r15129n29790j69216L03937P51404P67189N61445
32830a910460P41996J022009L90022j043694j775700j166948m70978n87030l91421
32821e192204J140729K638518K263450Q19262M46658R03243Q463k258699l164012
32812b394592j469895N40713O27233l01020l83479O0099k08540o45960l730R88102
32802c191069O17174o89611q18088N52747J432098Q31343J95095O90299J241204
32793H61192N67839n80314q08028l58070l02137m25367K48367J391802J674890
32784B270174R09198J47988k92138j054810j784174j020919J099854K009180R0810
$$ plain form
32775 2375163 -152515 -2640043 -2385200 -35928 1336883 -147586 -3437042 -5984151
32767 -5984151 -6118910 -4272745 -2521004 -2714571 -4572575 -5914504 -5196988 -3309217 -2231979
32758 -2231979 -2495780 -2964889 -2838904 -2627766 -2879939 -2994576 -2033726 -243950 968092
32749 968092 581308 -981014 -2489377 -3228879 -3274881 -2718318 -1505967 -339212 -650268
32740 -650268 -2684634 -4493829 -4355305 -3512180 -4343867 -6040420 -5012979 -505031 3227315
32731 3227315 2419328 -1000134 -2530601 -1538419 -1086732 -2339642 -3058676 -1929779 -771215
32722 -771215 -1215517 -2074522 -1675382 -702263 -939220 -2542369 -3994551 -3851681 -1703340
32713 -1703340 1515548 3583276 2735176 18278 -1526615 -672088 627299 397409 -712353
$$ packed form
32775B375163k527678k487528K54843K349272J372811j484469l289456k547109
32767e984151j34759J846165J751741j93567j858004j341929P17516J887771J077238
32758b231979k63801m69109J25985K11138k52173j14637R60850J789776J212042
32749I68092l86784j562322j508363p39502m6002N56563J212351J166755l11056
32740f50268k034366j809195J38524Q43125q31687j696553J027441M507948L732346
32731C227315q07987l419462j530467R92182M51687j252910p19034J128897J158564
32722g71215m44302q59005L99140R73119k36957j603149j452182J42870K148341
32713a703340L218888K067728q48100k716898j544893Q54527J299387k29890j109762
$$ plain form
32704 -712353 -1086442 -648573 -274558 -207603 -451372 -1270844 -1945559 -738898 2176850
32695 2176850 3535863 1030103 -2770277 -3171603 601373 4548471 4838213 1495060
32687 1495060 -2710543 -5063464 -4533471 -2314918 -890941 -1353569 -2016092 -962132 875658
32678 875658 1056633 -698028 -2491724 -3475460 -4468462 -5352479 -4667652 -2513474 -1298119
32669 -1298119 -2397892 -4078216 -3976871 -2020741 192195 1343465 745766 -1582004
32661 -1582004 -4046807 -4299867 -2193112 -399976 -795685 -1891443 -1507598 -286232 -248945
32652 -248945 -1086747 -648035 1233073 2092401 472808 -1963449 -2816239 -1852210 -594996
32643 -594996 -180780 -550872 -995214 -732442 470694 1679247 1362623 -833049 -3346421
$$ packed form
32704g12353l74089M37869L74015O6955k43769q19472o74715J206661K915748
32695B176850J359013k505760l800380m01326L772976L947098K89742l343153
32687A495060m205603k352921N29993K218553J423977m62628o62523J053960J837790
32678H75658J80975j754661j793696r83736r93002q84017O84827K154178J215355
32669a298119j099773j680324J01345J956130K212936J151270n97699k327770
32661a582004k464803k53060K106755J793136l95709j095758L83845J221366L7287
32652b48945q37802M38712J881108Q59328j619593k436257q52790R64029J257214
32643e94996M14216l70092m44342K62772J203136J208553l16624k195672k513372
$$ plain form
32634 -3346421 -4242155 -3079964 -861706 1250630 2477122 2256121 660560 -1024732
32626 -1024732 -1210876 35117 706266 -739217 -3161562 -3884528 -2026876 298645 553482
32617 553482 -1265453 -3030043 -3324756 -2766280 -2486659 -2475954 -2038005 -1078859 -39052
32608 -39052 1070585 2579493 4070265 4298049 2694197 452242 -509886 382000 1729350
32599 1729350 1687842 -83187 -2079648 -2447203 -755105 1657402 3029571 2808760 1878138
32590 1878138 1280348 1086233 778493 441961 937090 2677461 4661047 5205950 3711988
32581 3711988 1469652 493602 1397241 2519071 1616871 -1327209 -3600638 -2808260 22175
32572 22175 1568853 365264 -1654796 -2144421 -1232718 -424920 -130496 128037 108905
$$ packed form
32634c346421q95734J162191K218258K112336J226492k21001j595561j685292
32626a024732j86144J245993O71149j445483k422345p22966J857652K325521K54837
32617E53482j818935j764590k94713N58476K79621J0705M37949R59146J039807
32608c9052J109637J508908J490772K27784j603852k241955r62128Q91886J347350
32599A729350m1508j771029j996461l67555J692098K412507J372169k20811r30622
32590A878138n97790j94115l07740l36532M95129J740371J983586N44903j493962
32581C711988k242336r76050R03639J121830r02200k944080k273429P92378K830435
32572B2175J546678j203589k020060m89625R11703Q07798K94424K58533j9132
$$ plain form
32563 108905 -716500 -1743048 -1987705 -1757275 -1813874 -1510189 71072 1575771 639028
32554 639028 -2220372 -3787470 -2839039 -1788258 -2573032 -3792438 -3610250 -2774306 -2468381
32545 -2468381 -1512317 1517281 5091592 6566816 6082907 5896915 6733381 7493751 7858183
32536 7858183 8394553 8537861 7230018 5358255 4867996 5532716 5285620 3753347 2618672
32527 2618672 2262335 1108072 -998966 -1834799 -482916 785772 6668 -1401950 -945754
32518 -945754 1368893 3653167 4927291 5504463 5631133 5297010 4601436 3187441 331403
32509 331403 -3320163 -5316349 -4083896 -1129552 734534 637453 50554 705589 3069001
32500 3069001 6090711 7642527 6159123 2657069 28961 -460274 -569998 -1969048
$$ packed form
32563A08905q25405j026548k44657K30430n6599L03685J581261J504699r36743
32554F39028k859400j567098R48431J050781p84774j219406J82188Q35944L05925
32545b468381R56064L029598L574311J475224m83909j85992Q36466P60370L64432
32536G858183N36370J43308j307843j871763m90259O64720k47096j532273j134675
32527B618672l56337j154263k107038q35833J351883J268688p79104j408618M56196
32518i45754K314647K284274J274124N77172J26670l34123o95574j413995k856038
32509C31403l651566j996186J232453K954344J864086r7081n86899O55035K363412
32500C069001L021710J551816j483404l502054k628108m89235j09724j399050
$$ plain form
32492 -1969048 -3439753 -2890939 -762629 714589 890984 1241109 2784810 4679364 5380635
32483 5380635 4055627 1141286 -1542503 -1960144 -300711 678528 -809185 -2771428
32475 -2771428 -2127859 653278 2062207 436582 -2176256 -3345480 -3063412 -2447765 -1750814
32466 -1750814 -915829 -584976 -1152749 -1717662 -1146535 341752 1478574 1426690 421407
32457 421407 -638103 -859250 -104257 627122 101105 -1566695 -2790581 -2321112 -656657
32448 -656657 763659 1386465 2037060 3568990 5337271 5482195 3136336 -5666 -1340707
32439 -1340707 -651814 -322658 -1624637 -2537962 -855821 2034983 2889525 1367180 286275
32430 286275 1065865 1730278 359424 -1910608 -2837878 -2273783 -1803150 -2359117 -3588647
$$ packed form
32492a969048j470705N48814K128310J477218J76395L50125J543701J894554P01271
32483E380635j325008k914341k683789m17641J659433R79239j487713j962243
32475b771428O43569K781137J408929j625625k612838j169224K82068O15647O96951
32466a750814Q34985L30853n67773n64913N71127J488287J136822n1884j005283
32457D21407j059510k21147P54993P31379n26017j667800j223886M69469J664455
32448f56657J420316O22806O50595J531930J768281J44924k345859l142002j335041
32439a340707O88893L29156j301979r13325J682141K890804Q54542j522345j080905
32430B86275P79590O64413j370854k270032r27270N64095M70633n55967j229530
$$ plain form
32421 -3588647 -4689907 -4733678 -3024179 -174155 2025614 2655391 2555042 2431024 1627969
32412 1627969 18111 -618745 927705 2801634 2444905 551206 25649 1436860 2337989
32403 2337989 1278589 -312920 -950475 -1160839 -1611591 -1601235 -929003 -1070114 -2599962
32394 -2599962 -3373938 -1544058 1161404 1768016 567649 425613 2080211 3155249 2089644
32385 2089644 213173 -867168 -1379677 -1716472 -1000882 986714 2281412 1085185 -1549839
32376 -1549839 -3172496 -3115679 -2525674 -2084570 -1612889 -1458581 -2363118 -3943330 -4839017
32367 -4839017 -4462729 -3402132 -2218146 -1122187 -691362 -1458275 -2684089 -2854717 -1629748
32358 -1629748 -213287 341964 176902 -71329 -29604 302182 336537 -796555 -2660987
$$ packed form
32421c588647j101260m3771J709499K850024K199769O29777j00349j24018q03055
32412A627969j609858o36856J546450J873929l56729j893699n25557J411211R01129
32403B337989j059400j591509o37555k10364m50752J0356O72232j41111j529848
32394b599962p73976J829880K705462O06612j200367j42036J654598J075038j065605
32385B089644j876471j080341n12509l36795P15590J987596J294698j196227k635024
32376a549839j622657N6817N90005M41104M71681J54308r04537j580212q95687
32367d839017L76288J060597J183986J095959M30825p66913j225814j70628J224969
32358a629748J416461N55251j65062k48231M1725L31786L4355j133092j864432
$$ plain form
32349 -2660987 -3018275 -630391 2141528 1863445 -1115685 -3018667 -2070762 -591692 -743097
32340 -743097 -1262404 -297786 1084133 731689 -992854 -2026563 -1946874 -2104638 -3032257
32331 -3032257 -3849884 -3988357 -3774539 -3467092 -3043483 -2640121 -2115632 -783528 1277121
32322 1277121 2432436 1364415 -962091 -2552332 -2917841 -3001033 -3257519 -3241745 -2578198
32313 -2578198 -1169502 868256 2491777 2145090 139935 -880974 474099 1972610
32305 1972610 1147483 -656961 -516613 1165297 1449373 -164198 -1247602 -858108 -759463
32296 -759463 -1776531 -2477644 -2357717 -2916009 -4318716 -4264678 -1834958 513825 721501
32287 721501 146460 634808 1077237 -506296 -3348793 -5057912 -5039129 -4469636 -4010960
$$ packed form
32349b660987l57288K387884K771919k78083k979130j902982R47905J479070j51405
32340g43097n19307R64618J381919l52444j724543j033709P9689j57764r27619
32331c032257q17627j38473K13818L07447M23609M03362N24489J332104K060649
32322A277121J155315j068021k326506j590241l65509q3192k56486J5774O63547
32313b578198J408696K037758J623521l46687k005155j020909J355073J498511
32305A972610q25127j804444J40348J681910K84076j613571j083404L89494R8645
32296g59463j017068p01113J19927n58292j402707N4038K429720K348783K07676
32287G21501n75041M88348M42429j583533k842497j709119J8783N69493M58676
$$ plain form
32278 -4010960 -3709539 -4058451 -4999753 -4928532 -2926206 -1002394 -1647911 -3852324 -4229939
32269 -4229939 -1940433 151476 -360448 -2420029 -3546660 -3084280 -2270797 -2217239 -2960962
32260 -2960962 -4005701 -4921068 -5427907 -5285974 -4334619 -2867527 -1868007 -2225988 -3482732
32251 -3482732 -4097400 -3388161 -2376580 -2090762 -1957965 -839535 1066853 2446436 2514389
32242 2514389 1516194 126690 -678055 216487 2758892 4946450 4638845 2068065 -553412
32233 -553412 -1765850 -1976680 -1869043 -1151694 498754 2295124 3049912 2589855 1696136
32224 1696136 792305 -507215 -2226676 -3131084 -2045373 -2093 364776 -1625307 -3178863
32215 -3178863 -1740049 878342 616130 -2884833 -5490999 -4458633 -2017731 -1348910
$$ packed form
32278d010960L01421l48912r41302P1221K002326J923812o45517k204413l77615
32269d229939K289506K091909n11924k059581j126631M62380Q13483N3558p43723
32260b960962j044739r15367n06839J41933R51355J467092R99520l57981j256744
32251c482732o14668P09239J011581K85818J32797J118430J906388J379583O7953
32242B514389r98195j389504q04745Q94542K542405K187558l07605k570780k621477
32233e53412j212438k10830J07637P17349J650448J796370P54788m60057q93719
32224A696136r03831j299520j719461r04408J085711K043280L66869j990083j553556
32215c178863J438814K618391k62212l500963k606166J032366K440902O68821
$$ plain form
32207 -1348910 -1794159 -860251 971069 903937 -1349369 -2684530 -939118 2419099 4684746
32198 4684746 5036339 4368572 3528482 2823385 2460769 2552816 2876928 2961297 2387475 1234167
32188 1234167 354197 616402 1579524 1820503 1070067 776758 1665561 2213721 1024936
32179 1024936 -682782 -950247 -280383 -521921 -1302202 -442914 2087382 3555677 2548949
32170 2548949 1137957 1702124 3590098 4471880 3666601 2640688 2911489 4464664 5758749
32161 5758749 4856274 1356843 -2427905 -3252989 -422762 3423239 5410944 5230720 4335828
32152 4335828 3615010 2855477 1701656 144383 -1548122 -2754000 -2768667 -1640803 -307718
32143 -307718 513052 1142080 2276210 3857494 4924072 4463831 2437531 89317 -1127570
$$ packed form
32207a348910m45249R33908J831320o7132k253306j335161J745412L358217K265647
32198D684746L51593o67767q40090p05097l62616R2047L24112Q4369n73822j153308
32188A234167q79970K62205R63122K40979p50436k93309Q88803N48160j188785
32179A024936j707718k67465O69864k41538p80281Q59288K530296J468295j006728
32170B548949j410992N64167J887974Q81782q05279j025913K70801J553175J294085
32161E758749r02475l499431l784748q25084K830227L846001J987705j80224q94892
32152D335828p20818p59533j153821j557273j692505j205878j4667J127864J333085
32143c07718Q20770O29028J134130J581284J066578m60241k026300k348214j216887
$$ plain form
32134 -1127570 -1232100 -1655966 -2960737 -3644102 -2372763 -385095 99812 -774645 -840772
32125 -840772 626574 1990488 1987225 1213779 419679 -567535 -1510602 -1421827 -498344 -475622
32115 -475622 -1968646 -3305189 -3236146 -2987908 -4088121 -5725959 -5998871 -4605533 -2708921
32106 -2708921 -1143789 -203963 -167598 -599813 -197202 1224004 1766609 129093 -1989178
32097 -1989178 -2211742 -1202148 -1596888 -3690546 -4830242 -3434375 -1290931 -948182 -2518736
32088 -2518736 -4169636 -4652049 -4241076 -3747982 -3519214 -3346939 -2949715 -2461115 -2391280
32079 -2391280 -3008523 -3923510 -4404920 -3907081 -2395939 -708981 -418576 -2254135 -4514844
32070 -4514844 -4435931 -1700827 865674 981994 -293141 -753927 -396483 -553636 -878033
$$ packed form
32134a127570j04530m23866j304771o83365J271339J987668M84907q74457o6127
32125h40772J467346J363914l263p73446p94100r87214r43067Q8775R23483K2722
32115d75622j493024j336543O9043K48238j100213j637838k72912J393338J896612
32106b708921J565132R39826L6365m32215M02611J421206N42605j637516k118271
32097a989178k22564J009594l94740k093658j139696J395867K143444L42749j570554
32088b518736j650900m82413M10973M93094K28768J72275L97224M88600O9835
32079b391280o17243r14987m81410M97839J511142J686958K90405j835559k260709
32070d514844P8913K735104K566501J16320j275135m60786L57444j57153l24397
$$ plain form
32061 -878033 277907 2811392 4575787 4343015 3088081 2006677 1104990 281100 106681
32052 106681 740599 1358210 1370805 1125042 854651 117757 -1067583 -1687082 -1212477 -710448
32042 -710448 -1491502 -3238691 -4390839 -4056806 -2783380 -1579633 -826105 -231412 499463
32033 499463 1168901 1290846 730344 -111458 -886190 -1733987 -2815622 -3722785 -3787538 -2822667
32023 -2822667 -1286993 59773 571307 269838 51763 575158 908475 -437698 -2813584
32014 -2813584 -3538169 -1670051 280868 81320 -748503 289398 2065883 1460133 -1138388
32005 -1138388 -1942908 162508 1566027 -541570 -3981177 -5215204 -4430268 -4174051 -4847002
31996 -4847002 -4676500 -3229627 -2004213 -1694103 -1301244 -143919 1237388 2427513 3605396
$$ packed form
32061h78033J155940K533485J764395k32772j254934j081404r01687q23890j74419
32052A06681O33918O17611J2595k45763k70391p36894j185340o19499M74605N02029
32042g10448p81054j747189j152148L34033J273426J203747P53528N94693P30875
32033D99463O69438J21945n60502q41802p74732q47797j081635r07163o4753R64871
32023b822667J535674J346766N11534l01469k18075N23395L33317j346173k375886
32014b813584p24585J868118J950919j99548q29823J037901J776485o05750k598521
32005a138388q04520K105416J403519k107597l439607j234027P84936K56217o72951
31996d847002J70502J446873J225414L10110L92859J157325J381307J190125J177883
$$ plain form
31987 3605396 4302000 3397841 1060669 -733953 -593709 362579 36734 -1776606 -3198725
31978 -3198725 -2866540 -1636736 -1178763 -1613841 -1588635 -585469 99480 -679671 -2057109
31969 -2057109 -2449614 -1972359 -2009621 -2753810 -2995229 -2377516 -1844252 -1421645 196727
31960 196727 2799902 3651944 1201263 -1942003 -2072512 639838 2679919 2113142 458775
31951 458775 -389227 -684081 -1519632 -2820040 -3661824 -3531475 -2554154 -1274300 -602539
31942 -602539 -1166138 -2427603 -3187685 -2993865 -2180476 -733631 1522043 3602441 3912637
31933 3912637 2632543 2001344 3420410 5619775 6578933 5943119 4505905 2677173 905477
31924 905477 465443 1997312 3871012 3812334 1939847 524171 772926 1534620 1445470
$$ packed form
31987C605396O96604r04159k337172j794622J40244R56288l25845j813340j422119
31978c198725L32185J229804M57973m35078K5206J003166O84949p79151j377438
31969b057109l92505M77255l7262p44189k41419O17713N33264M22607J618372
31960A96727K603175Q52042k450681l143266j30509K712350K040081n66777j654367
31951D58775q48002k94854q35551j300408q41784J30349R77321J279854O71761
31942f02539n63599j261465p60082J93820Q13389J446845K255674K080398L10196
31933C912637j280094o31199J419066K199365R59158o35814j437214j828732j771696
31924I05477m40034J531869J873700n8678j872487j415676K48755P61694q9150
$$ plain form
31915 1445470 722391 186344 -118725 -473437 -723957 -890196 -1644202 -3158392 -4152071
31906 -4152071 -3248859 -993282 540080 126997 -1433632 -2511364 -2197235 -535053 1991201
31897 1991201 4670274 6559994 6745336 4862282 1592472 -1387780 -2526327 -1919352
31889 -1919352 -1290181 -1878382 -2835482 -2583428 -1342976 -1014878 -2501378 -4490395 -5334559
31880 -5334559 -4900213 -3875616 -2437444 -646728 729496 1003015 636831 482121 462527
31871 462527 78069 -370923 -369224 -519937 -1732462 -3276509 -3372093 -1906182 -842856
31862 -842856 -1408165 -2514623 -2797416 -2608512 -2734966 -2505924 -912150 1134007 1501764
31853 1501764 -245115 -2119975 -2143829 -369452 1797198 3206620 3363965 2160019 145719
$$ packed form
31915A445470p23079n36047l05069l54712k50520j66239p54006j514190r93679
31906d152071R03212K255577J533362m13083j560629j077732L14129J662182K526254
31897A991201K679073J889720J85342j883054l269810k980252j138547O06975
31889a919352O29171n88201r57100K52054J240452L28098j486500j989017q44164
31880e334559M34346J024597J438172J790716J376224K73519l66184j54710j9594
31871D62527l84458m48992J699j50713j212525j544047r5584J465911J063326
31862h42856n65309j106458k82793J88904j26454K29042J593774K046157L67757
31853A501764j746879j874860k3854J774377K166650J409422J57345j203946k014300
$$ plain form
31844 145719 -1305702 -1084738 248716 873772 -32253 -1017908 -159018 2163330 3540097
31835 3540097 2889730 2082455 3108710 4861327 4588824 1983707 -316654 -418230 693095
31826 693095 1228401 870332 118212 -860022 -1645185 -1435387 -599250 -716175 -1876073
31817 -1876073 -1837640 495663 2733753 2332218 488256 7979 751007 396093 -1205856
31808 -1205856 -1972559 -1532825 -1593190 -2214293 -1484992 379738 510506 -1606375 -2423642
31799 -2423642 74631 2550281 1192297 -2334231 -3485446 -1530605 252578 140570
31791 140570 -199385 446779 636185 -1050578 -3590936 -5047580 -4996349 -4454368 -4339640
31782 -4339640 -4610266 -4416669 -3081210 -1304224 -726503 -1615728 -2154859 -1255312 -655253
$$ packed form
31844A45719j451421K20964J333454O25056r06025r85655Q58890K322348J376767
31835C540097o50367q07275J026255J752617k72503k605117k300361j01576J111325
31826F93095N35306l58069p52120r78234p85163K09798Q36137j16925j159898
31817a876073L8433K333303K238090m01535j843962m80277P43028l54914j601949
31808a205856p66703M39734o0365o21103P29301J864730J30768k116881q17267
31799b423642K498273K475650j357984l526528j151215J954841J783183j12008
31791A40570l39955O46164J89406j686763k540358j456644N1231N41981J14728
31782d339640k70626J93597J335459J776986N77721q89225n39131Q99547O00059
$$ plain form
31773 -655253 -2241927 -4537444 -4508748 -2196801 -606303 -1117097 -2030555 -2041203 -2095576
31764 -2095576 -2842614 -3035891 -1866889 -543112 -72312 439576 1769560 2771526 2182044
31755 2182044 622209 -582691 -978867 -241880 2109125 4837798 5104154 2378886 58477
31746 58477 867557 2774943 2318369 98923 -538831 874129 1462340 -67746 -1630769
31737 -1630769 -1412873 -274920 374082 636235 1080749 1558719 1851932 1990853 1601823
31728 1601823 490019 -161426 928445 2712027 2851695 1269008 267594 840765 1448696
31719 1448696 1077101 845135 1562143 2196930 2015359 1894494 2177084 1559306 -320608
31710 -320608 -1464629 -555752 647837 96937 -1119077 -525620 1712060 2857327 1233542
$$ packed form
31773f55253j586674k295517K8696K311947J590498n10794r13458j0648n4373
31764b095576p47038j93277J169002J323777M70800N11888J329984J001966n89482
31755B182044j559835j204900l96176P36987K351005K728673K66356k725268k320409
31746E8477Q09080J907386m56574k219446o37754J412960N88211j530086j563023
31737a630769K17896J137953O49002K62153M44514M77970K93213J38921l89030
31728A601823j111804o51445J089871J783582J39668j582687j001414N73171O07931
31719A448696l71595k31966P17008O34787j81571j20865K82590o17778j879914
31710c20608j144021R08877J203589n50900j216014N93457K237680J145267j623785
$$ plain form
31701 1233542 -1905754 -3857986 -2870515 316060 2775269 2292100 182017 -453668 676367
31692 676367 892205 -550623 -1013362 550318 1178704 -827683 -2147002 173246 2991912
31683 2991912 1631931 -2369576 -3593760 -1335673 -82178 -1816463 -3502858 -2746916
31675 -2746916 -787430 1060429 3064819 4050538 1587207 -3180276 -5546828 -4038928
31667 -4038928 -2680170 -4261769 -6009893 -4927825 -3022408 -3380282 -4693095 -3898765
31659 -3898765 -1416268 454074 1947303 4331221 5909383 4039628 40417 -2133584
31651 -2133584 -1528999 -734557 -1248896 -1936830 -1906188 -1528987 -630046 1219177 2689583
31642 2689583 2049290 406313 435013 1948927 2169150 605094 -31439 1412760 2519506
$$ packed form
31701A233542l139296j952232R87471L186575K459209m83169k110083o35685J130035
31692F76367K15838j442828m62739J563680O28386k006387j319319K320248K818666
31683B991912j359981m001507j224184K258087J253495j734285j686395P55942
31675b746916J959486J847859K004390R85719k463331m767483k366552J507900
31667d038928J358758j581599j748124J082068J905417l57874j312813P94330
31659c898765K482497J870342J493229K383918J578162j869755l999211k174001
31651b133584O04585P94442n14339o87934L0642L77201Q98941J849223J470406
31642B689583o40293j642977K8700J513914K20223j564056o36533J444199J106746
$$ plain form
31633 2519506 1506797 134560 409914 1151474 177907 -2137920 -3834558 -4380799 -4564337
31624 -4564337 -4480251 -3670433 -2583431 -2154626 -2331801 -2362742 -2172731 -2320584 -2899917 -3397284
31614 -3397284 -3358046 -2567704 -1046651 552633 1113110 242439 -1158836 -1901743 -1483519
31605 -1483519 113417 2504169 4286903 3678393 882504 -1170251 123429 3731104
31597 3731104 6092531 5346259 3095229 1785787 1698477 1443733 640247 648229 2282829
31588 2282829 3933368 3242771 430330 -1599007 -1074365 158995 -643116 -2950366 -3488150
31579 -3488150 -732261 3122261 5096080 4589016 2889474 1130999 -94067 -259218
31571 -259218 560397 1241105 810670 -281291 -959083 -1111457 -1403286 -1856494 -1754643
$$ packed form
31633B519506j012709j372237K75354P41560r73567k315827j696638n46241j83538
31624d564337Q4086Q09818J087002M28805j77175l0941J90011j47853n79333m97367
31614c397284L9238P90342J521053J599284N60477q70671j401275p42907M18224
31605a483519J596936K390752J782734o08510k795889k052755J293680L607675
31597C731104K361427p46272k251030j309442q7310k54744q03486P982J634600
31588B282829J650539o90597k812441k029337N24642J233360q02111k307250n37784
31579c488150K755889L854522J973819n07064j699542j758475j225066j65151
31571b59218Q19615O80708m30435j091961o77792j52374k91829m53208J01851
$$ plain form
31562 -1754643 -961063 -292176 -297342 -531628 -531951 -784931 -1876915 -3027210 -2591516 -355501
31552 -355501 1647044 1464791 -229669 -1066957 -164989 994548 969456 71208 -928265
31543 -928265 -2260747 -4188403 -5736835 -5735058 -4335018 -2368521 -97323 2168791 3252266
31534 3252266 2506196 1213585 903961 1013704 43512 -1642654 -2231741 -1205954 410237
31525 410237 2097264 3851301 4539820 2918124 308380 -509000 571702 782145 -964491
31516 -964491 -2296476 -1298103 663575 1610498 1859798 2384641 2590169 1848054 1277099
31507 1277099 1773766 1986924 587978 -910418 -120368 2423893 3848645 2756705 387140
31498 387140 -1587921 -2545093 -2502413 -1854888 -1316407 -1006822 -193785 1077376 1258262
$$ packed form
31562a754643P93580O68887n166k34286l23k52980j091984j150295M35694K236015
31552c55501K002545j82253j694460q37288R01968J159537k5092q98248r99473
31543i28265j332482j927656j548432J777J400040J966497K271198K266114J083475
31534C252266p46070j292611l09624J09743r70192j686166n89087J025787J616191
31525D10237J687027J754037O88519j621696k609744q17380J080702K10443j746636
31516i64491j331985R98373J961678R46923K49300N24843K05528p42115n70955
31507A277099M96667K13158j398946j498396P90050K544261J424752j091940k369565
31498C87140j975061r57172M2680O47525N38481L09585Q13037J271161J80886
$$ plain form
31489 1258262 -371774 -1863653 -908432 1950740 4242128 4779796 4027012 2243668 -347979
31480 -347979 -2137285 -1441378 726797 1478857 -61884 -1652632 -1122818 1035469 2806443
31471 2806443 3037211 2154255 1377368 1471925 1803948 1014388 -875485 -2052980 -1488530
31462 -1488530 -505999 -397717 -170034 1226204 2104684 415938 -2293220 -2733414 -1079719
31453 -1079719 -626782 -2314684 -3536965 -2964253 -2453181 -2816371 -1778919 1577498 3980161
31444 3980161 2603528 -358135 -1132135 -75117 -225079 -1816933 -2337583 -1342346 -1100650
31435 -1100650 -2178459 -2181581 27567 2161473 2212473 1558817 2208235 3151690 2200764
31426 2200764 115503 -175438 1775410 3003575 1561424 -636803 -873187 390482
$$ packed form
31489A258262j630036j491879R55221K859172K291388N37668p52784j783344k591647
31480c47979j789306O95907K168175P52060j540741j590748N29814K158287J770974
31471B806443K30768q82956p76887R4557L32023p89560j889873j177495N64450
31462a488530R82531J08282K27683J396238Q78480j688746k709158m40194J653695
31453a079719M52937j687902j222281N72712N11072l63190J037452L356417K402663
31444C980161j376633k961663p74000J057018j49962j591854n20650R95237K41696
31435a100650j077809l122K209148K133906N1000o53656O49418R43455r50926
31426B200764k085261k90941J950848J228165j442151k198227k36384J263669
$$ plain form
31418 390482 642340 -728430 -1973018 -2112343 -2099062 -2404643 -1644156 1183004 4579973
31409 4579973 6077343 5024304 2781127 886338 30287 159420 583581 413715 -436581
31400 -436581 -1210603 -1586563 -1993022 -2305033 -1721511 -624638 -773440 -2531906 -3809638
31391 -3809638 -3265559 -2559150 -3437977 -4597820 -3959858 -2245243 -1317421 -575538 1579200
31382 1579200 3980002 4255601 3295888 3968519 5771271 5321468 2443594 986318 2501489
31373 2501489 3849326 2926484 2196889 3837043 5421586 3811089 193012 -2153409
31365 -2153409 -2550366 -2127881 -769155 1630786 2854600 1042515 -1634143 -1499802 1302232
31356 1302232 3236090 2470932 539983 -637828 -573240 695149 2749436 4122501 3597828
$$ packed form
31418C90482K51858j370770j244588j39325J3281l05581P60487K827160L396969
31409D579973J497370j053039k243177j894789q56051J29133M24161j69866q50296
31400d36581p74022l75960m06459l12011N83522J096873j48802j758466j277732
31391c809638N44079P06409q78827j159843O37962J714615R27822P41883K154738
31382A579200K400802K75599r59713O72631J802752m49803k877874j457276J515171
31373B501489J347837r22842p29595J640154J584543j610497l618077k346421
31365b153409l96957M22485J358726K399941J223814j812085k676658J34341K802034
31356A302232J933858p65158j930949j177811O4588J268389K054287J373065n24673
$$ plain form
31347 3597828 1943523 590945 -640974 -2482777 -3859098 -3090403 -843475 553736
31339 553736 302491 -598274 -1634565 -2904683 -3547123 -2607913 -1089720 -680559 -941796
31330 -941796 -350271 470054 -432504 -2609913 -3502415 -2473134 -1373439 -943844 -72747
31321 -72747 882866 -264313 -3371485 -4934285 -3045475 -439138 -486763 -2593753 -3780046
31312 -3780046 -2853909 -804006 1396835 3217496 3858650 2952918 1324618 -98051 -1280645
31303 -1280645 -2224628 -2386349 -1805202 -1429992 -1492471 -1100643 -263905 -440600 -1943107
31294 -1943107 -2793278 -1675126 -164511 -270581 -1476495 -2175323 -2486366 -3445737 -4624201
31285 -4624201 -4819466 -4246400 -3915911 -3573744 -2324262 -694222 -49774 -402775 -646414
$$ packed form
31347C597828j654305j352578j231919j841803j376321P68695K246928J397211
31339E53736k51245r00765j036291j270118o42440R39210J518193M09161k61237
31330i41796N91525Q20325r02558k177409q92502J029281J099695M29595Q71097
31321g2747R55613j147179l107172j562800J888810K606337m7625k106990j186293
31312c780046R26137K049903K200841J820661O41154r05732j628300j422669j182594
31303a280645r43983j61721N81147L75210o2479L91828Q36738j76695j502507
31294a943107q50171J118152J510615j06070j205914o98828l11043r59371j178464
31285d624201j95265N73066L30489L42167J249482J630040O44448l53001k43639
$$ plain form
31276 -646414 -491254 -361553 55237 1209324 2189230 1899835 1230902 1751049 2659021
31267 2659021 1766694 -456458 -904323 1255118 2698388 733059 -2495650 -3058798 -933763
31258 -933763 231684 -1371317 -3214481 -2251522 762215 2374966 1033248 -1161092
31250 -1161092 -1531294 -259927 340661 -753643 -2169262 -2530956 -2323165 -2506290 -2659701
31241 -2659701 -1940824 -1001610 -1214173 -2321545 -2579743 -1287726 453083 1767025 3087423
31232 3087423 4530012 4840224 3273433 1401219 1445685 3295161 4710954 4465934 3789763
31223 3789763 4182821 5033558 4505042 2220694 -166211 -1126592 -887888 -481765 -156553
$$ packed form
31276f46414J55160J29701M16790J154087R79906k89395o68933N20147R07972
31267B659021q92327k223152m47865K159441J443270j965329l228709n63148K125035
31258i33763J165447j603001j843164R62959L013737J612751j341718k194340
31250a161092l70202J271367O00588j094304j415619l61694K07791j83125j53411
31241b659701P18877R39214k12563j107372k58198J292017J740809J313942J320398
31232C087423J442589L10212j566791j872214M4466J849476J415793k45020o76171
31223C789763L93058Q50737n28516k284348k386905r60381K38704M06123L25212
$$ [...]
##END NTUPLES=NMR SPECTRUM
##END=
