##TITLE=31Pdec_CPA2B2906
 CDCl3, 24 sc
 1.07.2021
##JCAMPDX= 6.0         $$ Bruker NMR JCAMP-DX V2.0
##DATA TYPE= NMR SPECTRUM
##DATA CLASS= NTUPLES
##ORIGIN= UXNMR, Bruker Analytische Messtechnik GmbH
##OWNER= root
$$ XWIN-NMR		Version 3.5
$$ Thu Jul  1 09:33:12 2021 Russian Standard Time (UT+4h)  she@DPX200
##.OBSERVE FREQUENCY= 81.013821
##.OBSERVE NUCLEUS= ^31P
##.ACQUISITION MODE= SIMULTANEOUS
##.ACQUISITION SCHEME= undefined
##.AVERAGES= 24
##.DIGITISER RES= 16
##SPECTROMETER/DATA SYSTEM= spect
##.PULSE SEQUENCE= zgpg30
##.SOLVENT NAME= DMSO
##.SHIFT REFERENCE= (INTERNAL, DMSO, 0, 248.564)
##AUDIT TRAIL= $$ (NUMBER, WHEN, WHO, WHERE, WHAT)
$$ ##TITLE= Audit trail, XWIN-NMR		Version 3.5
$$ ##JCAMPDX= 5.01
$$ ##ORIGIN= Bruker BioSpin GmbH
$$ ##OWNER= she
$$ F:/spectra/data/she/nmr/P31/1/pdata/1/auditp.txt
$$ ##AUDIT TRAIL=  $$ (NUMBER, WHEN, WHO, WHERE, WHAT)
(   1,<2021-07-01 09:31:58.59 +0400>,<she>,<DPX200>,
      <created by zg, POWCHK disabled, PULCHK disabled
       configuration hash MD5:
       00 E9 B6 7A A2 85 ED C7 34 08 36 98 17 FE 4E 26
       data hash MD5: 32K
       E3 13 20 1F ED F2 AF 2D E6 9D 58 6E 82 FD FB 3A>)
(   2,<2021-07-01 09:32:06.43 +0400>,<she>,<DPX200>,
      <Start of raw data processing
       efp BC_mod = 2 LB = 1 FT_mod = 6 PKNL = 1 PHC0 = -6854.145 PHC1 = 66.48596 SI = 64K 
       data hash MD5: 64K
       D7 61 22 BE 6D 0E 92 1D 16 62 E5 B5 72 8B EE 93>)
(   3,<2021-07-01 09:32:27.45 +0400>,<she>,<DPX200>,
      <pk PHC0 = -154.9093 PHC1 = -1.8 
       data hash MD5: 64K
       E8 A0 A2 5C 0E 88 89 C0 90 75 40 36 8C FB 7E 2E>)
(   4,<2021-07-01 09:32:31.85 +0400>,<she>,<DPX200>,
      <abs ABSG = 5 
       data hash MD5: 64K
       3F 90 F0 11 96 F1 5B A3 E4 A1 3E D9 EA 61 83 BF>)
$$ ##END=
$$ 
$$ hash MD5
$$ 8F F7 22 6F 29 5E 14 A0 1B CA E7 FB 97 F8 ED 2A
##$RELAX= 
##$RELAX= 
##$RELAX= 
##$RELAX= 
##$RELAX= 
##$RELAX= 
##$RELAX= 
##$RELAX= 
$$ Bruker specific parameters
$$ --------------------------
##$DU= <F:/spectra>
##$EXPNO= 1
##$NAME= <P31>
##$PROCNO= 1
##$TYPE= <nmr>
##$USER= <she>
##$AMP= (0..31)
100 100 100 100 100 100 100 100 100 100 100 100 100 100 100 100 100 100 
100 100 100 100 100 100 100 100 100 100 100 100 100 100 
##$AQSEQ= 0
##$AQ_mod= 1
##$AUNM= <au_zg>
##$AUTOPOS= <>
##$BF1= 81.014009
##$BF2= 200.13
##$BF3= 200.13
##$BF4= 200.13
##$BF5= 200.13
##$BF6= 200.13
##$BF7= 200.13
##$BF8= 200.13
##$BYTORDA= 1
##$CFDGTYP= 0
##$CFRGTYP= 5
##$CHEMSTR= <none>
##$CNST= (0..31)
1 1 145 1 1 1 1 1 1 1 1 1 1 1 1 1 1 1 1 1 1 1 1 1 1 1 1 1 1 1 1 1 
##$CPDPRG= <waltz16>
##$CPDPRG1= <>
##$CPDPRG2= <waltz16>
##$CPDPRG3= <>
##$CPDPRG4= <mlev>
##$CPDPRG5= <mlev>
##$CPDPRG6= <mlev>
##$CPDPRG7= <mlev>
##$CPDPRG8= <mlev>
##$CPDPRGB= <>
##$CPDPRGT= <>
##$D= (0..31)
0 1 0 0 0 0 0 0 0 0 0 0.03 2e-05 3e-06 0 0 0 0 0 0 0 0 0 0 0 0 0 0 0 0 
0 0 
##$DATE= 1625117518
##$DBL= (0..7)
120 120 120 11 120 120 24 19 
##$DBP= (0..7)
150 150 150 150 150 150 150 150 
##$DBP07= 0
##$DBPNAM0= <>
##$DBPNAM1= <>
##$DBPNAM2= <>
$$ [...]
##$SUBNAM3= <"">
##$SUBNAM4= <"">
##$SUBNAM5= <"">
##$SUBNAM6= <"">
##$SUBNAM7= <"">
##$SUBNAM8= <"">
##$SUBNAM9= <"">
##$SW= 501.771253377433
##$SWIBOX= (0..15)
0 1 3 0 0 0 0 0 0 0 0 0 0 0 0 0 
##$SW_h= 40650.406504065
##$TD= 32768
##$TD0= 1
##$TE= 0
##$TE2= 300
##$TE3= 300
##$TEG= 300
##$TL= (0..7)
0 120 53 12 22 120 120 120 
##$TP= (0..7)
150 150 150 150 150 150 150 150 
##$TP07= 0
##$TPNAME0= <>
##$TPNAME1= <>
##$TPNAME2= <>
##$TPNAME3= <>
##$TPNAME4= <>
##$TPNAME5= <>
##$TPNAME6= <>
##$TPNAME7= <>
##$TPOAL= (0..7)
0.5 0.5 0.5 0.5 0.5 0.5 0.5 0.5 
##$TPOFFS= (0..7)
0 0 0 0 0 0 0 0 
##$TUNHIN= 0
##$TUNHOUT= 0
##$TUNXOUT= 0
##$USERA1= <user>
##$USERA2= <user>
##$USERA3= <user>
##$USERA4= <user>
##$USERA5= <user>
##$V9= 5
##$VALIST= <valist>
##$VCLIST= <CCCCCCCCCCCCCCC>
##$VD= 0
##$VDLIST= <DDDDDDDDDDDDDDD>
##$VPLIST= <PPPPPPPPPPPPPPP>
##$VTLIST= <TTTTTTTTTTTTTTT>
##$WBST= 1024
##$WBSW= 4
##$XGAIN= (0..3)
0 0 0 0 
##$XL= 0
##$YL= 0
##$YMAX_a= 9731
##$YMIN_a= -12567
##$ZGOPTNS= <>
##$ZL1= 120
##$ZL2= 120
##$ZL3= 120
##$ZL4= 120
##$ABSF1= 248.5645
##$ABSF2= -253.2056
##$ABSG= 5
##$ABSL= 3
##$ALPHA= 0
##$AQORDER= 0
##$ASSFAC= 0
##$ASSFACI= 0
##$ASSFACX= 0
##$ASSWID= 0
##$AUNMP= <proc_1d>
##$AZFE= 0.1
##$AZFW= 0.5
##$BCFW= 0
##$BC_mod= 2
##$BYTORDP= 0
##$COROFFS= 0
##$CY= -3
##$DATMOD= 1
##$DC= 0
##$DFILT= <>
##$DTYPP= 0
##$F1P= 0
##$F2P= 0
##$FCOR= 1
##$FTSIZE= 65536
##$FT_mod= 6
##$GAMMA= 0
##$GB= 0
##$INTBC= 1
##$INTSCL= 5.30512e-09
##$ISEN= 30
##$LB= 1
##$LEV0= 0
##$LPBIN= 0
##$MAXI= 10000
##$MC2= 0
##$MEAN= 0
##$ME_mod= 0
##$MI= 50
##$NCOEF= 0
##$NC_proc= -5
##$NLEV= 6
##$NOISF1= 182.463
##$NOISF2= 159.3651
##$NSP= 0
##$NTH_PI= 0
##$NZP= 0
##$OFFSET= 248.5645
##$PC= 4
##$PHC0= -7009.054
##$PHC1= 64.68596
##$PH_mod= 1
##$PKNL= yes
##$PPARMOD= 0
##$PSCAL= 0
##$PSIGN= 0
##$REVERSE= no
##$SF= 81.014009
##$SI= 65536
##$SIGF1= 159.3651
##$SIGF2= -187.1042
##$SINO= 113.3802
##$SIOLD= 16384
##$SREGLST= <1H.CDCl3>
##$SSB= 0
##$STSI= 65536
##$STSR= 0
##$SW_p= 40650.406504065
##$SYMM= 0
##$S_DEV= 0
##$TDeff= 32768
##$TDoff= 0
##$TI= <>
##$TILT= no
##$TM1= 0
##$TM2= 0
##$TOPLEV= 0
##$USERP1= <user>
##$USERP2= <user>
##$USERP3= <user>
##$USERP4= <user>
##$USERP5= <user>
##$WDW= 1
##$XDIM= 65536
##$YMAX_p= 285210654
##$YMIN_p= -45856791
$$ End of Bruker specific parameters
$$ ---------------------------------
##NTUPLES= NMR SPECTRUM
##VAR_NAME=  FREQUENCY,     SPECTRUM/REAL,   SPECTRUM/IMAG
##SYMBOL=    X,             R,               I
##VAR_TYPE=  INDEPENDENT,   DEPENDENT,       DEPENDENT
##VAR_FORM=  AFFN,          ASDF,            ASDF
##VAR_DIM=   65536,         65536,           65536
##UNITS=     HZ,            ARBITRARY UNITS, ARBITRARY UNITS
##FACTOR=    0.620285442955139, 1,           1
##FIRST=     20137.2065510759, 0,            0
##LAST=      -20513.1999529892, 0,           0
##MIN=       -20513.1999529892, -45856791,   0
##MAX=       20137.2065510759, 285210654,    0
$$ Real data points
##PAGE= N=1
##DATA TABLE= (X++(R..R)), XYDATA
$$ [...]
43065 -895212 -992323 -1306154 -1687601 -1710611 -1403211 -1197690 -1102938 -670788 79508 503240
43055 503240 360006 216385 453263 637987 372784 53921 165175 392746 124500 -577911
43045 -577911 -1134125 -1256937 -1062210 -667105 -199376 56446 -2919 -61495 114343 243134
43035 243134 6919 -374112 -487181 -328098 -127480 95152 377749 552175 539421 546402
43025 546402 609877 420135 -7532 -87979 388503 723898 376861 -127063 -145992 -76947
43015 -76947 -560659 -1171693 -1105291 -683154 -826936 -1337673 -1155999 -252481 240437 -69809
43005 -69809 -274006 143632 449478 54261 -499543 -627208 -665150 -988749 -1151372 -722626
42995 -722626 -157964 -27723 -104819 12332 63538 -296120 -714373 -729591 -573156 -624278
42985 -624278 -630291 -248115 196729 294359 316710 536460 402614 -543757 -1456910 -1144425
42975 -1144425 42191 576498 -32220 -682362 -501175 15670 106767 -86446 -77701 39847
42965 39847 -86716 -351503 -401613 -234656 -111663 -114944 -138688 -113624 -9027 172093 265093
42954 265093 86524 -213444 -289445 -146765 -101891 -130380 153537 663117 659484 -168477
42944 -168477 -1050130 -1148075 -741009 -681418 -1014439 -972629 -260506 477545 626124 351807
42934 351807 110248 -36650 -234646 -397056 -397477 -432175 -729309 -1024293 -777751 51965
42924 51965 823346 936499 490282 38649 -136657 -270887 -656748 -1157230 -1320310 -931459
42914 -931459 -305275 49633 -24397 -252612 -362618 -413500 -607026 -933411 -1178900 -1212929
42904 -1212929 -1100306 -968268 -923465 -1060788 -1355945 -1546630 -1330559 -739381 -148884 126025
42894 126025 86033 -100829 -264670 -218902 123155 510363 543210 265250 230740 727118
42884 727118 1254610 1141732 434152 -226383 -417119 -209408 200453 641618 815414 488624
42874 488624 -115047 -509890 -544084 -433088 -274454 -12867 155553 -64482 -442998 -371734
42864 -371734 203179 626816 550650 426381 617788 724560 371715 49510 381114 979460
42854 979460 928570 206784 -285705 -129517 89299 -107749 -298015 16369 424631 162358
42844 162358 -639971 -993220 -381649 520310 733107 198048 -289480 -224036 30988 -32856
42834 -32856 -212104 58123 670716 801084 88622 -675967 -501647 464713 1090628 687327
42824 687327 -201348 -551916 -40920 732881 1005819 626312 119098 67396 460775 733175
42814 733175 493561 42646 -49068 244462 344127 -140844 -867333 -1176948 -865805 -337501
42804 -337501 -93403 -268850 -645997 -933251 -960769 -724751 -377273 -163689 -255091 -577512
42794 -577512 -852084 -854136 -602840 -282290 -71871 -111105 -477390 -1007766 -1225573 -715971
42784 -715971 343413 1199490 1199028 411424 -447083 -679089 -237425 251713 162862 -407634
42774 -407634 -779607 -613899 -349730 -452960 -636478 -376611 77509 -33819 -756534 -1279097
42764 -1279097 -1183847 -1023707 -1270482 -1463598 -1024068 -314294 -124839 -478504 -728271 -654556
42754 -654556 -687132 -1029985 -1264135 -1008993 -471475 -98646 -17157 -32101 18326 76026
42744 76026 -29529 -320474 -529006 -374950 -30696 -4766 -372289 -488452 145490 1016846
42734 1016846 1119081 224499 -857013 -1288226 -1024053 -553029 -234378 -92000 -29553
42725 -29553 -34959 -186754 -496719 -794722 -903096 -897300 -929543 -799753 -156846 724793 951750
42714 951750 205680 -591800 -412699 460816 858855 335333 -391064 -550016 -161060 331430
42704 331430 665731 818010 858026 882178 835919 473286 -198398 -633643 -375698 197836
42694 197836 301604 -192712 -679985 -723822 -445732 -75639 262439 332147 -18145 -418711
42684 -418711 -344874 70767 207756 -75693 -312980 -257863 -124310 4902 221260 213011
42674 213011 -467956 -1438551 -1724828 -1194306 -780728 -970094 -1092235 -594788 -6359 15697
42664 15697 -308131 -531103 -786144 -1164768 -1105481 -295255 524542 600316 388091 722835
42654 722835 1314906 1208214 399834 -133105 92497 553194 650526 317331 -267754 -832397
42644 -832397 -963593 -582417 -285783 -550668 -923258 -787230 -508649 -775895 -1184549 -803429
42634 -803429 8405 -131931 -1358869 -2094061 -1398862 -363630 -305326 -822228 -760898 -171441
42624 -171441 5646 -344113 -403442 137910 658513 687374 517728 553894 725767 780943
42614 780943 670384 447893 138034 -166648 -341857 -408606 -445866 -381216 -145948 49782
42604 49782 -49741 -280312 -212950 193673 470867 277093 -158606 -379350 -247478 -1922
42594 -1922 52414 -213644 -688105 -1097095 -1239029 -1162674 -1012956 -768806 -356165 23466
42584 23466 19266 -318986 -457639 -60887 521630 728784 525285 320479 308130 308297 235397
42573 235397 278861 499269 627160 476558 261616 250814 342159 262138 6710 -216183
42563 -216183 -353771 -497672 -573564 -370241 98195 524325 655366 516666 266395 5772
42553 5772 -245527 -516602 -806463 -959240 -773616 -375439 -215548 -420459 -459617 86088
42543 86088 709810 578874 -194442 -634085 -272063 343754 648952 721230 630299 14859
42533 14859 -1110687 -1861931 -1534218 -634939 -158663 -263367 -381768 -258838 -97008 52854
42523 52854 267086 314668 -10928 -310628 -88416 334537 237329 -296544 -500766 -229024
42513 -229024 -154037 -515353 -661560 -207267 234827 -587 -634814 -926635 -627204 -1565
42503 -1565 616831 879251 518303 -184748 -492651 -171283 142154 -60471 -389257 -358235
42493 -358235 -352471 -979893 -1857416 -1968510 -1103431 -94479 392379 502129 510424 293019
42483 293019 -189574 -512045 -352577 -17590 63010 54214 419002 1054172 1263796 685978
42473 685978 -171504 -556434 -369284 -130116 -177144 -268876 -54006 384684 668727 602482
42463 602482 279703 -128515 -431899 -407346 -38852 323435 372103 316194 558221 983156
42453 983156 1073398 744660 487393 525113 434682 -89217 -648994 -755782 -562556 -490730
42443 -490730 -518043 -396945 -262683 -392693 -563097 -304932 277341 587541 455786 352277
42433 352277 563958 741449 510067 69086 -110531 131580 587477 922942 809758 137451
42423 137451 -696981 -1009020 -576813 72402 332028 197363 35650 -24224 -112380 -231372
42413 -231372 -251572 -214149 -282486 -413814 -391951 -184901 23483 165557 350098 556335
42403 556335 594576 470046 460150 662206 775311 575738 328334 389895 610512 539332
42393 539332 133261 -169015 -94778 147540 282588 308278 287420 184780 99719 264061
42383 264061 549910 405540 -329284 -950694 -774624 -169637 -24714 -388247 -477782 -74971
42373 -74971 22887 -683426 -1451771 -1322941 -523360 -69263 -281126 -503554 -246886 153557
42363 153557 190183 -109661 -426460 -664289 -874502 -942540 -709519 -284340 55969 237444
42353 237444 435314 749404 1029040 1085406 936934 724326 450935 -21309 -662833 -1117373
42343 -1117373 -1032199 -502874 11113 228329 277932 323688 245486 -72200 -357122 -217970
42333 -217970 254130 509683 247691 -195890 -329075 -145956 -46925 -227388 -418621 -285746
42323 -285746 109801 383232 290386 -14747 -192855 -86151 173716 346200 294687 62778
42313 62778 -181525 -287490 -249228 -158237 -12308 309979 795901 1166860 1185896 991410
42303 991410 888271 882384 723091 390980 182730 219078 227274 2025 -239539 -226814 -86003
42292 -86003 -89727 -157648 711 325563 380786 -62132 -706115 -1070450 -932097 -385841
42282 -385841 285319 700354 580415 56410 -348903 -243773 172422 346371 64848 -287224
42272 -287224 -266775 7018 26003 -352510 -653051 -436267 79708 347855 247502 119820
42262 119820 133192 73152 -163403 -308758 -165151 47877 40940 -130904 -264649 -369527
42252 -369527 -525390 -564444 -224371 442035 1043035 1200904 824007 170610 -243919 -20405
42242 -20405 659844 1141118 1036297 626944 335712 125364 -251430 -691101 -864820 -749904
42232 -749904 -616452 -562995 -441699 -202046 27488 182821 319742 462636 600632 728673
42222 728673 728631 436657 24664 -45789 238993 215405 -448994 -1010798 -662931 108277 153670
42211 153670 -548720 -862143 -320642 199118 17088 -270228 66251 601067 503503 -95563
42201 -95563 -449253 -467559 -663468 -1055868 -1095087 -682909 -401718 -561923 -746421 -563311
42191 -563311 -245077 -152427 -153240 88453 497682 676835 488251 207045 94862 77136
42181 77136 -69369 -363018 -593755 -611678 -491402 -373270 -307953 -377581 -761636 -1393986
42171 -1393986 -1707719 -1182121 -177926 269021 -304013 -1181493 -1407505 -926141 -397871
42162 -397871 -238629 -354641 -606437 -968662 -1280298 -1324659 -1177964 -1086204 -1013696 -718022
42152 -718022 -252325 60486 184275 412988 748795 747782 231160 -301675 -330961 -57819
42142 -57819 -78116 -515262 -896052 -830422 -455372 -164621 -164968 -379819 -598417 -611864 -317192
42131 -317192 183738 590343 587515 114628 -503784 -768290 -470228 63274 320710 198320
42121 198320 60321 172160 326805 217363 -24622 29179 483214 957823 1115092 1063882
42111 1063882 1080527 1154699 1067042 791581 524652 337368 103288 -163150 -202810 84933
42101 84933 403318 469574 436473 579288 754099 614172 294436 349545 889726 1276992
42091 1276992 955992 188137 -385488 -584641 -684694 -818471 -854814 -761673 -648917 -494785
42081 -494785 -243268 -143402 -521729 -1139166 -1249973 -531691 407811 740412 376907 -81039
42071 -81039 -154142 88500 333447 403653 267493 -65750 -487658 -766972 -788038 -782412 -1101462
42060 -1101462 -1670119 -1887733 -1322224 -379554 76341 -213186 -614788 -513493 -75820
42051 -75820 190650 221968 265228 267612 4367 -315786 -214491 258841 495225 218856
42041 218856 -146552 -194483 -80119 -78731 -100341 1170 52462 -119413 -330530 -373252 -389419
42030 -389419 -534600 -578705 -263137 197383 394986 300844 165448 79210 44247 226773
42020 226773 650999 867710 480224 -154439 -316575 92465 524931 641020 565346 359868
42010 359868 -49523 -379894 -162634 435206 667999 299047 -89297 -137240 -258929 -712630
42000 -712630 -926646 -437709 153229 4181 -635159 -814254 -357920 -34653 -280248 -615875
41990 -615875 -530678 -252867 -309324 -745985 -1084219 -848612 -34769 789939 933842 367433
41980 367433 -120910 98746 623303 638720 169278 -30040 262005 445867 216672 76933
41970 76933 366616 600954 338124 17767 227197 654501 576628 66157 -121066 266043
41960 266043 697437 809720 881317 1142214 1241896 799454 92786 -217499 109704 667546
41950 667546 900821 626463 91218 -325143 -429093 -312348 -198746 -224801 -350263 -412428
41940 -412428 -255572 112458 475149 608481 527292 417372 358963 304642 292159 399780
41930 399780 480231 278290 -121004 -336306 -273693 -214951 -179742 214813 929335 1164589
41920 1164589 422428 -593451 -829041 -265023 277565 393624 317662 117503 -367608
41911 -367608 -802249 -548723 245345 663631 388292 162675 518663 927028 765216 345635
41901 345635 283899 456113 330242 -117911 -536336 -866438 -1169583 -1112522 -395858 498432
41891 498432 744747 291492 -132426 -94482 112229 140304 49477 -23763 -104792 -134454 41430
41880 41430 293031 260183 -77334 -324619 -320448 -396146 -750060 -1005880 -747384 -170805
41870 -170805 192050 205594 186947 302954 299235 -59894 -542124 -671387 -353534 -53902
41860 -53902 -220407 -672665 -817903 -439229 64013 303465 372636 450228 340027 -149470
41850 -149470 -654235 -644658 -235331 -18742 -111193 8611 577598 1088673 1074245 839629
41840 839629 954187 1339515 1383835 855346 242433 113934 444653 721672 577623 171852
41830 171852 -62463 30991 146659 -75541 -587750 -1019019 -1121288 -936628 -599404 -225689
41820 -225689 25389 62069 68075 326403 765365 964698 745114 472777 538328 710000
41810 710000 316166 -886340 -2211308 -2580096 -1616286 -116074 741347 631365 263578
41801 263578 278601 423331 169635 -271428 -198992 461394 979689 850865 422568 309173
41791 309173 657126 1194703 1591246 1570988 1068318 465672 301158 572250 720843 441378
41781 441378 29731 -230458 -455714 -668723 -533965 -9195 310312 35527 -322160 -116132
41771 -116132 389430 435020 -56747 -443904 -370725 -139511 -109071 -295442 -567614 -748548
41761 -748548 -556742 74873 663019 623844 23075 -545401 -726495 -591832 -222691 316093
41751 316093 684262 582016 333126 508871 961843 935632 236427 -428892 -493532 -215031
41741 -215031 -33093 79450 228733 175178 -200032 -469390 -212824 337154 645354 574713
41731 574713 347526 107020 -88489 -112316 -320 -76244 -468173 -764347 -555745 -76271
41721 -76271 137739 32225 21642 306840 639699 733407 561341 264975 23229 -35645
41711 -35645 14985 -47105 -231904 -245496 46026 347556 393550 356151 456266 497219 214942
41700 214942 -197619 -391784 -429305 -546013 -613986 -411512 -188920 -315665 -555812 -412104
41690 -412104 -45124 -40385 -330260 -271648 127622 77864 -599601 -971361 -432808 266687
41680 266687 188416 -361597 -458993 -60815 114759 -120154 -260355 -130593 -123711 -347871
41670 -347871 -388243 -113156 30818 -190834 -363719 -122443 259492 360699 245445 205847
41660 205847 232308 149603 5532 -68893 -179934 -490615 -879456 -1093529 -1086835 -922875
41650 -922875 -542690 25231 410766 275352 -160014 -366464 -212846 8906 200001 557660
41640 557660 981874 948709 259441 -522716 -737278 -402976 13552 289940 481320 505306
41630 505306 213476 -197273 -325998 -146432 -35689 -182630 -370882 -427305 -459858 -486407
41620 -486407 -240993 371297 933983 942221 372291 -402231 -1045343 -1375980 -1305379 -975908
41610 -975908 -772848 -874217 -959778 -707324 -390923 -545139 -1136572 -1554398 -1424285 -954795
41600 -954795 -418582 194342 817744 1087480 809494 318826 49711 14907 18450 98860
41590 98860 349020 494916 151061 -521918 -867112 -554977 -8429 170170 -75407 -339396
41580 -339396 -390802 -430359 -705962 -1108450 -1300877 -1169320 -975568 -1017935 -1268013 -1455209
41570 -1455209 -1422845 -1234575 -969022 -625692 -278662 -111471 -187506 -359202 -532016 -830776
41560 -830776 -1301803 -1606463 -1320564 -543591 66484 926 -510716 -784588 -503341 -71882
41550 -71882 -70212 -483450 -708101 -364368 163192 227471 -213848 -579355 -472458 -130146
41540 -130146 18731 -113324 -352679 -571568 -692701 -629626 -439076 -316407 -255937 11644
41530 11644 516012 796405 483949 -136940 -526128 -600048 -620238 -603645 -374326 -75426
41520 -75426 -62384 -289849 -320077 18352 453481 780499 1057411 1244439 1170388 942958
41510 942958 850800 755356 200000 -681492 -1037414 -421875 569770 1181875 1372453 1314231
41500 1314231 743156 -402772 -1251783 -914053 118692 489928 -158256 -820719 -727970
41491 -727970 -294226 -112573 51226 617812 1245641 1309900 924792 716733 781861 609843
41481 609843 22623 -494893 -558053 -424373 -508166 -764217 -879202 -804891 -752380 -780515
41471 -780515 -693758 -331740 238331 787289 1016758 673480 -163650 -914761 -926194 -199261
41461 -199261 544038 684999 369662 137613 155819 205505 270570 609968 1169686 1426955
41451 1426955 1090831 586889 494347 756630 839924 522679 114891 -74765 -102899 -145815
41441 -145815 -199962 -179366 -122577 -152712 -313913 -526275 -655801 -616162 -458287 -342239
41431 -342239 -359950 -428517 -418185 -304490 -120666 113584 299878 255619 -14811 -188934
41421 -188934 -7179 323643 381263 112641 -129145 -111813 19968 64706 72593 232438
41411 232438 617892 1101754 1417012 1359065 1071060 986565 1245133 1341768 745852 -243848
41401 -243848 -754398 -461309 51874 162896 -73884 -288124 -375377 -395891 -293579 -91658
41391 -91658 -68496 -362569 -624044 -415888 183515 661088 625824 91716 -601342 -961358
41381 -961358 -681589 -21329 387150 289173 54814 3884 -59266 -319310 -463103 -223148
41371 -223148 19492 -207614 -628227 -598590 -99798 315708 365598 122839 -524880 -1636448
41361 -1636448 -2517458 -2235384 -999196 -120226 -313739 -895839 -1032664 -898415 -1018040
41352 -1018040 -1243966 -1138265 -808231 -593271 -334885 287524 1001270 1261355 1123554
41343 1123554 1105162 1319178 1409628 1252887 1084357 982870 841770 805059 1094803 1410212
41333 1410212 1172918 461325 43990 309036 772520 873436 664569 426641 168216
41324 168216 -108551 -146263 106775 170105 -348213 -1091659 -1383659 -1098653 -660393 -354487
41314 -354487 -115381 95867 164595 87822 819 -84539 -250629 -376706 -212802 179308
41304 179308 379506 146536 -245961 -384485 -244717 -139618 -225714 -275230 6883 560964
41294 560964 1001578 1085476 1022876 1185713 1573938 1791997 1583163 1136139 737023 368077
41284 368077 -113928 -589586 -779198 -658172 -467301 -313149 -50945 364188 669613 593852
41274 593852 208375 -175287 -379908 -491690 -627446 -694006 -469695 75442 634398 839752
41264 839752 652613 348194 136335 -12062 -139952 -166616 -99951 -131099 -315438 -390466
41254 -390466 -173857 60912 -66115 -460177 -680424 -572488 -410723 -435945 -596514 -741774
41244 -741774 -731380 -363391 415246 1180087 1317090 763423 109530 -153919 -123694 -85812
41234 -85812 -51737 50954 77549 -121168 -414528 -585815 -614391 -559683 -397153 -174195
41224 -174195 -65059 -43384 207025 773145 1194591 1010155 389757 -125040 -294179 -240187
41214 -240187 -66358 170137 275243 133472 -14388 104524 339615 381860 288713 258613
41204 258613 79210 -562202 -1280548 -1212252 -170529 1028226 1594197 1568646 1371277 1114490
41194 1114490 745175 426380 335398 336014 192843 -80128 -313994 -398849 -227827 266198
41184 266198 808950 863339 291267 -363112 -534663 -289493 -33544 108761 274680 494052
41174 494052 696225 858404 856163 477995 -73423 -83583 775208 1764860 1875484 1077061
41164 1077061 205904 -184794 -213873 -81081 150322 184740 -326852 -1097287 -1381855 -1038651
41154 -1038651 -747364 -933304 -1159815 -946172 -531151 -334842 -222745 114615 479795
41145 479795 473800 174811 -64043 -236123 -515256 -679508 -338460 341380 733843 588992
41135 588992 262486 100379 101547 232144 551894 901666 939342 654972 432707 441687
41125 441687 396656 121519 -101585 -41635 31697 -205167 -544705 -539033 -165680 227839
41115 227839 501393 783795 1001060 833886 289927 -71287 229916 927823 1267060 895356
41105 895356 263384 33609 252809 355921 5502 -390693 -277576 148970 140864 -466049
41095 -466049 -872358 -391070 553734 1023549 866900 757360 992914 1002265 319030 -564361
41085 -564361 -829423 -466104 -192864 -369093 -579051 -404250 -83338 -75590 -325846 -436302
41075 -436302 -423723 -744232 -1425650 -1694688 -906825 431669 1126211 745100 61810 -84897
41065 -84897 188708 295276 212011 428105 1038750 1514175 1440656 1006166 598937 322845
41055 322845 118271 37302 124411 212174 83947 -232252 -473001 -393452 25467 527674
41045 527674 749820 584120 337055 340056 492262 481518 354221 408932 528860 204925
41035 204925 -585527 -1111786 -867755 -307422 -139298 -344602 -477063 -551607 -898361 -1328431
41025 -1328431 -1237966 -577243 -13118 27028 -140179 -116180 -13259 -70945 -158906 -56509
41015 -56509 108573 94907 -3701 95672 405189 656595 678793 559678 487127 581748 805007
41004 805007 916217 647334 54548 -436880 -489964 -242178 -82566 -151403 -239936 -139715
40994 -139715 68722 105808 -181448 -605859 -803731 -666823 -502923 -604846 -772790 -552944
40984 -552944 72330 569307 509524 41462 -408873 -621369 -619080 -490129 -347864 -260763
40974 -260763 -112720 222093 510114 347438 -148361 -317258 82441 393130 12719 -598485
40964 -598485 -518107 273233 850748 643269 92873 -120076 76600 336137 477097 546337
40954 546337 559948 459563 211194 -166902 -554191 -724290 -614328 -531656 -746469 -936843
40944 -936843 -537623 309764 772132 522133 262604 592227 968230 535866 -433605 -867940
40934 -867940 -536323 -379025 -989113 -1671109 -1510290 -682457 -41114 122952 179079 297741
40924 297741 267337 100986 91131 162765 -146537 -823502 -1113781 -514721 433657 810895
40914 810895 442890 -90893 -316675 -227808 61377 486541 837676 833065 498490 176473
40904 176473 93381 168331 267624 373926 470643 520344 592413 769216 920258 834874 577851
40893 577851 420876 423239 415535 409620 614012 941903 937779 420372 -156949 -269418 17672
40882 17672 229082 124478 -106983 -181689 -43191 89142 -97162 -663217 -1223640 -1282130
40872 -1282130 -796857 -191976 203210 429361 579572 576536 391757 163665 -7912 -59942
40862 -59942 262574 1143073 2092689 2212834 1347098 414805 228457 521882 598020 381151
40852 381151 216297 83336 -260366 -625632 -586005 -195739 81921 52542 -122027 -348612
40842 -348612 -579481 -548731 -112991 307645 237736 -56036 66011 567832 787034 511879
40832 511879 254095 341800 454597 277464 4657 -76611 -26961 -48751 -213163 -515008
40822 -515008 -846196 -906792 -551116 -150398 -106217 -128730 335159 1043414 1162394 591177
40812 591177 174735 361994 571953 301254 -25922 96601 323556 82649 -440715 -665032
40802 -665032 -533405 -395624 -309453 -102971 121191 127469 721 -19893 56498 149997 398419
40791 398419 832549 1091859 942737 734786 809829 826477 328297 -320399 -338810 269812
40781 269812 703994 569660 365345 594174 1017619 1090859 714865 248250 2073 -57381
40771 -57381 -186947 -508647 -760021 -559305 -8030 279665 -15418 -446757 -510901 -422650
40761 -422650 -616268 -824626 -435447 379237 751769 424658 143952 476335 975398 962062
40751 962062 534664 252549 224416 91533 -291085 -660267 -744131 -472498 131636 907367
40741 907367 1432253 1293155 565672 -187149 -459841 -223562 176450 365308 176074 -263104
40731 -263104 -610740 -622868 -447604 -465280 -749198 -864884 -401779 421653 972114 997591
40721 997591 865040 897467 854202 377372 -326212 -688987 -559023 -335659 -335227 -439381
40711 -439381 -448476 -401852 -409574 -467512 -551247 -623832 -503528 -50737 473001 619580 391408
40700 391408 232425 303564 278486 7922 -185658 -121910 -80092 -178869 -58466 389347
40690 389347 615046 309454 95602 585511 1258880 1165334 410660 772 343450 816295
40680 816295 837641 528905 197533 -85283 -210985 1387 359321 382298 15813 -257953
40670 -257953 -167931 13586 39286 58891 231538 449101 634286 865116 1045145 911321
40660 911321 523418 272276 254857 155010 -87860 -74850 315296 560392 254879 -253161
40650 -253161 -424241 -312547 -303575 -392501 -268278 31715 51184 -465707 -1193315 -1540596
40640 -1540596 -1233568 -582373 -180539 -262330 -434276 -232785 191100 312272 71601 -43258
40630 -43258 175382 313115 55774 -249757 -106055 444254 988431 1291227 1341455 1141025
40620 1141025 796439 588363 615852 557001 84594 -639396 -1146491 -1188756 -865081 -399070
40610 -399070 -18464 109393 51070 97879 415387 816624 980737 746134 158618 -529811
40600 -529811 -900000 -748318 -474589 -667529 -1219163 -1367091 -797513 -121636 65384 -4045
40590 -4045 118016 233654 -81793 -595292 -703003 -393305 -185503 -193057 8385 511286
40580 511286 789712 535503 195610 288742 596776 508702 -13971 -288251 195494 1043314
40570 1043314 1361626 808977 -3801 -251174 175050 674279 722923 343855 -144955 -484379
40560 -484379 -528480 -284486 4747 102065 133231 357897 586341 328310 -364560 -788685
40550 -788685 -587700 -281115 -392939 -602590 -318886 333822 741816 720360 561130 360141
40540 360141 -38951 -501964 -634290 -410189 -266320 -490200 -924982 -1310843 -1507985 -1352806
40530 -1352806 -736925 57217 489708 405321 255706 514101 1078474 1405292 1101285 278216
40520 278216 -594514 -1119787 -1271205 -1266549 -1211505 -1034251 -758166 -562413 -472467 -267305
40510 -267305 157397 604418 911919 1183152 1498848 1707378 1696806 1558117 1307233 842121
40500 842121 368006 362044 823600 1109102 895527 713778 1026317 1403385 1273227 888326
40490 888326 738360 555806 -110144 -756822 -506252 379400 729620 218162 -242613 -15637
40480 -15637 432675 527640 423523 404610 283332 -102896 -458221 -553806 -628642 -874849
40470 -874849 -1046512 -934339 -734751 -634105 -510078 -316244 -259040 -339156 -241693 72556
40460 72556 215105 45152 -96452 -88278 -323305 -965969 -1524412 -1534910 -1124286 -595045
40450 -595045 -70704 158267 -321940 -1249373 -1675298 -1232123 -676694 -673664 -871106 -817917
40440 -817917 -901358 -1490408 -1934599 -1470872 -533899 -81029 -106409 33613 221132 -230942
40430 -230942 -1160944 -1580680 -1160736 -595721 -385590 -279410 -79110 -6116 -51910 116928
40420 116928 373290 135221 -591565 -1038940 -806546 -312867 122523 691740 1263970 1188768
40410 1188768 473838 147875 728411 1251048 698550 -413662 -898577 -687383 -610742
40401 -610742 -832567 -731664 -181422 241505 385297 760302 1416752 1593175 906462 53117
40391 53117 -212851 -127570 -319678 -665193 -465258 423552 1274904 1371801 805212 272586
40381 272586 279270 647999 788413 421066 -75629 -180043 52046 119617 -110257 -198317
40371 -198317 101974 372365 193550 -98860 168994 1017784 1742835 1800515 1344986 866941
40361 866941 686583 868206 1275087 1579494 1504037 1182384 1038536 1205702 1329693 1088057
40351 1088057 638538 345797 278781 237882 148098 133758 199032 81494 -413778 -992739
40341 -992739 -990187 -109458 1000623 1246837 359307 -666131 -752349 -70449 367566 231064
40331 231064 187084 629608 979513 663870 39745 -271747 -385967 -762584 -1236091 -1235515
40321 -1235515 -742920 -273979 -29381 204965 378825 153879 -375540 -626181 -340018
40312 -340018 117923 390196 500606 505424 358184 243144 442133 726455 523886 -107505
40302 -107505 -351766 214519 997681 1289043 1155829 970138 665815 76826 -456218 -495643
40292 -495643 -242371 -257649 -631726 -951402 -961197 -803288 -695412 -731432 -899818 -1028194
40282 -1028194 -864960 -430074 -57682 83170 181970 337472 370223 292688 382428 486681
40272 486681 -12176 -1036317 -1435476 -565569 490414 315381 -797743 -1395784 -1065975
40263 -1065975 -725947 -856028 -906511 -654084 -704908 -1135547 -946129 330542 1534422
40254 1534422 1363605 198555 -546605 -352585 131707 403984 649653 978330 1018139
40245 1018139 542493 -63981 -269887 -26298 284508 362938 284032 288196 359856 168900
40235 168900 -422073 -960270 -868540 -246665 255078 391562 576914 1000332 1140038 605103
40225 605103 -77785 -143362 279390 386902 -78705 -477035 -207157 517487 1036959 1078055
40215 1078055 990422 1237673 1779748 2039313 1565915 647094 5479 -88018 -27503 -144652
40205 -144652 -257964 -175800 -152282 -447179 -816780 -864946 -573352 -91865 597214 1316356
40195 1316356 1425726 590033 -487411 -825311 -459910 -231019 -434341 -552582 -324804
40186 -324804 -161201 -279889 -278631 71015 330719 131042 -216680 -299234 -241843 -288913
40176 -288913 -245553 131172 591439 764242 715960 653862 462031 78767 -58396 390599
40166 390599 938027 872369 372804 216160 491651 512889 81911 -109845 327166 754629
40156 754629 530338 76698 221674 922344 1392572 1265369 907611 651212 391936 44895
40146 44895 -180250 -160844 -72302 -2350 253218 750039 1100664 963096 572624 396022
40136 396022 400984 98045 -696112 -1548885 -1989179 -2043783 -1975224 -1782661 -1324989 -786105
40126 -786105 -566195 -646824 -475459 277174 1137369 1343889 787682 75173 -279385 -316201
40116 -316201 -230343 42861 561667 987837 847060 127927 -636336 -890967 -535437 49581
40106 49581 314590 -13101 -632560 -919982 -624163 -153278 14815 -30840 89556 353348
40096 353348 387830 121037 -133489 -242176 -362991 -424503 -98245 507354 750937 410753
40086 410753 135511 437972 780347 351199 -627064 -1161657 -882094 -377404 -179141 -202443
40076 -202443 -308950 -637218 -1074367 -1085331 -500633 60618 21869 -337256 -403352 -200374
40066 -200374 -253294 -694112 -1107091 -1223395 -1228439 -1297894 -1290594 -1089790 -905277 -980325 -1186529
40055 -1186529 -1150607 -718793 -117291 339663 547895 557516 357987 -68759 -469082 -376004
40045 -376004 316666 1027363 1093346 636197 403600 712874 1036396 839323 356730 158396
40035 158396 292825 337633 103325 -189198 -359049 -469197 -574961 -609135 -545080 -425468
40025 -425468 -264186 -146128 -295125 -732899 -1021822 -766960 -277484 -226806 -655281 -858269
40015 -858269 -392582 334928 712290 672935 494589 281398 43044 -44838 102234 191399
40005 191399 -50795 -376450 -353883 -81437 -76058 -457176 -725652 -484694 32117 381297
39995 381297 537426 782688 1147109 1325498 1168038 942037 925650 925795 492861 -378239
39985 -378239 -1060942 -1000856 -404695 53473 97313 71163 314495 707718 963969 1020150
39975 1020150 933643 693649 391590 324024 625699 980210 980872 636212 270403 101860
39965 101860 195881 620896 1268323 1653765 1330955 500222 -144711 -195143 121071 326738
39955 326738 147818 -362994 -853400 -889418 -447599 -71659 -190600 -460416 -263806 297889
39945 297889 536699 238024 -134073 -357567 -775766 -1437215 -1703812 -1188657 -434822 -113383
39935 -113383 -91312 123188 500665 701914 764165 894877 899031 509046 37668 -14204
39925 -14204 172539 -15106 -597070 -955358 -818495 -598732 -659694 -865498 -983921 -1001720
39915 -1001720 -926682 -751103 -664982 -837190 -1000844 -776443 -343736 -176835 -192624 68905
39905 68905 429343 168520 -683876 -1139028 -725160 -227722 -393935 -793304 -718388 -439238
39895 -439238 -626291 -1080423 -1040178 -437826 93686 293017 467704 687207 607483 159374
39885 159374 -281646 -486210 -532515 -361821 196182 893956 1187151 999532 785531 720150
39875 720150 455413 -112492 -467316 -225070 236081 313652 -13449 -321042 -403986 -388579
39865 -388579 -346262 -203708 -27078 -80152 -484648 -962521 -1054068 -629388 -115752 -63194
39855 -63194 -449050 -637333 -188146 532358 832935 584616 239077 84268 -47188 -310430
39845 -310430 -554258 -638040 -663524 -699126 -584490 -235678 95249 122339 -44073 -3863
39835 -3863 418020 920775 1048395 717199 334254 306745 513682 488889 123727 -149475
39825 -149475 -3659 325237 476996 496118 566901 563993 328704 119815 266513 566315
39815 566315 564076 283322 136772 226352 286050 226204 172474 53510 -262655 -510464 -334524
39804 -334524 27747 58852 -114051 106704 685133 890515 482615 87744 136853 269884
39794 269884 142792 33446 228944 522473 724643 986816 1243338 1084488 599699 528945
39784 528945 1054422 1287768 621507 -224368 -303570 143167 288433 119214 233849 663090
39774 663090 878643 712756 403615 -24104 -604321 -922684 -606612 -95298 -88162 -440142
39764 -440142 -458840 -98695 63618 -70323 3303 401659 636145 477188 237162 86221
39754 86221 -160500 -460537 -471298 -198381 -68588 -247169 -478719 -632638 -766403 -654708
39744 -654708 18492 937285 1337095 1011442 491984 199370 94137 141518 339561 293161
39734 293161 -371486 -1128452 -1029275 -167260 332501 -28024 -528130 -578837 -537846 -715483
39724 -715483 -685892 -249928 -96814 -742456 -1621800 -1948261 -1711615 -1195881 -402401 322292
39714 322292 84315 -1171723 -2017016 -1428952 -478457 -776029 -1928717 -2134398 -938546
39705 -938546 278065 546379 416316 512562 477258 -15715 -377163 -18123 674063 987365
39695 987365 898831 833446 922684 1034530 1110347 1035246 602676 -9643 -207928 160938
39685 160938 424651 50272 -494421 -452338 57415 313376 188451 272222 798894 1205279
39675 1205279 986349 406484 14630 -125118 -305624 -543658 -536298 -200953 129568 143998
39665 143998 -84112 -298799 -409480 -452386 -370522 -91239 229716 303329 86838 -144934
39655 -144934 -174123 -86950 -51993 -45818 55128 259442 498747 770731 1084888 1339073
39645 1339073 1392721 1223545 919679 573559 261039 62330 32389 178409 444513 636521
39635 636521 469117 -73091 -486532 -222864 532356 952546 604619 -3804 -168218 101125
39625 101125 285150 179510 49528 85292 123223 -63518 -440709 -692376 -455816 257875
39615 257875 826641 553955 -383847 -971733 -653097 -92085 -134213 -502520 -298183 511361
39605 511361 1041890 905795 732489 1021380 1305754 956043 228862 -86853 226529 605447
39595 605447 519001 92289 -155522 4125 227493 58394 -392317 -507260 -65001 278302
39585 278302 -160608 -1035973 -1390480 -1019780 -690583 -901352 -1181025 -954819 -461682 -307996
39575 -307996 -553638 -774671 -762894 -676366 -639089 -583514 -421043 -116342 300043 623031
39565 623031 576292 204657 -86494 -87947 -79868 -298758 -450270 -162343 333568 476883
39555 476883 230336 158177 597581 1159836 1223076 673205 -14514 -308273 -104363 286523
39545 286523 544821 644607 715323 744606 622212 400118 224749 39865 -291672 -555387
39535 -555387 -322409 348532 825519 771753 629410 873461 1221870 1083241 469518 -81827
39525 -81827 -294024 -328968 -304012 -146176 102979 268879 318857 315715 184666 -118992 -335012
39514 -335012 -188521 159144 344575 332655 280353 85938 -361549 -672830 -403649 70980
39504 70980 -75083 -810739 -1151694 -617072 40632 -15497 -547374 -771566 -467677 17776
39494 17776 396327 485468 57692 -736739 -1139519 -613009 357807 884127 821710 663841
39484 663841 570580 299129 -29410 39597 425408 489620 88568 -113048 297743 814013
39474 814013 849568 628515 656686 792237 545148 34500 -82154 391515 881332 846351
39464 846351 405339 -2303 -163608 -69134 306946 870726 1253131 1152078 786274 694903
39454 694903 1036249 1361811 1221826 753032 427077 387974 377522 257934 192022 202704
39444 202704 -14965 -559996 -958331 -735030 -114618 294153 322239 235268 63304 -391178
39434 -391178 -868322 -747837 -89074 161906 -526771 -1397812 -1460891 -923514 -791059 -1333450
39424 -1333450 -1786292 -1516397 -722834 71657 517707 322358 -620724 -1716525 -1970013
39415 -1970013 -1211809 -461101 -610670 -1267994 -1464603 -1063030 -722502 -713167 -599076 -157884
39405 -157884 144987 -82353 -484226 -504710 -272100 -405718 -1020785 -1430941 -1030209 -148127
39395 -148127 308306 -25763 -560362 -560137 -66378 264830 74457 -320731 -455977 -265128
39385 -265128 8687 140426 5774 -375026 -672553 -406189 455158 1274037 1439492 1097213
39375 1097213 841635 853382 796084 512777 305152 379029 452125 188718 -269324 -510811
39365 -510811 -416897 -224431 -133498 -141965 -242921 -491829 -785632 -807421 -379645 238826
39355 238826 604735 598442 471727 379564 143732 -347744 -752587 -615243 -1851 556097
39345 556097 749773 765430 813650 797886 643028 568032 711871 771576 387439 -273858
39335 -273858 -661294 -469425 127070 725990 942067 610687 57092 -66549 412629 798592
39325 798592 434646 -239125 -212678 591307 1127607 705987 -92904 -358528 -81345 98965
39315 98965 -42302 -103239 259797 917608 1490763 1661438 1326177 697465 184824 -14250
39305 -14250 -82442 -185876 -139239 264070 783446 937074 600377 116159 -142960 -90229
39295 -90229 130705 293719 240572 72358 101901 429992 702375 530200 40921 -260242
39285 -260242 -112818 262738 491348 374687 -22797 -368075 -225891 478311 1210600 1333023
39275 1333023 820743 189057 -230017 -557507 -897795 -1033733 -783231 -352008 -98017
39266 -98017 -128934 -307940 -495625 -618867 -624492 -516376 -368814 -226226 -76765 43303
39256 43303 52833 -34135 -124955 -223408 -386561 -479451 -255154 194414 357861 -83715 -769218
39245 -769218 -1059946 -797848 -381237 -176410 -175304 -240778 -364265 -532381 -547072 -184267
39235 -184267 509075 1186992 1480694 1290021 837450 443342 224695 50042 -173596 -284084
39225 -284084 -94398 233787 311481 76029 -50665 252202 678965 661990 166092 -234576
39215 -234576 -125722 225395 290491 -20201 -323728 -293949 23610 369004 518955 401710
39205 401710 159832 93226 352196 691611 730647 457578 234813 262418 330729 258051
39195 258051 294790 792868 1594464 2070245 1823866 1168189 793606 1022636 1469957 1476269
39185 1476269 870218 193340 58167 398364 607227 380644 62795 50833 244393 342793
39175 342793 343596 370080 277538 -89796 -415570 -229653 325715 605533 406182 221284
39165 221284 360834 411904 -34860 -634372 -813690 -689449 -809304 -1167126 -1193268 -752974
39155 -752974 -455331 -728566 -1169068 -1174220 -768445 -376456 -141557 43521 105069 -59412
39145 -59412 -161147 164108 679807 794957 519784 516674 1016960 1370830 1060723 551222
39135 551222 573503 1041923 1347558 1384452 1522750 1735235 1567006 1015027 673093 798435
39125 798435 902190 576198 158315 180079 575125 839102 695322 288142 -54345 -41389
39115 -41389 333037 636375 451032 69681 197908 780514 837526 -85564 -1024084 -871018
39105 -871018 14388 366722 -173377 -783026 -845828 -614677 -420765 -187754 -1333 -287126
39095 -287126 -981356 -1253347 -611285 267042 406359 -163569 -598843 -488095 -271548 -448288
39085 -448288 -906217 -1185131 -1063126 -697446 -362335 -210028 -232561 -337710 -417700 -388349
39075 -388349 -261183 -206387 -418227 -824541 -1062092 -883420 -464062 -147554 -36581 -31310
39065 -31310 -87930 -173744 -142104 41873 131955 -4781 -49924 278645 645204 571081 291972
39054 291972 428605 879867 857659 126777 -602161 -754655 -589828 -489663 -318232 53142
39044 53142 270871 87849 -153222 -146242 -163419 -429911 -540496 -123200 449101 653651
39034 653651 585821 458642 -42274 -1043561 -1716125 -1294076 -430396 -352254 -953209 -1034096
39024 -1034096 -339323 86754 -227155 -398114 189626 783286 561581 -44321 -246959
39015 -246959 -236906 -592443 -1016738 -766820 37161 561706 530142 440348 620414 888621
39005 888621 1101748 1278415 1204424 661567 41911 -45784 168884 -192293 -1215306 -1828635
38995 -1828635 -1311773 -385295 -161213 -601971 -789190 -358703 163150 361069 490621
38986 490621 871898 1309675 1413374 1132449 695764 259634 -123786 -334929 -230400 163093
38976 163093 630811 942752 1000318 859595 651600 452420 244868 47514 -12607 107040
38966 107040 198052 56453 -166036 -181932 -108944 -340725 -763516 -654042 260863 1125547
38956 1125547 946961 -17085 -566858 -159482 556331 880730 928388 1011348 895852 301222
38946 301222 -328937 -271793 439775 1040480 1034574 653934 324735 172387 142021 197341
38936 197341 261831 260777 306848 561927 859767 787737 254053 -321857 -525147 -392767
38926 -392767 -203026 -81875 -21884 -80488 -302485 -546689 -618280 -552362 -594976 -876264
38916 -876264 -1215803 -1322046 -1153275 -986320 -1044876 -1128944 -829264 -165677 262270 -13880
38906 -13880 -678266 -1000001 -730165 -286067 -111258 -235284 -477152 -689024 -697705 -358631
38896 -358631 176047 522174 524673 389685 268206 41522 -334200 -628109 -702279 -751622
38886 -751622 -922226 -1019107 -902852 -835277 -1008448 -1034211 -476178 269138 304106 -472332
38876 -472332 -1052425 -626673 313323 672424 226159 -220747 -87501 216783 35194 -520497
38866 -520497 -773691 -469961 -20667 226142 417823 704678 788379 353894 -332202 -686354
38856 -686354 -527629 -143032 248639 664555 1029973 1140526 1026302 959006 989148 838338
38846 838338 384980 -79650 -241899 -133670 17720 42500 -147020 -477673 -604856 -259113
38836 -259113 225572 195409 -372776 -738754 -458431 1311 85300 -1072 169496 359326
38826 359326 56082 -540997 -703333 -256841 224640 347275 380414 657557 1009384 1029517
38816 1029517 597179 -19482 -401782 -325240 -29583 4707 -250866 -224912 349615 817035
38806 817035 519440 -39937 158769 1031712 1468188 1091580 810134 1245458 1712419 1436315
38796 1436315 857361 833358 1224730 1260346 874927 693029 923843 1210785 1454021 1859549
38786 1859549 2191039 1914192 1222709 1003669 1482758 1771148 1235219 536542 629739 1318941
38776 1318941 1648905 1411735 1363921 1934447 2521684 2379125 1657335 1145959 1249074 1600579
38766 1600579 1626497 1212564 761588 707666 1039299 1322532 1203007 797056 482400 412220
38756 412220 459484 568270 803048 989462 738510 91098 -245192 271317 1213474 1717576
38746 1717576 1621184 1449309 1366300 950455 194557 -115882 466801 1223439 1241305 679016
38736 679016 269959 13001 -623877 -1387217 -1291849 -196819 720938 531993 -268512 -716437
38726 -716437 -724905 -723249 -591120 82249 988320 1318501 962784 650034 783110 894115
38716 894115 514334 -71359 -345124 -363124 -571885 -1065291 -1444247 -1340427 -794619 -138551
38706 -138551 317670 498869 570982 700271 786342 581398 140026 -71972 268831 831032
38696 831032 983879 662336 533470 1116468 2016606 2395435 2076833 1704382 1719966 1736657
38686 1736657 1284090 683985 557091 766001 644127 177551 40434 316960 206039
38677 206039 -537212 -863395 45140 1303682 1449135 519037 -174816 -78288 78562 -184416
38667 -184416 -323695 87305 539912 499007 280358 383035 617484 546781 279490 213064
38657 213064 377721 535322 575511 444263 124630 -7052 558742 1460566 1545855 590739
38647 590739 38304 1028570 2482703 2489892 1117178 284076 917521 1829154 1770736 1129927
38637 1129927 848206 838175 466501 -158504 -384538 -97060 205704 185120 -85862 -408016
38627 -408016 -515160 -134712 570162 957277 756344 572854 1016932 1730003 1913974 1485430
38617 1485430 979815 575139 43558 -431060 -269550 547861 1311295 1584843 1700222
38608 1700222 1973520 2090451 1701928 1111888 855968 931026 944291 818907 859183 1169616
38598 1169616 1425761 1303363 878498 501891 418734 602256 896760 1212389 1497731 1565554
38588 1565554 1168958 403597 -161101 -42237 553343 989768 1002564 880686 865988 802533
38578 802533 505013 100120 -174900 -214695 34976 555484 1019519 988733 565864 427167
38568 427167 902932 1444376 1405150 964637 757747 884354 901910 669112 571065 861719
38558 861719 1300260 1560163 1596089 1487348 1257653 968566 725979 522699 296910 127813
38548 127813 106773 75542 -170698 -474155 -499406 -292796 -211900 -294553 -198703 163341 465708
38537 465708 571666 727148 950122 839690 321739 -31313 103083 157435 -437128 -1180128
38527 -1180128 -1088114 -105107 842810 1115405 951421 771324 595510 339673 112183 -25868
38517 -25868 -163541 -226485 10982 429246 531711 147846 -247826 -198001 139855 381509
38507 381509 546578 885226 1307248 1426148 1102640 607366 263902 173981 261213 377132
38497 377132 390376 325427 358091 555650 742489 775958 806420 1041305 1352293 1365845 925701
38486 925701 276348 -211270 -367928 -310819 -295829 -420403 -426175 18781 734727 1016953
38476 1016953 496774 -228898 -271416 352168 721362 296734 -328585 -288150 323502 574963
38466 574963 -31725 -896427 -1101557 -538494 77399 213238 134328 341160 718893 678522
38456 678522 82891 -452917 -378994 50760 182987 -147680 -527168 -626453 -547261 -506372
38446 -506372 -532368 -553570 -516443 -338549 24204 386421 422097 46960 -432623 -620480
38436 -620480 -382466 88308 430033 387806 90586 -25030 249025 570276 534004 326191
38426 326191 473325 1005878 1360435 1179012 736306 442138 373657 472975 741149 989252
38416 989252 845760 323694 -29368 105615 299597 24382 -531125 -755171 -449447 89530
38406 89530 590584 941264 996814 727566 416028 297035 190653 -86529 -208773 211689
38396 211689 872068 1088336 736624 289543 42033 -54984 68131 455510 589040 -108071
38386 -108071 -1150591 -1335247 -462156 260632 -34194 -681512 -678854 -182477 65499 121198
38376 121198 625823 1588581 2353790 2609106 2598433 2465040 2159121 1892158 1925098 1987779
38366 1987779 1668345 1291274 1546387 2228583 2299090 1439441 640285 798000 1475837 1639797
38356 1639797 1087779 530800 554433 1015862 1342316 1119279 497573 125890 434500 972931
38346 972931 906006 237841 -68085 564020 1488566 1755415 1286745 650203 191443 -29398
38336 -29398 90273 432141 453996 -74039 -487773 -112415 618656 791187 499732 689214
38326 689214 1535082 2048246 1553128 629367 168766 259235 465218 556680 459455 46086
38316 46086 -494854 -543904 172382 1055153 1340062 986561 470753 112251 56124 468489
38306 468489 1174187 1472512 933328 81724 -313943 -325714 -563161 -1079609 -1376151 -1321209
38296 -1321209 -1216546 -1017337 -391023 384799 529828 13157 -196924 474763 1378670
38287 1378670 1677871 1459399 1233446 1027376 688563 507704 746750 987730 755119
38278 755119 406158 542261 866352 625544 9453 -13435 687436 1104470 730472 393549
38268 393549 860018 1559842 1531067 916387 574263 689819 781986 817403 1253483 1978162
38258 1978162 2222574 1768643 1363611 1545323 1828114 1595792 1157700 1205952 1638414 1712835
38248 1712835 1232531 849370 1119513 1852860 2567083 3088029 3435363 3487365 3098958 2387301
38238 2387301 1668593 1205942 1119864 1370520 1702394 1787336 1558909 1234301 907735 392383
38228 392383 -337040 -837714 -683258 -84094 354206 413402 426621 673711 1001887 1146169
38218 1146169 1102682 1025570 989654 1009936 1113772 1253528 1290041 1172680 1013446 911428
38208 911428 836731 738277 618041 464003 276712 173647 251190 329540 111996 -345788
38198 -345788 -633473 -544291 -292429 -37692 400761 1095267 1653621 1674041 1265955 757782
38188 757782 189840 -461862 -840992 -563527 115717 557909 616268 691300 898272 808184
38178 808184 217268 -373902 -386665 101942 577885 769388 792306 797482 766329 610990
38168 610990 335541 135983 321151 949997 1565136 1574912 959382 301829 36644 -6920
38158 -6920 -181726 -493570 -712096 -719009 -502804 -52203 486249 734374 425808 -261086
38148 -261086 -840873 -889649 -295492 581544 1001923 518766 -351878 -624363 -166552 80059
38138 80059 -478709 -1152442 -1051088 -472613 -328966 -597654 -400245 464894 1127575 981449
38128 981449 480962 234371 129131 -99885 -119682 464079 1233958 1363776 747121 115758
38118 115758 62488 447411 807657 919793 842710 733228 762164 991334 1228653 1189478
38108 1189478 884787 668207 798285 1124481 1348654 1465801 1751725 2342829 2992521
38099 2992521 3284081 2996932 2255094 1427158 915540 909356 1225943 1451958 1333662 988143
38089 988143 688865 569385 633216 873725 1185430 1330831 1274996 1387777 1940060 2547723
38079 2547723 2620484 2281596 2196098 2440266 2325098 1609242 1048089 1211110 1546558 1378043
38069 1378043 1121321 1501972 2087651 1827225 840157 378531 910686 1474153 1263751
38060 1263751 720646 517631 487528 263255 132791 438344 758986 517885 -54974 -321908
38050 -321908 -208723 -56686 138634 593612 1106742 1278332 1158786 1032749 801391 271188
38040 271188 -179593 -805 599620 894777 714888 506751 405160 131416 -146061 193192
38030 193192 1125470 1771631 1655172 1364915 1496864 1688632 1322982 595091 188649 296319
38020 296319 613633 998422 1489418 1856750 1746823 1232673 760760 585005 599629 626281
38010 626281 528892 188934 -272416 -397597 99406 862110 1304737 1342855 1309482 1329145
38000 1329145 1280313 1250197 1447328 1688428 1556103 1103610 809503 752871 490521 -55678
37990 -55678 -287471 133902 685727 810699 772787 1074873 1517027 1599310 1525201 1923419
37980 1923419 2681418 2961058 2505125 2102982 2446399 3222240 3761068 3989735 4201766
37971 4201766 4331365 4096947 3671452 3645307 4338818 5522493 6783159 7877982 8805761
37962 8805761 9805853 11208506 13057657 15026495 16958927 19299579 22655535 27109249
37954 27109249 32368857 38507294 46151643 55902874 67701806 80480709 92135557 100300788
37946 100300788 103864813 103584353 100623443 94809318 85262804 72617443 59403928 47887325
37938 47887325 38530182 30983622 25382205 21742395 19026188 16074752 13094640 11137910
37930 11137910 10344449 9756705 8798263 7872284 7327884 6779557 5830518 4769137 4108595
37921 4108595 3888052 3777611 3557033 3257585 3080297 3263921 3753479 4020327 3608092
37912 3608092 2835664 2471926 2697603 2955005 2912935 2926301 3270421 3527253 3169599 2338422
37902 2338422 1608638 1267568 1187149 1181783 1181965 1221887 1451694 1961957 2490755 2617162 2359713
37891 2359713 2181676 2234646 2069986 1383474 587071 268557 471090 879571 1328856 1718143
37881 1718143 1820821 1663921 1739022 2309017 2836785 2688573 2107004 1817158 1900502 1837639
37871 1837639 1584010 1751370 2549233 3293593 3331019 2926328 2840824 3366553 4108200 4502903
37861 4502903 4326427 3858534 3677381 4094777 4722978 4848789 4307405 3702882 3670567 4217638
37851 4217638 4907409 5377496 5496972 5295704 4972283 4791680 4800689 4795083 4656279 4491172
37841 4491172 4337369 4032694 3579685 3357208 3675121 4302372 4736309 4821138 4809166 4890366
37831 4890366 4981392 4999566 5047107 5186639 5233573 4978777 4557015 4389633 4700792 5252090
37821 5252090 5701213 6080694 6635194 7229788 7353355 6905302 6572840 7037200 8086619
37812 8086619 8979126 9465695 9888500 10396528 10765206 11080330 11902185 13453145 15197084
37803 15197084 16581403 17752638 19208674 21188145 23763263 27081132 31083945 35431491
37795 35431491 40212339 46341056 54691023 65206577 77524667 92144095 110182353
37788 110182353 132104497 157386832 185164706 214138170 241695996 264217641 278941185
37781 278941185 285210654 283791898 275676527 261831131 243298737 220928987 195505405
37774 195505405 168598690 142689983 119809350 100455928 84314341 71342293 61366322
37767 61366322 53279403 45866728 39246994 34367433 31104566 28065891 24511126 21287048
37759 21287048 19307902 18121339 16745388 15124809 13834200 12873105 11735724 10414040
37751 10414040 9416427 8860385 8350435 7773872 7460486 7426782 7161721 6411324 5598709
37742 5598709 5174983 5042496 4933749 4916932 5132191 5341882 5141581 4440752 3446209 2363901
37732 2363901 1401503 872289 955092 1422260 1847812 2013536 1948880 1749842 1601484 1802334
37722 1802334 2437406 3104521 3275037 2915085 2510641 2506325 2929428 3492805 3820845 3650690
37712 3650690 3097486 2674411 2764608 3132087 3270285 3143560 3150510 3378579 3433994 3142576
37702 3142576 2877356 2919948 2987412 2758642 2431524 2309647 2224424 1906991 1616448 1766131
37692 1766131 2136438 2155496 1862528 1840085 2167717 2263403 1964909 1913043 2411694 2689366
37682 2689366 1996390 874207 506576 1120358 1849729 2044144 1901966 1785847 1677341
37673 1677341 1509026 1424813 1470647 1517906 1676270 2262563 3124675 3518813 3006227 2074134
37663 2074134 1543166 1706617 2325859 3069792 3617647 3708774 3478146 3429361 3750382 4040773
37653 4040773 4064995 4265033 4980219 5650189 5563622 5101119 5380100 6744737 8412503
37644 8412503 9666048 10651447 11863599 13528923 15704109 18395092 21388818 24533242
37636 24533242 28352662 33785964 41122968 49828466 59585275 70619438 82419227 92873959
37628 92873959 99587941 101833228 100569396 96730591 90172530 80396445 67883683 54512467
37620 54512467 42655569 33693024 27290041 22249422 17963523 14651560 12356532 10550287
37612 10550287 8948612 7859682 7274367 6459519 5113314 4106377 4175297 4569254 4086507
37603 4086507 2940564 2346800 2538648 2544801 1940949 1476634 1658991 1915448 1667171 1236161
37593 1236161 1106170 1118354 1006177 1013831 1362377 1703064 1701501 1631914 1800432 1867964 1376390
37582 1376390 573590 116723 221686 593603 937951 1121492 1104669 1069999 1286841 1549733
37572 1549733 1223779 226718 -584947 -513625 40825 324268 343629 514702 722607 615390
37562 615390 442645 648567 903093 544470 -167914 -295221 299007 766911 700735 685891
37552 685891 1146562 1637320 1720278 1660045 1722867 1578514 1008202 532629 666892 1069005
37542 1069005 1068667 624300 175009 -65402 -105556 143619 599981 764882 339959 -204881
37532 -204881 -237826 179496 616820 1068297 1690315 2067852 1627615 667389 97036 140021
37522 140021 147722 -195248 -379153 -63466 280316 182080 -61432 21676 272435 271645 93892
37511 93892 93596 242151 259688 193303 301122 500119 479809 304707 372538 750012 1044962
37500 1044962 1042200 1019469 1239458 1490824 1406538 1020094 724262 742431 852634 685750
37490 685750 208221 -193430 -167006 138674 238153 -50388 -377911 -387399 -185367 -78637
37480 -78637 -118392 -219329 -476655 -941104 -1268409 -1107958 -750463 -815102 -1270834 -1384364
37470 -1384364 -804091 -85542 169290 136433 293210 578396 583348 287898 36442 -61773
37460 -61773 -170967 -238005 22944 618867 1171862 1386276 1276909 912125 309164 -340567
37450 -340567 -702326 -687586 -540490 -448694 -344641 -166991 -5746 130609 377710 677016
37440 677016 668311 150241 -561403 -953970 -846623 -443368 -39190 154722 69654 -139541
37430 -139541 -201876 -73270 -23627 -240251 -540532 -669472 -678550 -752256 -821936 -654594 -242902
37419 -242902 166527 377276 333874 -3378 -576013 -1057526 -1085440 -705006 -317063 -145729
37409 -145729 -26786 216313 472679 544233 407203 138692 -201612 -475263 -472423 -205081
37399 -205081 -11280 -157319 -477547 -616101 -495866 -324834 -257748 -308686 -503740 -815116
37389 -815116 -977646 -704577 -139795 213227 115016 -149759 -267681 -327331 -512773 -662356
37379 -662356 -507505 -184952 -91406 -264262 -312734 -21824 361262 579280 729868 932965
37369 932965 950786 508698 -168816 -531337 -386968 -78278 68955 156969 432863 839457
37359 839457 1079081 1022147 838463 727400 685499 602534 474895 408896 439598 463270 390783
37348 390783 272941 189793 93520 -112326 -387918 -607561 -761926 -907908 -916392 -541051
37338 -541051 150653 669430 621270 147048 -341987 -660812 -832809 -782204 -416685 58032
37328 58032 280135 213674 176156 346854 554564 615449 556829 389046 -5786 -536722
37318 -536722 -740784 -276416 559890 1108226 1080642 767591 547741 488228 506563 642274
37308 642274 926486 1122785 916801 418895 203532 648786 1412045 1835570 1785920 1763019
37298 1763019 2166859 2816119 3314665 3549803 3619493 3578085 3529298 3706957 4149671 4509103
37288 4509103 4491102 4276076 4182163 4150789 3944100 3613389 3332948 2995410 2463015 1990073
37278 1990073 1822769 1611119 926968 189627 204676 802001 911626 189132 -436217 -240651
37268 -240651 238568 251525 71382 346543 876727 977849 642166 399535 289422 -102537
37258 -102537 -698861 -916563 -634322 -365031 -341052 -188927 252127 498577 209861 -135168
37248 -135168 141911 917050 1365241 991425 199592 -236950 -62374 267494 249329 -6461
37238 -6461 21195 486889 946512 991721 762882 606556 530849 314564 -55224 -364019
37228 -364019 -442592 -233229 222897 663215 738355 507163 478992 875539 1208248 942628
37218 942628 211267 -524671 -1090266 -1390457 -1092016 -200461 466374 212580 -417696 -348285
37208 -348285 412769 870272 692472 646649 1167038 1553476 1092163 147437 -441189 -447283
37198 -447283 -212511 9311 185560 347197 659105 1302318 2030744 2259072 1833209 1254951
37188 1254951 903562 566494 49197 -314138 -184373 215729 473760 502520 321128 -180103
37178 -180103 -823668 -1005966 -503101 44252 29006 -175539 155786 871005 1114287 576280
37168 576280 -162991 -533923 -573514 -530398 -418716 -156761 192972 466159 492006 164652
37158 164652 -384151 -779219 -784268 -545569 -242609 233828 900334 1261980 822690 -83450
37148 -83450 -531960 -147628 458952 532071 68804 -319850 -187930 307402 625115 372400
37138 372400 -333729 -996973 -1238212 -1096115 -824414 -572140 -379011 -305992 -379542 -500201
37128 -500201 -540170 -449015 -214960 113645 331605 237886 -49114 -206078 -175225 -182896 -261446
37117 -261446 -213714 -133573 -376463 -815043 -797023 -200906 167675 -243892 -837576 -819771
37107 -819771 -422897 -344578 -507144 -356833 -23081 -117199 -565211 -688158 -370628 -124350
37097 -124350 -9083 430284 1059806 1114954 518551 146254 398571 592539 300360 210923
37087 210923 891591 1630546 1470264 699095 298991 397947 311933 -149374 -430799 -228207
37077 -228207 131786 363486 544608 677898 576193 313805 229491 339284 261333 -111238
37067 -111238 -344732 -92857 407104 702282 666623 450006 170916 -82121 -147092 44782
37057 44782 285149 267552 -69113 -466273 -584793 -301904 151552 358107 142493 -176319
37047 -176319 -137115 243533 436683 92050 -473949 -702378 -538619 -442234 -679291 -947489
37037 -947489 -853248 -494146 -291994 -384286 -513542 -511868 -530899 -638059 -512390 131908
37027 131908 979355 1335622 924455 188456 -246937 -177762 150967 367839 216446 -301694
37017 -301694 -856349 -1010732 -688565 -320085 -354629 -702497 -860418 -584361 -210920 -176069
37007 -176069 -372537 -262069 333245 839583 579543 -344165 -1140306 -1249255 -800514 -157420
36997 -157420 486987 879138 631243 -177256 -742575 -441568 283285 531030 205062 -20028
36987 -20028 131441 203673 -66058 -288004 -169233 -21959 -126578 -199579 14743 145909
36977 145909 -226907 -790302 -912956 -599389 -414374 -592528 -816454 -844001 -790259 -723414
36967 -723414 -506366 -213514 -253623 -787619 -1323392 -1225220 -502180 191693 315486 -39921
36957 -39921 -439135 -666967 -786240 -759638 -391935 220973 538122 208413 -354978 -452331
36947 -452331 -31595 320118 260706 21233 -186366 -456676 -689008 -451726 275429 809033
36937 809033 698366 425915 589354 883014 654927 116920 84414 617181 849249 321913
36927 321913 -328848 -328009 248571 813011 1069617 1073832 889324 594798 365985 242797
36917 242797 66873 -127465 -25414 361741 421527 -234676 -977904 -826590 172985 862411
36907 862411 409628 -680199 -1266082 -910892 -166175 254532 172568 -158975 -475781 -644158
36897 -644158 -590802 -332556 -45599 76491 69196 162900 440375 667305 594913 336567
36887 336567 261514 530874 917641 1123597 1105746 1000590 873739 696454 488382 303525
36877 303525 72198 -376207 -1043189 -1609446 -1689073 -1252921 -718027 -562337 -874301 -1310715
36867 -1310715 -1456699 -1168636 -600237 -9716 410624 605039 657177 704765 780451 753021
36857 753021 506256 169676 46823 229605 376230 49915 -689037 -1203365 -943981 -108973
36847 -108973 552997 574286 182913 -147531 -283881 -384918 -484070 -418292 -120909 254986
36837 254986 509731 534553 326250 46308 -3052 301927 639429 543108 -20499 -609504
36827 -609504 -853059 -801411 -715591 -761209 -939467 -1070784 -840342 -155402 536754 648329
36817 648329 210828 -174145 -210913 -216137 -362633 -228508 461504 1156280 1145165 577720
36807 577720 182199 182041 178135 29372 118225 599699 1018246 959329 616712 403277 365919
36796 365919 321244 298815 483819 838551 1072594 970931 602226 252195 238566 684499
36786 684499 1366780 1877769 2016320 1917439 1758107 1526138 1193226 908480 803762 741977
36776 741977 517385 246961 272066 617171 823014 511769 -46168 -194642 294710 918977
36766 918977 1051118 650172 178939 -51219 -172242 -385998 -576496 -456165 47458 718799
36756 718799 1291897 1607158 1574395 1169209 552049 87088 76506 413794 609580 309515
36746 309515 -264471 -601891 -620416 -752559 -1177057 -1390725 -946178 -283313 -231381 -816351
36736 -816351 -1212781 -917945 -335126 -32968 -42139 -147783 -302023 -405338 -210320 168445
36726 168445 164232 -371731 -716110 -243099 595195 895770 556497 200018 98608 -61929
36716 -61929 -413197 -604962 -364974 150839 624204 807310 565372 87277 -101280 211531
36706 211531 476630 134674 -440465 -454361 45316 268782 -2288 -133827 185587 416722
36696 416722 150644 -213452 -232794 -166079 -431790 -876328 -1090116 -999850 -705582 -186017
36686 -186017 384786 481716 -105438 -823050 -1048517 -879068 -756041 -690048 -445746 -209591
36676 -209591 -416096 -1001741 -1400337 -1300349 -971289 -793404 -802205 -768165 -520186 -155531
36666 -155531 3690 -233725 -588148 -566337 -114768 323709 491842 587430 662978 345538
36656 345538 -426670 -931587 -534761 341224 764396 546759 285548 322146 359176 112576
36646 112576 -268932 -536309 -632336 -579384 -442107 -401197 -529907 -586435 -390368 -225595
36636 -225595 -391587 -554867 -188837 439430 475022 -247290 -872490 -705143 -42660 494629
36626 494629 822818 1117231 1206224 838162 260860 -13330 106859 254695 158393 -105055
36616 -105055 -325297 -348956 -133386 176554 344424 388471 620980 1112306 1385002 1007429
36606 1007429 288076 -64320 134031 419580 444890 358274 343560 293471 162661 199512
36596 199512 505847 731316 594567 410561 627369 1039366 1014796 457693 -28127 -36281
36586 -36281 118463 -5068 -341981 -607891 -798516 -994108 -1008635 -713434 -455919 -628923
36576 -628923 -986443 -940606 -460750 -110623 -188613 -401172 -474875 -528491 -655540 -641785
36566 -641785 -333659 121807 578165 995166 1098895 481393 -693209 -1607542 -1750382
36557 -1750382 -1471045 -1245533 -953093 -351751 259311 446742 301170 109870 -217603
36548 -217603 -763066 -1054187 -673298 -103975 -136130 -622940 -696623 -119108 487698 758787
36538 758787 980039 1214059 997715 276513 -212461 4852 396435 283490 -139814 -239518
36528 -239518 62736 341836 400449 371669 299689 132427 1174 73456 222750 197022
36518 197022 4165 -182858 -362021 -620076 -854091 -914416 -913245 -1039219 -1130282 -789354
36508 -789354 43245 902808 1246836 937957 303417 -137082 -57824 384997 675834 475124
36498 475124 -21432 -361531 -367692 -246438 -261399 -455970 -648332 -602100 -289345 -49083
36488 -49083 -307037 -1013192 -1567166 -1499767 -1027533 -674521 -541759 -321196 66658 297722
36478 297722 189780 37214 185724 533984 725821 685939 660686 751453 724782 436334
36468 436334 209323 485102 1136076 1457099 993126 137491 -333579 -170721 188814 288251
36458 288251 139959 2998 -22443 -29411 -117678 -297425 -458942 -389429 29981 617841
36448 617841 1067489 1339629 1625263 1870178 1677788 884188 -53957 -529491 -457206 -189597
36438 -189597 84248 491400 1050941 1466473 1491121 1267111 1108482 1077452 989686 788517
36428 788517 660650 700698 698464 469049 217325 257502 466992 433608 154577 84330 333427
36417 333427 392782 7873 -244112 177549 803715 790546 207407 -150215 -56010 -31916
36407 -31916 -235679 -147976 409526 848588 761814 490882 356809 121517 -306528 -427383
36397 -427383 -19074 287399 23138 -200511 358685 1251726 1427959 801226 260658 290126
36387 290126 491768 451759 260139 111325 67001 248501 658305 849977 408871 -298730
36377 -298730 -528615 -237049 -3465 72970 493580 1243441 1501249 849179 -25994 -328333
36367 -328333 -183078 -132061 -166856 95809 623523 950265 796564 303557 -204760 -404759
36357 -404759 -122142 437143 810420 830958 779116 801507 588920 -48754 -696973 -873344
36347 -873344 -719029 -636702 -505997 99356 996194 1377092 885708 164171 3323 319469
36337 319469 388499 -85658 -593660 -571328 -158952 43721 -202315 -524689 -506133 -207058
36327 -207058 -12285 -178051 -653059 -1135229 -1187636 -579295 296995 661311 278057 -183048
36317 -183048 -82171 274971 202345 -221855 -329898 -33181 43024 -320508 -518095 -100509
36307 -100509 553225 924073 1077084 1255359 1312074 1066517 790787 813190 957528 854805
36297 854805 542965 315939 210396 49229 -198387 -430464 -573505 -480582 14649 675246
36287 675246 900935 538269 206016 388391 693442 571496 285229 424403 814298 762139
36277 762139 219693 -158329 -90468 24306 -37999 37202 392174 642638 559845 495345
36267 495345 727349 878575 453768 -352260 -825126 -583251 37355 396302 194887 -238235
36257 -238235 -282640 248697 799119 707987 70812 -375075 -199037 267514 470021 249132
36247 249132 -181698 -532762 -579739 -307149 -38711 -159211 -600097 -857763 -615728 -105172
36237 -105172 218675 118307 -328766 -800556 -896626 -535689 -162690 -212719 -435966 -221900
36227 -221900 438246 901150 859068 716220 756494 635117 135371 -182432 288997 1217463
36217 1217463 1710375 1451818 873851 340969 -226484 -884477 -1343856 -1321914 -942089 -606938
36207 -606938 -567054 -681235 -595587 -199462 149801 32894 -450658 -806085 -833436 -776993
36197 -776993 -732544 -461353 -18157 48707 -442337 -807239 -458875 98719 -6450 -612514
36187 -612514 -734186 -115725 326786 -154145 -1091706 -1504567 -1133608 -523875 -173311 -53275
36177 -53275 91199 297420 362392 184389 -6211 89666 356449 314902 -213946 -808194
36167 -808194 -1049522 -1083079 -1200855 -1216645 -805702 -225157 -47357 -279728 -407296 -274492
36157 -274492 -227477 -337633 -236111 112122 236477 53336 160419 791295 1210310 797477
36147 797477 146713 282096 1131812 1611979 1115398 176365 -383495 -345496 -5595 285668
36137 285668 295492 -12337 -379362 -469052 -283935 -155272 -268053 -430998 -389070 -154552
36127 -154552 60865 95567 -32442 -124617 81261 666003 1382133 1834788 1799745 1346609
36117 1346609 784261 551144 935924 1719861 2285183 2289606 2037050 1956179 1993734 1889522
36107 1889522 1777879 1974542 2289705 2150215 1435494 634618 83734 -376785 -814434
36098 -814434 -893294 -501062 -152036 -289281 -595835 -532906 -237453 -252399 -529836 -398543
36088 -398543 388471 1164823 1175880 513558 -52796 61122 798094 1666313 2130984 1899858
36078 1899858 1109594 298234 22200 357388 799323 757840 189452 -339111 -290019 237569
36068 237569 695447 799721 770753 833636 847537 647196 434268 478394 634458 556593
36058 556593 281702 186685 401958 678413 846949 980691 1030648 751960 162761 -332300
36048 -332300 -495525 -557506 -722158 -761763 -442076 -8969 154986 94192 73707 35509
36038 35509 -256816 -669854 -802236 -603659 -436067 -501362 -624119 -638711 -596450 -535946
36028 -535946 -420070 -341802 -414501 -442502 -149326 220291 65651 -631185 -1078846 -697173
36018 -697173 104276 535117 398869 43764 -287638 -555717 -627024 -407056 -145731 -155865
36008 -155865 -315099 -259476 17988 187017 138342 86129 119539 85191 -24940 21690 270748
35997 270748 395749 125378 -365356 -653190 -532274 -196877 -33114 -222126 -492676 -387788
35987 -387788 123547 531258 494322 376652 687933 1230410 1335242 845321 282337 13707
35977 13707 -162716 -470993 -756669 -877050 -1007941 -1253864 -1342048 -1022289 -458023 61992
35967 61992 491129 816521 809486 364754 -131713 -168807 247120 620857 590192 289410
35957 289410 117999 293382 615689 657611 290704 -46716 130635 618818 719142 228666
35947 228666 -243157 -136061 359823 744232 886365 901067 776972 568723 584614 895435
35937 895435 988263 443131 -335139 -650486 -549738 -668606 -1164880 -1485986 -1227279 -619108
35927 -619108 -74633 209984 115970 -393348 -970527 -1083191 -719669 -465110 -667950 -947073
35917 -947073 -787447 -270652 87526 -11638 -406793 -708559 -614304 -170306 182955 43448
35907 43448 -413778 -607336 -316213 79227 229294 262343 378452 425910 238523 42644
35897 42644 87711 123606 -262633 -924555 -1269775 -1072547 -705716 -511061 -397349 -212645
35887 -212645 -80698 -100640 -73918 114593 132048 -323622 -848902 -707763 76455 574860
35877 574860 155943 -646863 -875724 -389404 146454 264680 97143 -137479 -419522 -630208
35867 -630208 -539009 -247484 -141640 -247075 -168567 139428 162711 -289334 -619837 -333847
35857 -333847 177495 302051 129076 54526 -42260 -435819 -759161 -481730 44209 -26245
35847 -26245 -661395 -940511 -493118 3471 8478 -104138 129544 424144 271639 -237229
35837 -237229 -634132 -725506 -597569 -302594 77358 310854 258945 26659 -282882 -674977
35827 -674977 -1011596 -1024686 -722702 -418858 -264117 -172628 -242587 -665257 -1100533 -844347
35817 -844347 96078 778307 570978 -15151 -198148 7724 157684 221075 375320 409889
35807 409889 64643 -342325 -306326 68528 275971 189898 44107 -147533 -508440 -788265
35797 -788265 -585193 -29742 334570 342293 354613 608413 892738 922952 669499 306990
35787 306990 115788 326117 775675 930660 593325 313230 645052 1283241 1499623 1210295
35777 1210295 958931 978924 960835 719825 421048 95505 -427928 -1008025 -1214229 -1006674
35767 -1006674 -833059 -891412 -851607 -513581 -199087 -198175 -286273 -130110 172113 283073
35757 283073 116595 -133530 -281693 -271539 -146443 -27614 -16392 -81206 -145698 -216607
35747 -216607 -262844 -131194 141008 119399 -511329 -1346814 -1642523 -1233667 -602065 -82096
35737 -82096 438809 987564 1263362 1107569 740327 363413 -32568 -334795 -269743 115895
35727 115895 398281 398118 402430 566645 598596 321340 70609 175363 450223 568695 564644
35716 564644 579664 473533 134070 -109581 135061 700728 1046787 957573 673336 424879
35706 424879 232769 138147 242880 432909 359499 -133340 -705461 -810307 -296658 355585
35696 355585 485183 -45779 -699105 -881820 -575533 -201422 -41445 -69295 -227928 -515096
35686 -515096 -817230 -998550 -1157647 -1457021 -1693450 -1426936 -622837 183741 480033 249374
35676 249374 -204273 -592206 -730550 -594029 -355701 -149218 142114 561058 727331 326302
35666 326302 -177371 11937 832514 1358677 1151104 851702 1084824 1478532 1311170 608409
35656 608409 26702 -26891 301287 621032 559894 -10958 -734207 -1045959 -883048 -709492
35646 -709492 -695275 -455705 134406 555205 495374 410078 680179 880160 556858 109461
35636 109461 79684 106541 -462699 -1306734 -1498901 -940046 -413437 -277537 -110854 258154
35626 258154 354122 -31111 -369580 -239725 21450 -78488 -454960 -718364 -767456 -738705
35616 -738705 -681819 -617663 -675986 -890219 -1035736 -903267 -604538 -437639 -539058 -771584
35606 -771584 -895430 -816583 -690452 -700134 -704098 -337635 386851 880705 674828 52046
35596 52046 -380169 -503069 -631901 -856321 -956776 -869708 -716526 -425327 156708 781801
35586 781801 943115 544450 -21314 -479530 -890273 -1230977 -1267256 -956454 -565467 -297273
35576 -297273 -156001 -160199 -255467 -79021 627699 1380469 1377338 655697 132844 292265
35566 292265 553846 298765 -193269 -361742 -314096 -470607 -670817 -400108 248973 557781
35556 557781 184349 -378881 -523905 -282567 -106024 -152335 -123437 204047 544334 394581
35546 394581 -287167 -931046 -998932 -589754 -213895 -143341 -258922 -395424 -482166 -411311
35536 -411311 -146101 52850 -113416 -484214 -585534 -308892 -47042 -101513 -376017 -722377
35526 -722377 -1101088 -1257716 -784396 194349 860553 614451 -194201 -808965 -1007922 -1075348
35516 -1075348 -1113492 -928899 -545550 -342984 -556556 -934953 -1041205 -738206 -266121 70795
35506 70795 180416 149956 50804 -92048 -165955 -32055 186782 135232 -257164 -546322
35496 -546322 -356574 52704 187555 65062 82088 300300 399699 253141 -6781 -412963
35486 -412963 -1030917 -1440885 -1073473 -147616 453701 410411 335951 691567 1095277 1068329
35476 1068329 749058 430775 58896 -337622 -357299 109774 528364 546711 545803 789710
35466 789710 725807 -108714 -1090447 -1300780 -859314 -583477 -699320 -805298 -805957 -917424
35456 -917424 -949163 -544365 -10902 33527 -253365 -193958 130126 -49160 -743362 -991678
35446 -991678 -396932 220888 182116 -62855 75619 282479 80224 -169825 50362 312457
35436 312457 -131844 -939590 -973119 -4006 852143 663568 -113570 -369441 238520 1061957
35426 1061957 1366982 1024025 400839 -58942 -105513 205986 536953 525467 163240 -144729
35416 -144729 -24805 407723 707503 690631 601051 610094 490196 53643 -372180 -332810
35406 -332810 36559 165733 -96220 -290756 -132494 26107 -193228 -526042 -443565 14766
35396 14766 249733 -68921 -559696 -635837 -207117 304088 523875 499710 503638 636510
35386 636510 750041 673095 360538 -126207 -584975 -662785 -191016 412435 451099 -146669
35376 -146669 -603251 -276436 476027 821863 544251 115481 -73689 12689 379676 961748
35366 961748 1341235 1162968 791414 852408 1153834 932556 269672 196402 976727 1379725
35356 1379725 464418 -815380 -867933 279178 1182091 1126939 802611 818930 807140 392507
35346 392507 44235 314875 892299 1048138 634648 119211 -89207 69377 452259 803336
35336 803336 890153 793085 820135 969464 859034 423652 192413 469627 725267 375266
35326 375266 -239594 -380571 -139194 -273039 -867467 -1084025 -475551 266991 310690 -221708
35316 -221708 -652337 -718287 -573011 -238605 296284 689772 608288 349610 482397 894754
35306 894754 824216 -47466 -1066954 -1393772 -919017 -199007 198256 84686 -324961 -579443
35296 -579443 -379676 78621 346288 329644 351482 559831 687278 557787 407943 442514
35286 442514 471841 340250 345822 766620 1222963 1044843 195196 -638443 -876139 -587842
35276 -587842 -201360 -39861 -193340 -505133 -600608 -223534 365795 597796 298965 -61857
35266 -61857 45987 614115 1216052 1525331 1521734 1302287 892727 266136 -519335 -1213547
35256 -1213547 -1444270 -1003199 -101369 731273 1048075 793508 283856 -35315 114061
35247 114061 625155 1058166 1010993 478103 -187538 -629942 -744649 -633919 -419998 -130920
35237 -130920 242015 571227 568086 98988 -502950 -695678 -360276 89443 317660 442882
35227 442882 616410 627297 297459 -58344 -50636 131700 26659 -277656 -221410 336806
35217 336806 910893 1168458 1334141 1605363 1720056 1436824 988084 660868 296446 -339143
35207 -339143 -941486 -915150 -157448 782695 1295999 1172273 549510 -242042 -762509 -711427
35197 -711427 -226795 238599 419365 470487 642245 891142 944369 659074 173517 -281124
35187 -281124 -587673 -716336 -611925 -260783 136134 224810 -153162 -741645 -1100837 -1029760
35177 -1029760 -700348 -420672 -326342 -266047 30999 602760 1091192 1103467 741881 504839
35167 504839 577098 569414 186485 -218386 -155147 211269 283235 -90331 -470947 -534667 -422073
35156 -422073 -336197 -251427 -134310 -58560 26270 301251 745267 1093033 1180746 1042831
35146 1042831 692897 183399 -160377 -28892 364257 571686 664993 1042156 1472920 1193180
35136 1193180 199695 -455399 -160817 304335 9138 -687314 -822834 -394749 -202365
35127 -202365 -440968 -511531 -159951 185065 311342 565055 1056746 1284376 867379 77750
35117 77750 -613883 -1000379 -980922 -550039 -163941 -457668 -1255849 -1507240 -657294 510762
35107 510762 953681 722438 543096 528456 220338 -308674 -407496 -14164 46894 -692058
35097 -692058 -1539028 -1610419 -1056009 -703603 -858333 -1141131 -1330661 -1623631 -1990620 -1943500
35087 -1943500 -1244040 -393593 -72254 -368104 -839818 -1092877 -1018321 -699020 -396651 -447725
35077 -447725 -849178 -1096447 -757438 -68897 383207 440464 421311 483208 412104 90571
35067 90571 -257493 -409585 -392500 -298469 -173999 -150192 -339115 -549007 -481572 -260557
35057 -260557 -314432 -642036 -719815 -339389 3547 -128929 -470371 -565265 -474070 -477630 -458788
35046 -458788 -144699 279495 363656 72317 -230704 -402213 -654398 -1069409 -1371440 -1247088
35036 -1247088 -668971 68394 486337 273891 -298919 -569230 -328107 -146473 -504546
35027 -504546 -984348 -871789 -261975 110499 660 -107090 86833 244763 64325 -174243
35017 -174243 -76478 215126 190551 -345785 -984122 -1103730 -541480 157779 329856 42332
35007 42332 -9386 412703 666023 279667 -181943 8833 523551 536331 138091 111363
34997 111363 458429 378433 -177275 -202408 684585 1440412 1166235 472917 409916 837535
34987 837535 882200 466144 303506 618136 867435 737735 575379 688236 877469 877947
34977 877947 787947 831202 986419 1027870 792463 362788 65942 204939 697747 1137050
34967 1137050 1282346 1223379 956700 238854 -840178 -1574223 -1415428 -738271 -314335
34958 -314335 -245153 5581 617944 1071569 911431 388803 112382 309127 610168 480199
34948 480199 -199155 -957997 -1214677 -903692 -430272 -38474 369544 700208 514729 -256523
34938 -256523 -951613 -1003847 -715413 -690180 -906799 -978502 -963161 -1156306 -1320466 -951533
34928 -951533 -234894 74569 -233887 -587941 -601588 -545929 -672872 -759965 -597857 -366065
34918 -366065 -277569 -327667 -531894 -882801 -985529 -390723 556625 920386 465404 -9840
34908 -9840 40774 119999 -296127 -746555 -538395 87275 369862 199113 49037 21767
34898 21767 -212788 -624543 -722711 -304826 242791 443169 142238 -493799 -1026318 -967468
34888 -967468 -363684 75804 -119656 -471149 -315947 71836 -82258 -728045 -1038445 -748495
34878 -748495 -464818 -478728 -259889 476089 1089408 994355 618061 704124 1153419 1249595
34868 1249595 742443 91491 -213791 -99779 207476 388738 255715 17587 107306 549523
34858 549523 852279 757314 622660 718390 711098 378194 253975 806574 1441976 1261947
34848 1261947 517162 263728 691287 928514 615256 465462 853678 979673 163410
34839 163410 -936962 -1278254 -923013 -644746 -565726 -213994 364287 599637 429988 366583
34829 366583 485304 290010 -252986 -476576 -144770 47808 -386707 -855792 -610753 52666
34819 52666 276956 -79605 -431145 -482638 -471281 -480382 -277238 94354 230990 32217
34809 32217 -131493 -76685 -67145 -210597 -177861 164003 387368 182675 -91990 -35699 62332
34798 62332 -269923 -771963 -749522 -133587 463874 706503 825752 897028 598629 -36444
34788 -36444 -345034 28042 483868 323234 -186033 -244667 239951 549664 236939 -334601
34778 -334601 -650057 -708259 -781092 -882074 -778839 -367448 183528 609352 791099 872050
34768 872050 1110639 1527267 1793626 1645876 1289145 1125164 1164519 1045811 614291 110839
34758 110839 -246287 -467367 -485563 -88796 615751 1062145 882194 426902 301072 596393
34748 596393 924073 1024193 965164 843819 673083 564219 695707 1045244 1378180 1521753
34738 1521753 1454719 1153717 601556 -28536 -439135 -530907 -470370 -375596 -131591 365110
34728 365110 923160 1178250 977002 550476 280830 318675 476893 530337 522824 616438
34718 616438 701694 465024 -66127 -384459 -151568 303084 473344 425351 595745 972474
34708 972474 1036767 596816 151972 174010 426715 347000 -148810 -610469 -698919 -548696
34698 -548696 -462807 -497381 -470696 -276562 -52623 -2224 -119244 -213508 -227143 -346056 -664327
34687 -664327 -923015 -839668 -574335 -526922 -705351 -684443 -266191 211215 393254 370135
34677 370135 360322 260356 -124385 -605974 -766356 -509993 -139862 70543 83223 -78017
34667 -78017 -372605 -595889 -516022 -242675 -163693 -395680 -585966 -436991 -150941 -84218
34657 -84218 -171384 -48376 332218 581233 424562 67642 -117214 -23893 218585 491403
34647 491403 704360 750496 671656 721355 1006303 1202130 948259 432197 184072 297780
34637 297780 312614 -8628 -254710 -5689 482651 629271 331046 22003 58238 387934
34627 387934 745347 867820 604155 101140 -195248 -4314 409888 590825 486593 375055
34617 375055 345592 272136 216938 396323 727918 834876 551816 60225 -468587 -937034
34607 -937034 -1046289 -503448 384290 860067 663863 340525 382771 578723 523363 298231
34597 298231 237556 390639 609893 849332 1009627 827369 320912 18905 303670 825511
34587 825511 1031514 969688 1023311 1119067 865031 348900 99017 219966 233345 -57008
34577 -57008 -154125 360929 1112407 1393241 1084981 730886 788007 1122201 1300354 1206261
34567 1206261 1206222 1651273 2330882 2673714 2548716 2534146 3122356 3939824 4199307 3807288
34557 3807288 3532457 4027214 5106135 6107730 6578974 6419407 5716205 4755448 3996874
34548 3996874 3716340 3714289 3579761 3202253 2829659 2619864 2357553 1781312 1094935 878846
34538 878846 1358034 1974152 1985906 1397815 895314 836882 813590 445365 114550 415761
34528 415761 1169388 1551613 1141334 374765 -49604 151616 766307 1344749 1509310 1260875
34518 1260875 961917 848566 750409 539613 520697 899466 1168968 698600 -214950 -638890
34508 -638890 -331421 21365 1707 18913 350467 484633 3853 -549152 -407387 260036
34498 260036 640464 452406 141833 50697 34873 -86867 -227351 -254542 -157882 51151
34488 51151 333352 540180 576187 566248 642265 718570 736349 907219 1340781 1626986 1265571
34477 1265571 425286 -208795 -336413 -314860 -477718 -663601 -599290 -357933 -194956 -191831
34467 -191831 -267349 -343772 -346509 -223889 -104332 -259135 -764181 -1320858 -1521066 -1212492
34457 -1212492 -590403 -59677 18969 -347739 -707943 -632417 -268124 -163463 -519721 -938241
34447 -938241 -997544 -729244 -357306 68224 502628 691603 493085 199758 158528 227456
34437 227456 30591 -339557 -354411 159760 704612 759717 404356 68265 -54629 -62874
34427 -62874 -10918 160917 401266 500128 308248 -108430 -520297 -669662 -440969 -10670
34417 -10670 254691 174338 -56545 -168211 -170395 -228337 -341601 -412607 -507662 -701800 -739458
34406 -739458 -290670 417599 714558 399102 47528 114258 229278 -114559 -589794 -443871
34396 -443871 309235 863210 813368 632516 744384 853362 648541 562397 1139839 1988295
34386 1988295 2121402 1304840 369420 37591 51797 -191652 -624231 -654604 -134349 382458
34376 382458 417261 173718 136629 343684 382647 25372 -451983 -655245 -564887 -502703
34366 -502703 -704451 -1045594 -1170977 -857067 -278095 108555 42070 -205572 -150305 246217
34356 246217 502702 294887 -102126 -265262 -219673 -242821 -315903 -236180 -155229 -458062
34346 -458062 -1046084 -1268805 -795540 -138636 -8618 -451914 -941352 -1086247 -912275 -587290
34336 -587290 -227177 40866 95332 -37460 -190692 -224157 -121581 23643 55041 -122922
34326 -122922 -385110 -451211 -209340 109693 163815 -168927 -723369 -1188143 -1286609 -992707
34316 -992707 -629158 -573418 -808407 -967921 -869769 -720397 -696309 -663467 -496914 -330049
34306 -330049 -223364 67387 641230 1090661 1033529 749512 768590 1003380 889018 347497
34296 347497 -8614 235540 745787 1003717 978504 945114 968098 887516 629701 294050
34286 294050 60697 134311 580837 1095546 1169972 664884 22047 -250480 -109761 138494
34276 138494 248587 151153 -101495 -297977 -191907 135226 277609 91940 -17972 285647
34266 285647 694265 732074 550744 664030 1026390 1052090 596694 227451 294027 385962
34256 385962 103582 -205597 -11529 546596 988338 1322663 1826625 2202123 1800022 745426
34246 745426 36522 256111 865914 1129787 1084004 1092660 1027524 586294 51851 -23384
34236 -23384 280183 380619 165291 115384 407601 607264 461015 335607 530500 716114
34226 716114 492097 72404 -62161 108372 218257 103214 -96694 -241679 -228276 83682
34216 83682 584298 751241 240671 -496953 -706772 -373371 -209621 -542710 -804281 -391729
34206 -391729 441174 942039 809293 384907 61571 -109239 -228253 -285781 -210405 -48317
34196 -48317 2541 -259956 -824199 -1372923 -1506152 -1143468 -622978 -287005 -55400 394643
34186 394643 1031180 1302581 747191 -362898 -1227209 -1357396 -981361 -563549 -224226
34177 -224226 140116 412911 341634 16004 -141179 54404 321912 372322 258508 120732
34167 120732 -54038 -187835 1120 522067 845551 551071 -3588 -155789 96162 166012
34157 166012 -163208 -491878 -586717 -755229 -1174023 -1429668 -1169293 -784990 -917049 -1496149
34147 -1496149 -1792745 -1360038 -509309 156052 322100 37187 -470594 -921254 -1130381
34138 -1130381 -1130815 -1033919 -794888 -326509 170571 309359 65902 -78659 225574 672429
34128 672429 735234 450664 345981 621621 873957 765822 536113 558298 741629 754126
34118 754126 592437 494266 451930 293904 151089 300774 561682 460508 115482 271199
34108 271199 1130807 1814217 1532001 781805 665119 1328348 1867444 1682374 1140484 779203
34098 779203 566966 284676 111213 374935 968124 1377147 1231085 640113 53095 -133290
34088 -133290 104270 462651 734129 1053293 1545251 1919886 1785998 1280745 943506 944994
34078 944994 899005 542363 142568 35298 172677 377470 661674 985923 1037027 622036
34068 622036 73644 -84037 248418 715874 952526 836010 472045 160926 209238 538459
34058 538459 658155 274591 -270203 -454527 -276974 -145121 -206591 -205692 16186 269020
34048 269020 347783 328762 422137 713689 1110939 1395018 1327732 898042 479470 542733
34038 542733 1145674 1850133 2197822 2157751 2071770 2265116 2755708 3286213 3610177 3737912
34028 3737912 3849499 3993052 4033044 3937135 3891540 3998966 4079905 3964063 3766464 3635936
34018 3635936 3453795 3111827 2900575 3195622 3842570 4306683 4441243 4648437 5174791
34009 5174791 5690332 5789465 5576732 5512255 5918526 6846814 8215604 9888092 11792101
34000 11792101 14094285 17044526 20581670 24471590 29042080 35354895 44228311 55314869
33992 55314869 67440925 79433139 90018756 97251408 99047713 94709557 85538811 73805442
33984 73805442 61503826 50095424 40612421 33347837 27762861 23261839 19925811 18074369
33976 18074369 17305515 16523084 14951241 12720004 10405242 8375250 6706539 5405965
33968 5405965 4477257 3873804 3488686 3156386 2735479 2309417 2161626 2331565 2375252 1925801
33958 1925801 1350425 1347355 1898313 2205895 1850112 1428549 1656999 2274680 2378221 1654786
33948 1654786 786893 609390 1176112 1749422 1610401 863432 382946 808480 1718248
33939 1718248 2188529 2106537 2302654 3245666 4403931 5373860 6822254 9369193 11993908
33930 11993908 12683343 10712449 7425547 4650205 3116626 2578545 2602414 2747077 2562543
33921 2562543 1973766 1395341 1145483 1031454 747376 330298 -46756 -395090 -732956
33912 -732956 -894975 -814128 -719190 -764586 -734570 -426610 -79877 -66270 -327862 -478984
33902 -478984 -377491 -267947 -364454 -549092 -549307 -282942 39781 149967 42477 -22101
33892 -22101 93538 174911 7715 -222962 -202247 -5985 60736 43751 256514 639978
33882 639978 766634 553650 394662 450521 422395 241564 343756 947501 1698452 2413679
33872 2413679 3487257 4986459 5984767 5576551 4149512 2864862 2161141 1585415 932631
33863 932631 646948 967963 1431355 1530521 1384707 1436363 1780263 2048944 1831846 1088216
33853 1088216 213176 -305726 -352717 -223799 -180625 -172732 -59851 194245 647565 1295609
33843 1295609 1702395 1251153 102181 -648177 -267599 636791 1022892 814576 669801
33834 669801 756005 663357 356499 280781 486350 480923 105353 -168482 -21685 244877
33824 244877 246301 -2368 -325594 -647728 -853541 -798052 -570061 -392903 -265598 -95865
33814 -95865 -86880 -463434 -896022 -815658 -279289 123805 214411 349035 566849 426932
33804 426932 -117008 -471537 -315398 -30899 63823 166632 334239 153398 -465068 -893038
33794 -893038 -737890 -520959 -779671 -1101938 -797278 -80048 202977 -205091 -692850 -617384
33784 -617384 74426 947734 1432683 1236901 680315 378911 417097 270393 -219224 -417858
33774 -417858 96005 718000 641557 -3739 -515239 -669217 -672478 -467483 80568 585120
33764 585120 576414 345601 505126 856779 617217 -239513 -798969 -536057 -2267 88709
33754 88709 -227638 -468315 -346260 155388 858243 1326560 1200897 753418 620989 863362
33744 863362 859973 321132 -229243 -287406 -103163 -177094 -504046 -755000 -843246 -895332 -945487
33733 -945487 -1005378 -1167176 -1346088 -1227464 -766213 -407199 -472951 -654072 -485790 -48960
33723 -48960 198837 57364 -323301 -753913 -1042282 -961325 -577872 -375034 -622857 -880510
33713 -880510 -618986 -83461 90660 -53236 130699 729863 998928 508269 -151092 -247778
33703 -247778 75469 201448 22718 -76418 43609 160682 176752 167912 36671 -323788
33693 -323788 -565768 -226671 395679 406337 -390551 -1048298 -784462 -105607 23918 -380729
33683 -380729 -587627 -537273 -898431 -1675703 -1853358 -899625 244921 380236 -356005 -866770
33673 -866770 -641989 -91682 415324 927833 1308777 1128125 434045 -57640 77499 363291
33663 363291 189769 -270272 -426464 -238857 -234992 -650118 -1076418 -1058235 -660589 -292375
33653 -292375 -210496 -360659 -556595 -653380 -596000 -419224 -223508 -111105 -121617 -232819
33643 -232819 -433048 -762576 -1207807 -1558428 -1537457 -1191168 -969269 -1167874 -1427545 -1163936
33633 -1163936 -476482 -153330 -605774 -1267382 -1394773 -1063689 -868701 -912912 -743417 -241586
33623 -241586 89697 -87518 -423334 -445611 -205512 12389 251245 676632 1048314 933874
33613 933874 391969 -45790 -123231 -157166 -472035 -932470 -1233462 -1327746 -1317808 -1175919
33603 -1175919 -848613 -478606 -270393 -230778 -219500 -134891 97557 525922 954421 944909
33593 944909 334165 -417119 -716949 -535349 -253850 -4697 340511 613114 404536 -198846
33583 -198846 -533573 -277149 79258 28752 -176978 -38525 310366 351036 81541 4734
33573 4734 243991 292518 -207007 -914510 -1239609 -999159 -449108 49276 224661 22901
33563 22901 -268025 -219505 246050 725468 809070 505451 97563 -212766 -397746 -551515
33553 -551515 -856717 -1360796 -1671596 -1215445 -47030 928972 933413 283592 -54112 266323
33543 266323 668458 608644 276089 149963 317208 545909 725878 888142 967574 868861
33533 868861 679316 554276 448947 188286 -231779 -596785 -704051 -526141 -229497 -132313
33523 -132313 -474744 -1063972 -1348909 -1086043 -719159 -783107 -1146515 -1268082 -1029299 -784792
33513 -784792 -677610 -512736 -319802 -368925 -500361 -162416 611896 1009777 646124 234093
33503 234093 461116 898705 818829 484412 628807 1061521 918289 129317 -512002 -760297
33493 -760297 -1216197 -1979374 -2178541 -1364326 -368178 -100140 -314149 -310715 -160782 -372157
33483 -372157 -832509 -952954 -588426 -88560 333431 631991 584079 83295 -424736 -440692
33473 -440692 -135968 57058 293417 951787 1634028 1507138 673854 204966 553273 890724
33463 890724 498752 -45970 184010 932735 1064186 188073 -827748 -1041125 -503010
33454 -503010 95366 398950 639340 1077475 1553635 1682191 1328624 764787 410869 524678
33444 524678 1062276 1657605 1787662 1247354 517164 327276 711058 886357 375479 -177611
33434 -177611 147308 1142957 1619594 984501 24120 -142162 597207 1390760 1488208 902834
33424 902834 171572 -232909 -250146 -145377 -129986 -128708 246 157258 157509 102429 256199
33413 256199 562245 671610 533337 539684 881023 1147082 906255 396146 213592 449809
33403 449809 582407 270486 -140300 -111661 356263 794127 949257 1026377 1157314 1013950
33393 1013950 296217 -612562 -972389 -677519 -420397 -690603 -1093172 -1011707 -553696 -343220
33383 -343220 -591246 -883875 -836915 -525468 -240646 -150546 -228525 -279395 -78568 306735
33373 306735 465730 162223 -275647 -394853 -249082 -212928 -350799 -411703 -316455 -198826
33363 -198826 -76679 73213 56782 -240253 -475942 -337455 -218667 -721054 -1585531 -1908977
33353 -1908977 -1444952 -880055 -704750 -653631 -501925 -559502 -959627 -1202090 -903990 -398921
33343 -398921 -110746 107466 514887 871134 799432 365383 -129515 -537731 -708797 -433291
33333 -433291 78778 193567 -248801 -579065 -296745 173484 259852 140529 177748 55056
33323 55056 -665677 -1556664 -1792938 -1344396 -872032 -666865 -530261 -518441 -892198 -1354338
33313 -1354338 -1203724 -353272 530526 990257 1190312 1287657 1123158 755101 658339 1080286
33303 1080286 1646379 1844036 1545358 917740 181975 -417972 -716245 -768973 -665070 -298531
33293 -298531 340538 825801 705745 120833 -460947 -936100 -1429750 -1689422 -1353768 -725014
33283 -725014 -472852 -576425 -402612 105560 264394 -101186 -221147 355785 942056 776707
33273 776707 205244 97603 600325 1134178 1252095 911510 232329 -468715 -708407 -401973
33263 -401973 -94362 -184086 -319107 -93550 114218 -266447 -896761 -880988 -121821 523431
33253 523431 525807 328178 441146 594213 265580 -388038 -684780 -358930 93120 64839
33243 64839 -428213 -821842 -729140 -412023 -400755 -733007 -850507 -361413 360750 603740
33233 603740 200645 -305526 -347174 73887 507864 573323 274281 -100573 -329168 -479293
33223 -479293 -715716 -937360 -844332 -441992 -181300 -359319 -620273 -403469 236205 649152
33213 649152 448934 -5054 -113857 229001 603436 627001 360456 157532 235385 469203
33203 469203 590636 492069 263385 14969 -183928 -246157 -166342 -177363 -537873 -1097503
33193 -1097503 -1366328 -1147023 -791596 -642508 -562114 -325392 -158388 -429109 -981153 -1267443
33183 -1267443 -1102103 -823773 -689196 -550751 -253985 34891 97945 -2028 -30498 161788
33173 161788 582667 1100415 1439826 1393809 1080725 754225 373565 -270449 -962524 -1089523
33163 -1089523 -486687 204579 367637 176725 94858 27111 -383607 -891128 -874098 -399556
33153 -399556 -230790 -575261 -641834 98482 931658 893058 238630 34454 492984 702500
33143 702500 151083 -418919 -176990 480141 516326 -204567 -759479 -502275 156294 504828
33133 504828 488118 504883 607934 429725 -141011 -645315 -584648 -31528 485548 588327
33123 588327 343284 5784 -288770 -504800 -588680 -554722 -567632 -719384 -789504 -493530
33113 -493530 21047 235806 -48450 -362069 -153187 466290 869089 723896 331972 120948
33103 120948 106916 21455 -227131 -455824 -525239 -550930 -722874 -1032965 -1308225 -1470649
33093 -1470649 -1601363 -1708599 -1615666 -1225947 -758976 -514303 -494581 -504571 -543426 -778035
33083 -778035 -1132444 -1260806 -1016027 -625266 -301748 -17693 216053 211642 -79584 -458389
33073 -458389 -829218 -1236097 -1395538 -795016 383125 1060322 548796 -493488 -1044190
33064 -1044190 -1110307 -1304220 -1525799 -1192517 -550442 -484188 -929190 -757854 346090 1103296
33054 1103296 442475 -886551 -1403542 -889394 -299998 -153211 -51732 309411 596366
33045 596366 463562 92039 -121862 -37289 210735 415487 468069 471298 620832 864335
33035 864335 886959 608346 411206 614220 1010704 1247048 1342647 1430239 1291289 682000
33025 682000 -68546 -342111 -39663 379605 593174 653086 586528 309711 -8641 -14564
33015 -14564 275476 432768 267064 99490 221730 475898 573323 484083 295882 7878
33005 7878 -290602 -319749 33564 474640 690570 794973 1077938 1440396 1439023 919351
32995 919351 301348 99863 355189 709779 920113 1054558 1194565 1202609 925066 438378
32985 438378 -87602 -592428 -944261 -764155 134418 1204084 1592304 1211775 859923
32976 859923 1068026 1385903 1181486 635752 391587 569350 745277 706338 625534 580195
32966 580195 458495 329826 405285 606896 617057 375275 122823 -35551 -203831 -350582
32956 -350582 -319828 -175618 -117145 -88696 72428 162811 -164583 -708981 -852282 -466472
32946 -466472 -104612 -158715 -412225 -584238 -702465 -725395 -433276 24197 117599 -184971
32936 -184971 -206973 327447 679465 222178 -445820 -329997 442675 825280 371940 -285721
32926 -285721 -449130 -87498 504999 1119606 1540341 1572615 1342632 1180581 1135738 1002079
32916 1002079 833744 943293 1291872 1369687 875584 128321 -376565 -481958 -305210 -12270
32906 -12270 192542 178897 119338 273368 474287 284533 -207306 -314761 208606 632386
32896 632386 270021 -426444 -476832 194041 705952 564274 274944 407820 706634 551978
32886 551978 -115220 -795458 -1123202 -1138798 -982350 -697417 -354145 -105132 -63521 -243418
32876 -243418 -568577 -822354 -730150 -302861 36237 -53278 -323378 -290043 -17393 -59470
32866 -59470 -535720 -809526 -392712 288478 479883 117521 -269937 -452150 -673825 -998818
32856 -998818 -1117090 -931098 -767666 -782687 -672701 -291699 -70496 -368816 -774703 -597461
32846 -597461 133525 707850 710888 448259 348792 414948 421720 283766 21339 -348966 -687771
32835 -687771 -751615 -557004 -497194 -836360 -1277162 -1342873 -1057151 -868845 -935164 -912837
32825 -912837 -591784 -310194 -412564 -612720 -383054 159797 340283 -21580 -244751 190766
32815 190766 785311 750250 239433 107343 549233 812405 441266 10173 154692 516447
32805 516447 318596 -408485 -909460 -836838 -598584 -580635 -661649 -628719 -543353 -503715 -461636
32794 -461636 -437949 -531913 -589789 -307529 161817 198049 -392405 -939934 -777810 -151084
32784 -151084 222290 165408 35154 -71416 -411330 -909148 -1057988 -709837 -414284 -651290
32774 -651290 -1135996 -1263285 -975889 -800714 -1140152 -1844011 -2437698 -2531203 -2034130 -1188231
32764 -1188231 -412807 17307 149541 153490 54454 -178922 -375752 -236788 282441 816856
32754 816856 894202 334149 -634613 -1537611 -1934046 -1688953 -1068035 -519499 -310968 -383290
32744 -383290 -517959 -558005 -467744 -283402 -60096 173946 422083 636230 665628 405184
32734 405184 4764 -214321 -135237 -22510 -187265 -539272 -654008 -321502 143533 283361
32724 283361 89225 -18435 169626 304533 -3596 -515514 -608050 -204131 -12343 -578597
32714 -578597 -1438477 -1641704 -970951 -166552 82938 -88516 -152408 3236 55170 -133736
32704 -133736 -264278 -34160 422153 682824 549681 265329 182588 323716 401795 235222
32694 235222 -77985 -443840 -929148 -1427282 -1474262 -805969 74332 381169 64438 -170710
32684 -170710 91141 481989 593734 629222 919922 1261372 1237792 912715 687190 640887
32674 640887 472697 3920 -626489 -1162390 -1326019 -924612 -230601 1279 -607611 -1388451
32664 -1388451 -1390365 -675674 -181477 -327625 -533901 -293579 44020 -22386 -278334 -201915
32654 -201915 142419 214829 -145632 -473953 -286181 392330 1118155 1432331 1186089 634210
32644 634210 201679 76811 79485 -58365 -418301 -907763 -1333918 -1416209 -972303 -195955
32634 -195955 468360 811465 984964 1098569 1041864 837281 776972 961329 1053060 788440
32624 788440 401366 189020 -13921 -468826 -899483 -788602 -223038 102305 -218820 -855622
32614 -855622 -1286564 -1377984 -1250702 -940921 -474358 -65239 45043 -104440 -227271 -123747
32604 -123747 120127 266289 185839 -40632 -248749 -348473 -327665 -190850 -10829 35540
32594 35540 -127242 -274301 -131240 187080 297406 141361 68408 201013 175425 -205007
32584 -205007 -512319 -329663 29693 -2455 -319434 -335438 7000 126755 -233753 -608691
32574 -608691 -603890 -512624 -775006 -1255733 -1478064 -1291906 -904993 -444571 96946 554154
32564 554154 616394 231265 -279361 -598055 -717355 -763271 -688350 -353260 127207 372299
32554 372299 203686 -52826 33355 403103 623902 563839 537766 680895 638234 152087
32544 152087 -455400 -764227 -843187 -884571 -622552 227855 1174063 1355308 743794 210503
32534 210503 282270 538144 458826 182744 49437 -17259 -213965 -404498 -413842 -394042 -471091
32523 -471091 -401088 -33968 243305 53524 -287837 -227997 107771 112808 -276182 -434874
32513 -434874 -30124 470186 524074 285800 297991 692395 1056957 1007197 609053 194609
32503 194609 -73903 -323040 -663083 -925227 -878641 -635938 -552213 -669189 -598265 -136824
32493 -136824 334622 374163 125174 62300 280544 450162 370989 161844 -48831 -224984
$$ [...]
##END NTUPLES=NMR SPECTRUM
##END=
