##TITLE=31Pdec_CPA2B2806
 CDCl3, 24 sc
 29.06.2021
##JCAMPDX= 6.0         $$ Bruker NMR JCAMP-DX V2.0
##DATA TYPE= NMR SPECTRUM
##DATA CLASS= NTUPLES
##ORIGIN= UXNMR, Bruker Analytische Messtechnik GmbH
##OWNER= root
$$ XWIN-NMR		Version 3.5
$$ Tue Jun 29 09:12:47 2021 Russian Standard Time (UT+4h)  she@DPX200
##.OBSERVE FREQUENCY= 81.013821
##.OBSERVE NUCLEUS= ^31P
##.ACQUISITION MODE= SIMULTANEOUS
##.ACQUISITION SCHEME= undefined
##.AVERAGES= 24
##.DIGITISER RES= 16
##SPECTROMETER/DATA SYSTEM= spect
##.PULSE SEQUENCE= zgpg30
##.SOLVENT NAME= CDCl3
##.SHIFT REFERENCE= (INTERNAL, CDCl3, 0, 248.564)
##AUDIT TRAIL= $$ (NUMBER, WHEN, WHO, WHERE, WHAT)
$$ ##TITLE= Audit trail, XWIN-NMR		Version 3.5
$$ ##JCAMPDX= 5.01
$$ ##ORIGIN= Bruker BioSpin GmbH
$$ ##OWNER= she
$$ F:/spectra/data/she/nmr/P31/1/pdata/1/auditp.txt
$$ ##AUDIT TRAIL=  $$ (NUMBER, WHEN, WHO, WHERE, WHAT)
(   1,<2021-06-29 09:11:36.67 +0400>,<she>,<DPX200>,
      <created by zg, POWCHK disabled, PULCHK disabled
       configuration hash MD5:
       00 E9 B6 7A A2 85 ED C7 34 08 36 98 17 FE 4E 26
       data hash MD5: 32K
       70 B9 E3 B7 A0 F6 B5 79 35 CE 23 8F 1E 5C 44 27>)
(   2,<2021-06-29 09:11:39.31 +0400>,<she>,<DPX200>,
      <Start of raw data processing
       efp BC_mod = 2 LB = 1 FT_mod = 6 PKNL = 1 PHC0 = -8133.766 PHC1 = 3829.887 SI = 64K 
       data hash MD5: 64K
       F3 FA D2 7E 92 00 77 88 D8 4E 88 92 08 BC 9D 66>)
(   3,<2021-06-29 09:12:07.90 +0400>,<she>,<DPX200>,
      <pk PHC0 = -65.37706 PHC1 = -105.6 
       data hash MD5: 64K
       2C 8C A2 50 7B 49 E5 03 19 91 37 4D 45 D2 81 67>)
(   4,<2021-06-29 09:12:11.18 +0400>,<she>,<DPX200>,
      <abs ABSG = 5 
       data hash MD5: 64K
       D9 C4 9B 0D FE C7 29 58 9D 81 36 08 5F 5C 0D 25>)
$$ ##END=
$$ 
$$ hash MD5
$$ F0 38 BC E9 5E 2D 67 F9 BE 9A F5 08 1B 2A B6 E5
##$RELAX= 
##$RELAX= 
##$RELAX= 
##$RELAX= 
##$RELAX= 
##$RELAX= 
##$RELAX= 
##$RELAX= 
$$ Bruker specific parameters
$$ --------------------------
##$DU= <F:/spectra>
##$EXPNO= 1
##$NAME= <P31>
##$PROCNO= 1
##$TYPE= <nmr>
##$USER= <she>
##$AMP= (0..31)
100 100 100 100 100 100 100 100 100 100 100 100 100 100 100 100 100 100 
100 100 100 100 100 100 100 100 100 100 100 100 100 100 
##$AQSEQ= 0
##$AQ_mod= 1
##$AUNM= <au_zg>
##$AUTOPOS= <>
##$BF1= 81.014009
##$BF2= 200.13
##$BF3= 200.13
##$BF4= 200.13
##$BF5= 200.13
##$BF6= 200.13
##$BF7= 200.13
##$BF8= 200.13
##$BYTORDA= 1
##$CFDGTYP= 0
##$CFRGTYP= 5
##$CHEMSTR= <none>
##$CNST= (0..31)
1 1 145 1 1 1 1 1 1 1 1 1 1 1 1 1 1 1 1 1 1 1 1 1 1 1 1 1 1 1 1 1 
##$CPDPRG= <waltz16>
##$CPDPRG1= <>
##$CPDPRG2= <waltz16>
##$CPDPRG3= <>
##$CPDPRG4= <mlev>
##$CPDPRG5= <mlev>
##$CPDPRG6= <mlev>
##$CPDPRG7= <mlev>
##$CPDPRG8= <mlev>
##$CPDPRGB= <>
##$CPDPRGT= <>
##$D= (0..31)
0 1 0 0 0 0 0 0 0 0 0 0.03 2e-05 3e-06 0 0 0 0 0 0 0 0 0 0 0 0 0 0 0 0 
0 0 
##$DATE= 1624943495
##$DBL= (0..7)
120 120 120 11 120 120 24 19 
##$DBP= (0..7)
150 150 150 150 150 150 150 150 
##$DBP07= 0
##$DBPNAM0= <>
##$DBPNAM1= <>
##$DBPNAM2= <>
$$ [...]
##$SUBNAM3= <"">
##$SUBNAM4= <"">
##$SUBNAM5= <"">
##$SUBNAM6= <"">
##$SUBNAM7= <"">
##$SUBNAM8= <"">
##$SUBNAM9= <"">
##$SW= 501.771253377433
##$SWIBOX= (0..15)
0 1 3 0 0 0 0 0 0 0 0 0 0 0 0 0 
##$SW_h= 40650.406504065
##$TD= 32768
##$TD0= 1
##$TE= 0
##$TE2= 300
##$TE3= 300
##$TEG= 300
##$TL= (0..7)
0 120 53 12 22 120 120 120 
##$TP= (0..7)
150 150 150 150 150 150 150 150 
##$TP07= 0
##$TPNAME0= <>
##$TPNAME1= <>
##$TPNAME2= <>
##$TPNAME3= <>
##$TPNAME4= <>
##$TPNAME5= <>
##$TPNAME6= <>
##$TPNAME7= <>
##$TPOAL= (0..7)
0.5 0.5 0.5 0.5 0.5 0.5 0.5 0.5 
##$TPOFFS= (0..7)
0 0 0 0 0 0 0 0 
##$TUNHIN= 0
##$TUNHOUT= 0
##$TUNXOUT= 0
##$USERA1= <user>
##$USERA2= <user>
##$USERA3= <user>
##$USERA4= <user>
##$USERA5= <user>
##$V9= 5
##$VALIST= <valist>
##$VCLIST= <CCCCCCCCCCCCCCC>
##$VD= 0
##$VDLIST= <DDDDDDDDDDDDDDD>
##$VPLIST= <PPPPPPPPPPPPPPP>
##$VTLIST= <TTTTTTTTTTTTTTT>
##$WBST= 1024
##$WBSW= 4
##$XGAIN= (0..3)
0 0 0 0 
##$XL= 0
##$YL= 0
##$YMAX_a= 12290
##$YMIN_a= -13998
##$ZGOPTNS= <>
##$ZL1= 120
##$ZL2= 120
##$ZL3= 120
##$ZL4= 120
##$ABSF1= 248.5645
##$ABSF2= -253.2056
##$ABSG= 5
##$ABSL= 3
##$ALPHA= 0
##$AQORDER= 0
##$ASSFAC= 0
##$ASSFACI= 0
##$ASSFACX= 0
##$ASSWID= 0
##$AUNMP= <proc_1d>
##$AZFE= 0.1
##$AZFW= 0.5
##$BCFW= 0
##$BC_mod= 2
##$BYTORDP= 0
##$COROFFS= 0
##$CY= -3
##$DATMOD= 1
##$DC= 0
##$DFILT= <>
##$DTYPP= 0
##$F1P= 0
##$F2P= 0
##$FCOR= 1
##$FTSIZE= 65536
##$FT_mod= 6
##$GAMMA= 0
##$GB= 0
##$INTBC= 1
##$INTSCL= 5.30512e-09
##$ISEN= 30
##$LB= 1
##$LEV0= 0
##$LPBIN= 0
##$MAXI= 10000
##$MC2= 0
##$MEAN= 0
##$ME_mod= 0
##$MI= 50
##$NCOEF= 0
##$NC_proc= -6
##$NLEV= 6
##$NOISF1= 182.463
##$NOISF2= 159.3651
##$NSP= 0
##$NTH_PI= 0
##$NZP= 0
##$OFFSET= 248.5645
##$PC= 4
##$PHC0= -8199.144
##$PHC1= 3724.287
##$PH_mod= 1
##$PKNL= yes
##$PPARMOD= 0
##$PSCAL= 0
##$PSIGN= 0
##$REVERSE= no
##$SF= 81.014009
##$SI= 65536
##$SIGF1= 159.3651
##$SIGF2= -187.1042
##$SINO= 113.3802
##$SIOLD= 16384
##$SREGLST= <1H.CDCl3>
##$SSB= 0
##$STSI= 65536
##$STSR= 0
##$SW_p= 40650.406504065
##$SYMM= 0
##$S_DEV= 0
##$TDeff= 32768
##$TDoff= 0
##$TI= <>
##$TILT= no
##$TM1= 0
##$TM2= 0
##$TOPLEV= 0
##$USERP1= <user>
##$USERP2= <user>
##$USERP3= <user>
##$USERP4= <user>
##$USERP5= <user>
##$WDW= 1
##$XDIM= 65536
##$YMAX_p= 394888570
##$YMIN_p= -6807378
$$ End of Bruker specific parameters
$$ ---------------------------------
##NTUPLES= NMR SPECTRUM
##VAR_NAME=  FREQUENCY,     SPECTRUM/REAL,   SPECTRUM/IMAG
##SYMBOL=    X,             R,               I
##VAR_TYPE=  INDEPENDENT,   DEPENDENT,       DEPENDENT
##VAR_FORM=  AFFN,          ASDF,            ASDF
##VAR_DIM=   65536,         65536,           65536
##UNITS=     HZ,            ARBITRARY UNITS, ARBITRARY UNITS
##FACTOR=    0.620285442955139, 1,           1
##FIRST=     20137.2065510759, 0,            0
##LAST=      -20513.1999529892, 0,           0
##MIN=       -20513.1999529892, -6807378,    0
##MAX=       20137.2065510759, 394888570,    0
$$ Real data points
##PAGE= N=1
##DATA TABLE= (X++(R..R)), XYDATA
$$ [...]
40541B319972L75006O61380J07169q34164j159703m31707N77696P76338J30583
40532B522570m14836l06108L6706R0109l9840k0685J57236L38503M50555L73632
40522C187842J5542l30342k24284J73040K11039j74858k08935N07764J218603
40513D375411J036636K01018l75168m20184m17418o01138o01579j66411L52508
40504C383675M58287J26105k13081j26124M41360J059378J074999K09537j011969
40495E402167j619937j161390k18693K08281j85889p38222p28698k78256l8266
40486F41097j94794l05289j55669j70372o35199j013804o05567L57808Q82613
40477a199176M88838j92730k82738K26703N17728L6512p54356r35619l42403K12045
$$ y = [2319972, 2694978, 3356358, 3463527, 2629363, 1469660, 1037953, 1615649, 2391987, 2522570, 2107734, 1801626, 1838332, 1928441, 1888601, 1867916, 2025152, 2363655, 2814210, 3187842, 3203384, 2873042, 2648758, 2821798, 3032837, 2857979, 2649044, 3156808, 4375411, 5412047, 5613065, 5237897, 4817713, 4400295, 3799157, 3197578, 3031167, 3383675, 3841962, 3968067, 3754986, 3628862, 4070222, 5129600, 6204599, 6414136, 5402167, 3782230, 2620840, 2402147, 2610428, 2424539, 1686317, 957619, 679363, 641097, 446303, 141014, -14655, -185027, -820226, -1834030, -2439597, -2081789, -1199176, -710338, -903068, -1185806, -959103, -441375, -404863, -1159219, -2094838, -2437241, -2225196]
40467b225196J09781j98068k1742L52450J74913l24137j78424N98481Q48935J69294
40457f93713l73273n6754L06229p3407m99132j34672L08989k35827j161831j051258
40447c664649n3788L38335l32359j003244r62792o40683m11923p6275K64525J72149
40437f370704o8187L23835J123051J195917L73011j98818L3091K27504j84278
40428c545578m97199j66111J43060r7414j37021O60255J330454O18740q74344
40419b565158j281979M16J583753J953115J131134K32280J0713K38205K77117
40410A579596o3861l88822l66816j89633j23858M4913O02389J163527R86644N767
40400C249846r82753j161482l70773Q11861J312293M03730j143876j498641j72513
$$ y = [-2225196, -2115415, -2313483, -2335225, -1982775, -1807862, -2131999, -2310423, -1711942, -863007, -693713, -1066986, -1123740, -817511, -890918, -1390050, -1524722, -1215733, -1451560, -2613391, -3664649, -3718437, -3380102, -3712461, -4715705, -5678497, -6319180, -6731103, -6807378, -6542853, -6370704, -6438891, -6115056, -4992005, -3796088, -3423077, -3621895, -3588804, -3361300, -3545578, -4042777, -4208888, -4065828, -4163242, -4300263, -3640008, -2309554, -1690814, -2565158, -3847137, -3846721, -2262968, -309853, 821281, 1053561, 1064274, 1302479, 1579596, 1515735, 1126913, 760097, 570464, 446606, 491519, 1093908, 2257435, 3244079, 3249846, 2267093, 1105611, 734838, 1546699, 2858992, 3262722, 2118846, 620205, 447692]
40391D47692R37896J75000j201307q24904R73631J537917k6129j623592j515352
40382a119148n17108M3726L83216J012693J285280O36280j59465k86674j71725
40373A107075l10114j62540N60843Q70549R3503p51719n49796J15395J41124k58244
40363H56076l03250j34001j36739R3753O98553O74573m06870j081363j36182J198591
40353A323141J154259K60128N1136J46185p32265j727352q72374J193645J663196
40344B459699n9626j420757q14729K46779J62092k25451K81478Q28008J72683
40335A630176q26342m90035Q39931J203763p4053j503233j504385k03482J077409
40326A49749J361460P41367o7723n76522q13192q41633m38364L74322R09913O07755
$$ y = [447692, 1385588, 1560588, 359281, -465623, 508008, 2045925, 2019796, 396204, -1119148, -1636256, -1592530, -1209314, -196621, 1088659, 1724939, 1565474, 1278800, 1107075, 796961, 634421, 1195264, 2065813, 2159316, 1407597, 857801, 973196, 1114320, 856076, 552826, 418825, 282086, 375839, 1074392, 1748965, 1342095, 260732, 124550, 1323141, 2477400, 2737528, 2788664, 2934849, 2202584, 475232, -397142, 796503, 2459699, 2400073, 979316, 164587, 411366, 573458, 348007, 629485, 1457493, 1630176, 803834, 313799, 1153730, 2357493, 2283440, 780207, -724178, -927660, 149749, 1511209, 2252576, 2184853, 1608331, 795139, -46494, -484858, -110536, 799377, 1407132]
40316A407132m7355j69489J88001K14776k63944n40533k15254K63725L95910K08492
40306A441461q4343l60004m67530l49010j85824j6561L82592P77918M25924n17855
40296A046768o15357O35608J422536K37772j274185n36047J638984J929975l27510
40287D158544k047013j170080N30568P61267M7483n6420K39546N4215j47865K32987
40277B603232K73536p90635j637463q28554N56118O21448r3525L12690J538118
40268B554965J443800j95882j147232l17525O70475L14892n91325p38579l92104
40259A601485l76934m22216L9769M53326k1863q69745p95215K87184J048438O37846
40249A582075j84084k20473M75155P49806P1693o07705j68402R52338J230921
$$ y = [1407132, 1359777, 1190288, 1378289, 1593065, 1329121, 788588, 573334, 837059, 1232969, 1441461, 1357118, 997114, 529584, 180574, -5250, -21811, 360781, 1138699, 1564623, 1046768, 431411, 1067019, 2489555, 2727327, 1453142, 917095, 2556079, 4486054, 4158544, 2111531, 941451, 1472019, 2233286, 2280769, 2224349, 2463895, 2518110, 2370245, 2603232, 2876768, 2086133, 448670, -379884, 176234, 797682, 704157, 1016847, 2554965, 3998765, 3802883, 2655651, 2338126, 3008601, 3323493, 2732168, 1993589, 1601485, 1224551, 802335, 842104, 1295430, 1273567, 403822, -391393, -104209, 944229, 1582075, 1397991, 1177518, 1652673, 2402479, 2474172, 1866467, 1698065, 2650403, 3881324]
40240C881324K44139o91141n25898k2398l33371r66784n86808O36961J096310
40231B732334J87536q34496q33084k82745j50324m03649m55319k53765o5812K19089
40221a40235P19392R46447M16303l80883m56807K67800P70970L21621n01132n59135
40211A404341L26236J053587N87321o52560j197006l79798P82447R78829L45242
40202C248639M1059M02070N72205M4963n40736n82772m92064p64029q85145j24058
40192I20132J078761J523247Q63488q4941n96283p50916q12873o75384k18980
40183A246251L22660O49125O90316M63679N76m56827n60468l15436j17774k09159
40173A712943l83851l24864M1807N49162Q60101O20627p0898n00562j95508K26863
$$ y = [3881324, 4125463, 3434322, 2908424, 2886026, 2552655, 1585871, 999063, 1636024, 2732334, 2919870, 2085374, 1252290, 969545, 819221, 415572, -39747, -293512, -359324, -140235, 579157, 1525604, 1941907, 1561024, 1104217, 1372017, 2142987, 2464608, 1963476, 1404341, 1730577, 2784164, 3371485, 2718925, 1521919, 1142121, 1924568, 2903397, 3248639, 3289698, 3691768, 4263973, 4308936, 3768200, 3185428, 2693364, 1929335, 1044190, 920132, 1998893, 3522140, 4385628, 4300687, 3704404, 2953488, 2140615, 1465231, 1246251, 1568911, 2218036, 2908352, 3372031, 3372607, 2915780, 2355312, 2039876, 1922102, 1712943, 1329092, 1004228, 1046035, 1595197, 2455298, 3075925, 3005027, 2504465, 2308957, 2535820]
40163B535820j50842r87231r61965J94194J133585Q75676J58006k3221l6486n62194
40153B175342r43364k11625Q77789O86654o02587j005519K62436J551733J211680
40144D002539j87550r31555l84189O87626J197210N36583r40453j850229j120113
40135A009869L56319O51028l38616o60904M46344J175700L01678m60342O52816
40126C133892K044552J046213j561456k481905r23327N61206M47850J81265Q50561
40117C298851J065482j95126j274034n39733O77439K95667r34931p52936O82679
40108B323358J048665j90007q81490K33645J477165R14666p43344j404335n99504
40099B178819L09268L45054q6314l01861k52528r9609K38386P10099Q77464M61512
$$ y = [2535820, 2384978, 1397747, 435782, 629976, 1763561, 2639237, 2797243, 2774022, 2737536, 2175342, 1231978, 1020353, 1898142, 2584796, 1982209, 976690, 1239126, 2790859, 4002539, 3814989, 2883434, 2499245, 3186871, 4384081, 4920664, 3980211, 2129982, 1009869, 1366188, 2017216, 1678600, 1017696, 1464040, 2639740, 2941418, 2481076, 3133892, 5178444, 6224657, 4663201, 2181296, 1257969, 1819175, 2267025, 2448290, 3298851, 4364333, 4169207, 2895173, 2355440, 3032879, 3328546, 2393615, 1640679, 2323358, 3372023, 3182016, 2300526, 2534171, 4011336, 4926002, 4182658, 2778323, 2178819, 2488087, 2833141, 2746827, 2444966, 2192438, 2092829, 2331215, 3041314, 3918778, 4380290]
40089D380290k18058o83574q33982p05607j49534O80302R17080n7395j359642
40080A969880j350782J53890J475134J342386M98843K41175L97593j2020q41430
40071C874669j040886m94878j25537j71311J56352J024449J375272N37101o67592
40062D467639j068322n64992J32430M39517J37020o01171j061093o09306K80923
40053A552645M83126r2261l45233J54702M55647l1056m51201j07116J90994l49018
40043A461229p73213J99201J791930K000131N26658q16563p37693L6844K79605
40034C968129l8235k33116j42717p0461k6139K32730N75797M98477j49438p75394
40024C839633o81757l2245K33026k95873p46089j73579Q23695P66483m28833j113368
$$ y = [4380290, 4162232, 3478658, 2644676, 1939069, 1789535, 2469837, 3386917, 3329522, 1969880, 619098, 772988, 2248122, 3590508, 4089351, 4330526, 4728119, 4716099, 3874669, 2833783, 2338905, 2213368, 2042057, 2198409, 3222858, 4598130, 5135231, 4467639, 3399317, 2834325, 2966755, 3406272, 3543292, 2942121, 1881028, 1271722, 1552645, 2035771, 1943510, 1598277, 1752979, 2208626, 2177570, 1726369, 1619253, 1810247, 1461229, 688016, 887217, 2679147, 4679278, 5205936, 4389373, 3651680, 3688524, 3968129, 3929894, 3696778, 3554061, 3483600, 3457461, 3690191, 4265988, 4764465, 4615027, 3839633, 3157876, 3125631, 3358657, 3062784, 2316695, 2143116, 2966811, 3733294, 3304461, 2191093]
40014B191093k96320Q98123J007865L34995R1978L27035J50446m50827n57387
40005C697001k8768J29932n87664j306596j039584n2067N94380M01585j35083
39996A673136k62508J70175O01674M68526n4523k59329J35926O16551N96629R8373
39986C784630m66016p41146m92081K52969R45863R77212N17095K23427J08581
39977E110534l19921p55577l16219O17886M72166q81224j383201O8630J535782
39968D148856Q62737r67418j463536m15713L61623K54634K40349M64278M1365
39959C527175p44101n52260M69154O69036j98527m76496L88516Q09201m0379o85018
39949C166301j6953O85712M3186r81250p72444K49048N37765l4953l75442j57725
$$ y = [2191093, 1894773, 2792896, 3800761, 4135756, 4227734, 4554769, 4705215, 4254388, 3697001, 3668233, 3798165, 3210501, 1903905, 864321, 812254, 1406634, 1808219, 1673136, 1410628, 1580803, 2182477, 2651003, 2596480, 2337151, 2473077, 3089628, 3686257, 3784630, 3318614, 2577468, 2085387, 2338356, 3284219, 4261431, 4778526, 5001953, 5110534, 4790613, 4035036, 3718817, 4336703, 4808869, 3927645, 2544444, 2613074, 4148856, 5011593, 4044175, 2580639, 2164926, 2526549, 2781183, 3021532, 3485810, 3527175, 2783074, 2230814, 2699968, 3369004, 3170477, 2693981, 3082497, 3891698, 3851319, 3166301, 3149348, 3835060, 3878246, 2896996, 2124552, 2373600, 2911365, 2876412, 2500970, 2343245]
39939B343245M4647R2910L02697N41853N08399M41402N13278J74606p78450j264002
39929B920585l88983Q29971P56142l50419p51745O9776Q17030N61708o2672k20252
39919D181141p0121o5512j46813k17061n30171j004837r04847J10655J143184
39910B495618R89892k74689j252160q34543M84896J163042M35734p03912p00242
39901A803636N31687J414840P70663o36496j200558n66391K20803L85841K72315
39892B996340L96639N06818Q1214o76682r08780j64764R35379J308379O30597
39883E105140k87328n02571n7826K78330J80350N8569J86634K55761L8813j53717
39873E102155l5747J99260L33707M58611M92689M1745p79609j106680n68036p8369
$$ y = [2343245, 2387892, 2480802, 2783499, 3325352, 3833751, 4275153, 4788431, 4963037, 4184587, 2920585, 2531602, 3361573, 4117715, 3767296, 3015551, 3085327, 3902357, 4464065, 4401393, 4181141, 4111020, 4045508, 3898695, 3681634, 3151463, 2146626, 1241779, 1352434, 2495618, 3485510, 3210821, 1958661, 1124118, 1609014, 2772056, 3207790, 2503878, 1803636, 2335323, 3750163, 4520826, 3884330, 2683772, 2117381, 2338184, 2724025, 2996340, 3392979, 3899797, 3981011, 3304329, 2395549, 2230785, 3166164, 4474543, 5105140, 4817812, 4315241, 4257415, 4535745, 4716095, 4774664, 4961298, 5217059, 5255872, 5102155, 5066408, 5265668, 5599375, 6057986, 6550675, 6592420, 5812811, 4706131, 4138095, 4059726]
39863D059726n27162j257452r27719M22512J314622Q46353k56401q18858n93945
39854B261676r8693K73877N10368O83798P82458P37613M90689R9639k55876m83845
39844E001704o77048q63909q47444m86341L8785M14862M75878K13929k00386l69411
39834B700619o9095K74304J11443j96529K24853J115173J031651l87839j374290
39825C430290m08271J382073J722164L94801p68406p50714l70901l70356k86796
39816C973884K45739O03754L28658l3801k812j5624m24196n98823M8337Q72192
39806D997308P69236l02677j344594j523127p85226L59001J163163J123858N32725
39797D989667J41534N5398l35778j016512r43740L12314J495026J255684O1525
$$ y = [4059726, 3532564, 2275112, 1347393, 1769905, 3084527, 3930880, 3674479, 2855621, 2261676, 2162983, 2436860, 2947228, 3631026, 4413484, 5151097, 5641786, 5741425, 5485549, 5001704, 4324656, 3460747, 2613303, 2126962, 2165747, 2580609, 3056487, 3270416, 3070030, 2700619, 2631524, 2905828, 3017271, 2820742, 3045595, 4160768, 5192419, 4804580, 3430290, 3022019, 4404092, 6126256, 6521057, 5752651, 5001937, 4631036, 4260680, 3973884, 4219623, 4823377, 5152035, 5118234, 5115422, 5099798, 4675602, 4076779, 4125116, 4997308, 5766544, 5463867, 4119273, 2596146, 1810920, 2169921, 3333084, 4456942, 4989667, 5131201, 5186599, 4850821, 3834309, 2890569, 3202883, 4697909, 5953593, 6015118]
39788F015118o54730o28098o93556r94215p86462j0644M19807J71223J1850L55737
39778C206030N16598L0600l69961R7428R88772J316067Q54247L9944q01091j377403
39768D501231j200010k63495N51251N78671L60109O54816J023340N14513o37817
39759F082609j261732r99481n40558j91689M01989J012619P98344j02698m09570
39750D789833K65019O41768j33607j008142p27323K21396O74502O89043Q50302
39741F262791O54385n75500j779210j217010O86830J544911L27201j302630j482803
39732C118965l96346O52789R94185O16979l49323j298686j261384j65114Q36276
39723B748341R33191O46657O19220N00345r1853n22719j54745L90885J46235o18834
$$ y = [6015118, 5360388, 4732290, 4038734, 3044519, 2258057, 2247413, 2667220, 2838443, 2850293, 3206030, 3722628, 3753228, 3383267, 3480695, 4469467, 5785534, 6639781, 6679725, 5878634, 4501231, 3301221, 3037726, 3588977, 4167648, 4527757, 5182573, 6205913, 6720426, 6082609, 4820877, 3821396, 3280838, 3089149, 3491138, 4503757, 5302101, 5199403, 4789833, 5054852, 5696620, 5563013, 4554871, 3827548, 4048944, 4723446, 5412489, 6262791, 6917176, 6341676, 4562466, 3345456, 4032286, 5577197, 5904398, 4601768, 3118965, 2722619, 3375408, 4369593, 4986572, 4637249, 3338563, 2077179, 1912065, 2748341, 3681532, 4328189, 4947409, 5447754, 5355901, 4833182, 4678437, 5069322, 5215557, 4596723]
39713D596723q44381k73118M31473P76656O98978J29850p38748j134407o12464
39704C030562R1975R2715k05111J80313J033118J195834M41343k55121l42616
39695E263012k71227k86395l82M68561K65882o66945j041326p0343J117618R60935
39685E739390l24395j129215o68280K73393P03336N15352O7706m44838p98517
39676C933932n94613J35635O29292L37532j23326K29166J076844R77926m14880
39667F187508j424150n99951R72849J081623l41616j166499m09424L62613j95289
39658D467664r19103j70460J257560J286393j35825r84807k97323O19923M70908
39649E594930k48178m59461j83168j23310m35860p21116p23109m50456J8396M67614
$$ y = [4596723, 3752342, 3479224, 3910697, 4687353, 5386331, 5516181, 4777433, 3643026, 3030562, 3122537, 3215252, 3010141, 3190454, 4223572, 5419406, 5860749, 5605628, 5263012, 4991785, 4705390, 4705008, 5173569, 5439451, 4772506, 3731180, 3660837, 4778455, 5739390, 5414995, 4285780, 3617500, 3890893, 4594229, 5109581, 5177287, 4732449, 3933932, 3339319, 3474954, 4104246, 4441778, 4318452, 4547618, 5624462, 6602388, 6187508, 4763358, 4163407, 5136256, 6217879, 5876263, 4709764, 4300340, 4662953, 4467664, 3548561, 3378101, 4635661, 5922054, 5786229, 4801422, 4504099, 5124022, 5594930, 5346752, 4887291, 4704123, 4580813, 4144953, 3423837, 2700728, 2250272, 2268668, 2736282]
39639B736282O20950M97558L46392J95007p4660k60853o7669K53171J98971q0886
39629D364263O534L92035L94157l3142j56724J93735K64783k19569m48275M2379
39619D800176M28792l4571o75554m84388K38164M83935K12437J49049K64513j54406
39609E228147r30463q91828K53121J143808O23201n20210o63768K81268P64381
39600E287657r9949j208145j033567K15779R35618L71576m97968n28875Q5407
39591C527533M59639M29591M70997O34912M99991N2356k48295k97317m58781p64242
39581D306384p47184k54957K48848M02030L46226K26159n6428l40561j42348N13890
39571D502059P95319R8044j016164j408517o69341N16394J163814R26700L46431
$$ y = [2736282, 3357232, 3854790, 4201182, 4396189, 4321529, 4060676, 3993007, 4246178, 4445149, 4364263, 4370797, 4762832, 5156989, 5123847, 4967123, 5160858, 5425641, 5206072, 4757797, 4800176, 5228968, 5194397, 4518843, 4034455, 4272619, 4756554, 4968991, 5118040, 5382553, 5228147, 4297684, 3405856, 3658977, 4802785, 5425986, 4905776, 4242008, 4523276, 5287657, 5187708, 3979563, 2945996, 3161775, 4097393, 4468969, 3971001, 3442126, 3527533, 3987172, 4416763, 4887760, 5522672, 6022663, 6075019, 5826724, 5529407, 5070626, 4306384, 3559200, 3304243, 3553091, 3955121, 4301347, 4527506, 4471078, 4130517, 3988169, 4502059, 5297378, 5395422, 4379258, 2970741, 2301400, 2817794, 3981608, 4908308, 5254739]
39562E254739K32617O99056R77719M55864l90356o12989j04176L87349M07256
39553G307079J80203j12645n65286r28621o18739L58258J159897J054838J27539
39544G962523r72153j424711o34165R16166J522759J90420j549044j336270N38725
39535E214250J356098Q0731j027336n9892J485553J180530n25327j305627o76611
39526E722369k11496n07201m14712N43547J154424N11625o16700j091032q10864
39517D279960k53823L14700O54849M92024O8299k1541K38296L40023K85888N12958
39507F911633P10015K4734j219200j452814k05184Q46728K06797j208371j476550
39498C137788m85078J74079k37773o83963j58006Q35977J143071N17587k71770
$$ y = [5254739, 5487356, 6186412, 7164131, 7619995, 7229639, 6616650, 6512474, 6899823, 7307079, 7487282, 7374637, 6809351, 5880730, 5261991, 5620249, 6780146, 7834984, 7962523, 6990370, 5565659, 4931494, 5847660, 7370419, 7560839, 6011795, 4675525, 5214250, 6570348, 6651079, 5623743, 5563851, 7049404, 8229934, 7704607, 6398980, 5722369, 5510873, 5003672, 4588960, 5132507, 6286931, 6798556, 6181856, 5090824, 4279960, 4026137, 4340837, 4995686, 5487710, 5556009, 5534468, 5772764, 6112787, 6398675, 6911633, 7621648, 7646382, 6427182, 4974368, 4769184, 5615912, 5822709, 4614338, 3137788, 2652710, 2826789, 2589016, 1905053, 1747047, 2583024, 3726095, 4243682, 3971912]
39489C971912n09845k13052J59375L44059M77151O64191N66986j67108j047680
39480D245989r81644K02285J129498N95221n77688n56821P68223J501590N76988
39471F903641o06226l99709M95080K49795j002231j297726p2861P74610j85380
39462D858993j631735j435521K82136J536972J264788K43444m77440p02196o22555
39453C316886l45693p0585L1313J39147L86230M06399j1722k66709J22951M41047
39443D149264j77939j097471j011718o2347M97945M62042O15238P19346j97682
39434C896678j410885r28784J027153J693048M9222j343848n07307P17619K5859
39425C218755j230343m53443J480040J570065j99864q91435L96733J236877J86265
$$ y = [3971912, 3462067, 3249015, 3408390, 3752449, 4229600, 4893791, 5460777, 5293669, 4245989, 3264345, 3466630, 4596128, 5191349, 4613661, 4056840, 4825063, 6326653, 6903641, 6297415, 5897706, 6392786, 6642581, 5640350, 4342624, 4269763, 5044373, 4858993, 3227258, 1791737, 2073873, 3610845, 4875633, 5119077, 4641637, 3939441, 3316886, 2971193, 2900608, 2931921, 3071068, 3457298, 3863697, 3851975, 3585266, 3708217, 4149264, 3971325, 2873854, 1862136, 1799789, 2297734, 2759776, 3375014, 4094360, 3896678, 2485793, 1557009, 2584162, 4277210, 4326432, 2982584, 2475277, 3192896, 3218755, 1988412, 1534969, 3015009, 4585074, 4385210, 3493775, 3890508, 5127385, 5313650]
39416E313650r28597k89983J078131J330664N57641q9808m22764q32250j081808
39407D634876q20535m09635k23502L4511N45306Q24520O32722M41079L81686j33195
39397E907833j076452j333458m07642N88672N80233L4779j45473q5683j93266
39388C869543o7652N91144R81456M47226j78002J00818O19171J74988p20496n50799
39378E267397N97208J045669J92917o60804n51895k52896o83340j262247q59571
39369B832438M36181J452216J408657N82750k25129m32222j07809R3216k76772
39360E763526o96781k93035O83546Q79246j92454j128520n03426R38526J238663
39351F689291Q4460p84449k70713N23654K71511m18166k34848M08502R0172q51020
$$ y = [5313650, 4385053, 4095070, 5173201, 6503865, 7061506, 6971698, 6548934, 5716684, 4634876, 3814341, 3404706, 3181204, 3215715, 3761021, 4585541, 5218263, 5659342, 6041028, 5907833, 4831381, 3497923, 3090281, 3678953, 4259186, 4293965, 4148492, 4062809, 3869543, 3801891, 4393035, 5374491, 5821717, 5643715, 5744533, 6363704, 6538692, 5818196, 5267397, 5864605, 6910274, 7103191, 6442387, 5890492, 5637596, 4954256, 3692009, 2832438, 3268619, 4720835, 6129492, 6712242, 6487113, 6054891, 5947082, 6040298, 5763526, 5066745, 4773710, 5457256, 6336502, 6144048, 5015528, 4512102, 5450628, 6689291, 6773751, 5989302, 5718589, 6242243, 6513754, 6095588, 5860740, 6269242, 6359414, 5508394]
39341E508394m73969J428458K352383O36582j844634k270395p68360L62289L65992
39332E296740N12928J174913J040314k41167r63759o547J250007R72084n23229
39323H512284j566844j508533r57205m22874K370J23673r3212j38743K74875N62530
39313D788321K26121j52287J42615O23793L53370m35909o94303k40970J29296
39304D740047P7351M1766J38970n8393m81333m18192K87288Q63593P86073M44405
39294F421575K73354R2405k20205k40197J86526L76858j55572o79838k15609Q08638
39284F647935R62038p7030r25765m97012L72091K23541p17852q54084K46190J070543
39274F450595M81803n12036m12364L64044K79366o74151r24145N6846Q76431M94301
$$ y = [5508394, 5034425, 6462883, 8815266, 9451848, 7607214, 5336819, 4568459, 4930748, 5296740, 5809668, 6984581, 8024895, 7783728, 6819969, 6813422, 8063429, 9035513, 8512284, 6945440, 5436907, 4479702, 4056828, 4059198, 4182871, 4089659, 3950916, 4225791, 4788321, 5014442, 4862155, 5004770, 5628563, 5981933, 5546024, 4851721, 4610751, 4740047, 4817398, 4859164, 4998134, 4939741, 4458408, 4040216, 4327504, 5191097, 5977170, 6421575, 6694929, 6787334, 6567129, 6326932, 6513458, 6890316, 6734744, 6054906, 5839297, 6647935, 7609973, 7532943, 6607178, 6110166, 6482257, 6705798, 5987946, 5133862, 5380052, 6450595, 6932398, 6420362, 6007998, 6372042, 6651408, 5977257, 5053112, 5109958, 5986389, 6480690]
39264F480690k45550k21821K05274J56041j64810j02365M8467l61548q92019n36629
39254D365730N54844J124980N67630l71545p10945k54724N10511Q75909L39824
39245G002214q20827j550566j133286o4527P08163R77529J051859Q80517L14190
39236G365266j81617q2714K20532J6590m38126l24804K37288K93299l52505q05935
39226E947274m81442K04638O77942P68330L46478n62152j190212o74534M98608
39217E534930Q45995L793p01985k90113M68772M33208j54545k68646K53204O66792
39207F791405N51712K28837R7786J82249K79114J75767j86098n40300m82850l451
39197G094171M04480L14446j70749o05103o36400k62581J54229K51775J92735
$$ y = [6480690, 6235140, 6013319, 6218593, 6374634, 6209824, 6107459, 6155926, 5794378, 4902359, 4365730, 4920574, 6045554, 6613184, 6241639, 5530694, 5275970, 5786481, 6662390, 7002214, 6181387, 4630821, 3497535, 3433008, 4141171, 5118700, 6170559, 7051076, 7365266, 7183649, 7100935, 7321467, 7338057, 6899931, 6575127, 6812415, 7105714, 6753209, 5947274, 5465832, 5670470, 6348412, 7116742, 7463220, 6901068, 5710856, 5036322, 5534930, 6380925, 6384718, 5682733, 5392620, 5861392, 6294600, 6140055, 5871409, 6124613, 6791405, 7343117, 7571954, 7669740, 7851989, 8131103, 8306870, 8120772, 7580472, 7097622, 7094171, 7498651, 7813097, 7642348, 7037245, 6400845, 6138264, 6292493, 6544268, 6737003]
39188F737003M44080Q10462M33421o59475r61253M20501J919234J371252p90853
39179I724372k072849j443420k74394L23109Q02861J262067O11018j146281j925394
39170E861089m65032J479015J565013Q6700r79823r08480l92737J35734N03180
39161F884659N1980j237794j792543n44296R46601O29340o72918n80212Q05988
39152D490805J121193j19894p20958L24756J179844M71920m80876k49739L04791
39143F321842j1960m53457L192M80884j59431r58092m17263P24822O83065k39620
39133E973982k36070P27813Q35744l36604j065590m96095k2429o53219j097886
39124C629646N2413J818156K207222J097021O4819j05371j37263o11475j032013
$$ y = [6737003, 7181083, 7991545, 8424966, 7765491, 6804238, 7224739, 9143973, 10515225, 9724372, 7651523, 6208103, 5933709, 6256818, 7059679, 8321746, 8932764, 7786483, 5861089, 5396057, 6875072, 8440085, 8526785, 7546962, 6638482, 6245745, 6381479, 6884659, 6936639, 5698845, 3906302, 3362006, 4308607, 4937947, 4265029, 3684817, 4490805, 5611998, 5492104, 4771146, 5095902, 6275746, 6747666, 6266790, 6017051, 6321842, 6309882, 5856425, 5859617, 6340501, 6181070, 5222978, 4805715, 5530537, 6213602, 5973982, 5737912, 6465725, 7301469, 6964865, 5899275, 5403180, 5380751, 4727532, 3629646, 3682059, 5500215, 7707437, 8804458, 8869277, 8763906, 8626643, 8015168, 6983155]
39115F983155q15218j58967M68516R20669J026066L29923j174232k421988k134614
39106C023310l74115J294913J478824M55170l62584k16634K87066K62410k80821
39097E567539o51544m20629K44665Q73255R65461L14686n83072q53095l95419
39088E061847j65394o98921j049209k05713J016408R39752l44360r69872j45568
39079C438970P09124L63461l15943O187R24788J143912N92373J72349K3704m18710
39069F640215r72271q06351N7236O33832M29662o9429l68685m25844k01764K68840
39059E185441M83362J28560j42952K93137O90812K8039r70799p47485L53562M52523
39049E754200o07735q54649L06761Q44180l29794j153448J78128J865426J208497
$$ y = [6983155, 6167937, 6008970, 6477486, 7398155, 8424221, 8754144, 7579912, 5157924, 3023310, 2649195, 3944108, 5422932, 5878102, 5515518, 5298884, 5585950, 5848360, 5567539, 4915995, 4495366, 4740031, 5613286, 6578747, 6893433, 6310361, 5457266, 5061847, 4896453, 4197532, 3148323, 2942610, 3959018, 4898770, 4554410, 3584538, 3438970, 4148094, 4511555, 4195612, 4201799, 5126587, 6270499, 6862872, 7035221, 7058925, 6640215, 5667944, 4861593, 4918829, 5552661, 5982323, 5912894, 5544209, 5118365, 4916601, 5185441, 5668803, 5797363, 5654411, 5947548, 6638360, 6666399, 5695600, 4948115, 5301677, 5754200, 5146465, 4291816, 4598577, 5442757, 5112963, 3959515, 4137643, 6003069, 7211566]
39040G211566r91031j703831l65975P52152M85528Q8803M31733O48157K17519
39031F774621k528L33777K32345o37161r98853q3432R88251J031664N04813K74088
39021H417585R1448m77690q60088m89598K6778m2769l17290k54369k96940q08068
39011D988999q98928J86151J371621J098084k01852o68639K28448J135448R81821
39002H221153J99734l99433o57737o75724m56072k50020l87683n64108j26182
38993D903928P76511J173461O14830k39254n96835m13680p6028J85986L45266
38984F674185M82938P20207Q98477N45202l43261q87362m61967J85459L662n58055
38974G259485k14073Q20627Q67436m76833j407349o47623M45120m2967j493800
$$ y = [7211566, 6220535, 4516704, 4150729, 4902881, 5388409, 5477212, 5908945, 6557102, 6774621, 6772093, 7105870, 7338215, 6701054, 5702201, 5618769, 6607020, 7638684, 8143497, 8417585, 8509033, 8031343, 7171255, 6681657, 6708435, 6665666, 6348376, 6094007, 5797067, 4988999, 4090071, 4276222, 5647843, 6745927, 6544075, 5875436, 6103884, 7239332, 8221153, 8420887, 8021454, 7363717, 6687993, 6231921, 5981901, 5594218, 5030110, 4903928, 5680439, 6853900, 7468730, 7229476, 6632641, 6218961, 6142933, 6328919, 6674185, 7157123, 7877330, 8775807, 9321009, 8977748, 8090386, 7628419, 7813878, 7817540, 7259485, 7045412, 7866039, 8733475, 8256642, 6849293, 6201670, 6646790, 6603823, 5110023]
38965E110023j534946M72637K438042K288339M12547j200112j365358n31846K81257
38956F370583N64814L60761j25381n80082n48474J38769Q96233Q70395J02397
38947H050015l68239K1959M27238j08433r91300q60307K31449P73498O9341q06143
38937F439078p68066j75953J38841J44972R1154k17955o79444m49209O40506J197529
38927F361453J78770j141036p62224R83947J787418O70325q48757j172314n47859
38918E509723k858K07947K91589J62451j60860k09433J87296M84956K95823j5084
38908F751550n5488L7403J82466O06686J037545O69382m21967r22767j88906N91021
38898H286925K25591n53194l86206L87821M02617k90631l18784N75118J022904
$$ y = [5110023, 3575077, 4047714, 6485756, 8774095, 9186642, 7986530, 6621172, 6089326, 6370583, 6935397, 7296158, 7170777, 6590695, 6042221, 6180990, 7077223, 7947618, 8050015, 7681776, 7703735, 8130973, 8022540, 7031240, 6170933, 6402382, 7175880, 7245221, 6439078, 5671012, 5495059, 5633900, 5778872, 5870026, 5652071, 4972627, 4523418, 5163924, 6361453, 6540223, 5399187, 4636963, 5620910, 7408328, 8078653, 7229896, 6057582, 5509723, 5506865, 5714812, 6006401, 6168852, 6007992, 5798559, 5985855, 6470811, 6766634, 6751550, 6696062, 6733465, 6915931, 7522617, 8560162, 9229544, 8807577, 7884810, 7695904, 8286925, 8512516, 7959322, 7573116, 7960937, 8363554, 8072923, 7754139, 8329257, 9352161]
38889I352161K74262o67414p42785l39255l48004p22317p58802j93350N46094
38880F400590P89145J71684p75190p62375O93902K107520J645997k28196j296372
38871H746705q27367l72226q32638r17852K72626J171957J21550j690009j830915
38862C841831k17561J069922J003446N15754M26100M73863M80886O92250Q03256
38853I089747K42597m91368l75983K35461L2481q24224o99553O76812J480529
38844I366499P19239j56076K30075R02355L46727q85865j150423k49191O85043
38835I808383J077770J107259O57329l57823j107345p97100j33837l58377j141243
38826H755016j020239J88081J034714O66690p9022j99382J53225M05123N28923
$$ y = [9352161, 9626423, 8959009, 8216224, 7876969, 7528965, 6806648, 6047846, 5854496, 6400590, 7189735, 7361419, 6586229, 5823854, 6517756, 8625276, 10271273, 10043077, 8746705, 7919338, 7547112, 6714474, 5796622, 6069248, 7241205, 7362755, 5672746, 3841831, 3624270, 4694192, 5697638, 6213392, 6639492, 7113355, 7594241, 8286491, 9089747, 9332344, 8840976, 8464993, 8700454, 8732935, 7908711, 7209158, 7885970, 9366499, 10085738, 9929662, 10159737, 11062092, 11408819, 10522954, 9372531, 9123340, 9808383, 10886153, 11993412, 12650741, 12292918, 11185573, 10388473, 10254636, 9896259, 8755016, 7734777, 7922858, 8957572, 9624262, 9545240, 9345858, 9499083, 9904206, 10433129]
38817A0433129O44874M85489j06841p14881q79688o80723m47119k70487n7319
38808H406434K35296N29521N52907j4892r26999j207592k77283J004429J274845
38799I576666N18522O6L18542O19273N5911r59386j470108j154364l03218O77186
38789G879090J268917J026262K59218r8537K11876L03470m38809j204933q79548
38780H327006K23047P58618K61384l56839k88482R1470L565n12828p23802l09589
38770G473550J96931J86272k04251m07969l87571o70958j256695j198621O8078
38761C798766J518493J635185M84506m40411m71080n15967j125494j239366O0487
38752C705119J626726J561380m2543j181744p20084L18315N57723J34601L8349
$$ y = [10433129, 11078003, 11563492, 11456651, 10741770, 9862082, 9181359, 8734240, 8463753, 8406434, 8641730, 9171251, 9724158, 9709266, 8782267, 7574675, 7297392, 8301821, 9576666, 10095188, 10095254, 10413796, 11033069, 11088980, 10129594, 8659486, 7505122, 7201904, 7879090, 9148007, 10174269, 10433487, 10334950, 10546826, 10850296, 10411487, 9206554, 8327006, 8550053, 9308671, 9570055, 9213216, 8924734, 9016204, 9019769, 8506941, 7783139, 7473550, 7670481, 7856753, 7652502, 7244533, 6856962, 6186004, 4929309, 3730688, 3798766, 5317259, 6952444, 7436950, 6996539, 6525459, 6009492, 4883998, 3644632, 3705119, 5331845, 6893225, 6850682, 5668938, 4948854, 5267169, 5824892, 5959493, 5997842]
38743E997842M32539N56261M004o60903o59111L4513O50402M95024k07359n01910
38733F141302J30618J036079J192413N58097J4163n773l5461m55688o92834j95615
38723G687301M41986K80347l89621l66652N59440J154944N65993m22319o38129
38714H873290k23096j54720n91278p46623k45598L63832N02060J80810l14286
38705G644391o54165m00677N12326J274811J064028L44078K01777M35868j78199
38696A0244238j447768j468095L10957J614995N41753j366489j372449K86301
38688G343443J006163K1871p72210l31936k5103q31382j438390n55859P89339
38679E205936R44643K03648m0146L10190K49614l54153o23194k63150Q3795L8633
$$ y = [5997842, 6430381, 6986642, 6990646, 6329743, 5670632, 5705145, 6355547, 6850571, 6643212, 6141302, 6271920, 7307999, 8500412, 9058509, 9072672, 9066899, 9031438, 8575750, 7882916, 7687301, 8129287, 8409634, 8020013, 7653361, 8212801, 9367745, 9933738, 9511419, 8873290, 8650194, 8495474, 7904196, 7157573, 6911975, 7275807, 7777867, 7958677, 7644391, 6990226, 6589549, 7101875, 8376686, 9440714, 9784792, 9986569, 10422437, 10244238, 8796470, 7328375, 7639332, 9254327, 9796080, 8429591, 7057142, 7343443, 8349606, 8371477, 7599267, 7267331, 7242228, 6410846, 4972456, 4416597, 5205936, 6150579, 6354227, 6314081, 6624271, 6873885, 6519732, 5896538, 5633388, 5717183, 5755816]
38669E755816n1214J22382M16831N87540M79461M9782l56709j66282N17998P66320
38659H121925J58443m63469l22230M6991j33483m02104O1289P33788M38532o34562
38649G605120j139218o53237l9335K40024O08548J027884P56082j39226n25561
38640G741081n3762J44219o25320j304734p04242O04874J147131N69155k69546
38631G248856p09198p61803n00302O8755O26207P54505M85032J56584q8819k40282
38621G039535j33662K76475O14512N31114K12724M160j79095n53009q57016o32603
38611F323135L4681N75497O35740K72383l65887j017572j104368j97363J216140
38602F372386J957634J367251k0290j128409j371607r19213k46457K89389N11670
$$ y = [5755816, 5704602, 5826984, 6243815, 6831355, 7310816, 7360598, 7003889, 6837607, 7355605, 8121925, 8280368, 7816899, 7494669, 7541660, 7408177, 7006073, 7067362, 7801150, 8239682, 7605120, 6465902, 5812665, 5773330, 6013354, 6621902, 7649786, 8405868, 8266642, 7741081, 7687319, 7831538, 7206218, 5901484, 5197242, 5802116, 6949247, 7518402, 7248856, 6539658, 5777855, 5277553, 5346308, 5972515, 6727020, 7212052, 7368636, 7279817, 7039535, 6905873, 7182348, 7796860, 8327974, 8540698, 8544858, 8365763, 7812754, 6955738, 6323135, 6357816, 6933313, 7569053, 7841436, 7475549, 6457977, 5353609, 5156246, 6372386, 8330020, 9697271, 9676981, 8548572, 7176965, 6257752, 6011295, 6300684, 6812354]
38593F812354L44654j25367n19759l65450L16363P97416M59735k33250k01585
38584G285111O56399J075548J47333j221408j435950m43221K34064k47827q65572
38575E184477l60387P94304J054613J17601n78834J3815R10185M94393r26377
38566F703790j273434L48954K120139J874536J09007q08621n2019P77187M32596
38557A0232135j30541K91621Q91525J98403j246518j510138k92070N93644J4800
38548I042861r62465j006603m30056j88982k14796P3090M86129M97790K78970
38539G575938J69935k04368j045121j305767q9976J362417R81900r33110j885566
38530D626282q56626L82084M24059L84208J392638K062646P34364j277712j362771
$$ y = [6812354, 7157008, 7031641, 6511882, 6146432, 6462795, 7260211, 7719946, 7486696, 7285111, 7941510, 9017058, 9164391, 7942983, 6507033, 6063812, 6297876, 6050049, 5184477, 4824090, 5618394, 6673007, 6790608, 6211774, 6225589, 7135774, 7630167, 6703790, 5430356, 5779310, 7899449, 9773985, 9882992, 9074371, 9022352, 9799539, 10232135, 10101594, 10393215, 11284740, 11483143, 10236625, 8726487, 8434417, 9028061, 9042861, 8080396, 7073793, 6643737, 6454755, 6239959, 6313049, 6799178, 7296968, 7575938, 7745873, 7541505, 6496384, 5190617, 5100641, 6463058, 7444958, 6511848, 4626282, 3769656, 4151740, 4575799, 4960007, 6352645, 8415291, 9149655, 7871943, 6509172]
38521F509172L28223J296813P50512K61704L14896n44870k277274k340814J54072
38512D452434K196367J183020r35782p54164J206399J650847l1915j177274n37173
38503G252759Q2933m72030p11388M51323J479836Q27950m59195o78159k04755
38494G569274k98926o33008j37701P24711O59814j28910l12296K24843L10605
38485G978406l40500o36527Q607P65308P20668J8447o34456p60852k82201L82413
38475G219313M38620l55565j103745q75732k1416N26096P42454J098463J148953
38466H817441J21438j263781j321481L0444R28688K95717o68693m71268O01160
38457G069665J311757J225036O74319o7178o67863o14333l6079J38351m02061
$$ y = [6509172, 6837395, 8134208, 8884720, 9146424, 9461320, 8916450, 6639176, 4298362, 4452434, 6648801, 7831821, 6896039, 6141875, 7348274, 8999121, 8967206, 7789932, 7252759, 7335692, 6863662, 6152274, 6603597, 8083433, 8911383, 8452188, 7774029, 7569274, 7270348, 6637340, 6499639, 7224350, 7884164, 7755254, 7442958, 7667801, 7978406, 7637906, 7001379, 7009986, 7775294, 8495962, 8514409, 7879953, 7119101, 6836900, 7219313, 7657933, 7302368, 6198623, 5322891, 5301475, 5827571, 6570025, 7668488, 8817441, 8938879, 7675098, 6353617, 6384061, 7312749, 7608466, 6939773, 6468505, 7069665, 8381422, 9606458, 10280777, 10213599, 9545736, 8931403, 8895324, 9033675, 8631614]
38448H631614o79762j0362P22749M38591l79152n33320k3276K39977J09281J73334
38438H689674L55454p390p21437p55309Q6733P23343M02285k59452l11678K28780
38428H431003O06250L45657l26366p74040n39907J06594L49717r5095m61659p8115
38418G564039M83609L52867j6923M68622J414806J152651n76940j820364j127496
38409G894871L65579P36933O733l71216L2148K76712j09144m64149l17500j38936
38399G912031l85956p25199o52636k38706J42781L53403M48934M71846M91875
38390G818373N33486L97886l8367l47886M0862Q51412J067117L38769m22774l83409
38380I855469l6258k96089q50361n65609N41953J047097L01362l29176N41534
$$ y = [8631614, 7951852, 7941490, 8664239, 9102830, 8723678, 8190358, 8167082, 8407059, 8516340, 8689674, 9045128, 9037738, 8316301, 7560992, 7647725, 8371068, 8773353, 8513901, 8202223, 8431003, 9037253, 9382910, 9056544, 8282504, 7742597, 7849191, 8198908, 8103813, 7642154, 7564039, 8047648, 8400515, 8383592, 8852214, 10267020, 11419671, 10842731, 9022367, 7894871, 8260450, 8997383, 9004116, 8632900, 8665048, 8941760, 8832616, 8368467, 8050967, 7912031, 7526075, 6800876, 6148240, 5909534, 6052315, 6405718, 6854652, 7326498, 7818373, 8351859, 8749745, 8711378, 8363492, 8404354, 9255766, 10322883, 10661652, 10238878, 9855469, 9819211, 9523122, 8672761, 8107152, 8649105, 9696202, 9997564, 9668388, 10209922]
38371A0209922J927697J589026o57931k408486j934765m53524n9874o43421n17105
38362G051539N49532R38177m4523r18144l62562P31070P55262j50209n49147p071
38352G993924N06303L20807j28225k97935k61063j83363M3935L35811K77076k19784
38342H387486o46798n48849l9125M50761N56575J46156m43133m57514L77398J157087
38332H940044P73091m77804j172338p06663M8842K49313J36067J69226J72551
38323H132329k4327m0240K62923L36441J3580M2385O82602Q42173k03404j243998
38313H800464q14474L66390M65748m52949n82576N06557J120872L42250m44564
38304I307718L2450Q13699M49303n45030o51379J56626N85767J70460l38686m79147
$$ y = [10209922, 12137619, 13726645, 13068714, 10660228, 8725463, 8271939, 8212065, 7568644, 7051539, 7601071, 8539248, 8494725, 7576581, 7214019, 7945089, 8700351, 8550142, 8000995, 7993924, 8500227, 8821034, 8692809, 8394874, 8133811, 7950448, 7994383, 8330194, 8607270, 8387486, 7740688, 7191839, 7152714, 7603475, 8160050, 8306206, 7863073, 7405559, 7782957, 8940044, 9713135, 9235331, 8062993, 7356330, 7405172, 7654485, 7790552, 7959778, 8132329, 8108002, 8067762, 8330685, 8667126, 8680706, 8723091, 9405693, 10247866, 10044462, 8800464, 7985990, 8352380, 8818128, 8365179, 7782603, 8289160, 9410032, 9752282, 9307718, 9340168, 10153867, 10603170, 10058140, 9406761, 9563387, 10149154, 10319614, 9980928, 9501781]
38294I501781n13846m48181L9100O28157N62273m6672k73189J08628L31394O0006
38284I949451j16108M6522m7500n46781o62006j57155k1500o98149r43050K29419
38274G033143J599651J410053J43445l01941K57298J72785r61903j402693j62146
38265G787692J185407Q58461n01796j018244k95590N57318Q55397P76374L37367
38256A0542386o10966j527465j552567p00912K88257J089608J764053J875342
38248A1167736Q84793o10307j262895p47660p2702N525j94235k05556r6971J5476
38238H883204J78625J68943j95582l18612M37745J326965R86930k83430p44174
38229A0440614l1917K09714p93644j550182r44270k00973n86644j056124k35353
$$ y = [9501781, 8987935, 8539754, 8578854, 9207011, 9769284, 9722612, 9449423, 9558051, 9889445, 9949451, 9833343, 9879865, 9832365, 9285584, 8623578, 8466423, 8444923, 7746774, 6803724, 7033143, 8632794, 10042847, 10186292, 9884351, 10141649, 10314434, 9352531, 7949838, 7787692, 8973099, 9831560, 9329764, 8311520, 8015930, 8573248, 9428645, 10205019, 10542386, 9931420, 8403955, 6851388, 6150476, 6438733, 7528341, 9292394, 11167736, 12052529, 11442222, 10179327, 9431667, 9358965, 9364490, 9170255, 8964699, 8867728, 8883204, 9061829, 9230772, 9035190, 8716578, 9154323, 10481288, 11468218, 11184788, 10440614, 10408697, 10618411, 9824767, 8274585, 7330315, 7129342, 6542698, 5486574, 5251221]
38220E251221Q85703O22282l33855j30011Q85111Q06124l56037p32564K6152L57066
38210G281192n1755K84579J417974J244251q00074k167384j024046Q31641R14000
38201G930378j90680l47694M81268O62853q1546n51009m08992m14528o00821k57452
38191F221777L84235L23327l42998m71007J11024L24435j87976m54622K6688M05614
38181F340497L3957m07658j20006N20446O89027L34399q2933m21050o94005n89095
38171E603579J22319R81468J252896P91616Q0631m48703p65299r81763j041942
38162E594802p32693J5913Q24129J030408M34133k58542j61118O01490R09966
38153H258488Q2759j099060j212528P1151J477385J541560L21843o71771l35549
$$ y = [5251221, 6136924, 6759206, 6425351, 6295340, 7180451, 7986575, 7630538, 6897974, 6924126, 7281192, 7229437, 7514016, 8931990, 10176241, 9376167, 7208783, 6184737, 7016378, 7930378, 7739698, 7392004, 7873272, 8536125, 8454579, 7903570, 7494578, 7080050, 6479229, 6221777, 6606012, 6929339, 6586341, 6115334, 6226358, 6550793, 6362817, 5908195, 5934883, 6340497, 6374454, 5966796, 5846790, 6367236, 7056263, 7390662, 7307729, 6886679, 6192674, 5603579, 5725898, 6707366, 7960262, 8751878, 8832509, 8383806, 7618507, 6636744, 5594802, 4862109, 4878022, 5702151, 6732559, 7166692, 6908150, 6747032, 7348522, 8258488, 8341247, 7242187, 6029659, 6100810, 7578195, 9119755, 9441598, 8769827, 8434278]
38144H434278O76369Q85460k6245q82997o98382P9338L70511p4372n41895l84612
38134G837453K50151O23455J93697o59046q47875O6488J016450P15127m12284
38125H783616p41616R5767P20470L27015j27123J49761L03810m74763j248300
38116G788637q77892l6229P4925o9864O03779J373812O96639r05756j328641j68125
38106G151285Q15886O89594M62636P59385O93613r7137m27319L09330Q59437K30163
38096A1446873n55323k26126O23535O98606J40925m4550J56878M379m85412o35962
38086A1123823l61402j55858j02131J18453M38498M55320J05867l13271n77065
38077A0732234n70264k58121Q1419R4800j2361J89685L11632m24239j467014j156649
$$ y = [8434278, 9110647, 9996107, 9969862, 9086865, 8388483, 8467821, 8838332, 8763960, 8222065, 7837453, 8087604, 8711059, 8904756, 8245710, 7397835, 7464323, 8480773, 9195900, 8783616, 8042000, 8137767, 8858237, 9185252, 9058129, 9207890, 9511700, 9036937, 7788637, 6910745, 6874516, 6949441, 6879577, 7483356, 8857168, 9553807, 8648051, 7319410, 7151285, 7967171, 8656765, 9119401, 9878786, 10572399, 10475262, 10047943, 10357273, 11216710, 11446873, 10891550, 10665424, 11288959, 11987565, 12128490, 12083940, 12240818, 12245197, 11759785, 11123823, 10762421, 10606563, 10504432, 10622885, 11061383, 11516703, 11622570, 11309299, 10732234, 10161970, 9903849, 9985268, 10080068, 10067707, 10257392, 10569024, 10144785, 8677771, 7521122]
38067G521122O65211J875818J030371m25063m22965N79634O49411l64365q10221
38058A0298953j29085L74188j34285p29335l57562N65575Q63773R2776j127503
38049I717495j739909j072695M52295J483335J142457Q2822m26955j57233O6737
38040I548349k74820q05763q82657k13496R14656J580154R25986n70591j295462
38031H926356o26727J51655J122q2941J057152K286518J710877q7309p70799M4118
38021A2610022L60336o56871j295932l30475Q93688P65490o5656q1039N90987
38012A2790550P59889L35301K21395N43030M95861j36195n33102p6104P82884
38003A5183509J152382P96268L97739P62205J738406K169607J294425p7706m63647
$$ y = [7521122, 8186333, 10062151, 11092522, 10667459, 10244494, 10824128, 11473539, 11109174, 10298953, 10169868, 10544056, 10409771, 9680436, 9322874, 9888449, 10752222, 10844998, 9717495, 7977586, 6904891, 7357186, 8840521, 9982978, 10065800, 9638845, 9481612, 9548349, 9273529, 8467766, 7585109, 7371613, 8286269, 9866423, 10792409, 10221818, 8926356, 8299629, 8451284, 8452406, 8369465, 9426617, 11713135, 13424012, 13336703, 12565904, 12610022, 12970358, 12313487, 11017555, 10687080, 11580768, 12346258, 12280602, 12199563, 12790550, 13550439, 13885740, 14107135, 14650165, 15146026, 15009831, 14476729, 14400625, 15183509, 16335891, 17132159, 17529898, 18292103, 20030509, 22200116, 23494541, 23416835, 22953188]
37994B2953188L97445J392142J688766J528141J288346Q92402M66275N24745J048682
37985C2180132J309170J041245Q76206J183613J430423J145305N64084j19346
37977C9610832j076381j912317j617966j94220Q37002M51136m41971o14984n21028
37968C4520103j379262l045881m177205m069417l138636j947025q79979m64547
37960A5418151q82499j354121j003515j62831J10265l87835q63141q22420n60705
37951I491349l64601j06860K41289L74199Q5795m69779r40886r44825l33726M39767
37941G471722O72334M15940M51115Q53555N71480p75322j725648q63883R21930
37932G993223J568439P07536j98652k99087j83441k37863L5205O12406N00248
$$ y = [22953188, 23350633, 24742775, 26431541, 27959682, 29248028, 30140430, 30606705, 31131450, 32180132, 33489302, 34530547, 35406753, 36590366, 38020789, 39166094, 39730178, 39610832, 38534451, 36622134, 35004168, 34809948, 35646950, 36098086, 35656115, 35041131, 34520103, 33140841, 30094960, 25917755, 21848338, 18709702, 16762677, 15882698, 15418151, 14535652, 13181531, 12178016, 12015185, 12125450, 11737615, 10874474, 10052054, 9491349, 9126748, 9019888, 9261177, 9635376, 9721171, 9251392, 8310506, 7365681, 7031955, 7471722, 8144056, 8559996, 9011111, 9864666, 10436146, 9660824, 7935176, 7071293, 7993223, 9561662, 10269198, 10070546, 9771459, 9588018, 9350155, 9385360, 9997766, 10498014]
37923A0498014n55673j283776p38449J76844Q9616p80080j055873j80071J090182
37914G260734J863247J844466J037121l53013j572766j639598m11440J031808
37906I060559J452256P71988L7035O5773M48311J86749p95774j319819m34797
37897I472281J156351J782065Q88746k06269m271J173234J539462K18410j459234
37888A4560775j626390m02479L08566l62124r47824p236J424437J321620j19451
37879A4149894p81361n269N85144J09085p8354R26687J609981N56906q81218o59151
37869A5532344N90780P40494k22727m61357K95165M08209n07824q26331J01194
37860A5649947P30044O8228o27557j62800N55807K76579m23528l18778L79120
$$ y = [10498014, 9942341, 8658565, 7920116, 8096960, 8186576, 7406496, 6350623, 6170552, 7260734, 9123981, 10968447, 12005568, 11652555, 10079789, 8440191, 8028751, 9060559, 10512815, 11284803, 11321838, 11387611, 11835922, 12022671, 11226897, 9907078, 9472281, 10628632, 12410697, 13299443, 13093174, 13088903, 14262137, 15801599, 16020009, 14560775, 12934385, 12531906, 12840472, 12478348, 11530524, 11523288, 12947725, 14269345, 14149894, 13368533, 13363264, 13948408, 14057493, 13979139, 14905826, 16515807, 17072713, 16191495, 15532344, 16123124, 16863618, 16640891, 16179534, 16474699, 16882908, 16375084, 15548753, 15649947, 16379991, 16448219, 15820662, 15657862, 16213669, 16490248, 16066720, 15747942, 16127062]
37851A6127062O85876N85464O12660N62544Q4480j87176M17826J151432Q66048
37842B0906216R571J2018R38587J390211P91685K03660M83115J032053J041801
37833B6808917Q82252J390712K486991L366145L687835L802475L982077M165592
37825E0572996M510188N517839P322490R390783J1399341J3932633J7529325K1338157
37817A41513752K3922623K5558540K8164008L1882437L3114542K7998614J7577664
37810C29732180P575328K685666K605445M026268M709450M608079M532817N241905
37802C65717138P025417Q844551Q475993M825471k48905l665567m548810m790875
37794C81634413o129920p806544p684414n056557j621689K90771k8678j521081
$$ y = [16127062, 16812938, 17398402, 18011062, 18573606, 18658086, 18470910, 18888736, 20040168, 20906216, 20915787, 20927805, 21866392, 23256603, 24048288, 24251948, 24735063, 25767116, 26808917, 27691169, 29081881, 31568872, 34935017, 38622852, 42425327, 46407404, 50572996, 55083184, 60601023, 67923513, 77314296, 88713637, 102646270, 120175595, 141513752, 165436375, 190994915, 219158923, 251041360, 284155902, 312154516, 329732180, 337307508, 339993174, 342598619, 346624887, 351334337, 355942416, 360475233, 365717138, 372742555, 381587106, 390063099, 394888570, 394639665, 390974098, 386425288, 381634413, 375504493, 367697949, 360013535, 354956978, 353335289, 353626060, 353597382, 352076301]
37786C52076301l146628m910748o678868o989831m393004L74185M981519Q227174
37778C39540100J0634209J2256138J1838438Q878004M622943j56145o611039j5327400
37770C65675248k3765344k8280051k8110175k5636838k3159821k1083480j8981371
37763A96658168j6768528j4660989j3035382j2239414j1818291j0596703q470156
37756A09068705p097144p468046p976816o792253n014530m996739o314040o370531
37748E7038606m786716l899010m433168m103928j827687j12829j141622l114598
37740C3619048l100396j523466r40811j734949k061896j376271r96412j232573
37732B0652274p78091N59606J054277p5543j146097o42761L59536R043j321785
$$ y = [352076301, 348929673, 344018925, 337340057, 330350226, 325957222, 326331407, 331312926, 339540100, 350174309, 362430447, 374268885, 383146889, 387769832, 387613687, 381002648, 365675248, 341909904, 313629853, 285519678, 259882840, 236723019, 215639539, 196658168, 179889640, 165228651, 152193269, 139953855, 128135564, 117538861, 109068705, 101971561, 94503515, 86526699, 79734446, 74719916, 69723177, 63409137, 57038606, 52251890, 48352880, 43919712, 39815784, 37988097, 37875268, 36733646, 33619048, 30518652, 28995186, 28054375, 26319426, 24257530, 22881259, 21884847, 20652274, 19874183, 20433789, 21488066, 21412523, 20266426, 19623665, 19983201, 19992244, 18670459]
37723A8670459j676425n76913L62651m5480r66634j032973l15583O9470k89199
37714A4199373p08440o14396k70453j32920j56388p8184R9328K68013M21162L61495
37704A3388590k47849j046049q61249O91876K050607J387184p33503j807860p40036
37695A2081711P28654O32305n07547p64066L00663J265891J058689J84082l69038
37686A4611344l65999r0505L46439R34103J416911J498502J253951J048785J096156
37677B1749687J264285J297868J096385P42086L71155J54781L37257J008763J761849
37668B9784116J934104J446243J038837J288568J753284J628287R07254K07236
37660C9987929k45544n90767n40214L01316J342403J414165M66555l28344m65403
$$ y = [18670459, 16994034, 16417121, 16779772, 16734292, 15767658, 14734685, 14419102, 14488572, 14199373, 13490933, 12876537, 12606084, 12473164, 12316776, 12238592, 12337920, 12605933, 13027095, 13388590, 13140741, 12094692, 11233443, 11925319, 13975926, 15363110, 14629607, 12821747, 12081711, 12810365, 13442670, 12935123, 12171057, 12471720, 13737611, 14796300, 14980382, 14611344, 14245345, 14154840, 14501279, 15435382, 16852293, 18350795, 19604746, 20653531, 21749687, 23013972, 24311840, 25408225, 26150311, 26521466, 26676247, 27013504, 28022267, 29784116, 31718220, 33164463, 34203300, 35491868, 37245152, 38873439, 39780693, 39987929, 39742385, 39151618, 38611404, 38912720, 40255123, 41669288, 42135843, 41807499, 41342096]
37651D1342096p97428j829409k713669k775104k702249l118651l216357k201362
37643B1987867j028573j055532j783767j736955r84893p95194j096508n33807
37635A2972638P82988R22481o87407j857655p77516J129800J232817n21646j732659
37626A1463841r97411N11028R92749J55911r73374j416879r88613k51589O982
37617H502645l48253m64892M13791J608853J565924m3767j624944j574502k26869
37608G807986Q11091P68092K60522k2401j39563k51333j54822N4303k56173j086586
37598G791116j200319J99543J746138J349037p24599j874424p34734R44274R98398
37589H494430p7799l60672L02570L96793m02574p06088J6664M46681k21736p80247
$$ y = [41342096, 40544668, 38715259, 36001590, 33226486, 30524237, 27405586, 24189229, 21987867, 20959294, 19903762, 18119995, 16383040, 15398147, 14602953, 13506445, 12972638, 13755626, 14678107, 13990700, 12133045, 11355529, 12485329, 13718146, 13196500, 11463841, 10466430, 10977458, 11970207, 12126118, 11152744, 9735865, 8747252, 8495663, 8502645, 8154392, 7689500, 8103291, 9712144, 11278068, 11234301, 9609357, 8034855, 7807986, 8619077, 9387169, 9647691, 9625290, 9485727, 9234394, 9079572, 9133875, 8877702, 7791116, 6590797, 6790340, 8536478, 9885515, 9160916, 7286492, 6551758, 7496032, 8494430, 8416631, 8055959, 8358529, 8755322, 8352748, 7646660, 7663324, 8110005, 7888269, 7108022]
37579G108022o6627J006005R97203L42828M39081J077759P52129o92818j633254
37570I330328j154056k62436m4539j15043K47172O85127N60917K09132K34111
37561I690713K74018l06706j002055p60920K38344P33914L12438r5331J20772
37552I205187L60031Q8282j55210J97346O18625L34133l82752p26249o63476p17931
37542H157986p90822k73627P45073J384975J203610O96879M13511K99874J14776
37533A1952235j54384m83052q49563r71276n89359o8612k3938k94358j22179M98159
37523H893673O27908r9874p78272o21565j12567m42m4659K77599N74977K17917
37513H934695l26931j10352O44542Q00866J43138l50356j98237p2865l88041m82484
$$ y = [7108022, 7041395, 8047400, 9044603, 9387431, 9826512, 10904271, 11656400, 10963582, 9330328, 8176272, 7913836, 7869297, 7754254, 8001426, 8686553, 9247470, 9456602, 9690713, 9964731, 9658025, 8655970, 7895050, 8133394, 8867308, 9179746, 9084415, 9205187, 9565218, 9653500, 9498290, 9695636, 10314261, 10648394, 10265642, 9539393, 8875917, 8157986, 7367164, 7093537, 7838610, 9223585, 10427195, 11124074, 11537585, 11837459, 11952235, 11797851, 11314799, 10465236, 9493960, 8904601, 8835989, 8812051, 8517693, 8395514, 8893673, 9521581, 9421707, 8643435, 8021870, 7909303, 7908861, 7864202, 8141801, 8716778, 8934695, 8607764, 8497412, 9141954, 9942820, 10085958, 9735602, 9537365, 9464500, 9076459, 8593975]
37503H593975J12004O49384L12654m09394m73447J34747N73789N34792M00331
37494A0428835K03536m19630j136912r58669J64936Q58091K40233n56226K5184
37485H849378J403105J430035l90535j866237j089451Q45753J415107J66037r57606
37476I805586o10063K84910L00683m28854q01084n01902j50255j33250k15604
37467G550167j72745j03879r3573l1845J74879M49402N63390K62214l78797p22551
37457G496662j95053P45518R34482R8426o17641k41176O43462Q42228K58022k66291
37447I698639l70939m34246o15332o23767m25579l24909k95005J0737N10840O67217
37437G797656L12638j17661k82932l01959l38265l31566k09514M1587M46986P85601
$$ y = [8593975, 8705979, 9355363, 9668017, 9258623, 8785176, 8919923, 9493712, 10028504, 10428835, 10632371, 10212741, 9075829, 8117160, 8282096, 9140187, 9380420, 8824194, 8849378, 10252483, 11682518, 11291983, 9425746, 8336295, 9182048, 10597155, 10763192, 9805586, 9195523, 9480433, 9781116, 9352262, 8551178, 8049276, 7899021, 7765771, 7550167, 7377422, 7273543, 7179970, 7148125, 7323004, 7772406, 8335796, 8598010, 8219213, 7496662, 7301609, 8047127, 8981609, 9080035, 8462394, 8221218, 8864680, 9706908, 9964930, 9698639, 9327700, 8893454, 8278122, 7654355, 7228776, 6903867, 6608862, 6619599, 7130439, 7797656, 8110294, 7992633, 7709701, 7407742, 7069477, 6737911, 6528397, 6569984, 7016970, 7802571]
37427G802571N30575l73502r99786n01985N54736Q66882K67419j45850J84316
37418H185376M93897P2626o15032p46945l03678J54202K85035Q9311k45600k94554
37408G074638K33837Q02499M52955p02576j222069k28493J145905J118954l31848
37399H343802j400453p88569P28021J396337O15605n63975r43909n82291l32183
37390F472385l99692j88159L92816M93075k53990q17032k03350R36614J269255
37381G701922P26578J93247j99468q62984j199254j89745J419316J570628j2512
37372I147728j213522p55030J5093k71679o36220K89344J575721J380251l9503
37363I492183q47099n64983m08242q87216j031562k28652P41372R25971L48560
$$ y = [7802571, 8333146, 7959644, 6959858, 6457873, 7012609, 7879491, 8146910, 8001060, 8185376, 8679273, 8751899, 8136867, 7389922, 7086244, 7240446, 7525481, 7614792, 7369192, 7074638, 7308475, 8110974, 8563929, 7861353, 6639284, 6410791, 7556696, 8675650, 8343802, 6943349, 6154780, 6882801, 8279138, 8894743, 8330768, 7386859, 6804568, 6472385, 6072693, 5884534, 6277350, 6770425, 6516435, 5699403, 5496053, 6432667, 7701922, 8428500, 8621747, 8422279, 7559295, 6360041, 6170296, 7589612, 9160240, 9147728, 7934206, 7179176, 7194269, 6922590, 6286370, 6575714, 8151435, 9531686, 9492183, 8645084, 8080101, 7671859, 6784643, 5753081, 5524429, 6265801, 7191772, 7540332]
37354G540332l45665n51010L6678J031546J363670M94718o37631q03167k29398
37345G900073n5899m09720l90718J81091M73129J89013j0997J07188p4121o49821
37335G259218p05127J70109R87279P08091l42943j051292q31937Q2301J002671
37326G278370J091698N8916j135675j107725J00081R42355N36895k06172k49527
37317G309216m1231m37106r73854n53308O45376J254155O25223m06847p46224
37308F675400k12597N87097R17228L97525o15814j143617o09489L15099M86102
37299F796934j52059n13445J373O19990L89639l62713m83473L19653J006957O22599
37289H245455l89109p82176j75161N21201M65726N6662K31580R68765J232528
$$ y = [7540332, 7194667, 6643657, 6680335, 7711881, 9075551, 9570269, 8932638, 8129471, 7900073, 7844174, 7434454, 7043736, 7224827, 7697956, 7886969, 7875972, 7983160, 7909039, 7259218, 6554091, 6724200, 7711479, 8419570, 8076627, 7025335, 6193398, 6275699, 7278370, 8370068, 8428984, 7293309, 6185584, 6285665, 7228020, 7764915, 7558743, 7309216, 7267985, 6830879, 5857025, 5303717, 5949093, 7203248, 7828471, 7421624, 6675400, 6462803, 7049900, 7967128, 8364653, 7748839, 6605222, 5995733, 6310832, 6796934, 6644875, 6131430, 6132803, 6752793, 7142432, 6779719, 6296246, 6615899, 7622856, 8245455, 7856346, 7074170, 6899009, 7420210, 7885936, 7942598, 8174178, 9142943, 10375471]
37280A0375471M45490o65718j009069m43125K45792L88586L4815l60719m75894
37271H535629l21344j25725q0100j37748j02610Q6490L02368M61667N69103M74956
37261I662686o3928q60837j179690n52074M70640Q61140L76523k16866k55422
37252H242172L2757J25278M5045O4527q238m66839q23743k62385R00925J264261
37242I113760L29461n99110l29907L84838J55095p12692q22511j83089j31338
37233G204507p14963l22315J383735K281116Q66463j254331j681349o24186J9684
37224G158361o9750L53370J290315J167554m14469j715697j314933R7417J086203
37215G638371J243930Q86030K15674m24347m72829k5237Q6433l74177n97527j48718
$$ y = [10375471, 10820961, 10155243, 9146174, 8703049, 8948841, 9337427, 9372242, 9011523, 8535629, 8214285, 8088560, 8008460, 7870712, 7768102, 7854592, 8156960, 8618627, 9187730, 9662686, 9598758, 8737921, 7558231, 7006157, 7476797, 8337937, 8714460, 8497594, 8242172, 8274929, 8400207, 8445252, 8509779, 8501541, 8034702, 7210959, 6948574, 7849499, 9113760, 9443221, 8844111, 8514204, 8899042, 9054137, 8341445, 7518934, 7335845, 7204507, 6489544, 6167229, 7550964, 9832080, 10698543, 9444212, 7762863, 7138677, 7158361, 7088611, 7441981, 8732296, 9899850, 9485381, 7769684, 6454751, 6552168, 7638371, 8882301, 9768331, 9984005, 9559658, 9086829, 9061592, 9148025, 8773848, 8176321, 8027603]
37205H027603K31958n9161m42497k78850m0446l21679n43553J24264J139553J201477
37195I038669K43164m20049J1823Q10303Q68049R0906p41385j024034q21417m83908
37185G572121j27258L25791O83193M78246k67771o78321o2576R16803R75787N4165
37175I870180n84282k61888K18942L7429l96330l84679j69807k82085m16010n990
37165G625480N83458M93115k82449r07795q97770m86197N3278O71180J149786
37156H002086J108475M92357l15404q27649p28695j43239J96209l64138j262582
37147F157420j104668K85101J206997M26526q13904n27608R67293J473850J94118
37138H265125j215972j157560m5664Q27873R95642O17618j97364r48636o67300
$$ y = [8027603, 8259561, 8200400, 7757903, 7479053, 7438607, 7116928, 6573375, 6697639, 7837192, 9038669, 9281833, 8861784, 8873607, 9683910, 10551959, 10642865, 9901480, 8877446, 8056029, 7572121, 7444863, 7770654, 8453847, 8932093, 8664322, 7986001, 7923425, 8840228, 9816015, 9870180, 9285898, 9024010, 9242952, 9280381, 8884051, 8499372, 8329565, 8047480, 7631470, 7625480, 8208938, 8702053, 8419604, 7511809, 6614039, 6127842, 6181120, 6852300, 8002086, 9110561, 9602918, 9287514, 8459865, 7731170, 7587931, 7784140, 7420002, 6157420, 5052752, 5337853, 6544850, 6971376, 6157472, 5629864, 6597157, 8071007, 8265125, 7049153, 5891593, 5845929, 6673802, 7669444, 8287062, 8089698, 7141062, 6473762]
37129F473762O40091J337868K01700j529263j590217J17038J364668Q04656k74691
37120G545612j52444P31109O95767m64990j256191q12043K1809K46590Q4258J88964
37110F828441N24739P88843J067043J202816L71382j594424l138511k586024m42088
37101C022217J228672J442164R31769L93889k32382o51894j52872Q65407R28255
37092G775225k89461j272489r38935j22211P6983p3578J7616L9281k10438K0142
37082E022135R48784J311939L91021m06920K61515J248274P45061o25908r38313
37073G957588k88510l23692r43213l78284J356469J981571N66045r86468j033942
37064G907564m21833m00440m77005J13500N88391J1440q29698o58920J66297L85436
$$ y = [6473762, 7113853, 8451721, 8653421, 7124158, 5533941, 5650979, 7015647, 7820303, 7545612, 7393168, 8124277, 8820044, 8355054, 7098863, 6286820, 6308629, 6555219, 6639477, 6828441, 7353180, 8142023, 9209066, 10411882, 10783264, 9188840, 6050329, 3464305, 3022217, 4250889, 5693053, 6624822, 7018711, 6786329, 6134435, 5981563, 6846970, 7775225, 7485764, 6213275, 5274340, 5152129, 5229112, 5155534, 5173150, 5212431, 5001993, 5022135, 5970919, 7282858, 7673879, 7266959, 7528474, 8776748, 9521809, 8895901, 7957588, 7669078, 7345386, 6402173, 6023889, 7380358, 9361929, 9927974, 8941506, 7907564, 7485731, 7085291, 6608286, 6721786, 7310177, 7321617, 6491919, 5832999, 5999296, 6384732]
37054F384732o8980k40222J24836M29989M45663M07363J85803m56152r76750n79062
37044E657220M10356P37633n8963r93000r65805j22616M83069K48431k95024j96193
37034D905108O23267J120535N19202m01904k36844Q72784J117206m50701k317365
37025E751288k361673o08578R61382J036832L08175R9987O07861R66758O07348
37016G369380j2705r0181L97697O06481j8573q85224j013657m03565L4624j30410
37006E853867l15179K1041N25324N65465J35126k95836m26813k47114J35995M57965
36996F409841L86674o4926m45983l57435J69644P94024J084271P31335n2880n12006
36986H142559k23127K34136J17334k95233k42894Q8963j58107q97928j057710
$$ y = [6384732, 6315752, 6075530, 6200366, 6630355, 7076018, 7483381, 7669184, 7213032, 6236282, 5657220, 6067576, 6805209, 6746246, 5753246, 4787441, 4664825, 5147894, 5396325, 5101301, 4905108, 5528375, 6648910, 7168112, 6766208, 6529364, 7402148, 8519354, 8068653, 5751288, 3389615, 2781037, 3742419, 4779251, 5087426, 5187413, 5795274, 6762032, 7369380, 7356675, 7266494, 7664191, 8270672, 8252099, 7366875, 6353218, 5949653, 5984277, 5853867, 5538688, 5559729, 6085053, 6650518, 6785644, 6489808, 6062995, 5815881, 5951876, 6409841, 6796515, 6731589, 6285606, 5928171, 6097815, 6891839, 7976110, 8707445, 8654565, 8142559, 7919432, 8153568, 8270902, 7975669, 7732775, 7821738, 7663631, 6765703, 5707993]
36977E707993l17128L96852M48952K53060J30062k38429p06134m09981O72075
36968E937322J255514O77301j0108J81079N93751K66350l35128k53981K33278
36959H545378J79834m57184j005938j189155j003687k64021P00697P93487k75734
36950F023677j130683o77660J65071J38078j21380O23280J640915J187682m80309
36941G368671j314274n71413M20892O78450O91278Q56293O95487J00525l23201
36932H602708n64433j221623j860885j165659O91753J652188O34423q27721q72139
36923E068612J88150Q27727N83925J08555j60611j84232J56590O79388O19340
36914G887444l19948j161260q22710L38647J031861P53306J73903K325J97257
$$ y = [5707993, 5390865, 5787717, 6236669, 6489729, 6619791, 6381362, 5675228, 5265247, 5937322, 7192836, 7870137, 7860029, 8041108, 8634859, 8901209, 8566081, 8312100, 8545378, 8725212, 8268028, 7262090, 6072935, 5069248, 4805227, 5505924, 6299411, 6023677, 4892994, 4215334, 4380405, 4518483, 4397103, 5020383, 6661298, 7848980, 7368671, 6054397, 5482984, 5903876, 6582326, 7273604, 8129897, 8825384, 8925909, 8602708, 8038275, 6816652, 4955767, 3790108, 4481861, 6134049, 6768472, 5940751, 5068612, 5256762, 6084489, 6668414, 6776969, 6616358, 6432126, 6588716, 7268104, 7887444, 7567496, 6406236, 5583526, 5922173, 6954034, 7707340, 7881243, 7883568, 8080825]
36905H080825K74908j08015q48723j369211j044402O1194J053666J066698J64198
36896G331138p45279q15260p9521N64778L40553m04986o16247q8587J73756l66034
36886E294311p49555j32438N76965J28720q14618o52334M13843O93869p0093l53698
36876D334972L21019N53724k42753o25167K82907J099791N51539l37817j15637
36867E822578O36093N67640k4176j7988L24145m429o35361l52060O83052J091742
36857H091236M60905l01584o42751q47209r38328n62913L1925K02474M1733J34086
36847E669574L71451K33413l4211J41456L55379j39412p70924l55659O40875N05624
36837F617566q20909j289589J04772J603140J237445m02037j282704p36616J86083
$$ y = [8080825, 8355733, 8247718, 7398995, 6029784, 4985382, 5046576, 6100242, 7166940, 7331138, 6585859, 5770599, 5691078, 6255856, 6596409, 6191423, 5575176, 5486589, 5660345, 5294311, 4544756, 4412318, 4989283, 5118003, 4303385, 3651051, 4064894, 4758763, 4688670, 4334972, 4655991, 5209715, 4966962, 4341795, 4624702, 5724493, 6276032, 5938215, 5822578, 6458671, 7026311, 7002135, 6984147, 7308292, 7303863, 6668502, 6316442, 6999494, 8091236, 8552141, 8250557, 7607806, 6760597, 5822269, 5259356, 5291281, 5493755, 5535488, 5669574, 6041025, 6274438, 6240227, 6381683, 6737062, 6597650, 5826726, 5471067, 6111942, 6617566, 5796657, 4507068, 4611840, 6214980, 7452425, 7050388, 5767684, 5031068, 5217151]
36828E217151M83713J31627l58467l92360L68672J429731J619046M60025j037906
36819G921232j573472j082772m30753n5571K75853O55550Q15639O88789N43896
36810G758391N08962M09021J03981l37818p55029r19172n99096Q3295N33174L08692
36800G094401k40579l69994P8294N38209O02755N20237N33071K17314q73883k072274
36790F027551j959922k38632J493392J587492M83705k0711N89859R83236K97566
36781I243536m47700j27651N39293J50674j044391j452710m66247Q73081J461377
36772H729262J200213M98120j83917k85431K90342O01939k34684j468169j525337
36763G622338l89887L41234j0668k78916L93847J138943J015042N72960N86120
$$ y = [5217151, 5700864, 5832491, 5474024, 5081664, 5450336, 6880067, 8499113, 8959138, 7921232, 6347760, 5264988, 4834235, 4778664, 5054517, 5710067, 6525706, 7214495, 7758391, 8267353, 8676374, 8780355, 8442537, 7687508, 6768336, 6169240, 6252535, 6785709, 7094401, 6853822, 6483828, 6562122, 7100331, 7703086, 8223323, 8756394, 8973708, 8099825, 6027551, 4067629, 3828997, 5322389, 6909881, 7393586, 7372875, 7962734, 8945970, 9243536, 8795836, 8668185, 9207478, 9358152, 8313761, 6861051, 6394804, 7267885, 8729262, 9929475, 10427595, 10243678, 9958247, 10248589, 10850528, 10615844, 9147675, 7622338, 7232451, 7573685, 7563017, 7284101, 7677948, 8816891, 9831933, 10404893, 10991013]
36754A0991013N27029k67493r60692l86885P82420P29046q35861k170608j811918
36745F596051k27626J065649J132630J28377j090228j559546q70779N13285J715082
36736G402895K117750J535622J80751j226951j789560j281831k99687O24763J383984
36727H647736J586842O09098j037749j618399m91162O27555N5214j269684j313007
36718E796444j98508J92427n17723o78710M39423J394231R60684j08737o03849
36709F675682n33881l50612L4542M59884J43034p91937p84051Q43459K269569
36700G965689J467564q16916k064658j343864k51O32174N30577Q1241n38307q74834
36690E038415m09691M72800Q03498M71985K76754M24889K12384m93031p11882
$$ y = [10991013, 11518042, 11250549, 10289857, 9902972, 10685392, 11414438, 10578577, 8407969, 6596051, 6368425, 7434074, 8566704, 8695081, 7604853, 6045307, 5174528, 5687813, 7402895, 9520645, 11056267, 11237018, 10010067, 8220507, 6938676, 6638989, 7263752, 8647736, 10234578, 10843676, 9805927, 8187528, 7696366, 8323921, 8379135, 7109451, 5796444, 5597936, 5790363, 5272640, 4593930, 5033353, 6427584, 7388268, 7279531, 6675682, 6141801, 5791189, 5825731, 6285615, 6428649, 5636712, 4852661, 5696120, 7965689, 9433253, 8616337, 6551679, 5207815, 5207564, 5839738, 6370315, 6451556, 5913249, 5038415, 4628724, 5101524, 5905022, 6377007, 6653761, 7078650, 7291034, 6798003, 6086121]
36681F086121J00078J016496R02118p1038q82715j017614p09823l60991k97112
36672D765520o43076r66459n66462M50094J038584O97684L20209P91271J470010
36663G357375J142915l757o17025k26825J94077j15135o25917n27972Q4620N81039
36653G243395O89066M92512N3045m47211n86905k24766J44579k8769o27736j040400
36643E666810q44216j13036O64427Q19040R9031p51315n85813O11001J441013
36634G006942R03541j92285m57982K9893O6671o04444r03921k47648N05476M46815
36624F553058n7803j18883L40677O92201N23685j10505q84710j186315m93247
36615E258158P08796J050943P175j147025r44034K77745R78331N67289j84181
$$ y = [6086121, 6186199, 7202695, 8104813, 8033775, 7151060, 6133446, 5423623, 5062632, 4765520, 4122444, 3155985, 2589523, 3039617, 4078201, 4775885, 5096094, 5887365, 7357375, 8500290, 8496533, 7879508, 7652683, 7846760, 7731625, 7105708, 6577736, 6662356, 7243395, 7932461, 8424973, 8478018, 8030807, 7443902, 7219136, 7363715, 7334946, 6707210, 5666810, 4822594, 4709558, 5373985, 6193025, 6292056, 5540741, 4954928, 5565929, 7006942, 7910483, 7718198, 7260216, 7290109, 7356780, 6752336, 5848415, 5600767, 6106243, 6553058, 6495255, 6376372, 6717049, 7409250, 7932935, 7822430, 6937720, 5751405, 5258158, 5966954, 7017897, 7025072, 5878047, 4934013, 5211758, 6190089, 6757378, 6573197]
36606F573197o04730p47468n79757J83019J166677J369260N31845l94238n25398
36597F972407p342N70825Q60342N75587l90738j292770j008382K97556J051229
36588G628714M35863m53976m28683L4745l6163l25490p0134K53706j99767p50855
36578F087960r3259J214332J205570m00229j559144r17646L31763M92033k52031
36569F109349n95906j43841M49020O11697K28580n07986r57353m50258N96858
36560E340160Q61197n752p22017l39554L17488K00415j78162J22688N95072K10472
36550F402007n21208k73727P04970Q21612k80680j172637q95071j20902L01790
36541D966154M38446M29649L969o02892n78501K4401J04024n90847p97097J66995
$$ y = [6573197, 5968467, 5220999, 4641242, 4824261, 5990938, 7360198, 7892043, 7497805, 6972407, 6965065, 7535890, 8396232, 8971819, 8581081, 7288311, 6279929, 6577485, 7628714, 8064577, 7610601, 7181918, 7216663, 7180500, 6855010, 6784876, 7038582, 6838815, 6087960, 5994701, 7209033, 8414603, 8014374, 6455230, 5537584, 5869347, 6361380, 6109349, 5513443, 5369602, 5818622, 6430319, 6658899, 6150913, 5193560, 4743302, 5340160, 6201357, 6195605, 5473588, 5134034, 5451522, 5651937, 5473775, 5596463, 6191535, 6402007, 5880799, 5607072, 6312042, 7133654, 6852974, 5680337, 4785266, 4664364, 4966154, 5404600, 5834249, 5838218, 5235326, 4656825, 4681226, 4785250, 4194403, 3397306, 3564301]
36531C564301J071773P15766q1193J15074R45444R25599o0688o27164q1651P37961
36521G225222R11357M72887j69333p77901j041626p26032k74935l99305q74835
36512D345499o37380O13076J740228J579579L93302n95927p13168l99648m61963
36503E863598j070824j506822r25281N38792J690521J607589P20963O7778j46112
36494F840202m46068q26343o68060q36K63914k25998n57771Q4373J123164J401190
36484F987767P33408j28435o92077j060332j221510q07858K30656J177050J103967
36475F322636j14026j408995j374234J54878J549874J072715q46317j875121o97137
36466B784273J254877J738160N85126m58967l15199L35967N32161L19371J57970
$$ y = [3564301, 4636074, 5351840, 5270647, 5385721, 6331165, 7256764, 7196076, 6568912, 6487261, 7225222, 8136579, 8609466, 8440133, 7662232, 6620606, 5894574, 5619639, 5220334, 4345499, 3708119, 4321195, 6061423, 7641002, 8034304, 7438377, 6725209, 6325561, 5863598, 4792774, 3285952, 2360671, 2899463, 4589984, 6197573, 6918536, 6986314, 6840202, 6394134, 5567791, 4899731, 4898895, 5162809, 4936811, 4379040, 4463413, 5586577, 6987767, 7721175, 7592740, 6900663, 5840331, 4618821, 3810963, 4041619, 5218669, 6322636, 6208610, 4799615, 3425381, 3580259, 5130133, 6202848, 5356531, 3481410, 2784273, 4039150, 5777310, 6362436, 5903469, 5588270, 5924237, 6456398, 6775769, 6933739]
36457F933739M9183j38279j76771P4615K51232N7611j95874j63757j15864m00323
36447F175512o64443l53160K86545N17421L10453L58409Q16518R17097J61765
36438H526117q62994j316201j121982o70337j05425M70017O12968J21627l75472
36429E278318j90700L70507N46177L78821M36236N38456M5651o20596k77433Q62137
36419G367574J027714k87467j086550J00645J515530O54053j572325j869495L88888
36410F238567K014035P32643j534023j766213j83824P37721K90430J6774N97545
36401G143655P90267r6964p94060j30159J020637J070049l754r07564r26433m31956
36391F733718J00074M84479M22765k60680r71754q70626j47982J23558l86980
$$ y = [6933739, 6982922, 6844643, 6667872, 6742487, 6993719, 7051330, 6855456, 6691699, 6575835, 6175512, 5511069, 5157909, 5444454, 5961875, 6272328, 6630737, 7447255, 8364352, 8526117, 7663123, 6346922, 5224940, 4554603, 4449178, 4919195, 5532163, 5653790, 5278318, 5087618, 5458125, 6004302, 6383123, 6819359, 7357815, 7403466, 6782870, 6505437, 7367574, 8395288, 8107821, 7021271, 7121916, 8637446, 9291499, 7719174, 5849679, 6238567, 8252602, 8985245, 7451222, 5685009, 5501185, 6238906, 6529336, 6546110, 7143655, 7933922, 7836958, 7042898, 6912739, 7933376, 9003425, 8999671, 8092107, 7165674, 6733718, 6833792, 7318271, 7741036, 7480356, 6508602, 5637976, 5489994, 5613552, 5226572]
36382E226572p34064j73902P46811J176996J155537R94506L02210j184099k345724
36373E164843j739862J82111J386790J019622L92422O71996J057909L10617j057610
36364G388838j489729o46733L37455N44037R4079m95340p75882l79947N06475
36355E083253R23417L19878l80861M751R75014R60710k37276j119092p63096M0066
36345E806764L43999L55832N56785O93701L86053j62630o48309j041571j096680
36336E193944m47770M70429P13634L64190M44137R18914M81790r49463j453834
36327E735971j02481J131520K60530j494157j557763P1220J153538P67687Q2208
36318F048273j30280l34410n21765N1846J048766J039380j58015r99806o57933
$$ y = [5226572, 4492508, 4318606, 5065417, 6242413, 7397950, 8392456, 8694666, 7510567, 5164843, 3424981, 3607092, 4993882, 6013504, 6405926, 7077922, 8135831, 8446448, 7388838, 5899109, 5252376, 5589831, 6133868, 6227947, 5732607, 4956725, 4576778, 5083253, 6006670, 6326548, 5945687, 5950438, 6925452, 7886162, 7648886, 6529794, 5766698, 5806764, 6150763, 6506595, 7063380, 7757081, 8143134, 7980504, 7332195, 6290624, 5193944, 4746174, 5216603, 5930237, 6294427, 6738564, 7657478, 8139268, 7189805, 5735971, 5633490, 6765010, 7025540, 5531383, 3973620, 4044840, 5198378, 5966065, 6048273, 5917993, 5583583, 5061818, 5113664, 6162430, 7201810, 7043795, 6043989, 5386056]
36309E386056j32190k50629l47354J82475O61550N05094L53007P27688R02072
36300G987769K87050k89040Q490M18898j57812j150023j106235J800P46512L33425
36290G080834n42792r25464o33669J2863O55595R24293O16448J467m16766m42332
36280F330477k54522r4343r9291k06342o9772N37252J108819P81881m02481j274907
36270F356771j004493j62679J96834o7849l23771k07835J12730L90973M61099
36261E751780K16863j56722k30001P5690L09275J64955j15372k38844k31275j17100
36251E429249J59318L48855J58129m6260K54937N10443k62088j407758r84019
36242D160806J090727K166622N16844j863152j993466j13250J063906M47493m59652
$$ y = [5386056, 5253866, 5003237, 4655883, 4838358, 5499908, 6005002, 6358009, 7085697, 7987769, 8274819, 7985779, 7994269, 8413167, 8255355, 7105332, 5999097, 6000897, 6747409, 7080834, 6538042, 5612578, 4978909, 4991772, 5647367, 6571660, 7188108, 7189575, 6772809, 6330477, 6075955, 5981612, 5882321, 5675979, 5606207, 6143459, 7252278, 8034159, 7631678, 6356771, 5352278, 5189599, 5386433, 5318584, 4994813, 4786978, 4899708, 5290681, 5751780, 5968643, 5811921, 5581920, 5657610, 5966885, 6131840, 6016468, 5777624, 5546349, 5429249, 5588567, 5937422, 6095551, 6049291, 6304228, 6814671, 6552583, 5144825, 4160806, 5251533, 7418155, 7934999, 6071847, 4078381, 3965131, 5029037, 5476530, 5016878]
36233E016878m21991j1153N186o9832K23174O73180R58537J014424O36442l09608
36223G715237j214642j232804m66051K47023N43780O04451L84181r9819j65066
36214F316290N43567R61266N7524j123018p87246N50878O05028r64211j775371
36205D384707l82758J497572J572518K2044j323517j508739r10470j53394L79330
36196C577293O00922Q34725J187367Q30195q30970k387770j746301N41306J540564
36187D147331K42948q77247R9459J471970R00400p18322r30411K46097P49689
36178E331914N0238m20160o6195J29546k77215m78162q5769K60950K55921L47033
36168E048101N38945J99506o36814j035369n46249K38107P12288Q56903O85819
$$ y = [5016878, 4594887, 4583734, 4588920, 4519088, 4742262, 5415442, 6373979, 7388403, 8024845, 7715237, 6500595, 5267791, 4801740, 5048763, 5592543, 6196994, 6581175, 6481356, 6316290, 6859857, 7821123, 7878647, 6755629, 5968383, 6519261, 7124289, 6160078, 4384707, 4001949, 5499521, 7072039, 7094083, 5770566, 4261827, 3351357, 3197963, 3577293, 4178215, 5012940, 6200307, 7030502, 6199532, 3811762, 2065461, 2606767, 4147331, 4390279, 3513032, 3612491, 5084461, 5984861, 5266539, 4336128, 4582225, 5331914, 5382152, 4961992, 4895797, 5025343, 4748128, 4269966, 4184197, 4445147, 4701068, 5048101, 5587046, 5786552, 5149738, 4114369, 3568120, 3806227, 4518515, 5375418, 6061237]
36159F061237Q2499o39784q68677n26353j01358J03991J30941J1320p2324L16801
36149D498293J042570J036335k45347j605917j565750n07951N963l67376n88727
36140A702093k30317J8186j10111J6796N93229R26101O54221K53982O8705r2249
36130C800636k15280j1941K80885Q2542m50405n48925p5858L59299M68088M37836
36120D126877J99542l54267p05746m52610k54591o70555p40785M49556J516028
36111C113449N02946j542547j614824N05667J706213M92716p45888J11574J531216
36102D060522J200601k48139q81476q14457j230254j563475m69673J304648J689864
36093C048161N14609l69722j6238O04636N25458k1393m53281n46429k63599J33497
$$ y = [6061237, 6143736, 5503952, 4635275, 4108922, 4007564, 4111555, 4242496, 4253816, 4181492, 4498293, 5540863, 6577198, 6331851, 4725934, 3160184, 2652233, 2658196, 2290820, 1702093, 1471776, 1489962, 1379851, 1396647, 1989876, 2915977, 3570198, 3824180, 3892885, 3800636, 3585356, 3573415, 3854300, 3936842, 3486437, 2937512, 2861654, 3220953, 3689041, 4126877, 4326419, 3972152, 3266406, 2813796, 2559205, 1888650, 1147865, 1597421, 3113449, 3616395, 2073848, 459024, 964691, 2670904, 3163620, 2417732, 2529306, 4060522, 5261123, 5012984, 4131508, 3317051, 2086797, 523322, 53649, 1358297, 3048161, 3562770, 3193048, 3176810, 3781446, 4306904, 4285511, 3832230, 3285801, 3022202, 3155699]
36083C155699O9321l90008k18078R36655J706645R03731m66795o61028J61004
36074E197146N03365O6738j83854j7703o3711j91115L31558J129813R69206k33030
36064G508413j227688j264609o54933K80941J264847J386142J47813j107574p54036
36055E579316M13957K34290j216414j614066k36300Q81590M04691k96960J85051
36046D335155R77985Q12255K30030K21260L10639k68040q72221o33189j72125
36037D941749m68949j002325o35801M47661J196195J347545J245221P35916l33571
36028G473641j176569j020065m22860l39616n10535j51016M10018L09038j54506
36019D417530j1229N30884L81265m26983o56214J03119Q07814O47497O5845k54751
$$ y = [3155699, 3225020, 2835012, 2616934, 3553589, 5260234, 6163965, 5697170, 5036142, 5197146, 5700511, 5767249, 5583395, 5565692, 5501981, 5310866, 5642424, 6772237, 7741443, 7508413, 6280725, 5016116, 4361183, 4642124, 5906971, 7293113, 7440926, 6333352, 5579316, 5993273, 6227563, 5011149, 3397083, 3160783, 4042373, 4447064, 4150104, 4335155, 5313140, 6125395, 6355425, 6576685, 6887324, 6619284, 5747063, 5113874, 4941749, 4472800, 3470475, 2834674, 3282335, 4478530, 5826075, 7071296, 7807212, 7473641, 6297072, 5277007, 4854147, 4514531, 4003996, 3852980, 4262998, 4572036, 4417530, 4406301, 4937185, 5318450, 4891467, 4235253, 4338372, 5146186, 5793683, 5859528, 5604777]
36009E604777l26458l88824l95245k88919j15401K30958P11005P35403q2724r42070
35999D742502o79787M59104J013684L69335n05023o02510o6609M80256P59409
35990E970361O04011j21760r33206r43882j20895M97354K43720l41862n11432
35981D342409k75907O3047M56841O95852L60189k77654k64410M92647P55454j29566
35971F218902r32033l35390Q65149Q28000n89570j669805j273659p5505P04638
35962C740727O30192j2154n74435k87669Q49109J462829K99260j654201k014275
35953B439383k90169J297840J009551o6479r2211N89478M16013m93732n64979
35944D244695M05203Q20212j971o71986r0747P31913M37501m11285l59699M39431
$$ y = [5604777, 5278319, 4889495, 4494250, 4205331, 4089930, 4320888, 5031893, 5767296, 5684572, 4742502, 4062715, 4521819, 5535503, 5904838, 5399815, 4797305, 4730696, 5210952, 5970361, 6574372, 6452612, 5519406, 4575524, 4454629, 4951983, 5195703, 4853841, 4342409, 4066502, 4129549, 4586390, 5282242, 5642431, 5364777, 5100367, 5593014, 6348468, 6218902, 5286869, 4951479, 5816628, 6644628, 6055058, 4385253, 3111594, 3036089, 3740727, 4370919, 4358765, 3784330, 3496661, 4345770, 5808599, 6107859, 4453658, 2439383, 2149214, 3447054, 4456605, 4390126, 4297915, 4887393, 5303406, 4809674, 4244695, 4649898, 5470110, 5468139, 4796153, 4705406, 5437319, 5874820, 5463535, 5103836, 5543267]
35934E543267M68079n94183j183442j64363J413621J697781M60815p77350q29459
35925F034766j69660M4536l71429n62097j4034P12206Q57357M80340J23622r0141
35915G045466l83086o53354o39198n60526p59916q44872j91127P37820P90957
35906D542164K8034j61555P00813J314126P76292J00378L27424N59333m50728
35897G736281j869408j910329o64382K36162L28762N74902J098728Q92607m9928
35888F373395m53072k1381O2721n62395p14432K3756L71271k76297o06117K02664
35878D400113Q22404J04095p86299m12840L98418J81252m33045K8264R67243O28281
35868E897886p36105j228303n49130k65600p76935o39606N70521J222848M12047
$$ y = [5543267, 6011346, 5417163, 4233721, 4069358, 5482979, 7180760, 7641575, 6864225, 6034766, 5865106, 5909642, 5538213, 4976116, 4962082, 5674288, 6531645, 7011985, 7135607, 7045466, 6662380, 6009026, 5369828, 4809302, 4049386, 3204514, 3013387, 3751207, 4542164, 4570198, 4408643, 5109456, 6423582, 7199874, 7300252, 7627676, 8187009, 7736281, 5866873, 3956544, 3292162, 3528324, 3857086, 4431988, 5530716, 6423323, 6373395, 5920323, 5898942, 5961663, 5399268, 4684836, 4708592, 5079863, 4803566, 4197449, 4400113, 5222517, 5326612, 4540313, 4127473, 4525891, 4707143, 4274098, 4302362, 5269605, 5897886, 5161781, 3933478, 3384348, 3118748, 2341813, 1702207, 2272728, 3495576, 3907623]
35859C907623m35330j3793O79615J81079q70476p53336O31706J742629J650734
35850F720451Q86968K06146k63548n68219o05982m91089n64883q01056o87285
35841C831503L4049Q32670R23696K45704l94708k83098L32660O47279L99276J6040
35831F585071k98460p98775j283727r55871J78567P98535J44662n71602J0741
35822C809141J043084P35506n60460p34266O00751J340633K41141j174807j206959
35813D093764n20536n29614q41308k49369P99776Q19414j57099o13845m9712L83157
35803C134628l0721m74774j40678M81051O03887M03527M01200L42160l09353j132649
35793C278278j040854J12815J068876P48133k32907l24932Q23133J804056J337944
$$ y = [3907623, 3472293, 3458500, 4138115, 4319194, 3448718, 2695382, 3327088, 5069717, 6720451, 7607419, 7813565, 7550017, 6981798, 6375816, 5884727, 5319844, 4518788, 3831503, 3865552, 4698222, 5621918, 5867622, 5472914, 5189816, 5522476, 6169755, 6569031, 6585071, 6286611, 5487836, 4204109, 3248238, 3426805, 4225340, 4370002, 3798400, 3809141, 4852225, 5587731, 5027271, 4293005, 4893756, 6234389, 6475530, 5300723, 4093764, 3573228, 3043614, 2202306, 1952937, 2752713, 3572127, 3415028, 2801183, 2751471, 3134628, 3103907, 2629133, 2488455, 2969506, 3573393, 3976920, 4378120, 4720280, 4410927, 3278278, 2237424, 2350239, 3419115, 4167248, 3934341, 3609409, 4432542, 6236598, 7574542]
35784G574542O536o20769j61958K68092j11466o69267n22668Q2352K42687k49941
35774E838140p29295o18066k2709N65806P82858O05742K67790k7714k92347n52300
35764E817905o41203m78319l10059k38797J36811R21564J184683J23952j277538
35755E238999j224718J56380P59501k85782j171059k95752J136168J111988N0509
35746E476234r7481Q00117R61683j90716j104461p25163n0349k13168o56072l44085
35736C856539M06621N58748N3250k96165j87357p5590k13422l19649k17513j10138
35726C455324r2628O2215L87827M10190k18192r22833o22708P89499J890275J319764
35716F458733l30602j178072o13608J6862k74216n62165J50000Q75814J76889
$$ y = [7574542, 7581078, 6960309, 6798351, 7066443, 6954977, 6285710, 5763042, 5845394, 6088081, 5838140, 5108845, 4490779, 4468070, 5033876, 5816734, 6422476, 6690266, 6662552, 6370205, 5817905, 5176702, 4698383, 4388324, 4149527, 4286338, 5207902, 6392585, 6516537, 5238999, 4014281, 4170661, 4930162, 4644380, 3473321, 3177569, 4313737, 5425725, 5476234, 5378753, 6178870, 7140553, 6949837, 5845376, 5120213, 5069864, 4856696, 4200624, 3856539, 4263160, 4821908, 4875158, 4578993, 4391636, 4316046, 4102624, 3782975, 3565462, 3455324, 3362696, 3424911, 3812738, 4222928, 4004736, 3081903, 2459195, 3248694, 5138969, 6458733, 6128131, 4950059, 4336451, 4353313, 4079097, 3516932, 3666932, 4542746, 4719635]
35707D719635j126407r38658O95705J477315M43942o37638l00033M15652J41562
35698D891075l95119O411N52459j25572j143466n06491J354713J844281K30936
35689F709227j145883n69233M93002M0915j122025q23146P86499J322500j97983
35680E493873j903208j775755k07587J029232J194868Q37588L34882n16777j483467
35671C003649j565881k26891J560607K108558Q62272r04974j445908m55461O49869
35662C585840M53121p67419j430641o25273Q25016J444561Q07085k22391o65575
35653C404324l80942Q9748J99984j55150n94363n71367P2187Q43797J059628N76386
35643D544232r3555l83141k10999Q8620K19050K33891L96383P00661O76979k2320
$$ y = [4719635, 3593228, 2654570, 3350275, 4827590, 5271532, 4633894, 4333861, 4749513, 4891075, 4495956, 4502367, 5054826, 4929254, 3785788, 3279297, 4634010, 6478291, 6709227, 5563344, 4994111, 5487113, 5528028, 4406003, 3582857, 4369356, 5691856, 5493873, 3590665, 1814910, 1607323, 2636555, 3831423, 4669011, 5003893, 4487116, 3003649, 1437768, 1210877, 2771484, 4880042, 5742314, 4837340, 3391432, 2935971, 3585840, 4038961, 3271542, 1840901, 1215628, 2040644, 3485205, 4292290, 4069899, 3404324, 3023382, 3113130, 3313114, 3157964, 2563601, 1992234, 2064421, 2908218, 3967846, 4544232, 4450677, 4067536, 3856537, 3945157, 4164207, 4398098, 4794481, 5495142, 6172121, 6149801]
35633F149801r15839j109939n41304j22198l10834l67453K65343O90819j45019
35624C593377j434463j307254M01958J716517J197588l14756j202767j043593
35616A606607l24678O42953J521787J567674N54702n32246o97427k68146j23598
35607C947628k28310j6024K98262M6065n19948m41356L46853P68611J84375o86442
35597C699714p55012J19306J061417J105939J70415p04893m06595P13506J016024
35588F019821j65906j321326q36622N26451P18349m70353j134481k03999J064626
35579D196560J133242K66989l18585l21194l20810n11687m47167J30669Q43011
35570D651028J058521M93825m83445j143313j168823r70647r32546p39524m8989
$$ y = [6149801, 5233962, 4124023, 3582719, 3460521, 3149687, 2782234, 3047577, 3738396, 3593377, 2158914, 851660, 1253618, 2970135, 4167723, 3852967, 2650200, 1606607, 1281929, 1924882, 3446669, 5014343, 5569045, 5036799, 4339372, 4071226, 3947628, 3719318, 3703294, 4001556, 4047621, 3527673, 3086317, 3433170, 4201781, 4386156, 3699714, 2944702, 3064008, 4125425, 5231364, 5401779, 4696886, 4290291, 5003797, 6019821, 5853915, 4532589, 3695967, 4222418, 4940767, 4470414, 3335933, 3131934, 4196560, 5329802, 5596791, 5278206, 4957012, 4636202, 4124515, 3677348, 3808017, 4651028, 5709549, 6203374, 5719929, 4576616, 3407793, 2437146, 1504600, 765076, 716087]
35561G16087O09213N13847M8518K35408J058840J384689O45481m63104j115954
35552C633025j163226o82880J86906Q10920N55809j28482k72635o9017n56801
35543B313619j485040j250032M73696J815952J352247O9276m07693q7682J22152
35534B916495R1142N5319k92076r41261r10422J67216R29618K59628p59160n60426
35524I56073K97671K13144o10451n79047M74863J060222N20455j98822l33712
35515A800396j16565K30188O92907P23330p1158o84135L2855J103015N44957j292319
35505B963471j924602n56122Q30880Q58798N91181Q98250O50178p60775j480481
35496B070778Q441J999536J895245O0491j114292r69421q26575j101587p92473
$$ y = [716087, 1325300, 1839147, 1887665, 2123073, 3181913, 4566602, 5212083, 4748979, 3633025, 2469799, 1786919, 1973825, 2784745, 3340554, 3212072, 2939437, 2870420, 2313619, 828579, -421453, 52243, 1868195, 3220442, 3289718, 2882025, 2794343, 2916495, 3007637, 3062956, 2770880, 1829619, 919197, 1086413, 2016031, 2275659, 1516499, 956073, 1253744, 1466888, 856437, 277390, 752253, 1812475, 2332930, 2134108, 1800396, 1683831, 1914019, 2606926, 3330256, 3259098, 2574963, 2607818, 3710833, 4255790, 2963471, 1038869, 482747, 1313627, 2172425, 2763606, 3661856, 4312034, 3551259, 2070778, 2079219, 4078755, 5974000, 6034491, 4920199, 3950778, 3124203, 2022616, 1230143]
35487A230143K15290P24134L95083K68024O93294O65813j78850o78662p2872P00495
35477C961892N63620j13503m45403m57787n69878n64890j39020K24987k2162m41257
35467A996599k87702J67824N9849n47789o26222K50720J205961J221275L65832
35458C806347m78326o89848l64434M4717K09796J03045r7788j96703j06517J24870
35448B355159L34320L43904J67635M1538N0964j37095p76150j338108r21353M27895
35438E48709J436345J127779J18973k56691K47270O68788L71603j91479l99399
35429C671898l26999k96992k23486M3286J58840k91628r97595j144030m61428
35420A31866L82271N79827J04829l35297j52655M63390P92561M52602j35003k88904
$$ y = [1230143, 1445433, 2169567, 2564650, 2832674, 3525968, 4191781, 4012931, 3334269, 3261397, 3961892, 4525512, 4412009, 3966606, 3508819, 2938941, 2374051, 2235031, 2460018, 2437856, 1996599, 1708897, 1876721, 1936570, 1388781, 762559, 1013279, 2219240, 3440515, 3806347, 3328021, 2638173, 2273739, 2318456, 2528252, 2631297, 2533509, 2336806, 2230289, 2355159, 2689479, 3033383, 3201018, 3242556, 3293520, 3156425, 2380275, 1042167, 120814, 548709, 1985054, 3112833, 3231806, 2975115, 3222385, 3891173, 4262776, 4071297, 3671898, 3344899, 3047907, 2824421, 2867707, 3026547, 2734919, 1737324, 593294, 131866, 514137, 1093964, 1198793, 863496, 710841, 1174231, 1966792, 2419394, 2284391, 1995487]
35410A995487Q2913M81547N72001N07621M67728L57119J24517q6519k96060o84900
35400C521454j007215o50957L17212Q69622L93993l18146k58387K56990K65676
35391C390242j37993o8135M40610M24040k35120m60171K19946Q45877N62692j92557
35381D789431o59377p96701o92261p9584P53428P41604k89538q90966j17184P61673
35371C520525J90600j035580r65077L14135Q06146j74565j046381o04908L02668
35362A307563M97799K42570L05969N17539L19726j24462l26671l11875l03127
35353B125031j81937R9162J84367m8947j76027k0510K3696o0440L47522J146930
35343C438847J055174m49382j796890j317956K68438R47281L91617M2960M50707
$$ y = [1995487, 2078400, 2559947, 3131948, 3639569, 4107297, 4464416, 4588933, 4502414, 4206354, 3521454, 2514239, 1863282, 2180494, 3050116, 3444109, 3125963, 2867576, 3124566, 3390242, 3252249, 3184114, 3624724, 4048764, 3813644, 3353473, 3573419, 4419296, 4981988, 4789431, 4130054, 3333353, 2641092, 2561508, 3314936, 4056540, 3767002, 2876036, 2758852, 3520525, 3711125, 2675545, 1710468, 2024603, 2830749, 2656184, 1609803, 1004895, 1307563, 1805362, 2047932, 2353901, 2871440, 3191166, 3066704, 2740033, 2428158, 2125031, 1943094, 2042256, 2226623, 2177676, 2001649, 1981139, 2004835, 1944395, 2291917, 3438847, 4494021, 4044639, 2247749, 929793, 1198231, 2145512, 2537129, 2580089, 3030796]
35334C030796N16766k96596q73492l39627M81475N19669J25425J32554K70939
35325C567909j45615o60334k76146P16499R76499J70699n89188o08639n41370
35316B610314q86306q54132K30555J359603J037185m20308j209422o11557J83541
35307A439473J50995p9595L73436R24635M74695o06273r00885j49391M11116J12910
35297B151116j27975M91937J130291N36935q71401j408102m27605Q51961J034744
35288C361901J93390n94306p25084m60573j26435L62637J004183J249569N59265
35279D824547o77479j316805p97204J00679K55187l30492o78183l31739R4444
35270A142955Q0042R6349P19958J413600J075493l19624j460811j292473k48843
$$ y = [3030796, 3547562, 3250966, 2377474, 2037847, 2519322, 3038991, 3164416, 3296970, 3567909, 3422294, 2761960, 2485814, 3202313, 4178812, 4349511, 3760323, 3151684, 2610314, 1724008, 869876, 1100431, 2460034, 3497219, 3076911, 1867489, 1255932, 1439473, 1590468, 1510873, 1884309, 2808944, 3283639, 2677366, 1776481, 1627090, 2038206, 2151116, 2023141, 2515078, 3645369, 4182304, 3310903, 1902801, 1475196, 2327157, 3361901, 3555291, 2960985, 2235901, 1775328, 1648893, 2011530, 3015713, 4265282, 4824547, 4147068, 2830263, 2033059, 2133738, 2388925, 2058433, 1380250, 1048511, 1142955, 1222997, 1319346, 2039304, 3452904, 4528397, 4208773, 2747962, 1455489, 1206646]
35261A206646M65115L85928P5226P9586K03709K1111l13101k36876L10695O65260
35251B863299L35223k77305m41950j04066J94684K45286L65796N93714L85498
35242D160179m92258j295839j098154j9132Q69494Q37498K59529k7951J73591
35233C366957K45367l25899j082647r94643J84608J363451J326269K27216p10366
35224C600313q23383n79480m94146l84453o3345N8624l01462n83448j17242Q20338
35214A132316J345271J067872K89333n40205r47372m49870P46566J398329N38755
35205D580995r99703j422392l87218N31981J40557p22105n65396N58618J287362
35196C002699R79237M03478L27878L97439q1466q84471j145010o76234k49329
$$ y = [1206646, 1671761, 2057689, 2132915, 2212501, 2416210, 2437321, 2124220, 1887344, 2198039, 2863299, 3198522, 2921217, 2479267, 2375201, 2569885, 2815171, 3180967, 3774681, 4160179, 3667921, 2372082, 1273928, 1254796, 2124290, 2961788, 3221317, 3193366, 3366957, 3612324, 3286425, 2203778, 1209135, 1393743, 2757194, 4083463, 4310679, 3600313, 2776930, 2197450, 1703304, 1318851, 1255506, 1314130, 1012668, 429220, 311978, 1132316, 2477587, 3545459, 3834792, 3294587, 2347215, 1897345, 2643911, 4042240, 4580995, 3581292, 2158900, 1771682, 2303663, 2444220, 1722115, 1156719, 1715337, 3002699, 3981936, 4385414, 4713292, 5110731, 5029265, 4144794, 2999784, 2323550, 2074221]
35187B074221l96961o23293k70761L52932M45624M0664k4059M94173P97814L31029
35177C221383l43548m88800k65800j64144j8309N13309R59280N57805m27298r17336
35167B626542n51034q7817j44750l74441j89939L54416P34297N60818j60953r73920
35157A793219j138183l54454O67224R05561K92271l17613l98370k35442j14205
35148A100008J25557N13997P34896P53049Q69492Q89467J53489j181369j862077
35139B096509j183878l0198M86850N47849Q23528R79120K99437o72296o09566
35130B737355N00597J127078L93274o90687p82544l7948L99454R2668l76238m82501
35120B880508l26169j40157J04269M32254O66387O92347N76346K59344m30761
$$ y = [2074221, 1677260, 1053967, 783206, 1136138, 1581762, 1622426, 1598367, 2092540, 2890354, 3221383, 2877835, 2389035, 2123235, 1959091, 1940782, 2454091, 3413371, 3971176, 3543878, 2626542, 2075508, 1987691, 1842941, 1468500, 1278561, 1632977, 2367274, 2928092, 2767139, 1793219, 655036, 300582, 967806, 1873367, 2165638, 1848025, 1449655, 1214213, 1100008, 1225565, 1739562, 2474458, 3227507, 4096999, 4986466, 5139955, 3958586, 2096509, 912631, 882433, 1369283, 1917132, 2740660, 3719780, 4019217, 3346921, 2737355, 3237952, 4365030, 4758304, 4067617, 3285073, 3247125, 3646579, 3739247, 3363009, 2880508, 2554339, 2414182, 2518451, 2950705, 3617092, 4309439, 4885785, 5145129, 4714368]
35111D714368j161179j020019K58547J361324P43524j061727j763152m77851Q10938
35102B404773J70549j152264n19432J800458K656827O81453j622600j672429m19373
35093B327962k09414q03917j81642J576957K110496N82323r58458p86499J41689
35084C799497K24133k28248m8441M97409L05365l93439k95651O68371R57802k65607
35074E221191j747952j793236m75390O45005O15703M0733j06549J28301j6146
35065B511660o65735r77654l25959P53060J237823Q55688J01815o48903j310897
35056A530898j523693q29290M04739J062862O59268l2010j35442J80039K27571
35047A544942r9859l85677m24217k72838J12346O91528J036534P68424J06207
$$ y = [4714368, 3553189, 2533170, 2791717, 4153041, 4896565, 3834838, 2071686, 1593835, 2404773, 2575322, 1423058, 903626, 2704084, 5360911, 6042364, 4419764, 2747335, 2327962, 2118548, 1314631, 1132989, 2709946, 4820442, 5402765, 4444307, 3657808, 3799497, 4023630, 3795382, 3746941, 4244350, 4549715, 4156276, 3860625, 4528996, 5486798, 5221191, 3473239, 1680003, 1204613, 1849618, 2465321, 2506054, 2399505, 2527806, 2511660, 1845925, 868271, 542312, 1295372, 2533195, 3388883, 3490698, 2841795, 1530898, 7205, -822085, -417346, 645516, 1304784, 1272774, 1137332, 1317371, 1544942, 1445083, 1059406, 635189, 362351, 474697, 1166225, 2202759, 2971183, 3077390]
$$ [...]
##END NTUPLES=NMR SPECTRUM
##END=
