##TITLE=31Pdec_CPA2B2506-2
 CDCl3, 24 sc
 28.06.2021
##JCAMPDX= 6.0         $$ Bruker NMR JCAMP-DX V2.0
##DATA TYPE= NMR SPECTRUM
##DATA CLASS= NTUPLES
##ORIGIN= UXNMR, Bruker Analytische Messtechnik GmbH
##OWNER= root
$$ XWIN-NMR		Version 3.5
$$ Mon Jun 28 10:20:40 2021 Russian Standard Time (UT+4h)  she@DPX200
##.OBSERVE FREQUENCY= 81.013821
##.OBSERVE NUCLEUS= ^31P
##.ACQUISITION MODE= SIMULTANEOUS
##.ACQUISITION SCHEME= undefined
##.AVERAGES= 24
##.DIGITISER RES= 16
##SPECTROMETER/DATA SYSTEM= spect
##.PULSE SEQUENCE= zgpg30
##.SOLVENT NAME= CDCl3
##.SHIFT REFERENCE= (INTERNAL, CDCl3, 0, 248.564)
##AUDIT TRAIL= $$ (NUMBER, WHEN, WHO, WHERE, WHAT)
$$ ##TITLE= Audit trail, XWIN-NMR		Version 3.5
$$ ##JCAMPDX= 5.01
$$ ##ORIGIN= Bruker BioSpin GmbH
$$ ##OWNER= she
$$ F:/spectra/data/she/nmr/P31/1/pdata/1/auditp.txt
$$ ##AUDIT TRAIL=  $$ (NUMBER, WHEN, WHO, WHERE, WHAT)
(   1,<2021-06-28 10:19:16.32 +0400>,<she>,<DPX200>,
      <created by zg, POWCHK disabled, PULCHK disabled
       configuration hash MD5:
       00 E9 B6 7A A2 85 ED C7 34 08 36 98 17 FE 4E 26
       data hash MD5: 32K
       0B 78 BD F1 F1 8A 74 59 FF 97 A3 8C 1F 3E 4E 0B>)
(   2,<2021-06-28 10:19:19.09 +0400>,<she>,<DPX200>,
      <Start of raw data processing
       efp BC_mod = 2 LB = 1 FT_mod = 6 PKNL = 1 PHC0 = -7545.072 PHC1 = 2615.884 SI = 64K 
       data hash MD5: 64K
       67 06 DD C2 23 B0 70 33 BF D5 70 59 1E 68 AB 04>)
(   3,<2021-06-28 10:19:59.79 +0400>,<she>,<DPX200>,
      <pk PHC0 = 188.2943 PHC1 = -275.6 
       data hash MD5: 64K
       77 04 33 79 91 8E A6 01 67 48 7D A2 30 FA DB E5>)
(   4,<2021-06-28 10:20:14.82 +0400>,<she>,<DPX200>,
      <abs ABSG = 5 
       data hash MD5: 64K
       FA 87 4D 9B 6B CB E5 A3 E3 B1 2A 17 3D A4 58 74>)
$$ ##END=
$$ 
$$ hash MD5
$$ 94 93 70 4F 19 99 76 E2 76 74 97 40 B4 BF F2 21
##$RELAX= 
##$RELAX= 
##$RELAX= 
##$RELAX= 
##$RELAX= 
##$RELAX= 
##$RELAX= 
##$RELAX= 
$$ Bruker specific parameters
$$ --------------------------
##$DU= <F:/spectra>
##$EXPNO= 1
##$NAME= <P31>
##$PROCNO= 1
##$TYPE= <nmr>
##$USER= <she>
##$AMP= (0..31)
100 100 100 100 100 100 100 100 100 100 100 100 100 100 100 100 100 100 
100 100 100 100 100 100 100 100 100 100 100 100 100 100 
##$AQSEQ= 0
##$AQ_mod= 1
##$AUNM= <au_zg>
##$AUTOPOS= <>
##$BF1= 81.014009
##$BF2= 200.13
##$BF3= 200.13
##$BF4= 200.13
##$BF5= 200.13
##$BF6= 200.13
##$BF7= 200.13
##$BF8= 200.13
##$BYTORDA= 1
##$CFDGTYP= 0
##$CFRGTYP= 5
##$CHEMSTR= <none>
##$CNST= (0..31)
1 1 145 1 1 1 1 1 1 1 1 1 1 1 1 1 1 1 1 1 1 1 1 1 1 1 1 1 1 1 1 1 
##$CPDPRG= <waltz16>
##$CPDPRG1= <>
##$CPDPRG2= <waltz16>
##$CPDPRG3= <>
##$CPDPRG4= <mlev>
##$CPDPRG5= <mlev>
##$CPDPRG6= <mlev>
##$CPDPRG7= <mlev>
##$CPDPRG8= <mlev>
##$CPDPRGB= <>
##$CPDPRGT= <>
##$D= (0..31)
0 1 0 0 0 0 0 0 0 0 0 0.03 2e-05 3e-06 0 0 0 0 0 0 0 0 0 0 0 0 0 0 0 0 
0 0 
##$DATE= 1624861155
##$DBL= (0..7)
120 120 120 11 120 120 24 19 
##$DBP= (0..7)
150 150 150 150 150 150 150 150 
##$DBP07= 0
##$DBPNAM0= <>
##$DBPNAM1= <>
$$ [...]
##$SUBNAM2= <"">
##$SUBNAM3= <"">
##$SUBNAM4= <"">
##$SUBNAM5= <"">
##$SUBNAM6= <"">
##$SUBNAM7= <"">
##$SUBNAM8= <"">
##$SUBNAM9= <"">
##$SW= 501.771253377433
##$SWIBOX= (0..15)
0 1 3 0 0 0 0 0 0 0 0 0 0 0 0 0 
##$SW_h= 40650.406504065
##$TD= 32768
##$TD0= 1
##$TE= 0
##$TE2= 300
##$TE3= 300
##$TEG= 300
##$TL= (0..7)
0 120 53 12 22 120 120 120 
##$TP= (0..7)
150 150 150 150 150 150 150 150 
##$TP07= 0
##$TPNAME0= <>
##$TPNAME1= <>
##$TPNAME2= <>
##$TPNAME3= <>
##$TPNAME4= <>
##$TPNAME5= <>
##$TPNAME6= <>
##$TPNAME7= <>
##$TPOAL= (0..7)
0.5 0.5 0.5 0.5 0.5 0.5 0.5 0.5 
##$TPOFFS= (0..7)
0 0 0 0 0 0 0 0 
##$TUNHIN= 0
##$TUNHOUT= 0
##$TUNXOUT= 0
##$USERA1= <user>
##$USERA2= <user>
##$USERA3= <user>
##$USERA4= <user>
##$USERA5= <user>
##$V9= 5
##$VALIST= <valist>
##$VCLIST= <CCCCCCCCCCCCCCC>
##$VD= 0
##$VDLIST= <DDDDDDDDDDDDDDD>
##$VPLIST= <PPPPPPPPPPPPPPP>
##$VTLIST= <TTTTTTTTTTTTTTT>
##$WBST= 1024
##$WBSW= 4
##$XGAIN= (0..3)
0 0 0 0 
##$XL= 0
##$YL= 0
##$YMAX_a= 645
##$YMIN_a= -589
##$ZGOPTNS= <>
##$ZL1= 120
##$ZL2= 120
##$ZL3= 120
##$ZL4= 120
##$ABSF1= 248.5645
##$ABSF2= -253.2056
##$ABSG= 5
##$ABSL= 3
##$ALPHA= 0
##$AQORDER= 0
##$ASSFAC= 0
##$ASSFACI= 0
##$ASSFACX= 0
##$ASSWID= 0
##$AUNMP= <proc_1d>
##$AZFE= 0.1
##$AZFW= 0.5
##$BCFW= 0
##$BC_mod= 2
##$BYTORDP= 0
##$COROFFS= 0
##$CY= -3
##$DATMOD= 1
##$DC= 0
##$DFILT= <>
##$DTYPP= 0
##$F1P= 0
##$F2P= 0
##$FCOR= 1
##$FTSIZE= 65536
##$FT_mod= 6
##$GAMMA= 0
##$GB= 0
##$INTBC= 1
##$INTSCL= 5.30512e-09
##$ISEN= 30
##$LB= 1
##$LEV0= 0
##$LPBIN= 0
##$MAXI= 10000
##$MC2= 0
##$MEAN= 0
##$ME_mod= 0
##$MI= 50
##$NCOEF= 0
##$NC_proc= -9
##$NLEV= 6
##$NOISF1= 182.463
##$NOISF2= 159.3651
##$NSP= 0
##$NTH_PI= 0
##$NZP= 0
##$OFFSET= 248.5645
##$PC= 4
##$PHC0= -7356.777
##$PHC1= 2340.284
##$PH_mod= 1
##$PKNL= yes
##$PPARMOD= 0
##$PSCAL= 0
##$PSIGN= 0
##$REVERSE= no
##$SF= 81.014009
##$SI= 65536
##$SIGF1= 159.3651
##$SIGF2= -187.1042
##$SINO= 113.3802
##$SIOLD= 16384
##$SREGLST= <1H.CDCl3>
##$SSB= 0
##$STSI= 65536
##$STSR= 0
##$SW_p= 40650.406504065
##$SYMM= 0
##$S_DEV= 0
##$TDeff= 32768
##$TDoff= 0
##$TI= <>
##$TILT= no
##$TM1= 0
##$TM2= 0
##$TOPLEV= 0
##$USERP1= <user>
##$USERP2= <user>
##$USERP3= <user>
##$USERP4= <user>
##$USERP5= <user>
##$WDW= 1
##$XDIM= 65536
##$YMAX_p= 284446429
##$YMIN_p= -8392188
$$ End of Bruker specific parameters
$$ ---------------------------------
##NTUPLES= NMR SPECTRUM
##VAR_NAME=  FREQUENCY,     SPECTRUM/REAL,   SPECTRUM/IMAG
##SYMBOL=    X,             R,               I
##VAR_TYPE=  INDEPENDENT,   DEPENDENT,       DEPENDENT
##VAR_FORM=  AFFN,          ASDF,            ASDF
##VAR_DIM=   65536,         65536,           65536
##UNITS=     HZ,            ARBITRARY UNITS, ARBITRARY UNITS
##FACTOR=    0.620285442955139, 1,           1
##FIRST=     20137.2065510759, 0,            0
##LAST=      -20513.1999529892, 0,           0
##MIN=       -20513.1999529892, -8392188,    0
##MAX=       20137.2065510759, 284446429,    0
$$ Real data points
##PAGE= N=1
##DATA TABLE= (X++(R..R)), XYDATA
$$ [...]
40615A095479K878K10188K12200Q9958m8550k06252k87933j38008J22868J72039
$$ 1095479 1098357 1308545 1520745 1610703 1562153 1355901 1067968 929960 1052828 1224867
40605A224867m569o1787J23351K37282Q0901r1201m1165N0564j9584o3389J18618
$$ 1224867 1220298 1158511 1281862 1519144 1600045 1508844 1467679 1518243 1498659 1435270 1553888
40594A553888K76332R9434j94845j78332P3000J28842m9817j01048L5133K3779
$$ 1553888 1830220 1929654 1734809 1556477 1629477 1758319 1708502 1607454 1642587 1666366
40584A666366j74156j43544K37669M73344K04717k02600k34720J3562J15449J8534
$$ 1666366 1492210 1348666 1586335 2059679 2264396 2061796 1827076 1840638 1956087 1974621
40574A974621l0265k9747j55624k77951r3146K85065L84731Q9368j82174j35362
$$ 1974621 1944356 1914609 1758985 1481034 1387888 1672953 2057684 2147052 1964878 1829516
40564A829516K828n2084j67988o9503J82739K81103R7421j96066l38843j90962
$$ 1829516 1832344 1780260 1612272 1542769 1725508 2006611 2104032 1907966 1569123 1378161
40554A378161J50395L67951K24710r7049j83056K6980J48288l1417k14647j16724
$$ 1378161 1528556 1896507 2121217 2024168 1841112 1868092 2016380 1984963 1770316 1653592
40544A653592M4449m7398k15885p8921K57124L09080k2637k98505k06803M3963
$$ 1653592 1698041 1650643 1434758 1355837 1612961 1922041 1899404 1600899 1394096 1438059
40534A438059J29116M9655J892O6412J80079K37222J39758q3087j99062l7680
$$ 1438059 1567175 1616830 1618722 1685134 1865213 2102435 2242193 2159106 1960044 1922364
40524A922364J92759J42923j33718k34455m3272J03798J4168m4790J33120K68687
$$ 1922364 2115123 2258046 2124328 1889873 1846601 1950399 1964567 1919777 2052897 2321584
40514B321584N0362l05626l63515j34419j4106j53101k82284j66202Q9715K41928
$$ 2321584 2371946 2066320 1702805 1568386 1554280 1401179 1118895 952693 1042408 1284336
40504A284336J98174M5930p3130q9189o5758r5962j23609j2512J72075J84957
$$ 1284336 1482510 1528440 1455310 1366121 1300363 1204401 1080792 1068280 1240355 1425312
40494A425312K912p6562R0401K27808R6410r7908q2511N63r1096j82832L982K37082
$$ 1425312 1428224 1351662 1442063 1669871 1766281 1668373 1585862 1586425 1495329 1312497 1316479 1553561
40482A553561Q1281k91199k75202J64594L74206O0024k42430p1948K30034J66915
$$ 1553561 1634842 1343643 1068441 1233035 1607241 1667265 1424835 1352887 1582921 1749836
40472A749836p2699j7653K20497J52629k03300l05094M5985L98030L38117K9198
$$ 1749836 1677137 1659484 1879981 2032610 1829310 1524216 1570201 1968231 2306348 2335546
40462B335546j40494r8642m3932q2432j34899j05139M446R5958N0347j16604j76796
$$ 2335546 2195052 2096410 2052478 1970046 1835147 1730008 1734454 1830412 1880759 1764155 1587359
40451A587359P1800M56739N21298Q3035m58270n49491j37962K92432L23285M7817
$$ 1587359 1659159 2115898 2637196 2720231 2261961 1712470 1574508 1866940 2190225 2238042
40441B238042j56041j34173n8716p6039q0611O0803K33436K23142O2245j0915
$$ 2238042 2082001 1947828 1889112 1813073 1732462 1793265 2026701 2249843 2312088 2301173
40431B301173N7673M8320j33190k25654J17L08715K62010j37163l80351j19421
$$ 2301173 2358846 2407166 2273976 2048322 2048439 2357154 2619164 2482001 2101650 1982229
40421A982229L53375M76127J31795k31679j92164J36007L07989J56596k4367N0078
$$ 1982229 2335604 2811731 2943526 2711847 2519683 2655690 2963679 3120275 3095908 3145986
40411C145986K35312K21980O9947J29864M30769N43844K26369j63975j94643O770
$$ 3145986 3381298 3603278 3673225 3803089 4233858 4777702 5004071 4840096 4645453 4652223
40401D652223L6679j07771j38088j20419m08581r01737j002628n29529q2361j48192
$$ 4652223 4688902 4581131 4443043 4322624 3914043 3012306 2009678 1480149 1397788 1249596
40391A249596l74528k24641R1965j3699m90166p05293m43322j47945j10412p8291
$$ 1249596 875068 650427 742392 728693 238527 -466766 -910088 -1058033 -1168445 -1246736
40381a246736J37139K72719J38083J1579J41175K83356J49436o1760k9154J09370
$$ -1246736 -1109597 -836878 -698795 -687216 -546041 -262685 -113249 -175009 -204163 -94793
40371i4793M1653j00203M0224L50153L49322l9014l55519k97339n9652J02686
$$ -94793 -53140 -153343 -113119 237034 586356 547342 191823 -105516 -165168 -62482
40361f2482J92629K22079Q8620j21587j11958J44004K81245J16455m3489P0636
$$ -62482 130147 352226 440846 319259 207301 351305 632550 749005 705516 776152
40351G76152K33716J34278r0177j18842O534J7679q2322q0044M631m9822k36069
$$ 776152 1009868 1144146 1053969 935127 941661 959340 877018 796974 801605 751783 515714
40340E15714k95203j28527Q4534J85711J73525N3505j57573k80843j25119J84931
$$ 515714 220511 91984 176518 362229 535754 589259 431686 150843 25724 210655
40330B10655L07025J46198m2173n7834M588k553m7053l4302L7461J34182K37409
$$ 210655 517680 663878 621705 563871 568459 565906 518853 484551 522012 656194 893603
40319H93603K75363J61613m7674j87123k00091j67206j19952k0332P0818L3541
$$ 893603 1168966 1330579 1282905 1095782 895691 728485 608533 588201 659019 692560
40309F92560o8851k3106J91711L20554J83445q3857k30696j65439L3306K07229
$$ 692560 623709 600603 792314 1112868 1296313 1212456 981760 816321 849627 1056856
40299A056856J80030p7876l16474k57931j248R5929k7203m5847J71769K92030
$$ 1056856 1236886 1159010 842536 584605 583357 679286 652083 606236 778005 1070035
40289A070035P0004j78919l2941L46354M06927L046m05772l93971q0608J28078
$$ 1070035 1140039 961120 928179 1274533 1681460 1684506 1278734 884763 804155 932233
40279I32233Q2427j2119M0101J44029Q0210j20799j48275J51898M74356M11276
$$ 932233 1014660 1002541 1042642 1186671 1266881 1146082 997807 1149705 1624061 2035337
40269B035337K3377k35223j48400L2254M8010k3124k7402j7660o9913r2543l6464
$$ 2035337 2058714 1823491 1675091 1707345 1755355 1732231 1704829 1687169 1617256 1524713 1488249
40258A488249m4018j69474k09740n1332Q5463K1130m8618P9645J97950L7556k07997
$$ 1488249 1444231 1274757 1065017 1013685 1099148 1120278 1071660 1151305 1349255 1386811 1178814
40247A178814j78919K0313P166j80106j37095J69460K96154N0157k12371j84478
$$ 1178814 999895 1020208 1027374 847268 710173 879633 1175787 1225944 1013573 829095
40237H29095k3821M1017P3424J44408R7124j05875j69086O8081K80538J47566
$$ 829095 805274 846291 919715 1064123 1161247 1055372 886286 954367 1234905 1382471
40227A382471r9631m9309K02314K20160m0350j82710l9706R2187j3708j77438
$$ 1382471 1282840 1233531 1435845 1656005 1615655 1432945 1393239 1485426 1471718 1294280
40217A294280j83404j20747j23207p7185J25122K76256J26539j75457k52333m2898
$$ 1294280 1110876 990129 866922 789737 914859 1191115 1317654 1142197 889864 846966
40207H46966J52801J61842J23176J19586n162k71410l39166K1554M58519M25673
$$ 846966 999767 1161609 1284785 1404371 1399209 1127799 788633 810187 1268706 1694379
40197A694379m8587l80334k31951Q9752J48951n1620k14310j84828j3293K17333
$$ 1694379 1645792 1265458 1033507 1123259 1272210 1220590 1006280 821452 808159 1025492
40187A025492L83638L05783j5803k75616k15368J3146Q7136Q08J0468J54240J75009
$$ 1025492 1409130 1714913 1699110 1423494 1208126 1221272 1308408 1309216 1319684 1473924 1648933
40176A648933l4135k28288j78628J1934J18245J15541J03881N6936j24285l50426
$$ 1648933 1614798 1386510 1207882 1219816 1338061 1453602 1557483 1614419 1490134 1139708
40166A139708l59722p2494K13992J45165k00682l34029J7460M66978M16642j08598
$$ 1139708 779986 707492 921484 1066649 865967 531938 549398 1016376 1433018 1324420
40156A324420m30948j31012L71823M17509J617l00524j50381K10040L88870K64666
$$ 1324420 893472 762460 1134283 1551792 1553409 1252885 1102504 1312544 1701414 1966080
40146A966080l6630k85420k55127M5479K61749R4548k38493k84924m7049N1785
$$ 1966080 1929450 1644030 1388903 1434382 1696131 1790679 1552186 1267262 1220213 1271998
40136A271998r6036j08122J72991L34182O9198k72896k30713N7146J55711N6154
$$ 1271998 1175962 1067840 1240831 1575013 1644211 1371315 1140602 1197748 1353459 1409613
40126A409613O8160J80628R2883j74281k41881l317J89129R5574p4433p5381j0555
$$ 1409613 1477773 1658401 1751284 1577003 1335122 1331805 1520934 1616508 1542075 1466694 1456139
40115A456139p0983j77129j39616K1591J55716K28086K73238K27471K4243k25985
$$ 1456139 1385156 1208027 1068411 1090002 1245718 1473804 1747042 1974513 1998756 1772771
40105A772771l44102l12496k36179j46697j7989Q8840R3348P0707J53192K69251
$$ 1772771 1428669 1116173 879994 733297 715308 804148 897496 968203 1121395 1390646
40095A390646K04965m1416j96380r0963J08368J77391J40654J18010M8484j70652
$$ 1390646 1595611 1554195 1357815 1266852 1375220 1552611 1693265 1811275 1859759 1689107
40085A689107l80551l07646k990J69040M3029j35074j29359o3153j33220k11315
$$ 1689107 1308556 1000910 997920 1166960 1209989 1074915 945556 882403 749183 537868
40075E37868l6884L14104M79786L23251J04330P7774J59705J11720j13729l45903
$$ 537868 500984 815088 1294874 1618125 1722455 1800229 1959934 2071654 1957925 1612022
40065A612022m08689k49995N9490L44332L92912J32252k46569m17605k37405P8525
$$ 1612022 1203333 953338 1012828 1357160 1750072 1882324 1635755 1218150 980745 1059270
40055A059270J62292q2862l34308k33315J32764L21763J31934j38119j49550J0232
$$ 1059270 1221562 1138700 804392 571077 703841 1025604 1157538 1019419 869869 880101
40045H80101O0102J1541P9441K23193J74184p7063k08582p0639R0768N7741l7753
$$ 880101 940203 951744 1031185 1254378 1428562 1351499 1142917 1072278 1163046 1220787 1183034
40034A183034j2473M1687j9478q7933j2355P9104j1680j51283m0635K58555L29044
$$ 1183034 1170561 1212248 1192770 1104837 1092482 1171586 1159906 1008623 967988 1226543 1555587
40023A555587L075l50121l05069O7112L24726K15175q5387k51515j57316P8841
$$ 1555587 1558662 1208541 903472 970584 1295310 1510485 1425098 1173583 1016267 1095108
40013A095108K67792K91650J43969p5251k13909j92781q7431k6536j3487N2776
$$ 1095108 1362900 1654550 1798519 1723268 1509359 1316578 1229147 1202611 1189124 1241900
40003A241900J62050J43051p7565l01817l00837j28987p742L1508J48297L45624
$$ 1241900 1403950 1547001 1469436 1167619 866782 737795 730053 761561 909858 1255482
39993A255482L87325J51780j46406k25163q1369O2003N3454n6854j18506l4163
$$ 1255482 1642807 1794587 1648181 1423018 1341649 1403652 1457106 1400252 1281746 1247583
39983A247583J37508K08310P2663j11585r4142J06260J97752K8408k00413k44170
$$ 1247583 1385091 1593401 1666064 1554479 1460337 1566597 1764349 1792757 1592344 1348174
39973A348174j44051q4275q2396k6911P4978J00027K8805j5628M1983J32794J58356
$$ 1348174 1204123 1119848 1037452 1010541 1085519 1185546 1214351 1198723 1240706 1373500 1531856
39962A531856J04313J7559n7111q7281m5791O0862J52984J11869p8088k35084
$$ 1531856 1636169 1653728 1596617 1509336 1463545 1524407 1677391 1789260 1711172 1476088
39952A476088j53172R0622J75450k962j21334R3789L76328K65398j70185l86711
$$ 1476088 1322916 1413538 1588988 1586026 1464692 1558481 1934809 2200207 2030022 1643311
39942A643311j53340J64863K19183J27572J06599O4707j31330l02554k14976K3862
$$ 1643311 1489971 1654834 1874017 2001589 2108188 2172895 2041565 1739011 1524035 1547897
39932A547897J35056P0013j8568m0551L0240K24115M06288K70709k05271n31437
$$ 1547897 1682953 1752966 1734398 1693847 1724087 1948202 2354490 2625199 2419928 1888491
39922A888491k89339K37178M14753J19964j77311j43551L0343L0798j39325k52878
$$ 1888491 1599152 1836330 2251083 2371047 2193736 2050185 2080528 2111326 1972001 1719123
39912A719123j73746J6555R7474p3310l31514l18523L6264L38641K58830J2115
$$ 1719123 1545377 1561932 1659406 1586096 1254582 936059 972323 1310964 1569794 1581909
39902A581909j3151J11326L5802j92421j66163J68952L67597J73566j16328j74390
$$ 1581909 1568758 1680084 1715886 1523465 1357302 1526254 1893851 2067417 1951089 1776699
39892A776699j11560j59774k27020r6698J49591K34216J01408l8307m2419L374
$$ 1776699 1665139 1505365 1278345 1181647 1331238 1565454 1666862 1628555 1586136 1589510
39882A589510k3069q7451p1684K9840Q5877L1729L125J32242K68622J42677j70963
$$ 1589510 1566441 1478990 1407306 1437146 1523023 1554752 1557877 1690119 1958741 2101418 1930455
39871A930455k70286l5647J35826m3582k62425j36112J12079K4992k70519k49934
$$ 1930455 1660169 1624522 1760348 1716766 1454341 1318229 1430308 1455300 1184781 934847
39861I34847J03484K54042K2930j25531J01880L36255J83390j44505k10868o524
$$ 934847 1038331 1292373 1315303 1189772 1291652 1627907 1811297 1666792 1455924 1449400
39851A449400J49824J10611j6088r7715n6891J12978K47231J18614k22151m31982
$$ 1449400 1599224 1709835 1693747 1596032 1539141 1652119 1899350 2017964 1795813 1363831
39841A363831l11843k1668K13700L20216K31001j01220m29401l56623O6299K97109
$$ 1363831 1051988 1030320 1244020 1564236 1795237 1694017 1264616 907993 974292 1271401
39831A271401P1827k07167j24884J33637J76668L0863k9417K8093P1000J11910
$$ 1271401 1343228 1136061 1011177 1144814 1321482 1352345 1322928 1351021 1422021 1533931
39821A533931J75059J05665j36926k60175o8441J65230J27651l2252l6477K281
$$ 1533931 1708990 1814655 1677729 1417554 1349113 1514343 1641994 1609742 1573265 1575546
39811A575546j31273k45575o7378J69387N7212k43513k30821P6000J61007j05259
$$ 1575546 1444273 1198698 1131320 1300707 1357919 1114406 883585 959585 1120592 1015333
39801A015333k60369l6084K36908J99861l5113j59112o6252J71285M03926L97289
$$ 1015333 754964 718880 955788 1155649 1120536 961424 895172 1066457 1470383 1867672
39791A867672N4742l14309l10133l8683K6059k01024k82205J8697L66711L89315
$$ 1867672 1922414 1608105 1297972 1259289 1285348 1084324 802119 820816 1187527 1576842
39781A576842J48564j07747k66943k48801J0865K91491K20310j32256k37007Q1524
$$ 1576842 1725406 1617659 1350716 1101915 1112780 1404271 1624581 1492325 1255318 1336842
39771A336842L04418K4082l79307l19222J09955L43298K02279K1577L0887Q1338
$$ 1336842 1641260 1665342 1286035 966813 1076768 1420066 1622345 1643922 1674809 1756147
39761A756147k499j47781j70847j66K36620K67276m9939m28493l79896J17838
$$ 1756147 1753648 1605867 1435020 1434854 1671474 1938750 1888811 1460318 1080422 1198260
39751A198260M85813L05184j15104k42943p2855L5591j166O456N5684p022p7017
$$ 1198260 1684073 1989257 1874153 1631210 1558355 1593946 1592780 1599236 1654920 1647898 1570881
39740A570881P6147L08223K34005j15587k68255l9562J87400Q5025j46637j78323
$$ 1570881 1647028 1955251 2189256 2073669 1805414 1765852 1953252 2038277 1891640 1713317
39730A713317o2763l7538p4757K5122K13634J99710j05540l90210l11476M0217
$$ 1713317 1650554 1613016 1538259 1563381 1777015 1976725 1871185 1480975 1169499 1209716
39720A209716K15228j0860k91418j58221K74093M14448O7822k44897r0791K07422
$$ 1209716 1424944 1414084 1122666 964445 1238538 1652986 1720808 1475911 1385120 1592542
39710A592542J52578p9763q579K11356M524n34655o22159k4470M98651L48951
$$ 1592542 1745120 1665357 1656778 1868134 1872658 1338003 715844 691374 1190025 1538976
39700A538976m5840l1117K35065J89943j36693k50422o8204K1648j15978j85720
$$ 1538976 1493136 1462019 1697084 1887027 1750334 1499912 1431708 1453356 1337378 1151658
39690A151658k1740J74873K14693J42193M0943n4322n1815Q9195J87484P8654
$$ 1151658 1129918 1304791 1519484 1661677 1702620 1648298 1596483 1685678 1873162 1951816
39680A951816o5055M483J46263M3217k07942k06102P0294K04739L5121j09077
$$ 1951816 1886761 1891244 2037507 2080724 1872782 1666680 1736974 1941713 1976834 1867757
39670A867757n796J13547L1143q6228m6415J9218m9880j26433n7976L6072L340
$$ 1867757 1861961 1975508 2006651 1920423 1874008 1893226 1843346 1716913 1658937 1695009 1698349
39659A698349o2901m2145k9505j00946r1018J15401L08446K61865R4124K5348
$$ 1698349 1635448 1593303 1563798 1462852 1371834 1487235 1795681 2057546 2151670 2177018
39649B177018l771j43400k68387j65818N6454J11025j6722r1969k6548O2219J13604
$$ 2177018 2173247 2029847 1761460 1595642 1652096 1763121 1746399 1654430 1627882 1690101 1803705
39638A803705J40580O3354j62369l22053j75126J34472K31493N4230q4544K607
$$ 1803705 1944285 2007639 1845270 1523217 1348091 1482563 1714056 1768286 1683742 1686349
39628A686349J37201R8894p7847k15321k07354p4862M7438J04j81652k25313J9959
$$ 1686349 1823550 1922444 1844597 1629276 1421922 1347060 1394498 1394602 1212950 987637 1007596
39617A007596L09636L23255J12391n4969j36688k43852k70481l7749K67079K72573
$$ 1007596 1317232 1640487 1752878 1697909 1561221 1317369 1046888 1009139 1276218 1548791
39607A548791L2838l4681J43550J73807j03590l12548j55589J35222K26173J55957
$$ 1548791 1581629 1546948 1690498 1864305 1760715 1448167 1292578 1427800 1653973 1809930
39597A809930J01433L6077p9501r3488M6559R7898p7190k05963l3110K14408J66570
$$ 1809930 1911363 1947440 1867939 1774451 1821010 1918908 1841718 1635755 1602645 1817053 1983623
39586A983623r6781j93522m6717N3848m6380j60797r8956N7663J05302l390j04404
$$ 1983623 1886842 1693320 1646603 1700451 1654071 1493274 1394318 1451981 1557283 1553893 1449489
39575A449489j5541K15278L01498P0672k33974k23996Q4029K76682J29630j43737
$$ 1449489 1433948 1649226 1950724 2021396 1787422 1563426 1647455 1924137 2053767 1910030
39565A910030k96761l30213k51858K8214L66045L73629J1742k19799j1696K49094
$$ 1910030 1613269 1283056 1031198 1059412 1425457 1799086 1810828 1591029 1579333 1828427
39555A828427J13072j83702j23979K31706L67137J30392j21292j31189o813J03808
$$ 1828427 1941499 1757797 1633818 1865524 2232661 2363053 2241761 2110572 2103759 2207567
39545B207567J66533J00894j44165l62412k91940k2032J30679R6985O4969Q5224
$$ 2207567 2374100 2474994 2330829 1968417 1676477 1654445 1785124 1882109 1947078 2032302
39535B032302L4915p1899j00628q0051j24495j45462o963J30414L9329r8334O8271
$$ 2032302 2067217 1995318 1894690 1814639 1690144 1544682 1537719 1668133 1707462 1609128 1677399
39524A677399M00272L97758P632k71222j95676j04731k27219k36080J46846N60252
$$ 1677399 2077671 2475429 2483061 2211839 2016163 1911432 1684213 1448133 1594979 2155231
39514B155231M73888k6883l65766k54238K5071Q8933p6804j90320p7711J01406
$$ 2155231 2629119 2602236 2236470 1982232 2007303 2096236 2019432 1829112 1751401 1852807
39504A852807O9145j61619k49652M437L31778L46143P0515j49824j42134k5847
$$ 1852807 1921952 1760333 1510681 1515118 1846896 2193039 2263554 2113730 1971596 1945749
39494A945749O7787J03127N4066j7401O9374K84522K52947j75085m97009k26547
$$ 1945749 2013536 2116663 2170729 2153328 2222702 2507224 2760171 2585086 2088077 1861530
39484A861530K65674K45404k33084m52902k35136j18868k61889j29574M23135
$$ 1861530 2127204 2372608 2139524 1686622 1451486 1332618 1070729 941155 1364290
39475A364290O99237K80019k30420j86999R0812j1843l41482l53220q7918J8214
$$ 1364290 2063527 2343546 2113126 1926127 2016939 2005096 1663614 1310394 1222476 1240690
39465A240690k4655J23288L85660L63756O1175j26891p9172l5806p8570m2008
$$ 1240690 1216035 1339323 1724983 2088739 2149914 2023023 1943851 1908045 1829475 1787467
39455A787467R6942J89771K12125J99660L4316k97554m40330j38428K42844K02233
$$ 1787467 1884409 2074180 2286305 2485965 2520281 2222727 1782397 1643969 1886813 2089046
39445B089046r7215j19649J28279J69989m2326o0318J86085K08063j65289m25798
$$ 2089046 1991831 1872182 2000461 2170450 2128124 2067806 2253891 2461954 2296665 1870867
39435A870867j88568K31334L63487K07063R34j79405k78473j26541K22049L76518
$$ 1870867 1682299 1913633 2277120 2484183 2485117 2305712 2027239 1900698 2122747 2499265
39425B499265J51075j18729j08709q322j31510l37791k68205M2405K08935N7979
$$ 2499265 2650340 2531611 2422902 2414580 2283070 1945279 1677074 1719479 1928414 1986393
39415A986393k00569l16008k34181k8762J78447K57061J95125J36426J70744J94441
$$ 1986393 1785824 1469816 1235635 1206873 1385320 1642381 1837506 1973932 2144676 2339117
39405B339117J08062O179L182J5047q7558k31016k51622j57715p5633k3058N9027
$$ 2339117 2447179 2453358 2456540 2471587 2384029 2153013 1901391 1743676 1668043 1644985 1704012
39394A704012J29917J15331P6269R3558N8656j65300m21052l92631q4277J37182
$$ 1704012 1833929 1949260 2025529 2119087 2177743 2012443 1591391 1198760 1114483 1251665
39384A251665O5257p3371k5212Q5726J1929j61281j38022R5526K36399J38466
$$ 1251665 1316922 1243551 1218339 1304065 1315994 1154713 1016691 1112217 1348616 1487082
39374A487082M700J0530K6219j06735k59299k13210j4036J23412J46277J45878
$$ 1487082 1491782 1502312 1528531 1421796 1162497 949287 935251 1058663 1204940 1350818
39364A350818J06497m1876j78866j11951P3993J01210n1868j18647m344Q5766
$$ 1350818 1457315 1415439 1236573 1124622 1198615 1299825 1247957 1129310 1124966 1210732
39354A210732O7955J35039L26403L43787M3373k56613k59383j39439j65561k02768
$$ 1210732 1278687 1413726 1740129 2083916 2127289 1870676 1611293 1471854 1306293 1103525
39344A103525j2271K21176J44086j55255k67242q8089J16939J91929J95009J00780
$$ 1103525 1091254 1312430 1456516 1301261 1034019 945930 1062869 1254798 1449807 1550587
39334A550587j44445l14352j21852K55529L41798Q3809p5211Q2105K39431J07700
$$ 1550587 1406142 1091790 969938 1225467 1567265 1651074 1575863 1657968 1897399 2005099
39324B005099j51841k57495j84535l6052J21709J51507p2861l41647k48065J92048
$$ 2005099 1853258 1595763 1411228 1375176 1496885 1648392 1575531 1233884 985819 1177867
39314A177867M57138K42489j36542k76024k03442j11139J1324J63089J41620p6430
$$ 1177867 1635005 1877494 1740952 1464928 1261486 1150347 1161671 1324760 1466380 1389950
39304A389950j23341K03157N06938L43701r6576l19699k74272k57559k81714j01700
$$ 1389950 1266609 1469766 1976704 2320405 2223829 1904130 1629858 1372299 1090585 988885
39294I88885K11106K79228L2455j61909o0231J57829K34837J48174M872q9424
$$ 988885 1199991 1479219 1511674 1349765 1289534 1447363 1682200 1830374 1835246 1745822
39284A745822j7969K18133L57154J56225k00183l01524j17202k5747j94525l34622
$$ 1745822 1727853 1945986 2303140 2459365 2259182 1957658 1840456 1814709 1620184 1285562
39274A285562k00803M2128J39437J08161O8757q14j15212j29934K3945J56888
$$ 1285562 1084759 1126887 1266324 1374485 1443242 1442428 1327216 1197282 1221227 1378115
39264A378115J01878n721L9476J71088J91145J11478R0540J27332Q3959l8587
$$ 1378115 1479993 1474272 1513748 1684836 1875981 1987459 2077999 2205331 2289290 2250703
39254B250703r5532n1720k0799n3333q0657o9064m5066K7274J95079L32875K27784
$$ 2250703 2155171 2103451 2082652 2029319 1948662 1879598 1834532 1861806 2056885 2389760 2617544
39243B617544r5056l35331k96856j25956o0512j07019j16383n2240n234o331P765
$$ 2617544 2522488 2187157 1890301 1764345 1703833 1596814 1480431 1428191 1422957 1416626 1424391
39232A424391O3110J13016J26721J13429P3842J5217j6750r992l7577j25227j36332
$$ 1424391 1487501 1600517 1727238 1840667 1914509 1929726 1912976 1902984 1865407 1740180 1603848
39221A603848M4117K56499K16674o3408k40360j10209J08991J11433p3580j93120
$$ 1603848 1647965 1904464 2121138 2057730 1817370 1707161 1816152 1927585 1854005 1660885
39211A660885j60787r8984p0461j2650P6182J11021J01951J51892K23730J22488
$$ 1660885 1500098 1401114 1330653 1318003 1394185 1505206 1607157 1759049 1982779 2105267
39201B105267j81307l94497k40337J51504L82435K78239O1281l845L6756m0500
$$ 2105267 1923960 1529463 1289126 1440630 1823065 2101304 2162585 2158740 2195496 2154996
39191B154996k47289l27151j25631J56337K10884K0124j63988j80165r9610j4655
$$ 2154996 1907707 1580556 1454925 1611262 1822146 1842270 1678282 1498117 1398507 1383852
39181A383852Q8841J85316J53431j1704j11448j6099J26701J10447l8939j49729
$$ 1383852 1472693 1658009 1811440 1799736 1688288 1672189 1798890 1909337 1870398 1720669
39171A720669j54428q9186K8999J50881J49829J2472o0958N3197J61326L7836
$$ 1720669 1566241 1477055 1506054 1656935 1806764 1819236 1758278 1811475 1972801 2010637
39161B010637j97578k62189j34789L590J18553K59898K70646j7059l50186k84079
$$ 2010637 1813059 1550870 1416081 1419671 1538224 1798122 2068768 2051709 1701523 1417444
39151A417444J30931L60241J67286q9859r3904j4412o9497r6261Q4928K39096
$$ 1417444 1548375 1908616 2075902 1986043 1892139 1877727 1808230 1711969 1796897 2035993
39141B035993O7645k51282k92606j7003K10867J77212N2119N2791J38691J17908
$$ 2035993 2103638 1852356 1559750 1542747 1753614 1930826 1982945 2035736 2174427 2292335
39131B292335p8180k82559k42253O8952L16077J51547k90837m92803k17615J92078
$$ 2292335 2214155 1931596 1689343 1758295 2074372 2225919 1935082 1442279 1224664 1416742
39121A416742L17709J83445O5856M4201J2196m2017l9543J4581O8807J32675J93287
$$ 1416742 1734451 1917896 1983752 2027953 2040149 1998132 1958589 1973170 2041977 2174652 2367939
39110B367939J66762O7381M0056R3825M0023j56389k56909j69732j44216k87340
$$ 2367939 2534701 2602082 2642138 2735963 2775986 2619597 2362688 2192956 2048740 1761400
39100A761400k74834Q6916L96519K39600j01721j01135J25473O8952k12481j65861
$$ 1761400 1486566 1573482 1970001 2209601 2107880 2006745 2132218 2201170 1988689 1822828
39090A822828K26292L09852j44432m77699j64365L48276L45154q6781k87921m0491
$$ 1822828 2049120 2358972 2214540 1736841 1572476 1920752 2265906 2179125 1891204 1850713
39080A850713K39382K20075M0170n8368o4769m5255M6772K36961L78053L00203
$$ 1850713 2090095 2310170 2350340 2291972 2227203 2181948 2228720 2465681 2843734 3143937
39070C143937N4949j18386q6732K498p5023k77822l14335o2818K03939J81769
$$ 3143937 3198886 3080500 2993768 2996266 2921243 2643421 2329086 2266268 2470207 2651976
39060B651976l1721j20910o3326j25293l57242m54290k26114J03321K25194J25814
$$ 2651976 2620255 2499345 2436019 2310726 1953484 1499194 1273080 1376401 1601595 1727409
39050A727409k5643j39577j77580p5105J05810J34384o4019k15084o9731J83858
$$ 1727409 1701766 1562189 1384609 1309504 1415314 1549698 1485679 1270595 1200864 1384722
39040A384722J73363q9473k22797n6993J21069K1658k03106j72747J82958N06788
$$ 1384722 1558085 1468612 1245815 1188822 1309891 1331549 1128443 955696 1138654 1645442
39030A645442M39598K6869l52726l91798j23286J74740K59357J04456j13436j71742
$$ 1645442 2085040 2111909 1759183 1367385 1244099 1418839 1678196 1782652 1669216 1497474
39020A497474q109J94728K05139M8790j6018J00306J35217j22625m24378l59156
$$ 1497474 1489365 1684093 1889232 1938022 1922004 2022310 2157527 2034902 1610524 1251368
39010A251368K7047K75774J92395P9630J66055K07348n6556l71389l03609O9714
$$ 1251368 1278415 1554189 1746584 1826214 1992269 2199617 2143061 1771672 1468063 1537777
39000A537777K51106P0951r1090O1754K78325J69694j83086l51399j74783O1567
$$ 1537777 1788883 1859834 1768744 1830498 2108823 2278517 2095431 1744032 1569249 1630816
38990A630816P4269o7117j41704j20162j23681j53416p6734J16210K26430R9343
$$ 1630816 1705085 1637968 1496264 1376102 1252421 1099005 1022271 1138481 1364911 1464254
38980A464254j43606k27709l7915K66050M28080L31060O3372j89889k91409k11242
$$ 1464254 1320648 1092939 1055024 1321074 1749154 2080214 2143586 1953697 1662288 1451046
38970A451046l562K18244L06042J83956k7160j02126m096M4641r3749k18986r9098
$$ 1451046 1447484 1665728 1971770 2155726 2128566 2026440 2022344 2066985 1973236 1754250 1655152
38959A655152J13989R3598j15194j52305M1213J11567p3555j46745J33732M06228
$$ 1655152 1769141 1862739 1747545 1595240 1636453 1748020 1674465 1527720 1661452 2067680
38949B067680K45573j50767k77906r4287J8447o7027r6678L7538J19743K5808
$$ 2067680 2313253 2162486 1884580 1790293 1808740 1741713 1645035 1682573 1802316 1828124
38939A828124q2006p0203r897M3639J36320K06004R6575j30442j96256k2879J25932
$$ 1828124 1746118 1675915 1666018 1709657 1845977 2051981 2148556 2018114 1821858 1798979 1924911
38928A924911L9052j55519k14806p4348J70658L66185L25698l968l47473l32964
$$ 1924911 1963963 1808444 1593638 1519290 1689948 2056133 2381831 2377863 2030390 1697426
38918A697426J4917K84191K37896O0154l9067j08469j92820j42546Q5153K38012
$$ 1697426 1712343 1996534 2234430 2294584 2255517 2147048 1954228 1811682 1896835 2134847
38908B134847J37399k1940K401J15107R8060o118k3785J1424m6388j55742j73428
$$ 2134847 2272246 2250306 2252707 2367814 2465874 2459756 2435971 2447395 2401007 2245265 2071837
38897B071837j28220j30684j18981J1611J22579P206j96397j27459K25016M21566
$$ 2071837 1943617 1812933 1693952 1705563 1828142 1835348 1638951 1511492 1736508 2158074
38887B158074J75619k33783l53555j49239M0929K5784m1328J2543J10896J01433
$$ 2158074 2333693 2099910 1746355 1597116 1638045 1663829 1622501 1635044 1745940 1847373
38877A847373K3054J8430P5168O2730q222J286O7663j945j91568j91175J10887
$$ 1847373 1870427 1888857 1964025 2026755 2018533 2019819 2087482 2085537 1893969 1702794 1813681
38866A813681L37014J31100k63790l24905r720K29133J42409l4880m5004M9691
$$ 1813681 2150695 2281795 2018005 1693100 1683380 1912513 2054922 2020042 1975038 2024729
38856B024729R8057J02770J01004O3450Q562o179l5622j44593j84339J0251K39613
$$ 2024729 2122786 2225556 2326560 2390010 2398572 2392393 2356771 2212178 2027839 2038090 2277703
38845B277703J56260j43501k12385J1799Q5218j85405m01573k26294J17759K90202
$$ 2277703 2433963 2290462 2078077 2089876 2175094 1989689 1588116 1361822 1479581 1769783
38835A769783L11806K91192J24736j79482l04317j24546M882j53503k67860k8923
$$ 1769783 2081589 2372781 2497517 2318035 2013718 1889172 1894054 1740551 1472691 1443768
38825A443768K43968J30512j41498r4640J49519R5494k32353l05988L8099L61662
$$ 1443768 1687736 1818248 1676750 1582110 1731629 1827123 1594770 1288782 1326881 1688543
38815A688543L05729Q788k20615k47276r0986J06071J21113n8948j22175R1991
$$ 1688543 1994272 2003060 1782445 1535169 1444183 1550254 1671367 1612419 1490244 1582235
38805A582235K44587L4276k08112j8385L60144L21975o4595j45330J98486L27938
$$ 1582235 1826822 1861098 1652986 1634601 1994745 2316720 2252125 2106795 2305281 2633219
38795B633219q0569m96595l90183M758J70225N3596n6536l2920N5243J27171P2526
$$ 2633219 2552650 2056055 1665872 1670630 1840855 1894451 1837915 1804995 1860238 1987409 2059935
38784B059935j68005l55483j48891L08817M40054O2810l07625k49432k0635N880
$$ 2059935 1891930 1536447 1387556 1696373 2136427 2199237 1891612 1642180 1621545 1627425
38774A627425j0327K03004L76156Q0932m63791n95087j51529L30153L96706J89010
$$ 1627425 1617098 1820102 2196258 2277190 1813399 1218312 1066783 1396936 1793642 1982652
38764A982652O7098J10515J65843J35322M2305n6041j08462r4593n0283j0901
$$ 1982652 2049750 2160265 2326108 2461430 2503735 2447694 2339232 2244639 2194356 2183455
38754B183455N1159J53394K11151J29898l4737j21586o4347M9966J25798J65533
$$ 2183455 2234614 2388008 2599159 2729057 2694320 2572734 2508387 2558353 2684151 2849684
38744B849684J96225J70195L0073j35626j22661J05390K62448P5874k53050k31735
$$ 2849684 3045909 3216104 3246177 3110551 2987890 3093280 3355728 3431602 3178552 2946817
38734B946817J87242M19409O3116m42691m05270J17520M34895K40870o3469r4362
$$ 2946817 3134059 3553468 3616584 3173893 2768623 2886143 3321038 3561908 3498439 3404077
38724C404077L9765J31421K12071K72366J21774j95594k77239K7370K76128O6941
$$ 3404077 3443842 3575263 3787334 4059700 4181474 3985880 3708641 3736011 4012139 4079080
38714D079080l33936m00151j02390J65310K00935J11249k6380j95537k38792l5003
$$ 4079080 3745144 3344993 3242603 3407913 3608848 3720097 3693717 3498180 3259388 3224385
38704C224385J75464L4100l76453n85569l82338o8493J7781p4214r8171P250J01936
$$ 3224385 3399849 3433949 3057496 2471927 2089589 2021096 2038877 1964663 1866492 1873742 1975678
38693A975678Q7627K0773R679O4823O7492p7763k54847k13807Q6456L44901K75483
$$ 1975678 2063305 2084078 2093757 2158580 2226072 2148309 1893462 1679655 1766111 2111012 2386495
38682B386495p024j51997o1780J7718q6280k02412r3030J50810J98528m9485k77572
$$ 2386495 2379471 2227474 2165694 2183412 2097132 1894720 1801690 1952500 2151028 2101543 1823971
38671A823971j59983J73372K89790N5033j86059j37225K3718p252j32432n3548
$$ 1823971 1663988 1837360 2127150 2182183 1996124 1858899 1882617 1875365 1742933 1689385
38661A689385J42912P6622k46086l41349L291L40127K06485j93761l17655o5054
$$ 1689385 1832297 1908919 1662833 1321484 1324775 1664902 1871387 1677626 1359971 1294917
38651A294917J61671R7398n2117J5457K40501K86289K0924k45896j28901K82818
$$ 1294917 1456588 1553986 1501869 1517326 1757827 2044116 2065040 1819144 1690243 1973061
38641A973061M76931K11557j26768j02669J19101J05822r7978j02806P2418J8122
$$ 1973061 2449992 2661549 2534781 2432112 2551213 2657035 2559057 2456251 2528669 2546791
38631B546791k79445l41683l2028J79125L2723q6782J11899K76233N2143k61094
$$ 2546791 2267346 1925663 1893635 2072760 2105483 2018701 2130600 2406833 2458976 2197882
38621B197882k18595M6135J29918K2609m3984p1997j34652o7055J99178L28127
$$ 2197882 1979287 2025422 2155340 2177949 2133965 2061968 1927316 1860261 2059439 2387566
38611B387566R4052j50491l6616J68443N2329j69052l4915L06220L30351N641
$$ 2387566 2481618 2331127 2294511 2462954 2515283 2346231 2311316 2617536 2947887 2953528
38601B953528k53538l07391l10494k21527L8584J71091n6055k16614J40355N60896
$$ 2953528 2699990 2392599 2082105 1860578 1899162 2070253 2014198 1797584 1937939 2498835
38591B498835L11280l20355m15740K9640J52343j88342j77470L72547N57999j1349
$$ 2498835 2810115 2489760 2074020 2103660 2256003 2067661 1890191 2262738 2820737 2809388
38581B809388m30441l1976M58885J90510l91161m04087r720O6966j10180N1689
$$ 2809388 2378947 2346971 2805856 2996366 2605205 2201118 2191398 2258364 2148184 2199873
38571B199873M56416M54712o811l49436l59148l37167l35220r3090K65627K74991
$$ 2199873 2656289 3111001 3104190 2754754 2395606 2058439 1723219 1630129 1895756 2170747
38561B170747p0609k69592j50643q2645k34980k78753j5185K65882K84991J64897
$$ 2170747 2100138 1830546 1679903 1597258 1362278 1083525 1068340 1334222 1619213 1784110
38551A784110J03468M8529q5625j88618j32706K9561J49866J13581r1943k70435
$$ 1784110 1887578 1936107 1850482 1661864 1529158 1558719 1708585 1822166 1730223 1459788
38541A459788j15263L43016N96983L13000j20642j52819O9096P4l16586l06088
$$ 1459788 1344525 1687541 2284524 2597524 2476882 2324063 2393159 2393233 2076647 1770559
38531A770559J07518L16626M0623k29005r2660J29180L2604j96644k17243j43608
$$ 1770559 1878077 2194703 2235326 2006321 1913661 2042841 2075445 1878801 1661558 1517950
38521A517950k12333k45117J2944L28469L00103K5637p7329L5770M2026j27136
$$ 1517950 1305617 1060500 1073444 1401913 1702016 1727653 1650324 1686094 1728120 1600984
38511A600984j73164L5510K44307K14964K3727j26115j39870k6738J29505J72710
$$ 1600984 1427820 1463330 1707637 1922601 1946328 1820213 1680343 1653605 1783110 1955820
38501A955820L4387j24670j18787k3786l3344j03199k6534J72294K44619J36343
$$ 1955820 1990207 1865537 1746750 1722964 1689620 1586421 1559887 1732181 1976800 2113143
38491B113143O4317J05700N8143j52998k66667j02035J12363J02051n313O9464
$$ 2113143 2177460 2283160 2341303 2188305 1921638 1819603 1931966 2034017 2028704 2098168
38481B098168K37477J69847j24333k65317r8798O5394l6853k18378j88676l3123
$$ 2098168 2335645 2505492 2381159 2115842 2017044 2082438 2045585 1827207 1638531 1605408
38471A605408j9194r8794J2942L03792L95621J06336k38758k44897L0889K23569
$$ 1605408 1586214 1487420 1500362 1804154 2199775 2306111 2067353 1822456 1853345 2076914
38461B076914J75598N3013M031m0077j67466k79837k13743P559J65377J03402
$$ 2076914 2252512 2305525 2309556 2269479 2102013 1822176 1608433 1615992 1781369 1884771
38451A884771p5209j28021K6060K09724K25672R5387k9192q9213r9912m605K13897
$$ 1884771 1809562 1681541 1707601 1917325 2142997 2238384 2209192 2119979 2020067 2015462 2229359
38440B229359L25517P3498l56406m44806o1601K84277J66201j42535j42082J00887
$$ 2229359 2554876 2628374 2271968 1827162 1765561 2049838 2216039 2073504 1931422 2032309
38430B032309J29278j02069j62921J09028L35520K09495o8107j74756j28792j19258
$$ 2032309 2161587 2059518 1896597 2005625 2341145 2550640 2482533 2307777 2178985 2059727
38420B059727j50175j09030k205Q7245J34115J19774M533j34920j25898L1717
$$ 2059727 1909552 1800522 1798317 1885562 2019677 2139451 2143984 2009064 1883166 1914883
38410A914883J23468N9029J5130J01961J49799K0254j20471p2816O8910J06226
$$ 1914883 2038351 2097380 2112510 2214471 2364270 2384524 2264053 2191237 2260147 2366373
38400B366373N6262K7279l6863k07203l24558k00212N4792J79262J41337J06496
$$ 2366373 2422635 2449914 2413051 2205848 1881290 1681078 1735870 1915132 2056469 2162965
38390B162965J22665R4428q670j41059k76439l20965j03872L14823N44423L60306
$$ 2162965 2285630 2380058 2371388 2230329 1953890 1632925 1529053 1843876 2388299 2748605
38380B748605O3700L953J9780j89686m12295k42608J27448J35456j91624k54424
$$ 2748605 2812305 2816258 2836038 2646352 2234057 1991449 2118897 2254353 2062729 1808305
38370A808305P4123K07071j30885m07395j90264J48371J31946k4871Q9971K96101
$$ 1808305 1882428 2089499 1958614 1551219 1360955 1509326 1641272 1616401 1706372 2002473
38360B002473J84121r6798r2491J53378J98189m7046k64282l20719l41367k75236
$$ 2002473 2186594 2089796 1997305 2150683 2348872 2301826 2037544 1716825 1375458 1100222
38350A100222K5605L30538K32212j40798k02006J92739M90938K84349j14086k12965
$$ 1100222 1125827 1456365 1688577 1547779 1345773 1538512 2029450 2313799 2199713 1986748
38340A986748l3430P7260J5548l4364M9311J98400K80146J92493o4281l21603
$$ 1986748 1953318 2030578 2046126 2011762 2061073 2259473 2539619 2732112 2667831 2346228
38330B346228l75075k32409p7763J8822J43008K71692K34202J4253j59048j24227
$$ 2346228 1971153 1738744 1660981 1679803 1822811 2094503 2328705 2342958 2183910 2059683
38320B059683K0824J19929J39620Q5240l8065j16450r845J97515K62888J41622
$$ 2059683 2080507 2200436 2340056 2425296 2387231 2270781 2260936 2458451 2721339 2862961
38310B862961K1900j8556q4248j57170p6758J03003J18005m0169p2208P8746Q2253
$$ 2862961 2884861 2866305 2782057 2624887 2548129 2651132 2769137 2728968 2656760 2735506 2817759
38299B817759j65807k74856k2185J92559p857k86652r0669M31929N98247J71922
$$ 2817759 2651952 2377096 2354911 2547470 2539613 2252961 2162292 2594221 3192468 3364390
38289C364390l51267m56349j85462P6428Q9143o6265j41452j6902J24471M0942
$$ 3364390 3013123 2556774 2371312 2447740 2536883 2470618 2329166 2312264 2436735 2477677
38279B477677j46420p2016K49064L32626q214k67732l045M37876M44494N3062
$$ 2477677 2331257 2259241 2508305 2840931 2832717 2564985 2561940 2999816 3444310 3497372
38269C497372k37773k79754k86794k48213N548K74938J99366o4910m0565K26022
$$ 3497372 3259599 2979845 2693051 2444838 2450386 2725324 2924690 2859780 2819215 3045237
38259C045237K26816o3429p9081L16435M74745j2013n96722n77330j09117J20041
$$ 3045237 3272053 3208624 3129543 3445978 3920723 3908710 3311988 2734658 2625541 2745582
38249B745582j02613l54756k72716K4302J90644Q1443j06612o6758K04782L23374
$$ 2745582 2642969 2288213 2015497 2039799 2230443 2311886 2205274 2138516 2343298 2666672
38239B666672L8343l10059k22629J78238K96725j8907k76434j62586K3745j7072
$$ 2666672 2705015 2394956 2172327 2350565 2647290 2628383 2351949 2189363 2213108 2196036
38229B196036r8842R477J38793P4044m5211k2938M0530L90n7397n7470j04897
$$ 2196036 2097194 2106671 2245464 2319508 2274297 2251359 2291889 2292279 2234882 2177412 2072515
38218B072515j79940n7286K35282L22514J00596m5998O7882R3365j34429j77729
$$ 2072515 1892575 1835289 2070571 2393085 2493681 2447683 2515565 2608930 2474501 2296772
38208B296772J98350M34477N3544m28464k52931L50219N29649J20984k59800k56374
$$ 2296772 2495122 2929599 2983143 2554679 2301748 2651967 3181616 3302600 3042800 2786426
38198B786426r6156K4600J20566N0640l05560n69440k80110K76066L95522O1242
$$ 2786426 2690270 2714870 2835436 2886076 2580516 2011076 1730966 2007032 2402554 2463796
38188B463796q2201J50270K49658l236j94239j24952j57254m06316l97829P0474
$$ 2463796 2381595 2531865 2781523 2778287 2584048 2459096 2301842 1895526 1497697 1568171
38178A568171M56681L21621J847m0021N6874j6767j17174m800J21732l574j78006
$$ 1568171 2024852 2346473 2348320 2308299 2365173 2348406 2231232 2226432 2348164 2344590 2166584
38167B166584q5613J28344J30677l3613j13325j28170k24777k94000j65188K9338
$$ 2166584 2080971 2209315 2339992 2306379 2193054 2064884 1840107 1546107 1380919 1410257
38157A410257Q0120P0476J43734J51248o2363k68870j83671L9822Q4287K2451
$$ 1410257 1490377 1560853 1704587 1855835 1793472 1524602 1340931 1380753 1465040 1487491
38147A487491J24921K98486K22825o6654k24932j59096q2471n9741M1347J62907
$$ 1487491 1612412 1910898 2133723 2067069 1842137 1683041 1600570 1540829 1582176 1745083
38137A745083Q0468j48911j84686O9538L00099K42649N001j57877j40667M778
$$ 1745083 1825551 1676640 1491954 1561492 1861591 2104240 2109241 1951364 1810697 1815475
38127A815475J49525J50720J3432n2051P3598J69467j7718l19881l27325K1124
$$ 1815475 1965000 2115720 2129152 2077101 2150699 2320166 2302448 1982567 1655242 1676366
38117A676366L53303L72244J57550n8765j56451j39319q7013r2277j07347L7673
$$ 1676366 2029669 2401913 2559463 2500698 2344247 2204928 2117915 2025638 1918291 1955964
38107A955964L08060L74082R4718j74281j05363N2277q5971l22378k04223J20387
$$ 1955964 2264024 2638106 2732824 2558543 2453180 2505457 2419486 2097108 1892885 2013272
38097B013272Q5597l10273m62275j68771Q0131K828n3972J08978J11698k21386
$$ 2013272 2098869 1788596 1326321 1157550 1237681 1240509 1186537 1295515 1407213 1185827
38087A185827l57298Q2248N55794L91658j23006k07286J66534K96357q9993m62534
$$ 1185827 828529 910777 1466571 1858229 1735223 1527937 1694471 1990828 1900835 1438301
38077A438301l53569L2278K47358J72484k5507j63428j20111R3561K56493J58704
$$ 1438301 1084732 1117010 1364368 1536852 1511345 1347917 1227806 1321367 1577860 1736564
38067A736564p4951j32066J8297R8956n424p3478N8097K15520J69202j4302q8182
$$ 1736564 1661613 1529547 1547844 1646800 1641376 1567898 1625995 1841515 2010717 1996415 1908233
38056A908233J6817J11368R365k14701k81924n5597K26536K22737j9728j05302
$$ 1908233 1925050 2036418 2045783 1831082 1549158 1493561 1720097 1942834 1923106 1817804
38046A817804R1248J94964m0349k36168N1071N41981N67921R0480k18198J9022
$$ 1817804 1909052 2104016 2063667 1827499 1878570 2420551 2988472 3078952 2860754 2879776
38036B879776L76608L37854J7157j54902r7987n1701r9517q6085P4143K70102
$$ 2879776 3256384 3594238 3611395 3456493 3358506 3306805 3207288 3121203 3195346 3465448
38026C465448L46647K30484l7253k86391l23128j43974M6972R6564N8601L9351
$$ 3465448 3812095 4042579 4005326 3718935 3395807 3251833 3298805 3395369 3453970 3493321
38016C493321L6904N742n5841j37892k05582j46843Q7630L04868K69961P7060
$$ 3493321 3530225 3535967 3480126 3342234 3136652 2989809 3077439 3382307 3652268 3729328
38006C729328J8261P8990m0051l24625l47576K8109L32141K03930k1959J15645
$$ 3729328 3747589 3826579 3786528 3461903 3114327 3142436 3474577 3678507 3656548 3772193
37996C772193M40973M80730K67798K01653K94952K03183n9726p8521K41756N08832
$$ 3772193 4213166 4693896 4961694 5163347 5458299 5661482 5601756 5523235 5764991 6273823
37986F273823N13078M93723N66462M65081J38421O7003N72743J229587J428472
$$ 6273823 6786901 7280624 7847086 8312167 8450588 8517591 9090334 10319921 11748393
37977A1748393J228633J160352J386400J578548J559461J561206J749966J886902
$$ 11748393 12977026 14137378 15523778 17102326 18661787 20222993 21972959 23859861
37969B3859861J653751J083607M91531J04280j16991l72352q35672j508764k180672
$$ 23859861 25513612 26597219 27088750 27193030 27076039 26703687 25868015 24359251 22178579
37960B2178579k560692k515766k185094j840098j628295j469725j216916q85427
$$ 22178579 19617887 17102121 14917027 13076929 11448634 9978909 8761993 7876566
37952G876566o50372n98315n95980m96300l67494l59347m17204l45704j49089
$$ 7876566 7226194 6627879 6031899 5535599 5168105 4808758 4391554 4045850 3896761
37943C896761p2760k38891m46454m44254k42063l1600P0549P9224M0302j1368
$$ 3896761 3824001 3585110 3138656 2694402 2452339 2420739 2491288 2570512 2610814 2599446
37933B599446n0798q3006j10539q0267L3122J14438M6133n7122J8402K00739J71548
$$ 2599446 2548648 2465642 2355103 2274836 2307958 2422396 2468529 2411407 2429809 2630548 2802096
37922B802096j16118k74469k9995L37282L66242L3577k68298k46166L0276K75493
$$ 2802096 2685978 2411509 2381514 2718796 3085038 3118615 2850317 2604151 2634427 2909920
37912B909920K20561j66651n37616m35504J03245M67205K39900k27117l52584
$$ 2909920 3130481 2963830 2426214 1990710 2093955 2561160 2801060 2573943 2221359
37903B221359j52219n3556j01779M8237L99132M97346J66456k02838k91525k73241
$$ 2221359 2069140 2015584 1913805 1962042 2361174 2858520 3024976 2822138 2530613 2257372
37893B257372l36241k69700R3412M07255K53959j76136l10177m51L14749K60983
$$ 2257372 1921131 1651431 1744843 2152098 2406057 2229921 1919744 1919293 2234042 2495025
37883B495025k0614j64211o1569R3995J15027L2647P668R0668J40281L2389j22039
$$ 2495025 2474411 2310200 2248631 2342626 2457653 2490300 2497968 2588636 2728917 2761306 2639267
37872B639267j15659K9686Q6191l720k5677J24266K10693J1280k98495l56472
$$ 2639267 2523608 2553294 2639485 2635765 2610088 2734354 2945047 2956327 2657832 2301360
37862B301360r1799K33979L83335L34718J79754K3437m3003j8493l810l8744l2019
$$ 2301360 2209561 2443540 2826875 3161593 3341347 3364784 3321781 3303288 3299478 3260734 3228715
37851C228715L7511K2679j13970j28523J26536L37838J14393l70499n45029k36236
$$ 3228715 3266226 3288905 3174935 3046412 3172948 3510786 3625179 3254680 2709651 2473415
37841B473415J34447K20025J64267J89217K05190J00327L9070J33077J36440j35068
$$ 2473415 2607862 2827887 2992154 3181371 3386561 3486888 3525958 3659035 3795475 3660407
37831C660407l54777j29544K98473L40189k4854k09467M2801K81617J31213j19536
$$ 3660407 3305630 3176086 3474559 3814748 3789894 3580427 3623228 3904845 4036058 3916522
37821C916522q6480L0447j41981l97209k24354L11694N90328L48696j643q6529
$$ 3916522 3830042 3860489 3718508 3321299 3096945 3408639 3998967 4347663 4346020 4259491
37811D259491n0586j05891j04162J02308K81349K02189P6127J87895L53302K28776
$$ 4259491 4208905 4103014 3998852 4101160 4382509 4584698 4660825 4848720 5202022 5430798
37801E430798l0968L1090L99350N66714L26144M0646p89K8931l2588J8675L03939
$$ 5430798 5399830 5430920 5830270 6396984 6723128 6763774 6762985 6791916 6759328 6778003 7081942
37790G081942M87538K72977o0219q0197R8386O1801j34108m2983L51118N15379
$$ 7081942 7569480 7842457 7782238 7702041 7800427 7862228 7728120 7685137 8036255 8551634
37780H551634K20197o4535P4710L27432J76525k66985m57694k49790l348Q2374
$$ 8551634 8771831 8707296 8782006 9109438 9285963 9018978 8561284 8311494 8308146 8390520
37770H390520J97596M03485M14354J35392l7017J87528M55097K84971j23089j49296
$$ 8390520 8588116 8991601 9405955 9541347 9504330 9691858 10146955 10431926 10308837 10159541
37760A0159541K75316N59474L95927K20619M57924Q25262Q24526N52600M94772
$$ 10159541 10434857 10994331 11390258 11610877 12068801 12894063 13718589 14271189 14765961
37751A4765961P24470Q69962Q18645R03159J292850J676251J748857J655613J723064
$$ 14765961 15490431 16360393 17179038 18082197 19375047 21051298 22800155 24455768 26178832
37742B6178832K029007K455725K935588L424630L833065M204949M800747N785690
$$ 26178832 28207839 30663564 33599152 37023782 40856847 45061796 49862543 55648233
37734E5648233O981789Q137766R298155J0672786J2272104J3937405J5636358
$$ 55648233 62630022 70767788 80065943 90738729 103010833 116948238 132584596
37727A32584596J7420627J9093496K0196941K0389581J9630492J7948595J5271023
$$ 132584596 150005223 169098719 189295660 209685241 229315733 247264328 262535351
37720B62535351J1620429P337197K953452j115819m710633p857512j0661593j3212064
$$ 262535351 274155780 281492977 284446429 283330610 278619977 270762465 260100872 246888808
37712B46888808j5485391j7310920j8450419j8726708j8119835j6810169j5138952
$$ 246888808 231403417 214092497 195642078 176915370 158795535 141985366 126846414
37705A26846414j3455883j1944539j0594753r344406q211588p264776o493829
$$ 126846414 113390531 101445992 90851239 81506833 73295245 66030469 59536640
37698E9536640n766804m951881m079442l343165k904517k713446k565954k329267
$$ 59536640 53769836 48817955 44738513 41395348 38490831 35777385 33211431 30882164
37690C0882164k053164j853104j748784j653463j481100j227989r70465q01772
$$ 30882164 28829000 26975896 25227112 23573649 22092549 20864560 19894095 19092323
37682A9092323p50020p47574o99456n78215m29060l02136k20544j95090k19125
$$ 19092323 18342303 17594729 16895273 16317058 15887998 15585862 15365318 15170228 14951103
37673A4951103k58912k84951k82782k06124j449K51737L37524J81698M1611K24702
$$ 14951103 14692191 14407240 14124458 13918334 13916885 14168622 14506146 14687844 14729455 14954157
37663A4954157O67917J017927J114306J145807J298218J515435J698105J870130
$$ 14954157 15622074 16640001 17754307 18900114 20198332 21713767 23411872 25282002
37655B5282002J996158J881250J463669J007063P53298N34024M119q23856j559771
$$ 25282002 27278160 29159410 30623079 31630142 32383440 32917464 32921583 32097727 30537956
37646C0537956j929579k029923k066257k079177k010530j846601j590634j243840
$$ 30537956 28608377 26578454 24512197 22433020 20422490 18575889 16985255 15741415
37638A5741415r18579q23065r84512j103767q89825m93238l64602o30532q66622
$$ 15741415 14822836 13999771 13015259 11911492 11021667 10528429 10163827 9533295 8666673
37629H666673o71482k51285j21502l38375m40282k03134n685k06205n42268n29503
$$ 8666673 7995191 7743906 7622404 7284029 6843747 6640613 6634928 6428723 5886455 5356952
37619E356952j89099O1213P2125N1477P6312K255j40509j30591J0494J3942j33880
$$ 5356952 5167853 5229066 5301191 5352668 5428980 5431235 5290726 5160135 5170629 5184571 5050691
37608E050691j43611K2366L8953j80269k82125j01713K6782j10844j97877R652
$$ 5050691 4907080 4929446 4968399 4788130 4506005 4404292 4431074 4320230 4122353 4132005
37598D132005J64949p8453l82316k26426K14157L29630K4016k22545j49568J5843
$$ 4132005 4296954 4218501 3836185 3609759 3823916 4153546 4177562 3955017 3805449 3821292
37588C821292O9631P0223M1116p9096j53809K1622K68525J75778k23224m00942
$$ 3821292 3890923 3961146 4002262 3923166 3769357 3790979 4059504 4235282 4012058 3611116
37578C611116j03921K71884K73590j8967k27149j92540k5963J30829J75981M7147
$$ 3611116 3507195 3779079 4052669 4033702 3806553 3614013 3588050 3718879 3894860 3942007
37568C942007j76213k91241k03201k8128Q8395J20160R4413K5718m8800r0818
$$ 3942007 3765794 3474553 3271352 3243224 3331619 3451779 3546192 3571910 3523110 3432292
37558C432292j15657j16966r710J95673K70956M6940k74545l39343j10967J26187
$$ 3432292 3316635 3199669 3189959 3385632 3656588 3703528 3428983 3089640 2978673 3104860
37548C104860J67677M3169j46608k81360k08185M0553J40343j01204l68721k60387
$$ 3104860 3272537 3315706 3169098 2887738 2679553 2720106 2860449 2759245 2390524 2130137
37538B130137Q6635K41811J85024K19152L04164J23054k16401k45577K5026N6201
$$ 2130137 2216772 2458583 2643607 2862759 3166923 3289977 3073576 2827999 2853025 2909226
37528B909226k54761l13391J51936N38732L05132j74694k53701r99P3241r3602
$$ 2909226 2654465 2341074 2493010 3031742 3336874 3162180 2908479 2907480 2980721 2887119
37518B887119j43285J0278R8212L480j17665j54434j22472j7707J18841J28371
$$ 2887119 2743834 2754112 2852324 2855804 2738139 2583705 2461233 2443526 2562367 2690738
37508B690738j4295p0413Q1373J80938M889k19785j72607M4135J27994P5834N4056
$$ 2690738 2676443 2606030 2687403 2868341 2873230 2653445 2480838 2524973 2652967 2728801 2782857
37497B782857k199k13137l67058j80912J82211L08053J38595m2200j10835j47260
$$ 2782857 2780658 2567521 2200463 2019551 2201762 2509815 2648410 2606210 2495375 2348115
37487B348115r5940J26582K70532K5162l73604l51391J38975M90763L04692j14903
$$ 2348115 2252175 2378757 2649289 2674451 2300847 1949456 2088431 2579194 2883886 2768983
37477B768983l00469k09303m7114J05373K23620K00455L3762q0857n8898j00209
$$ 2768983 2468514 2259211 2212097 2317470 2541090 2741545 2775307 2694450 2635552 2535343
37467B535343l34116n05725k85564K29749N82120M89612J33640j08176q8189K0985
$$ 2535343 2201227 1695502 1409938 1639687 2221807 2711419 2845059 2736883 2648694 2669679
37457B669679K1848l3390K6554J45155O2278k35706l69237r0340K88027L05036
$$ 2669679 2691527 2658137 2684691 2829846 2892124 2656418 2287181 2196841 2484868 2789904
37447B789904J2460j58083o6203L5569K8007P4976J82035Q3762k46364l99920
$$ 2789904 2802364 2644281 2578078 2613647 2641654 2716630 2898665 2982427 2736063 2336143
37437B336143j22009K41785K14703j31466l12800j17206J80970K60267J25190
$$ 2336143 2214134 2455919 2670622 2539156 2226356 2109150 2290120 2550387 2675577
37428B675577j4759m4451j5742m173J463M0470O1444l8496k21100k75887r6040
$$ 2675577 2660818 2616367 2600625 2596452 2597915 2638385 2699829 2661333 2440233 2164346 2068306
37417B068306J25295J47805M1630N9861K05665K18589K6731r2366O3750K91870
$$ 2068306 2193601 2341406 2383036 2442897 2648562 2867151 2893882 2801516 2865266 3157136
37407C157136K75108L2262j38856p3924R1453J32178k8699k77350m11534l08515
$$ 3157136 3432244 3464506 3325650 3251726 3343179 3475357 3446658 3169308 2757774 2449259
37397B449259n8727J02117M7642j03594j63831j18660j00697j63481k02525j23896
$$ 2449259 2390532 2492649 2540291 2436697 2272866 2154206 2053509 1890028 1687503 1563607
37387A563607O825N9196L3384N4460J52995J65603m5992l46391m41500k33798
$$ 1563607 1570432 1629628 1663012 1717472 1870467 2036070 1990078 1643687 1202187 968389
37377I68389P5900K55489K66395J88904P8802k9744j03378j55138k02222j65862
$$ 968389 1044289 1299778 1566173 1755077 1833879 1804135 1700757 1545619 1343397 1177535
37367A177535J8911J81677N0330l13183m77410j93300K59159M54899L27047R0962
$$ 1177535 1196446 1378123 1428453 1115270 637860 444560 703719 1158618 1485665 1576627
37357A576627j01984j97565j31595N3533J50853P0991p88O4810R6694m2009j54054
$$ 1576627 1474643 1277078 1145483 1199016 1349869 1420860 1420072 1484882 1581576 1539567 1385513
37346A385513n8950L8848q6373k20310n9296K13792K07768q128m8161J20221K04917
$$ 1385513 1326563 1365411 1279038 1058728 999432 1213224 1420992 1412864 1364703 1484924 1689841
37335A689841J67943J86200J37258k11184n43580k78653M11199O45324J24154
$$ 1689841 1857784 2043984 2181242 1970058 1426478 1147825 1559024 2204348 2328502
37326B328502l86806k20553K48089L12889m670j96628j32291o3398m3027P9249
$$ 2328502 1941696 1721143 1969232 2282121 2277451 2080823 1948532 1885134 1842107 1921356
37316A921356K28157J69648n2491j44161k597J65505J44353p8454l43059m22094
$$ 1921356 2149513 2319161 2266670 2122509 2119912 2285417 2429770 2351316 2008257 1586163
37306A586163k04818J23474K48942J39014M4427M6108m0593k01271j13940K59922
$$ 1586163 1381345 1504819 1753761 1892775 1937202 1983310 1942717 1741446 1627506 1887428
37296A887428M37931J24990k55969j78921J87571K92994N1960j43686r5411J8256
$$ 1887428 2325359 2450349 2194380 2015459 2203030 2496024 2547984 2404298 2308887 2327143
37286B327143M1895n835j16944k59297k50867j7790J60134L5751j45013p699K90934
$$ 2327143 2369038 2363203 2246259 1986962 1736095 1718305 1878439 1914190 1769177 1761478 2052412
37275B052412K89215R35j16797L2782L6231k55507m08254j22653K44433K35048
$$ 2052412 2341627 2342562 2225765 2258547 2294778 2039271 1631017 1508364 1752797 1987845
37265A987845k6734j09214M1377J08645l8831j86849j54686l2459J9218J650K0284
$$ 1987845 1961111 1851897 1893274 2001919 1963088 1776239 1621553 1589094 1608312 1609962 1630246
37254A630246J07990J94264K12149J72161J20344O2128k7026j25768j66848j29404
$$ 1630246 1738236 1932500 2144649 2316810 2437154 2499282 2472256 2346488 2179640 2050236
37244B050236o7214k5043L462K3092K9878N7709J17499J03723o9769k46478j69748
$$ 2050236 1983022 1957979 1961441 1984533 2014411 2072120 2189619 2293342 2223573 1977095 1807347
37233A807347J17288K84246J99756R6340J28324J20550l7858j19446K7545J41952
$$ 1807347 1924635 2208881 2408637 2504977 2633301 2753851 2715993 2596547 2624092 2766044
37223B766044p141j64908j3778K37170J91418l9728m6237J39632J23328j08798
$$ 2766044 2758903 2593995 2580217 2817387 3008805 2969077 2922840 3062472 3185800 3077002
37213C077002j62147L8011J23369k5369q5142O0098R2229j00813j66285L8070
$$ 3077002 2914855 2952866 3076235 3050866 2965724 3025822 3118051 3017238 2850953 2889023
37203B889023J07876j79868l68556n3772L71841L03239j13399k55189k5853R4540
$$ 2889023 2996899 2817031 2448475 2394703 2766544 3069783 2956384 2701195 2675342 2769882
37193B769882q8977k39273j53384p7397j88844k61469q0934J90461L11008L13131
$$ 2769882 2680905 2441632 2288248 2210851 2022007 1760538 1679604 1870065 2181073 2494204
37183B494204L15072K41379j557k64404l32612k31845j26287m2053O2346O9954
$$ 2494204 2809276 3050655 3049098 2784694 2452082 2220237 2093950 2051897 2114243 2184197
37173B184197j44920l90187l15701N3723K74843J09064j24467n0049J86203J85887
$$ 2184197 2039277 1649090 1333389 1387112 1661955 1771019 1646552 1596503 1782706 1968593
37163A968593l5224q8279J17757K13857l867k22368j28903Q7800R0783l9500l639
$$ 1968593 1933369 1845090 1962847 2176704 2172837 1950469 1821566 1909366 2000149 1960649 1957010
37152A957010J47554J07388j05590j45869M6209J04541j39605l22211r3278L31047
$$ 1957010 2104564 2211952 2106362 1960493 2006702 2111243 1971638 1649427 1556149 1887196
37142A887196M79369K64960j0434j47156k02031k02596m3812K48510L98296J85798
$$ 1887196 2366565 2631525 2621091 2473935 2271904 2069308 2025496 2274006 2672302 2858100
37132B858100k33315m62061l06054J3998J39301O580j02150L3977K55771K46064
$$ 2858100 2624785 2162724 1856670 1870668 2009969 2016549 1914399 1948376 2204147 2450211
37122B450211j7975k37690k08257m3542O9050J24556J92041K29823J72197P7406
$$ 2450211 2432236 2194546 1986289 1942747 2011797 2136353 2328394 2558217 2730414 2807820
37112B807820K6435k9891j59492k67194k07138l2153N2466k4017j22911j15435
$$ 2807820 2834255 2804364 2644872 2377678 2170540 2138387 2190853 2166836 2043925 1928490
37102A928490j9465J00676K09000K33396R4002j31347k30351j43981o8965j36505
$$ 1928490 1909025 2009701 2218701 2452097 2546099 2414752 2184401 2040420 1971455 1834950
37092A834950j66268L3140K60971J53450k12642l27198K6741M16086L67380K6828
$$ 1834950 1668682 1701822 1962793 2116243 1903601 1576403 1603144 2019230 2386610 2413438
37082B413438j32337l2243J7326o5064k5191J75498J94788j10067l52314j61535
$$ 2413438 2281101 2248858 2266184 2201120 2175929 2351427 2546215 2436148 2083834 1922299
37072A922299K42668L54999O8106k64447l30742j49985O7863J29663j4208j91831
$$ 1922299 2164967 2519966 2588072 2323625 1992883 1842898 1910761 2040424 2026216 1834385
37062A834385j57192O1591J42979m1548j73961J9895K82434J94586j54313k99505
$$ 1834385 1677193 1738784 1881763 1840215 1666254 1686149 1968583 2163169 2008856 1709351
37052A709351j11353P2343K3059q5991l4954J40926K91213L17046J59211j19412
$$ 1709351 1597998 1670341 1693400 1607409 1572455 1713381 2004594 2321640 2480851 2361439
37042B361439k56482r4501Q7858p8184m19451m06770j339K29637n20k50305q3937
$$ 2361439 2104957 2010456 2098314 2020130 1600679 1193909 1192570 1422207 1421687 1171382 1087445
37031A087445K45370K56547j926j22819o540J08038J21369J52925K19304J95934
$$ 1087445 1332815 1589362 1587436 1464617 1458077 1566115 1687484 1840409 2059713 2255647
37021B255647O8802n3701j31087j68755j10628J7992Q638k21232l83292k07144
$$ 2255647 2324449 2270748 2139661 1970906 1860278 1878270 1886908 1665676 1282384 1075240
37011A075240Q5479R2139j04244o0835K53255L46611R592k76164l8592M53088
$$ 1075240 1160719 1252858 1148614 1087779 1341034 1687645 1697237 1421073 1382481 1835569
37001A835569N57517J48295k76734l04775n9774J01988N4246p4871j53412j54446
$$ 1835569 2393086 2541381 2264647 1959872 1900098 2002086 2056332 1981461 1828049 1673603
36991A673603r3195N287Q7165J09339J01412J21158J46735R1816m6217j39572
$$ 1673603 1580408 1585695 1672860 1782199 1883611 2004769 2151504 2243320 2197103 2057531
36981B057531j00414k9073q3987k33825k70435r5004J28475J79763O2443k1011
$$ 2057531 1957117 1928044 1844057 1610232 1339797 1244793 1373268 1553031 1615474 1594463
36971A594463N1065J60161J08067j04801k35915q1996K37518L83432K05405p4197
$$ 1594463 1645528 1805689 1913756 1808955 1573040 1491044 1728562 2111994 2317399 2243202
36961B243202j66086q2350n1028j45568j99532r0310P6271J24258K7566q8663
$$ 2243202 2077116 1994766 1943738 1798170 1598638 1508328 1584599 1708857 1736423 1647760
36951A647760r4114K5121J42564J15868r977j4396J72053K78410L8746l62450
$$ 1647760 1553646 1578767 1721331 1837199 1827222 1812826 1984879 2263289 2302035 1939585
36941A939585m66954j53978K09941K79278J12359m4984r5519o8642J7557J03139
$$ 1939585 1472631 1318653 1528594 1807872 1920231 1875247 1779728 1711086 1728643 1831782
36931A831782N6065j48153l32253l18955j25226J12692K78339K86624J17186r6480
$$ 1831782 1887847 1739694 1407441 1088486 963260 1075952 1354291 1640915 1758101 1661621
36921A661621j66863r3365l9536m9869p126R7209J13866K3433o906N8835N1956
$$ 1661621 1494758 1401393 1361857 1311988 1304862 1402071 1515937 1539370 1532464 1591299 1643255
36910A643255n1733m6098J00203J24458m7151r6381J35000K97772J02312j55596
$$ 1643255 1591522 1545424 1645627 1770085 1722934 1626553 1761553 2059325 2161637 2006041
36900B006041q8987J08888L6115j53696j0211L36548K70756k97906o94973m51423
$$ 2006041 1917054 2025942 2062057 1908361 1898150 2234698 2505454 2207548 1512575 1061152
36890A061152O4273K76382J84173J40937K07719J60571l6062j59658j01565j9229
$$ 1061152 1125425 1401807 1585980 1726917 1934636 2095207 2059145 1899487 1797922 1778693
36880A778693p8228k25207k79651j59817L8555J66861J85265J58181J04826l4456
$$ 1778693 1700465 1475258 1195607 1035790 1074345 1241206 1426471 1584652 1689478 1655022
36870A655022k29520k92449j05602J83259L35228K98314J71553J4091j23752j04205
$$ 1655022 1425502 1133053 1027451 1210710 1545938 1844252 2015805 2029896 1906144 1801939
36860A801939J17697L00239J68251j78701l70830k60434n1403N6621Q5855J15153
$$ 1801939 1919636 2219875 2388126 2209425 1838595 1578161 1526758 1583379 1669234 1784387
36850A784387J46928J86819K44759K31494O0421j47361j87989j01444j22641k97458
$$ 1784387 1931315 2118134 2362893 2594387 2654808 2507447 2319458 2218014 2095373 1797915
36840A797915m09435l12389q0468J80094L92408L95175J04549j98589j31634J85568
$$ 1797915 1388480 1076091 995623 1175717 1568125 1963300 2067849 1869260 1737626 1923194
36830A923194K27904j16013l16217l3646L15269K15787j37921j95908O8990J95230
$$ 1923194 2151098 2035085 1718868 1685222 2000491 2216278 2078357 1882449 1951439 2146669
36820B146669J7596j35193m9570N2839n7713k45241k57043r9415K5582R824q5612
$$ 2146669 2164265 2029072 1979502 2032341 1974628 1729387 1472344 1372929 1398511 1408335 1322723
36809A322723j57396j52558p5664L6382J53869K57701K89446J73814m3995j75197
$$ 1322723 1165327 1012769 937105 973487 1127356 1385057 1674503 1848317 1804322 1629125
36799A629125j10752J4043J0989q1647p7728M9060J31035Q3574K6438P0495J38942
$$ 1629125 1518373 1532416 1543405 1461758 1384030 1433090 1564125 1647699 1674137 1744632 1883574
36788A883574J01811o047j7720J29597K74784J99407r5802l46979l17460p9492
$$ 1883574 1985385 1979338 1961618 2091215 2365999 2565406 2469604 2122625 1805165 1725673
36778A725673J00171J12598P4494N1273m8252k18366k55494q8584J9888j46233
$$ 1725673 1825844 1938442 2012936 2064209 2015957 1797591 1542097 1453513 1473401 1327168
36768A327168l61775k55457J19917L56388K81238J24842Q1560N7649m6857j21199
$$ 1327168 965393 709936 829853 1186241 1467479 1592321 1673881 1731530 1684673 1563474
36758A563474o1179M2980Q3043Q5737O8175l1537j48760p2190J91440K87119j0132
$$ 1563474 1502295 1545275 1628318 1714055 1782230 1750693 1601933 1529743 1721183 2008302 1998170
36747A998170l98054m12011l8879L15279L63320J74839l6120j03825L1009K16390
$$ 1998170 1600116 1188105 1149226 1464505 1827825 2002664 1966544 1862719 1893728 2110118
36737B110118J44746k33530m94103k59596K04688L29628Q2939k9904J93215L70906
$$ 2110118 2254864 2021334 1527231 1267635 1472323 1801951 1884890 1854986 2048201 2419107
36727B419107K42523R8731K26074L98552K88953P159j55015j93435k22337j44138
$$ 2419107 2661630 2760361 2986435 3384987 3673940 3681099 3526084 3332649 3110312 2966174
36717B966174R3349J96233n1910l11832j45462K47354L08934J0865j38621N9789
$$ 2966174 3059523 3255756 3203846 2892014 2746552 2993906 3302840 3313705 3175084 3234873
36707C234873K45687J55168l4767j37259k10341k35243m6851K32337J89344k07974
$$ 3234873 3480560 3635728 3600961 3463702 3253361 3018118 2971267 3203604 3392948 3184974
36697C184974m09035n3031M63915N29218R4068m04036o17985m97248j70582J04564
$$ 3184974 2775939 2722908 3186823 3716041 3810109 3406073 2788088 2290840 2120258 2224822
36687B224822R3020j07074j41768N5645J26405j18039l45217k20562Q6438K33645
$$ 2224822 2317842 2210768 2069000 2124645 2251050 2133011 1787794 1567232 1653670 1887315
36677A887315K12206J88149J49789N2809K2259Q5377J5747k36599l25980q6334
$$ 1887315 2099521 2287670 2437459 2490268 2512527 2597904 2613651 2377052 2051072 1964738
36667A964738Q0620j61100m65521l52629K45J13899K5617R1170K36440J19365
$$ 1964738 2045358 1884258 1418737 1066108 1066353 1180252 1205869 1297039 1533479 1652844
36657A652844j44434j41291P5990J02762k9080O9992L17299K04590k58536m40344
$$ 1652844 1508410 1367119 1443109 1545871 1516791 1586783 1904082 2108672 1850136 1409792
36647A409792r8634K41381J58309r4141j60676j01856m0830J21039L19142K08316
$$ 1409792 1311158 1552539 1710848 1616707 1456031 1354175 1313345 1434384 1753526 1961842
36637A961842k28996m66646j83141K35243K95882P9322m3389O492P4252J02453
$$ 1961842 1732846 1266200 1083059 1318302 1614184 1693506 1650117 1656609 1730861 1833314
36627A833314R3862O728r7481p9472j8806j28126k93993j73565J55702K17445
$$ 1833314 1927176 1933904 1836423 1756951 1738145 1610019 1316026 1142461 1298163 1515608
36617A515608l5833p3029K84064M87398J96429j26484m6814J01262r3364l17197
$$ 1515608 1479775 1406746 1690810 2178208 2374637 2248153 2201339 2302601 2209237 1892040
36607A892040j23571K14142J93306l3650m6020j0970l04196o08721l15489L64207
$$ 1892040 1768469 1982611 2175917 2142267 2096247 2085277 1781081 1172360 856871 1221078
36597A221078O08894K47054p6149j7083M5968j48147k89003j39883L4736j2257
$$ 1221078 1829972 2077026 2000877 1983794 2029762 1881615 1592612 1452729 1487465 1475208
36587A475208j05720l8458Q6771J35671J60358J62063K6462j63725j50581M1923
$$ 1475208 1369488 1331030 1417801 1553472 1713830 1875893 1902355 1738630 1588049 1629972
36577A629972Q9272p3389j18105R0189K27377M8829k13780k44119q2092O8457
$$ 1629972 1719244 1645855 1527750 1617939 1845316 1894145 1680365 1436246 1354154 1422611
36567A422611J61868K06242J14321j10314k59158j77715M1949K27327K77487J20282
$$ 1422611 1584479 1790721 1905042 1794728 1535570 1357855 1399804 1627131 1904618 2024900
36557B024900j94971l46392n5854L90288L78721j48466n28969l11237J35034K50029
$$ 2024900 1829929 1483537 1427683 1817971 2196692 2048226 1519257 1208020 1343054 1593083
36547A593083O8025l8964j6669m2537n9403R6341K67804J67484r5780j40019P3241
$$ 1593083 1661108 1622144 1605475 1562938 1503535 1599876 1867680 2035164 1939384 1799365 1872606
36536A872606J87801M4774r9451n1040J2543r7714k22737j16456J24809J79615
$$ 1872606 2060407 2105181 2005730 1954690 1967233 1869519 1646782 1530326 1655135 1834750
36526A834750j4400j53513j048K62798K71910k5648k85028k19923L0943J30205
$$ 1834750 1820350 1666837 1665789 1928587 2200497 2174849 1889821 1669898 1700841 1831046
36516A831046J3773p8665r808O8061L29j19182j32763r4808j73437l50750m02524
$$ 1831046 1844819 1766154 1756346 1824407 1824736 1705554 1572791 1477983 1304546 953796 551272
36505E51272j80397K01498M76416M56862J73108j46360k40762l9707K58259L74250
$$ 551272 370875 572373 1048789 1505651 1678759 1532399 1291637 1251930 1510189 1884439
36495A884439K33725K6596l4696L5134N3603m8444j31627q6136k1058o8697j21297
$$ 1884439 2118164 2144760 2110064 2145198 2198801 2150357 2018730 1932594 1911536 1842839 1721542
36484A721542l482J57025N7200k47046l13004J4949K82062P8798l03650k99839
$$ 1721542 1718060 1875085 1932285 1685239 1372235 1387184 1669246 1748044 1444394 1144555
36474A144555O2847K29244j7321k67929j52502J53666K75963J59291J7519j1603
$$ 1144555 1207402 1436646 1419325 1151396 998894 1152560 1428523 1587814 1605333 1593730
36464A593730M3825J06822J09864K7490p5116j15912j26649j82407k25856j38947
$$ 1593730 1637555 1744377 1854241 1881731 1806615 1690703 1564054 1381647 1155791 1016844
36454A016844L3161J34598J50489J73737J54854k4521k35122j97878N2555J62271
$$ 1016844 1050005 1184603 1335092 1508829 1663683 1639162 1404040 1206162 1258717 1420988
36444A420988J3990r2496K4007J08466n5430k24557j06598J07505N0950j77145
$$ 1420988 1434978 1342482 1366489 1474955 1419525 1194968 1088370 1195875 1246825 1069680
36434A069680j55026J47616K85693M5245k01755o3213K75661L31654L3690j90556
$$ 1069680 914654 1062270 1347963 1393208 1191453 1128240 1403901 1735555 1769245 1578689
36424A578689m5479K18181J82990j32023l08418j29145J34836J39035o2002j53034
$$ 1578689 1533210 1751391 1934381 1802358 1493940 1364795 1499631 1638666 1576664 1423630
36414A423630k4883J31538J39085K4670r4394j34718o0285P5494J19906j599j42063
$$ 1423630 1398747 1530285 1669370 1694040 1599646 1464928 1404643 1480137 1600043 1598444 1456381
36403A456381j26282k0196j0696q5051p0927M4423R8495M9849K5557N7084K7795
$$ 1456381 1330099 1309903 1299207 1214156 1143229 1187652 1286147 1335996 1361553 1418637 1446432
36392A446432q7160j74223j92421j83334q3062J76669L84479K28815j82789l64580
$$ 1446432 1359272 1185049 992628 809294 726232 902901 1287380 1516195 1333406 968826
36382I68826j24395J84044K32927J54958J86909K51504J91579J14232J68964K19546
$$ 968826 844431 1028475 1261402 1416360 1603269 1854773 2046352 2160584 2329548 2549094
36372B549094P5295j28565j15801Q4562J86885P5686q6374j44569j23785j20526
$$ 2549094 2624389 2495824 2380023 2464585 2651470 2727156 2640782 2496213 2372428 2251902
36362B251902j77787k54595k34456k9646K59227L97022K90357Q0824p8496j61567
$$ 2251902 2074115 1819520 1585064 1555418 1814645 2211667 2502024 2582848 2504352 2342785
36352B342785j45662J0386J80893J28659j32844k95253k04475o6411n0351j4852
$$ 2342785 2197123 2207509 2388402 2517061 2384217 2088964 1884489 1818078 1767727 1752875
36342A752875J51543K47579J06062o9993l8967P4026M0896n1340j6061L3818q4068
$$ 1752875 1904418 2151997 2258059 2188066 2149099 2223125 2264021 2212681 2196620 2230438 2146370
36331B146370j92065j2913K78078K47184j10621l54541k69551r6206l5517K5069
$$ 2146370 1954305 1941392 2219470 2466654 2356033 2001492 1731941 1635735 1600218 1625287
36321A625287J57079J66947n8281k78765k09891Q2448K85891K26020J3616j17859
$$ 1625287 1782366 1949313 1891032 1612267 1402376 1484824 1770715 1996735 2010351 1892492
36311A892492m9396J00552R7182j05582k68248j98367m8463o3345j50647j8519
$$ 1892492 1843096 1943648 2040830 1935248 1667000 1468633 1420170 1356825 1206178 1187659
36301A187659L01280M29155J98172r7556j44031j016J10919J43793J28626r211
$$ 1187659 1488939 1918094 2116266 2018710 1874679 1873663 1984582 2128375 2257001 2247790
36291B247790k65769l70935j10547K61355K85812l3020j96469N0034L25144K05792
$$ 2247790 1982021 1611086 1500539 1761894 2047706 2014686 1818217 1868251 2193395 2399187
36281B399187j13828j53060P6473J29968q8084j70718M3239J49441j01569l12607
$$ 2399187 2285359 2132299 2208772 2338740 2250656 2079938 2123177 2272618 2171049 1858442
36271A858442j16067J44480n170l12840k36897O5322K2641k54325j18839L71204
$$ 1858442 1742375 1886855 1881685 1568845 1331948 1397270 1419911 1165586 1046747 1417951
36261A417951M02925j70702m22725J49988P10878L84382l59882n10473p2223J60562
$$ 1417951 1820876 1650174 1227449 1377437 2088315 2472697 2112815 1602342 1530119 1690681
36251A690681k2228j08631Q5264J74028P633r7263j4702o438j47841j63069K7030
$$ 1690681 1668453 1559822 1645086 1819114 1826747 1729484 1714782 1708344 1560503 1397434 1424464
36240A424464J17767n9696k57857j97496Q6897L61059M04338J46208j79078j70150
$$ 1424464 1542231 1482535 1224678 1027182 1114079 1475138 1879476 2025684 1846606 1676456
36230A676456J78029L14689r0731n48535m43863j516J09095j26387j45152J49420
$$ 1676456 1854485 2169174 2078443 1529908 1086045 1084529 1193624 1067237 922085 1071505
36220A071505K60951L0268j18893K0286J41657Q3443P2881J51038N6286j45903
$$ 1071505 1332456 1362724 1243831 1264117 1405774 1489217 1562098 1713136 1769422 1623519
36210A623519m8394K75117K09910l42636o39757k39412K87570K96784K5239O297
$$ 1623519 1575125 1850242 2060152 1717516 1077759 838347 1125917 1422701 1447940 1454237
36200A454237J45561P2430p0855P1183L09830J71694k77057n10320l40855p8672
$$ 1454237 1599798 1672228 1601373 1672556 1982386 2154080 1877023 1366703 1025848 947176
36190I47176M6596J14595J74568J20333m0373j20666k2502J41944K13485J35355
$$ 947176 993772 1108367 1282935 1403268 1362895 1242229 1219727 1361671 1575156 1710511
36180A710511j7490p3912O1901K24341J53277j09140k41373j25687O39k5919o5873
$$ 1710511 1693021 1619109 1681010 1905351 2058628 1949488 1708115 1582428 1583067 1557148 1491275
36169A491275j8622k2765j24014j08136J10359K74391J82911k4683j74152k81299
$$ 1491275 1472653 1449888 1325874 1217738 1328097 1602488 1785399 1760716 1586564 1305265
36159A305265k91889l2487L54513M07294O2210j28333J53045M38654K17176k66764
$$ 1305265 1013376 980889 1335402 1742696 1804906 1676573 1829618 2268272 2485448 2218684
36149B218684m67530l51625k02744k0455K79353M11892J19961k42426j63732K01660
$$ 2218684 1751154 1399529 1196785 1176330 1455683 1867575 1987536 1745110 1581378 1783038
36139A783038K94186M9444j06370l1561M159r3750j34461r5644j37274j85593
$$ 1783038 2077224 2126668 2020298 1988737 1992896 1899146 1764685 1669041 1531767 1346174
36129A346174k8968J99519J55870j18477k41103j08171L0972Q5914J88630K64172
$$ 1346174 1317206 1516725 1672595 1554118 1313015 1204844 1235816 1321730 1510360 1774532
36119A774532Q6059k16530k51985k3906M0195j91499l31507j10950K32243L67016
$$ 1774532 1860591 1644061 1392076 1368170 1408365 1216866 885359 774409 1006652 1373668
36109A373668K66605N7603j56318k19825l5849J81547J23458j19908j74736O934
$$ 1373668 1640273 1697876 1541558 1321733 1285884 1467431 1590889 1470981 1296245 1303179
36099A303179J07195L0403K2796J30114P0436j99772l07392o5088K06990J99704
$$ 1303179 1410374 1440777 1463573 1593687 1664123 1464351 1156959 1091871 1298861 1498565
36089A498565M8263R430P0739J10451J22779Q7852p6945k83740l09408j76789
$$ 1498565 1546828 1556258 1626997 1737448 1860227 1948079 1871134 1587394 1277986 1101197
36079A101197j42768k12471r8817J96802K54619p8512l49838j65472K17032L19640
$$ 1101197 958429 745958 647141 843943 1098562 1020050 670212 504740 721772 1041412
36069A041412J23318n8378j10289j45492j93605j83657j13175r767J36909K54576
$$ 1041412 1164730 1106352 996063 850571 656966 473309 360134 350367 487276 741852
36059G41852J97785J0203o5050L4284Q5194o526k6981J21479J78661k7643k25427
$$ 741852 939637 949840 884790 919074 1004268 997742 970761 1092240 1270901 1243258 1017831
36048A017831j00504K13941L62027K57185O2929j09000k03164j15512J43627L38211
$$ 1017831 917327 1131268 1493295 1750480 1813409 1704409 1501245 1385733 1529360 1867571
36038A867571K85733R4511n0791j37667j90075j29671K4864O4576q8154k03913
$$ 1867571 2153304 2247815 2197024 2059357 1869282 1739611 1764475 1829051 1740897 1536984
36028A536984j05552M6902N6696K2387J18761K71715L01860K05270Q6530n298
$$ 1536984 1431432 1478334 1535030 1557417 1676178 1947893 2249753 2455023 2541553 2536255
36018B536255k9201M1796P6418o8161k06199k8704K91454K29121k20978m32066
$$ 2536255 2507054 2548850 2625268 2557107 2350908 2322204 2613658 2842779 2621801 2189735
36008B189735j54967O5621j23445k38111J19369M24303J01837l84579k48896K78255
$$ 2189735 2034768 2100389 1976944 1738833 1858202 2282505 2384342 1999763 1750867 2029122
35998B029122L43857r6939l04718o9057O5289j00549j20770J41138K18228m7542
$$ 2029122 2372979 2276040 1971322 1902265 1967554 1867005 1746235 1887373 2105601 2058059
35988B058059j77509M0930J39960j54868l85417j54103J90654J62368r6794j50047
$$ 2058059 1880550 1921480 2061440 1906572 1521155 1367052 1557706 1720074 1623280 1473233
35978A473233M9606K45320K99971J81675j32814m48841m15607n5146J76013Q6999
$$ 1473233 1522839 1768159 2068130 2249805 2116991 1668150 1252543 1197397 1373410 1460409
35968A460409K7045J90116K19615r6157l11890l9406L30407K36355j33648k02203
$$ 1460409 1487454 1677570 1897185 1801028 1489138 1449732 1780139 2016494 1882846 1680643
35958A680643K8724P1317j75531l33908k43370j21488n6453Q1901K23258J41854
$$ 1680643 1709367 1780684 1605153 1271245 1027875 906387 849934 931835 1155093 1296947
35948A296947m8127K0453L14158L59686n382l30589k06162J84318L90103K55287
$$ 1296947 1248820 1269273 1583431 1943117 1937735 1607146 1400984 1585302 1975405 2230692
35938B230692m7692k83835k86103m9403J81360J42334n6021m6532K04869K80082
$$ 2230692 2183000 1899165 1613062 1563659 1745019 1887353 1831332 1784800 1989669 2269751
35928B269751m8439m10848l58870j4537J47577l189j43609l6622J51763J44705
$$ 2269751 2221312 1810464 1451594 1437057 1584634 1581445 1437836 1401214 1552977 1697682
35918A697682o5863k48387k25467m0823J29579J74010J35803J11482J03974M8772
$$ 1697682 1631819 1383432 1157965 1117142 1246721 1420731 1556534 1668016 1771990 1820762
35908A820762l5238m2126M0071O7611n9436k31444k63191j28250M2000J45628
$$ 1820762 1785524 1743398 1783469 1851080 1791644 1560200 1297009 1168759 1210759 1356387
35898A356387J86085J83156J26507M3324J7691Q2232J41024O7181j38021l40396
$$ 1356387 1542472 1725628 1852135 1895459 1913150 1995382 2136406 2203587 2065566 1725170
35888A725170m22231l70620k11424L8245K84927L46230J79191M0751J91111M52548
$$ 1725170 1302939 932319 720895 759140 1044067 1390297 1569488 1610239 1801350 2253898
35878B253898L62133j37164m84056k29110K88395L70456p7257m53601l28944M4099
$$ 2253898 2616031 2478867 1994811 1765701 2054096 2424552 2347295 1893694 1564750 1608849
35868A608849K23542J79255J39453J33422K0725j80981l08407l19470k88996j96586
$$ 1608849 1832391 2011646 2151099 2284521 2305246 2124265 1815858 1496388 1207392 1010806
35858A010806K4326K56992K88379J41731O1023J08909N3996k11105l99663k13163
$$ 1010806 1035132 1292124 1580503 1722234 1783257 1892166 1946162 1735057 1335394 1122231
35848A122231J76806L19010R8582j28833o5268J33661J42786m3230j32163K1183
$$ 1122231 1299037 1618047 1716629 1587796 1522528 1656189 1798975 1755745 1623582 1644765
35838A644765K18004K03293j1335j99057j97209m7458R3144J09748K1192m4888
$$ 1644765 1862769 2066062 2054727 1855670 1658461 1611003 1704147 1813895 1835087 1790199
35828A790199P962J16645J24359r936j54657k00796k07089k60752k92866j72109
$$ 1790199 1798161 1914806 2039165 2029229 1874572 1673776 1466687 1205935 913069 740960
35818G40960O9649K50257K59090J42739p003j18908j24039k7793J9859r0640j85901
$$ 740960 810609 1060866 1319956 1462695 1455692 1336784 1212745 1184952 1204811 1114171 928270
35807I28270Q941M08246N69290K86973r4221j71885k7517J6926m5670k96P8239
$$ 928270 937211 1345457 1914747 2201720 2107499 1935614 1908097 1925023 1879353 1879057 1957296
35796A957296r8644m27416m03935Q7038M45574J64540m01929n31012j58597J15734
$$ 1957296 1858652 1431236 1027301 1114339 1559913 1724453 1322524 791512 632915 748649
35786G48649j6218j68180N2951M35556N33590L20873J19061N8874j6394j65860
$$ 748649 732431 564251 617202 1052758 1586348 1907221 2026282 2085156 2068762 1902902
35776A902902k12963n6455J34697J54365K2023j05396j67621k16919k57805k02879
$$ 1902902 1689939 1633484 1768181 1922546 1944569 1839173 1671552 1454633 1196828 993949
35766I93949j3965J86030K11692L6901j36899j04951P3870J52809N3643k6038
$$ 993949 979984 1166014 1377706 1414607 1277708 1172757 1246627 1399436 1453079 1427041
35756A427041M3279P5248j16005l11347j37253L15134N04988J80651k48699k86670
$$ 1427041 1470320 1545568 1429563 1118216 980963 1296097 1801085 1981736 1733037 1446367
35746A446367R01J88511J13114l6978j04583q6211M0382K56966L18108M29m52448
$$ 1446367 1447268 1635779 1748893 1711915 1607332 1521121 1561503 1818469 2136577 2137006 1684558
35735A684558n34283j99223M3951q3913k11134K2033L11390J78021j86920j66467
$$ 1684558 1150275 951052 995003 911090 699956 721989 1033379 1211400 1024480 858013
35725H58013K86672N20700J59544l49531m25682j41958M2911J0462L273J06920
$$ 858013 1144685 1665385 1824929 1475398 1049716 907758 950669 961131 964404 1071324
35715A071324J63094J45784K05459L04575J99357j03725k37202j8105K08761N8865
$$ 1071324 1234418 1380202 1585661 1890236 2089593 1985868 1748666 1730561 1939322 1998187
35705A998187k92316l52184l4761K42740J93276J9642J2220R6875J8495k14281
$$ 1998187 1705871 1353687 1318926 1561666 1754942 1774584 1786804 1883679 1902174 1687893
35695A687893l34685k02334L7828J75891J51421L9705m2301n015J26532J93873
$$ 1687893 1353208 1150874 1188702 1364593 1516014 1555719 1513418 1508403 1634935 1828808
35685A828808Q2251r8803j44530m8827O469k8910J0564J73472K09955o2950l81073
$$ 1828808 1911059 1812256 1667726 1618899 1625368 1596458 1607022 1780494 1990449 1927499 1546426
35674A546426l15383J12495M07822K60276o3117j46102n008K4362j52179k67226
$$ 1546426 1231043 1343538 1751360 2011636 1948519 1802417 1797409 1821771 1669592 1402366
35664A402366j44234L7705N7910j4479k853M9993Ko7026O0238K97104K87424m6852
$$ 1402366 1258132 1295837 1353747 1339268 1336415 1386408 1386410 1319384 1379622 1676726 1964150 1917298
35652A917298l02353j53944J45617J31037j82874l43938j49197R3800P4308q8586
$$ 1917298 1614945 1461001 1606618 1737655 1554781 1210843 1061646 1155446 1229754 1141168
35642A141168j07197K4667Q9467K4216q338R3822K12087J84414K2103j25322j67965
$$ 1141168 1033971 1058638 1148105 1172321 1163983 1257805 1469892 1654306 1676409 1551087 1383122
35631A383122j54465j42018p4355J08810K81315K27126k6567j77115o8330P7503
$$ 1383122 1228657 1086639 1012284 1121094 1402409 1629535 1602968 1425853 1357523 1435026
35621A435026M4004j3602J04058J95201r296k54133r1517K71899J72244l78857
$$ 1435026 1479030 1465428 1569486 1764687 1755391 1501258 1409741 1681640 1853884 1475027
35611A475027n56056k0899M47766J63656l67406l13813J22481J51733k07175k33331
$$ 1475027 918971 898072 1345838 1509494 1142088 828275 950756 1102489 895314 661983
35601F61983J64985L11651L728j59910Q3918J94002j23560l20165O947L47906
$$ 661983 826968 1138619 1142347 982437 1066355 1260357 1136797 816632 823579 1171485
35591A171485J49536k36191j96819J06259J20786j09369j34316L2695K6139r4566
$$ 1171485 1321021 1084830 888011 994270 1115056 1005687 871371 904066 930205 835639
35581H35639M7110L66808L93796R9636n0083Q9338J41250p7175k55199j57675
$$ 835639 882749 1249557 1643353 1742989 1692906 1782244 1923494 1846319 1591120 1433445
35571A433445M3825J61220K23806K00992j8469k60102j90478P6519O1984k44459
$$ 1433445 1477270 1638490 1862296 2063288 2044819 1784717 1594239 1670758 1732742 1488283
35561A488283k70767J65204M43256J15308l29108k30269K12716L29627L4555j93052
$$ 1488283 1217516 1382720 1825976 1941284 1612176 1381907 1594623 1924250 1958805 1765753
35551A765753j62112j22174j56528p1665R4316M4036k10028k78068l0548J82177
$$ 1765753 1603641 1481467 1324939 1253274 1347590 1391626 1181598 903530 872982 1055159
35541A055159J28830N7069J99819L30162J53601j56062k04436J2900J32398p191
$$ 1055159 1183989 1241058 1440877 1771039 1924640 1768578 1564142 1577042 1709440 1702249
35531A702249j69158j29137J4428N7294P096K1155J36903K21993J61137k1968
$$ 1702249 1533091 1403954 1418382 1475676 1482772 1503927 1640830 1862823 2023960 2001992
35521B001992k16618l03360j96890O5776K63137J61644j73024l75765k19957P0379
$$ 2001992 1785374 1482014 1285124 1350900 1614037 1775681 1602657 1226892 1006935 1077314
35511A077314J27785m3954j16441M0109J83073J08225o0543j31203j26214j11511
$$ 1077314 1205099 1161145 1044704 1084813 1267886 1376111 1315568 1184365 1058151 946640
35501I46640Q702K59094L56475M7946m16618n13897j44157K46486L04211J88741
$$ 946640 955342 1214436 1570911 1618857 1202239 688342 544185 790671 1094882 1283623
35491A283623J98794K77155J64594j21178k69907j22020J20111J82183M3595j17990
$$ 1283623 1482417 1759572 1924166 1802988 1533081 1411061 1531172 1713355 1756950 1638960
35481A638960j84429j77394j38139n7165N6287J22485O7189p7781j91345j80065
$$ 1638960 1454531 1277137 1138998 1081833 1138120 1260605 1327794 1250013 1058668 878603
35471H78603o5527M2539O4338M5302R7766K19222K44618Q1655q3050j0016J83725
$$ 878603 813076 855615 919953 965255 1063021 1282243 1526861 1608516 1525466 1515450 1699175
35460A699175J23744k28823m12520j22941K73358K49321r1334k09444O619J27038
$$ 1699175 1822919 1594096 1181576 1058635 1331993 1581314 1489980 1280536 1287155 1414193
35450A414193n1220j97154o8561R8329Q4884P4081J94214J55421k06745m44447
$$ 1414193 1362973 1165819 1097258 1195587 1280471 1354552 1548766 1704187 1497442 1052995
35440A052995j16615M15486M41930l2213l33051j55000J14581J49310J02815J10036
$$ 1052995 936380 1351866 1793796 1761583 1428532 1273532 1388113 1537423 1640238 1750274
35430A750274j2788k93042l66694p1896J77543J4130k70766j88221J72348L22817
$$ 1750274 1737486 1444444 1077750 1005854 1183397 1197527 926761 738540 910888 1233705
35420A233705J42513l6941l1683j0997q3526j03988Q604J03715P7659M2683Q8378
$$ 1233705 1376218 1339277 1307594 1296597 1213071 1109083 1117687 1221402 1299061 1341744 1430122
35409A430122J11910K4041p8119q6410n7112p1298p6122j3114L4906j6802r0945
$$ 1430122 1542032 1566073 1487954 1401544 1344432 1273134 1197012 1183898 1218804 1202002 1111057
35398A111057q8913p7955j46579j80570k3181K06250K33420O4613n626J09893
$$ 1111057 1022144 944189 797610 617040 593859 800109 1033529 1098142 1092516 1202409
35388A202409J21317j31481l19793r1236L22179L62664o1995m51577m15314j22744
$$ 1202409 1323726 1192245 872452 781216 1103395 1466059 1404064 952487 537173 414429
35378D14429O9602R9333J01160J04860Q7249J33106K81137L42200J27296k28984
$$ 414429 484031 583364 684524 789384 876633 1009739 1290876 1633076 1760372 1531388
35368A531388m08321l10013r6913R3441K42108K84189J13144j94479l55837j76666
$$ 1531388 1123067 813054 716141 809582 1051690 1335879 1449023 1254544 898707 722041
35358G22041K22946N10664M21405j0086m20550m30600r8969R6710q7291k48353
$$ 722041 944987 1455651 1877056 1866970 1446420 1015820 916851 1013561 926270 677917
35348F77917Q5114O38380O55907o895n98052m82200L3350K34615j98j94721o9288
$$ 677917 763031 1401411 2057318 2050423 1452371 970171 1003521 1238136 1237938 1043217 973929
35337I73929J45662J76197P2855J3028L0546O8602R6126O4573q0179k48921k38326
$$ 973929 1119591 1295788 1368643 1381671 1412217 1480819 1576945 1641518 1561339 1312418 1074092
35326A074092j7550J71394J32775r105k4816O0274N0775m7778k6156J39115J89163
$$ 1074092 1056542 1227936 1360711 1351606 1326790 1387064 1437839 1390061 1363905 1503020 1692183
35315A692183l335j94921j49315j7391n5847j55798k5082K55870K91444N815k13781
$$ 1692183 1688848 1493927 1344612 1327221 1271374 1115576 1090494 1346364 1637808 1643623 1429842
35304A429842j29400J0696m6431j35465k8809J22817P1953o1257m41J93687K31356
$$ 1429842 1300442 1311138 1264707 1129242 1100433 1223250 1295203 1233946 1233505 1427192 1658548
35293A658548O7987r2143j56413j65286p5962J22243K10262L5091j43520k0792
$$ 1658548 1726535 1634392 1477979 1312693 1236731 1358974 1569236 1604327 1460807 1440015
35283A440015K04224J46476n7151K7311K87346J69683l23346n20455j67708J46856
$$ 1440015 1644239 1790715 1733564 1760875 2048221 2217904 1894558 1374103 1206395 1353251
35273A353251K023j73857O7075L57708J68774k38677k59499L2563Q7243j28892
$$ 1353251 1355274 1181417 1248492 1606200 1774974 1536297 1276798 1309361 1396604 1267712
35263A267712j35286J41296K15490r9905l59545k10771R1469J52683P94r4051
$$ 1267712 1132426 1273722 1489212 1389307 1029762 818991 910460 1063143 1063937 969886
35253I69886n5570L525K5562M0488O8977J10377J42330J03969j5297r7955m8700
$$ 969886 914316 917841 943403 983891 1052868 1163245 1305575 1409544 1394247 1296292 1247592
35242A247592L6188K1026l1659R206P0994N285r1384q684J62953J13827j58072
$$ 1247592 1283780 1304806 1273147 1282353 1353347 1358632 1267248 1258564 1421517 1535344 1377272
35231A377272k76737n4952K12439J91491m4743k12111k16982j44469l7316P9695
$$ 1377272 1100535 1045583 1258022 1449513 1404770 1192659 975677 831208 793892 873587
35221H73587Q6553q6011k63062j90983J08058L19462K17918n5806j82194o3315
$$ 873587 960140 874129 611067 420084 528142 847604 1065522 1009716 827522 764207
35211G64207Q6670P5652J7083J28155L30295L07238m772k67917k25146o3889o9355
$$ 764207 850877 926529 943612 1071767 1402062 1709300 1704528 1436611 1211465 1147576 1078221
35200A078221j49288k4614K50510L20041N6880k40569k30400R1630M18207M17612
$$ 1078221 928933 904319 1154829 1474870 1531750 1291181 1060781 1152411 1570618 1988230
35190A988230M5174l38931l06291P4159K51595l9267l55479k18327J33419J48068
$$ 1988230 2033404 1694473 1388182 1462341 1713936 1674669 1319190 1100863 1234282 1382350
35180A382350j51477k80615j30402l8226p6840M8552L42495M23633K10990O5958
$$ 1382350 1230873 950258 819856 781630 704790 753342 1095837 1519470 1730460 1796418
35170A796418R3408l5463l46509l49210J04609M18564J46539l08992l83581j87576
$$ 1796418 1889826 1854363 1507854 1158644 1263253 1681817 1828356 1519364 1135783 948207
35160I48207j16942j27487N645J27519K0654p5755J23507L51918K30373j6450
$$ 948207 831265 703778 709423 836942 857596 781841 905348 1257266 1487639 1471189
35150A471189M5890K44680J11532k24468k45443J0015M0238j56145q5333K39280
$$ 1471189 1517079 1761759 1873291 1648823 1403380 1413395 1453633 1297488 1212155 1451435
35140A451435K09369k76842n09596j03287L62706K89135n2664j06613O8997P5616
$$ 1451435 1660804 1383962 874366 771079 1133785 1422920 1370256 1263643 1332640 1408256
35130A408256q3192j13292J3718J19926J95255K77343K00075j20291l81836k90648
$$ 1408256 1325064 1211772 1225490 1345416 1540671 1818014 2018089 1897798 1515962 1225314
35120A225314l5199L3747m0395j7523K1130j43765l37922j89652K10043L69683
$$ 1225314 1190115 1223862 1183467 1165944 1187074 1043309 705387 515735 725778 1095461
35110A095461J33098j24623r6962R0830K11122K37186J97860O5133q8406j03742
$$ 1095461 1228559 1103936 1006974 1097804 1308926 1546112 1743972 1809105 1720699 1616957
35100A616957o220O2j21015j67869m5377R5309J28043R2507J8097r6954j01117
$$ 1616957 1610737 1610799 1489784 1321915 1276538 1371847 1499890 1592397 1610494 1513540 1412423
35089A412423J54226M16218K24653l46224o11764k16755K95363K48168k02704
$$ 1412423 1566649 1982867 2207520 1861296 1249532 1032777 1328140 1576308 1373604
35080A373604l65962l7016L13588K90923K3975j65220j46313L0706K26074K44831
$$ 1373604 1007642 970626 1284214 1575137 1599112 1433892 1287579 1318285 1544359 1789190
35070A789190L6051j48501n7176J46968R6288j89042l02396q0534J66643J60777
$$ 1789190 1825241 1676740 1619564 1766532 1862820 1673778 1371382 1290848 1457491 1618268
35060A618268O895j08397j96169k43385p3798L03444N16776L04991q5994k72498
$$ 1618268 1625163 1516766 1320597 1077212 1003414 1306858 1823634 2128625 2042631 1770133
35050A770133k50101k20004j48611R7431L54791L44744J63142J53563L16053K77875
$$ 1770133 1520032 1300028 1151417 1248848 1603639 1948383 2111525 2265088 2581141 2859016
35040B859016r1215m40614m47144k29874r5426j25520j78809j22485M9319J91242
$$ 2859016 2767801 2327187 1880043 1650169 1554743 1429223 1250414 1127929 1177248 1368490
35030A368490Q6020k67970m91968k36235K64543M12450O8013k70996k40477r4564
$$ 1368490 1454510 1186540 694572 458337 722880 1135330 1203343 932347 691870 597306
35020E97306j62097k68322j00219J95444K50468Q4119j236K3961m9947j77766
$$ 597306 435209 166887 66668 262112 512580 596699 595463 619424 569477 391711
35010C91711j03096J21381J59913j1439m3067J36603J38609j76386l21532Q1017
$$ 391711 288615 409996 569909 558470 515403 652006 790615 614229 292697 373714
35000C73714O02179N70225P5743j82781K5479J70211j28354m75211l42274Q2090
$$ 373714 975893 1546118 1621861 1439080 1464559 1634770 1506416 1031205 688931 771021
34990G71021J84203j27761l10198m9862K55666J17893l10484m84049k42002O5930
$$ 771021 955224 827463 517265 467403 723069 840962 530478 46429 -195573 -129643
34980a29643J71700J97051K84691K89785O0545k21157k49492k0241J90987K09961
$$ -129643 42057 239108 523799 813584 874129 652972 403480 383239 574226 784187
34970G84187J18164N9844P3205J09765R4775j2853j31412j00322Q1943J80164
$$ 784187 902351 962195 1035400 1145165 1239940 1227087 1095675 995353 1077296 1257460
34960A257460L7512j60836j50640P333O0292M244M3195J35795m817l64164m93425
$$ 1257460 1294972 1134136 983496 990829 1051121 1055365 1098560 1234355 1229538 865374 371949
34949C71949j46488K96000L42049O0707j13189n3224j3087j03293j17386O0832
$$ 371949 225461 521461 863510 924217 811028 757804 744717 641424 524038 584870
34939E84870K31431K01927P2111K8030N1070J2295q9521j67432k21056k90571
$$ 584870 816301 1018228 1090339 1118369 1169439 1181734 1092213 924781 703725 413154
34929D13154l05501j65335O0775J98227K24807K69368L26250K03871j22202l27413
$$ 413154 107653 -57682 3093 201320 426127 695495 1021745 1225616 1103414 776001
34919G76001j37723K34086L41112J28295k9803N4543J11142o9335k16253j5406
$$ 776001 638278 872364 1213476 1341771 1311968 1366511 1477653 1408318 1192065 1176659
34909A176659L06200K79586n5457k01562j3798P1194k06919m40003j73031L40407
$$ 1176659 1482859 1762445 1706988 1505426 1491628 1562822 1355903 915900 742869 1083276
34899A083276M59301N0672l83705m22487j65978O4571J19149K7720r6173o5618
$$ 1083276 1542577 1593249 1209544 787057 621079 685650 804799 832519 736346 670728
34889F70728K14293N01674M00957q4947m51745l27441L4172J41470n1939j72211
$$ 670728 885021 1386695 1787652 1702705 1250960 923519 957691 1099161 1047222 875011
34879H75011l1787J43091J19506k0915r2819j00089j32758j23769O6823L59478
$$ 875011 843224 986315 1105821 1084906 992087 891998 759240 635471 702294 1061772
34869A061772M48773J66934k49736l75608q3947K69067K35479j76526m83333l18355
$$ 1061772 1510545 1677479 1427743 1052135 968188 1237255 1472734 1296208 812875 494520
34859D94520J00369K63558L9413k06525j74162j7628j6859j12480m6071J72653
$$ 494520 594889 858447 897860 691335 517173 499545 482686 370206 324135 496788
34849D96788K66529J45140M2160J13048J73469R624k56854l34009j70325K0242
$$ 496788 763317 908457 950617 1063665 1237134 1246758 989904 655895 485570 505812
34839E05812Q7667Q8319R8195P7817j4684j10927j14251k0266J00320J81824J84359
$$ 505812 593479 681798 779993 857810 843126 732199 617948 597682 698002 879826 1064185
34828A064185R2307n2660j51377j36816n6884k1371n6132n8777M9388J60337P9651
$$ 1064185 1156492 1103832 952455 815639 758755 737384 681252 622475 671863 832200 911851
$$ [...]
##END NTUPLES=NMR SPECTRUM
##END=
