##TITLE=31Pdec_CPA2806
 D2O, 24 sc
 29.06.2021
##JCAMPDX= 6.0         $$ Bruker NMR JCAMP-DX V2.0
##DATA TYPE= NMR SPECTRUM
##DATA CLASS= NTUPLES
##ORIGIN= UXNMR, Bruker Analytische Messtechnik GmbH
##OWNER= root
$$ XWIN-NMR		Version 3.5
$$ Tue Jun 29 09:23:59 2021 Russian Standard Time (UT+4h)  she@DPX200
##.OBSERVE FREQUENCY= 81.013821
##.OBSERVE NUCLEUS= ^31P
##.ACQUISITION MODE= SIMULTANEOUS
##.ACQUISITION SCHEME= undefined
##.AVERAGES= 24
##.DIGITISER RES= 16
##SPECTROMETER/DATA SYSTEM= spect
##.PULSE SEQUENCE= zgpg30
##.SOLVENT NAME= D2O
##.SHIFT REFERENCE= (INTERNAL, D2O, 0, 248.564)
##AUDIT TRAIL= $$ (NUMBER, WHEN, WHO, WHERE, WHAT)
$$ ##TITLE= Audit trail, XWIN-NMR		Version 3.5
$$ ##JCAMPDX= 5.01
$$ ##ORIGIN= Bruker BioSpin GmbH
$$ ##OWNER= she
$$ F:/spectra/data/she/nmr/P31/1/pdata/1/auditp.txt
$$ ##AUDIT TRAIL=  $$ (NUMBER, WHEN, WHO, WHERE, WHAT)
(   1,<2021-06-29 09:21:32.71 +0400>,<she>,<DPX200>,
      <created by zg, POWCHK disabled, PULCHK disabled
       configuration hash MD5:
       00 E9 B6 7A A2 85 ED C7 34 08 36 98 17 FE 4E 26
       data hash MD5: 32K
       54 79 7E C5 9C 6D 9C 9D D8 43 AE 79 2D E2 06 5D>)
(   2,<2021-06-29 09:21:35.35 +0400>,<she>,<DPX200>,
      <Start of raw data processing
       efp BC_mod = 2 LB = 1 FT_mod = 6 PKNL = 1 PHC0 = -8199.144 PHC1 = 3724.287 SI = 64K 
       data hash MD5: 64K
       AF 8C 2E 19 AB 51 AF 51 D7 4A 53 32 2A 0D FC F0>)
(   3,<2021-06-29 09:22:01.82 +0400>,<she>,<DPX200>,
      <pk PHC0 = -39.61464 PHC1 = 39.8 
       data hash MD5: 64K
       DF A9 6E C7 7A 46 0C B4 AE B6 35 BD F3 2E E1 FA>)
(   4,<2021-06-29 09:22:05.04 +0400>,<she>,<DPX200>,
      <abs ABSG = 5 
       data hash MD5: 64K
       06 4F 2F 68 56 51 7B 96 49 A9 22 3B 0E 85 F3 C9>)
(   5,<2021-06-29 09:22:50.26 +0400>,<she>,<DPX200>,
      <pk PHC0 = 1161.196 PHC1 = -2754.601 
       data hash MD5: 64K
       CC DD 72 B7 73 09 D0 B1 16 85 BE 01 06 05 53 5F>)
(   6,<2021-06-29 09:23:19.78 +0400>,<she>,<DPX200>,
      <pk PHC0 = 296.436 PHC1 = -701.4 
       data hash MD5: 64K
       35 B3 E8 91 F6 87 72 E4 7D 0F 91 61 1B 7A 08 3F>)
$$ ##END=
$$ 
$$ hash MD5
$$ FE 43 75 10 0E 12 5C FF BF C2 2C 46 97 E3 8C E0
##$RELAX= 
##$RELAX= 
##$RELAX= 
##$RELAX= 
##$RELAX= 
##$RELAX= 
##$RELAX= 
##$RELAX= 
$$ Bruker specific parameters
$$ --------------------------
##$DU= <F:/spectra>
##$EXPNO= 1
##$NAME= <P31>
##$PROCNO= 1
##$TYPE= <nmr>
##$USER= <she>
##$AMP= (0..31)
100 100 100 100 100 100 100 100 100 100 100 100 100 100 100 100 100 100 
100 100 100 100 100 100 100 100 100 100 100 100 100 100 
##$AQSEQ= 0
##$AQ_mod= 1
##$AUNM= <au_zg>
##$AUTOPOS= <>
##$BF1= 81.014009
##$BF2= 200.13
##$BF3= 200.13
##$BF4= 200.13
##$BF5= 200.13
##$BF6= 200.13
##$BF7= 200.13
##$BF8= 200.13
##$BYTORDA= 1
##$CFDGTYP= 0
##$CFRGTYP= 5
##$CHEMSTR= <none>
##$CNST= (0..31)
1 1 145 1 1 1 1 1 1 1 1 1 1 1 1 1 1 1 1 1 1 1 1 1 1 1 1 1 1 1 1 1 
##$CPDPRG= <waltz16>
##$CPDPRG1= <>
##$CPDPRG2= <waltz16>
##$CPDPRG3= <>
##$CPDPRG4= <mlev>
##$CPDPRG5= <mlev>
$$ [...]
##$SUBNAM3= <"">
##$SUBNAM4= <"">
##$SUBNAM5= <"">
##$SUBNAM6= <"">
##$SUBNAM7= <"">
##$SUBNAM8= <"">
##$SUBNAM9= <"">
##$SW= 501.771253377433
##$SWIBOX= (0..15)
0 1 3 0 0 0 0 0 0 0 0 0 0 0 0 0 
##$SW_h= 40650.406504065
##$TD= 32768
##$TD0= 1
##$TE= 0
##$TE2= 300
##$TE3= 300
##$TEG= 300
##$TL= (0..7)
0 120 53 12 22 120 120 120 
##$TP= (0..7)
150 150 150 150 150 150 150 150 
##$TP07= 0
##$TPNAME0= <>
##$TPNAME1= <>
##$TPNAME2= <>
##$TPNAME3= <>
##$TPNAME4= <>
##$TPNAME5= <>
##$TPNAME6= <>
##$TPNAME7= <>
##$TPOAL= (0..7)
0.5 0.5 0.5 0.5 0.5 0.5 0.5 0.5 
##$TPOFFS= (0..7)
0 0 0 0 0 0 0 0 
##$TUNHIN= 0
##$TUNHOUT= 0
##$TUNXOUT= 0
##$USERA1= <user>
##$USERA2= <user>
##$USERA3= <user>
##$USERA4= <user>
##$USERA5= <user>
##$V9= 5
##$VALIST= <valist>
##$VCLIST= <CCCCCCCCCCCCCCC>
##$VD= 0
##$VDLIST= <DDDDDDDDDDDDDDD>
##$VPLIST= <PPPPPPPPPPPPPPP>
##$VTLIST= <TTTTTTTTTTTTTTT>
##$WBST= 1024
##$WBSW= 4
##$XGAIN= (0..3)
0 0 0 0 
##$XL= 0
##$YL= 0
##$YMAX_a= 18749
##$YMIN_a= -19074
##$ZGOPTNS= <>
##$ZL1= 120
##$ZL2= 120
##$ZL3= 120
##$ZL4= 120
##$ABSF1= 248.5645
##$ABSF2= -253.2056
##$ABSG= 5
##$ABSL= 3
##$ALPHA= 0
##$AQORDER= 0
##$ASSFAC= 0
##$ASSFACI= 0
##$ASSFACX= 0
##$ASSWID= 0
##$AUNMP= <proc_1d>
##$AZFE= 0.1
##$AZFW= 0.5
##$BCFW= 0
##$BC_mod= 2
##$BYTORDP= 0
##$COROFFS= 0
##$CY= -3
##$DATMOD= 1
##$DC= 0
##$DFILT= <>
##$DTYPP= 0
##$F1P= 0
##$F2P= 0
##$FCOR= 1
##$FTSIZE= 65536
##$FT_mod= 6
##$GAMMA= 0
##$GB= 0
##$INTBC= 1
##$INTSCL= 5.30512e-09
##$ISEN= 30
##$LB= 1
##$LEV0= 0
##$LPBIN= 0
##$MAXI= 10000
##$MC2= 0
##$MEAN= 0
##$ME_mod= 0
##$MI= 50
##$NCOEF= 0
##$NC_proc= -5
##$NLEV= 6
##$NOISF1= 182.463
##$NOISF2= 159.3651
##$NSP= 0
##$NTH_PI= 0
##$NZP= 0
##$OFFSET= 248.5645
##$PC= 4
##$PHC0= -6781.126
##$PHC1= 308.086
##$PH_mod= 1
##$PKNL= yes
##$PPARMOD= 0
##$PSCAL= 0
##$PSIGN= 0
##$REVERSE= no
##$SF= 81.014009
##$SI= 65536
##$SIGF1= 159.3651
##$SIGF2= -187.1042
##$SINO= 113.3802
##$SIOLD= 16384
##$SREGLST= <1H.CDCl3>
##$SSB= 0
##$STSI= 65536
##$STSR= 0
##$SW_p= 40650.406504065
##$SYMM= 0
##$S_DEV= 0
##$TDeff= 32768
##$TDoff= 0
##$TI= <>
##$TILT= no
##$TM1= 0
##$TM2= 0
##$TOPLEV= 0
##$USERP1= <user>
##$USERP2= <user>
##$USERP3= <user>
##$USERP4= <user>
##$USERP5= <user>
##$WDW= 1
##$XDIM= 65536
##$YMAX_p= 287568925
##$YMIN_p= -11197311
$$ End of Bruker specific parameters
$$ ---------------------------------
##NTUPLES= NMR SPECTRUM
##VAR_NAME=  FREQUENCY,     SPECTRUM/REAL,   SPECTRUM/IMAG
##SYMBOL=    X,             R,               I
##VAR_TYPE=  INDEPENDENT,   DEPENDENT,       DEPENDENT
##VAR_FORM=  AFFN,          ASDF,            ASDF
##VAR_DIM=   65536,         65536,           65536
##UNITS=     HZ,            ARBITRARY UNITS, ARBITRARY UNITS
##FACTOR=    0.620285442955139, 1,           1
##FIRST=     20137.2065510759, 0,            0
##LAST=      -20513.1999529892, 0,           0
##MIN=       -20513.1999529892, -11197311,   0
##MAX=       20137.2065510759, 287568925,    0
$$ Real data points
##PAGE= N=1
##DATA TABLE= (X++(R..R)), XYDATA
$$ [...]
40634D70958o1280J82078J10124j01213k5106K14142K44750J47645J40777j4800
$$ 470958 409678 591756 701880 600667 575561 789703 1034453 1182098 1322875 1308075
40624A308075n05771p72750k44229N41823N64102j01900m06123j3507K60482q6249
$$ 1308075 802304 29554 -214675 327148 891250 789350 383227 369720 630202 543953
40614E43953m44130k05040K74608M07202K84339K04858l7832o54710j150126r04101
$$ 543953 99823 -105217 169391 576593 860932 1065790 1027958 373248 -776878 -1680979
40604a680979j69587K42921R8656j20626r9193k8913m7216K8847K49801L40747
$$ -1680979 -1850566 -1607645 -1508989 -1629615 -1728808 -1757721 -1804937 -1776090 -1526289 -1185542
40594a185542J80932M5885J24678J82063J2586j06837J58866N41662M47222j33374
$$ -1185542 -1004610 -958725 -834047 -651984 -639398 -746235 -587369 -45707 401515 268141
40584B68141n18086l05043N2547P507j81709P2381N52935M18596l73978p21877
$$ 268141 -249945 -554988 -502441 -494934 -676643 -604262 -51327 367269 -6709 -728586
40574g28586L9048R62368P55404k76604o38349J26741P98166L68316n17520o82996
$$ -728586 -689538 272830 1028234 751630 113281 240022 1038188 1406504 888984 205988
40564B05988j51637J47817r4563l13134j42990J51508L44794N55987P51884O44853
$$ 205988 54351 202168 107605 -205529 -348519 -197011 147783 703770 1455654 2100507
40554B100507K90839J41378K39911J9721p09012j198142p67700R7050L57455j21408
$$ 2100507 2391346 2532724 2772635 2792356 2083344 885202 117502 214552 572007 450599
40544D50599m50839k5564O97269Q76148K80365n70707r56829n50021K77209P14015
$$ 450599 -240 -25804 671465 1547613 1827978 1257271 300442 -249579 27630 741645
40534G41645L47932l20414n28315k67027j27037k40901j31920K76138L63288p9495
$$ 741645 1089577 769163 240848 -26179 -153216 -394117 -526037 -249899 113389 33894
40524C3894k86063K81364Q89338N91134k06975l28981K85796M90432j98944q33080
$$ 33894 -252169 29195 918533 1509667 1302692 973711 1259507 1749939 1550995 717915
40514G17915n55790J23237K66771m8118o6830L29673N20594J98732k24125l19266
$$ 717915 162125 285362 552133 504015 437185 766858 1287452 1486184 1262059 942793
40504I42793j76959q5097p5716p681J10709Q8547j66817m22573l05324J81558
$$ 942793 765834 680737 605021 597340 708049 796596 629779 207206 -98118 83440
40494H3440M89842J72963m12423n07602l9793K81405Q7740j22315P4571K83506
$$ 83440 573282 746245 333822 -173780 -213573 67832 155572 33257 107828 391334
40484C91334P7910j21565K37979P38312N57431j54790m92816k57310j12569k43785
$$ 391334 469244 347679 585658 1323970 1881401 1726611 1233795 976485 863916 620131
40474F20131l2878O20920Q29928J64820m75205k62000J87098j27667q31763p15180
$$ 620131 587253 1208173 2038101 2202921 1727716 1465716 1652814 1525147 693384 -21796
40464b1796L16716J096675R66539N13711L64662L52537K61422M02308R11399J311943
$$ -21796 294920 1391595 2358134 2871845 3236507 3589044 3850466 4252774 5164173 6476116
40454F476116J345243J454018J864528K126146K379630L943424P090778Q985846
$$ 6476116 7821359 9275377 11139905 13266051 15645681 19589105 26679883 35665729
40446C5665729O044928j277121p949237r598738o939955l917439k760252k542605
$$ 35665729 41710657 40433536 32484299 22885561 15945606 12028167 9267915 6725310
40438F725310j869123q83953l31804k39527k93655n40428r80304j140939p17578
$$ 6725310 4856187 3972234 3640430 3400903 3107248 2566820 1586516 445577 -272001
40429b72001j60043l8687j97263q1477L65610O61463M93257L8155l59014n02137
$$ -272001 -432044 -470731 -667994 -749471 -383861 277602 770859 809014 450000 -52137
40419e2137l71174p3612K19657L83858L64483J45021j56633k63739q3141N0671
$$ -52137 -423311 -496923 -277266 106592 471075 616096 459463 195724 112583 163254
40409A63254j51761l73397j35482L29050L65626K4865M990L40985K10500n48885
$$ 163254 11493 -361904 -497386 -168336 197290 222155 227145 568130 778630 229745
40399B29745q53239m3001Q83452P15115j39636m63456k09290k83036p38225o90818
$$ 229745 -623494 -666495 216957 932072 792436 328980 119690 -163346 -901571 -1592389
40389a592389p039L61841r188l40336p289N15472O01023M26567L94920L72871
$$ -1592389 -1599428 -1237587 -1246775 -1587111 -1594400 -1078928 -477905 -51338 343582 716453
40379G16453J12024j82475k48949k19855k28885q8511K24393L03561k4224k94571
$$ 716453 828477 646002 397053 177198 -51687 -140198 84195 387756 363532 68961
40369F8961j18293K00912K20185L5229p1592j72598l73401m15281j37378R8941
$$ 68961 -49332 151580 371765 406994 335402 162804 -210597 -625878 -763256 -664315
40359f64315m803j14826J27704L71594J12660l87947m87862j81252L3566P9663
$$ -664315 -669118 -783944 -656240 -284646 -171986 -559933 -1047795 -1229047 -1195481 -1115818
40349a115818K80491N43772M15826m7031k79837j61641j54554l36618j59504M88209
$$ -1115818 -835327 -291555 124271 77240 -202597 -364238 -518792 -855410 -1014914 -526705
40339e26705Q12525K81003m14138k96673M31381O87366Q8468n78903n57323p8449
$$ -526705 285820 566823 152685 -143988 287393 974759 1063227 484324 -72999 -151448
40329a51448J80933P1145n5670k5343K3495P6321K87709N05223K54185n02903
$$ -151448 29485 100630 44960 19617 43112 119433 407142 912365 1166550 663647
40319F63647r95707n30635M52293P96226J31849o29698n62683N0722K67413q5172
$$ 663647 -332060 -862695 -410402 385824 517673 -112025 -674708 -623986 -356573 -441745
40309d41745k21058L31358R30264O93038k17547p58689m15605J44625J01871l28436
$$ -441745 -662803 -331445 598819 1291857 1074310 315621 -99984 44641 146512 -181924
40299a81924l21844J88677L81051r7704m82491r1183N35321M64587j45318l34611
$$ -181924 -503768 -315091 65960 -31744 -514235 -605418 -70097 394490 249172 -85439
40289h5439J22054M61461K06176k63528n36529o36673m62151K47827J036339Q59445
$$ -85439 36615 498076 704252 440724 -95805 -732478 -1194629 -946802 89537 948982
40279I48982l32057j130867n65750M46482N07589j84363l62735K17256N57366
$$ 948982 616925 -513942 -1079692 -633210 -125621 -309984 -672719 -455463 101903
40270A01903J53666l11879k06195J63773K44631M5926j21961j68820j62635j12125
$$ 101903 255569 -56310 -262505 -98732 145899 191825 69864 -98956 -261591 -373716
40260c73716l098J77358M21098M81162l3759r34122j236621l62170Q09292R54403
$$ -373716 -376814 -199456 221642 702804 669045 -265077 -1501698 -1863868 -1054576 -100173
40250a00173J28954m35600k27282L4579j05597q8376M64397R03653N72315j61579
$$ -100173 28781 -406819 -634101 -599522 -705119 -793495 -329098 574555 1146870 985291
40240I85291n53739m97623l05526r6412N6711l3877k01607N7803O50899P47848
$$ 985291 431552 -66071 -371597 -468009 -411298 -445175 -646782 -588979 61920 809768
40230H09768J15402l16878M5665L63954k22185r75337o68183L44659O61339P7704
$$ 809768 925170 608292 653957 1017911 795726 -179611 -847794 -503135 158204 235908
40220B35908k79210J8262J48569k38233l10329L60967Q70496M40711k98024m09254
$$ 235908 -43302 -25040 123529 -114704 -425033 -64066 806430 1247141 949117 539863
40210E39863j28756k22240n49202l76549K52468N24335J27136l69481m44258k17579
$$ 539863 411107 188867 -360335 -736884 -484416 39919 167055 -202426 -646684 -864263
40200h64263j0528J08051J77892J74965J25938J15001J23535Q0342L0835M0815
$$ -864263 -874791 -766740 -588848 -413883 -287945 -172944 -49409 30933 61768 102583
40190A02583L8282j8041J9112J95409K20544j08846m58121l83070n5313l1725
$$ 102583 140865 122824 141936 337345 557889 449043 -9078 -392148 -447461 -479186
40180d79186l65546n15260j88745K69555M70994M58164L91700K25261m1613j68629
$$ -479186 -844732 -1359992 -1548737 -1279182 -808188 -350024 41676 266937 225324 56695
40170E6695k3218J67516J63362M8716Q999L4301N1514Q5541R7619m5970k58176
$$ 56695 33477 200993 364355 413071 422070 456371 507885 593426 691045 645075 386899
40159C86899k30592L2042Q8280k19760l77436J2249M75057L27712k07292k93950
$$ 386899 156307 188349 276629 56869 -320567 -308318 166739 494451 287159 -6791
40149f791K20191N75066K58885l13089n24572l62425j63138m4035K8074k8056
$$ -6791 213400 788466 1047351 734262 209690 -152735 -315873 -359908 -331834 -359890
40139c59890k14504k72365n4349J55713N4292j55039m0980L74536O21518M46334
$$ -359890 -574394 -846759 -901108 -745395 -691103 -846142 -887122 -512586 108932 555266
40129E55266J00087r7867j59033k36154k77872j17637J71688K58598j8534l51419
$$ 555266 655353 557486 398453 162299 -115573 -233210 -61522 197076 178542 -172877
40119a72877k83799J86835N53165M29109Q493k78424l24672k75828j24112J96852
$$ -172877 -456676 -269841 283324 712433 720926 442502 117830 -157998 -282110 -85258
40109h5258M34933K55486j40748j80683J93174L65557l753m49798m58775k00055
$$ -85258 349675 605161 464413 283730 476904 842461 838708 388910 -69865 -269920
40099b69920m6935J02722M17013M95741o6715p44346n84079L66320R75783N53521
$$ -269920 -316855 -214133 202880 698621 631906 -112440 -696519 -330199 645584 1199105
40089A199105k94755o42964m14189j32794l6516J5421O6451K3068n9443o3656
$$ 1199105 904350 261386 -152803 -285597 -322113 -306692 -240241 -217173 -276616 -340272
40079c40272o9969j89699k66597q8450K14659L32899K45441J67460J14228o8903
$$ -340272 -410241 -599940 -866537 -954987 -740328 -407429 -161988 5472 119700 50797
40069E0797k79273k28021J9223P7912n6847P4683N09234N32201k15505q76097
$$ 50797 -228476 -456497 -437274 -359362 -416209 -341526 167708 699909 484404 -391693
40059c91693m62965N36467P02462j99223q12990k63836N31170L98060k38362j91294
$$ -391693 -854658 -318191 384271 185048 -627942 -891778 -360608 37452 -200910 -392204
40049c92204M45628M97967k45699o36307m9205O36442M96939p5185k16124L9521
$$ -392204 53424 551391 305692 -330615 -379820 256622 753561 678376 462252 501773
40039E01773P8221j90080l72807l38105k04968N6011L77321L50317j24128l99532
$$ 501773 579994 389914 17107 -320998 -525966 -469955 -92634 257683 133555 -265977
40029b65977l9060K98278j45834q11293n66129M07621Q18396L39733L0028L79299
$$ -265977 -305037 -6759 -152593 -963886 -1530015 -1122394 -303998 35735 65763 445062
40019D45062M34857m05800j092876n32742N30045N94406k66762o09007Q5196P51757
$$ 445062 879919 474119 -618757 -1151499 -621454 -27048 -293810 -902817 -817621 -65864
40009f5864N59748Q0548J06533L34697M7308n45962n92673M004L64652m9055o17316
$$ -65864 493884 574432 680965 1015662 1062970 517008 -75665 -71661 292991 243936 -373380
39998c73380m90121J36314L14330k02293n24165O1609R40153R59409O9127o19539
$$ -373380 -863501 -727187 -412857 -615150 -1139315 -1077706 -137553 821856 890983 271444
39988B71444m22310R1479J61049m9382J2630K39112J62478n2206J47073N50054
$$ 271444 -150866 -59387 101662 52280 64910 304022 466500 414294 561367 1111421
39978A111421K85417o92608j180128l73369Q07757Q93822q0389o97668k50792
$$ 1111421 1396838 704230 -475898 -849267 -41510 852312 771923 74255 -176537
39969a76537L43703Q5508n61698m42596M73496J010860M87033l89114o32207k96533
$$ -176537 167166 252674 -309024 -751620 -278124 732736 1219769 830655 198448 -98085
39959i8085j21544l11214l76368o3656K53678K49298J39582K09870K76156L2156
$$ -98085 -219629 -530843 -907211 -970867 -717189 -467891 -328309 -118439 157717 189873
39949A89873l34044l46817J6578K58581J10454p6794P4888L28807J84737k88625
$$ 189873 -144171 -490988 -474410 -215829 -105375 -182169 -107281 221526 406263 117638
39939A17638m63205o5017L91625L57759M6246J8019K31625J33405l30683m96317
$$ 117638 -345567 -410584 -18959 338800 385046 403065 634690 768095 437412 -58905
39929e8905k8577M45575K36286l58817n34405k05481k9199k84218m67276j54197
$$ -58905 -87482 358093 594379 235562 -298843 -504324 -533523 -817741 -1285017 -1439214
39919a439214L66023O00354N09437L32939J44401o6388j55773k6241J30933R7694
$$ -1439214 -1073191 -472837 36600 369539 513940 447552 291779 265538 396471 494165
39909D94165l3827o5627o2495j98927l58831k36057J76554M87455L53621j49153
$$ 494165 460338 394711 332216 133289 -225542 -461599 -285045 202410 556031 406878
39899D06878o26064p02532k92632L16129O58246N09552J05456j59302j81355j49685
$$ 406878 -219186 -921718 -1214350 -898221 -239975 269577 375033 215731 34376 -115309
39889a15309j72840j42611O577J34220J07357J6846K3675Q1478l417k34523l23580
$$ -115309 -288149 -430760 -424183 -289963 -182606 -165760 -142085 -60607 -64024 -298547 -622127
39878f22127m0961M13864N57287J83209l40331m59047p8695L17866K42169k27659
$$ -622127 -663088 -249224 308063 491272 150941 -308106 -386801 -68935 173234 -54425
39868e4425n56849l83990J06943M80222N55522M58041K55048j54610o74445q30842
$$ -54425 -611274 -995264 -888321 -408099 147423 605464 860512 705902 31457 -799385
39858g99385k95323N28456Q31966L68727k54472l84150q1465J56661J46419J26317
$$ -799385 -1094708 -566252 265714 634441 379969 -4181 -85646 71015 217434 343751
39848C43751K46637L23560J58162j39888k72516j23442P6612J1214k78201l52356
$$ 343751 590388 913948 1072110 932222 659706 536264 612876 624090 345889 -6467
39838f467M8761N36291N12170M594l73142l07617j02554o724J50841L87068K86720
$$ -6467 42294 578585 1090755 1095349 722207 414590 312036 305312 456153 843221 1129941
39827A129941k49926n93205l03242Q5548j10004o00230o24663j70913J90692L61377
$$ 1129941 880015 286810 -16432 69116 -40888 -641118 -1265781 -1436694 -1246002 -884625
39817h84625O20568P09760J16056p61022q54959j0936P22697O26892J34436j68604
$$ -884625 -264057 445703 561759 -199263 -1054222 -1065158 -342461 284431 418867 250263
39807B50263l22287l59354N6175P63124Q40477o1702r57920q66376j63834K14640
$$ 250263 -72024 -431378 -375203 387921 1228398 1166696 208776 -657600 -821434 -606794
39797f06794K14121L46750N23238K59675k89374n10534l56360k88806l41632j18109
$$ -606794 -392673 -45923 477315 736990 447616 -62918 -419278 -708084 -1049716 -1167825
39787a167825L34802M93312K40127L6085J26483K34284J39011k2950j17273j50991
$$ -1167825 -833023 -339711 -99584 -63499 62984 297268 436279 413329 296056 145065
39777A45065l2182K88039M61325J14484m33633m71947L3042L50040J07519k00618
$$ 145065 112883 400922 862247 976731 543098 71151 104193 454233 561752 361134
39767C61134j06193J18429O5124p0689Q1708L13334J54495k50450k47168L06890
$$ 361134 254941 373370 438494 367805 449513 762847 917342 666892 419724 726614
39757G26614P01722L23385m52329p30808k96872J40687j3722m27333m01027Q4119
$$ 726614 1428336 1751721 1299392 568584 271712 412399 398677 -28656 -429683 -345564
39747c45564L99904K22947j15502k67582k92694k93543j73283J0899k7725k49356
$$ -345564 54340 277287 161785 -105797 -398491 -692034 -865317 -854418 -882143 -1131499
39737a131499j85559K78786N82487L56042K7519N4364J59133k4869j52593J67586
$$ -1131499 -1317058 -1038272 -455785 -99743 -72224 -17860 141273 116404 -36189 131397
39727A31397M45152L9981n78734m47468K43450L83404j68980k92402M57464R46722
$$ 131397 576549 616530 37796 -409672 -166222 217182 48202 -244200 213264 1159986
39717A159986K29808q76790r85028j53219L87934J19163k69976j99733P629q1444
$$ 1159986 1389794 513004 -472024 -625243 -237309 -118146 -388122 -587855 -580226 -661670
39707f61670k21337K2549M75513O06723L69456K29451L42298K55306k99898p85426
$$ -661670 -883007 -860458 -384945 221778 591234 820685 1162983 1418289 1118391 332965
39697C32965n52916J07185K92448j83074n48794l27933j3762j00089k41162j1936
$$ 332965 -219951 -112766 179682 -3392 -552186 -880119 -893881 -993970 -1235132 -1247068
39687a247068K17777k603k27779J52890O82599M73389k31841l87560Q2782J93837
$$ -1247068 -1029291 -1031894 -1259673 -1106783 -424184 49205 -182636 -570196 -487414 -293577
39677b93577l13427m99241O8496N04500J59874k66583m3406K78129n6806n22109
$$ -293577 -607004 -1106245 -1037749 -533249 -373375 -639958 -683364 -405235 -462041 -984150
39667i84150j60886P01240Q99788K41389l84437n25968n56317n43589q420R01522
$$ -984150 -1145036 -443796 455992 697381 312944 -213024 -769341 -1312930 -1321350 -419828
39657d19828J156755L19825o42080o81781q9441J57445q8862j42292K68242O05964
$$ -419828 736927 1056752 414672 -267109 -356550 -199105 -287967 -430259 -162017 443947
39647D43947M22007l8386l10720k90222j22422Q0977J83725K5758k67593k90224
$$ 443947 865954 827568 516848 226626 104204 185181 368906 394664 127071 -163153
39637a63153N5832K99707Q4878k10810k8714M56840O00224L09220P4651j534l41471
$$ -163153 -107321 192386 277264 66454 37740 494580 1094804 1404024 1478675 1477141 1135670
39626A135670q59113p40217K34878J003096O11155l73806p29237l27913j6108
$$ 1135670 276557 -463660 -228782 774314 1385469 1011663 282426 -45487 -61595
39617f1595r3842m6371K82450L59255j3773k94249j23625J36504J24910M7297
$$ -61595 -155437 -201808 80642 439897 426124 131875 8250 144754 269664 316961
39607C16961J62553K82516J42337j75904m43003n13663k56679K74591N77956K09359
$$ 316961 479514 762030 904367 728463 285460 -228203 -484882 -210291 367665 577024
39597E77024m08608l98143K50545N66877L1619o91285p81652k61977L76976P98413
$$ 577024 168416 -229727 20818 587695 619314 -71971 -853623 -1115600 -738624 59789
39587E9789P24888K8383o96330n09068M73458R80845M32818j63100R3414M97510
$$ 59789 784677 813060 116730 -392338 81120 1061965 1494783 1331683 1425097 1922607
39577A922607J3867q86550r94744l32492M1791j79074l20109j00866N1722K9801
$$ 1922607 1936474 1049924 55180 -277312 -235521 -414595 -734704 -835570 -783848 -754047
39567g54047J78990L70387R2819m30917l57325L65310P98218M78887J4070j05761
$$ -754047 -575057 -204670 -111851 -542768 -900093 -534783 263435 742322 756392 650631
39557F50631j97170m59626m38348J313J62817l01495o09844r4844N79029M39008
$$ 650631 453461 -6165 -444513 -443200 -280383 -581878 -1191722 -1286566 -707537 -268529
39547b68529j93328k59483K70517M08365j60876n83531k64738K36701K11074j09071
$$ -268529 -461857 -721340 -450823 -42458 -203334 -786865 -1051603 -814902 -603828 -712899
39537g12899q4814K48324L28705J4405k66591k19682J1149K32106L92177L43263
$$ -712899 -797713 -549389 -220684 -206279 -472870 -692552 -681403 -449297 -57120 286143
39527B86143p4556n64615n21974P4618M39944P2693m28595k48555L60992M97692
$$ 286143 211587 -353028 -875002 -800384 -360440 -287747 -716342 -964897 -603905 -106213
39517a06213P3641j23522J37593J15383n29809r61785m39141M50829O66470K26524
$$ -106213 -32572 -156094 -18501 96882 -432927 -1394712 -1833853 -1383024 -716554 -490030
39507d90030n9449M5735R2202k7542O7467L56349L04835j66425l97539R840N41749
$$ -490030 -549479 -503744 -411542 -439084 -371617 -15268 289567 123142 -274397 -264557 277192
39496B77192N08082k1880m04301k68466J29546K77909k4492m28019m02488P0251
$$ 277192 785274 763394 359093 90627 220173 498082 473590 45571 -356917 -286666
39486b86666M00667K12654p3925Q5774M34281L01091k68497n37510k29296J18191
$$ -286666 114001 326655 252730 338504 772785 1073876 805379 267869 38573 156764
39476A56764J00814J0580J64237L30117K11607l1430j43983k08175l28227l00678
$$ 156764 257578 268158 432395 762512 974119 942689 798706 590531 262304 -38374
39466c8374r593K16454P9115j58710o6876K50480L02216o1281m75916n85613m04357
$$ -38374 -47967 168487 247602 88892 22016 272496 574712 513431 37515 -548098 -952455
39455i52455j39258R2948K96090M64299M96361K76025j18812l78227k87669j1713
$$ -952455 -1091713 -998765 -702675 -238376 257985 534010 415198 36971 -250698 -262411
39445b62411J55345K04323K72691K28225j39269n44325m05524K40787O12083K56824
$$ -262411 -107066 97257 369948 598173 458904 -85421 -490945 -250158 361925 618749
39435F18749k77220k67719J53871L40862J65896P3733K17121J87162k56939o83771
$$ 618749 341529 73810 227681 568543 734439 808172 1025293 1212455 955516 271745
39425B71745n20971J51855O52382N04362l3881l52184k55875j17885k57032m66796
$$ 271745 -249226 -97371 555011 1059373 1025492 673308 417433 299548 42516 -424280
39415d24280l70494l640K80859L32473K63794J08931j54905l03990o5118L51723
$$ -424280 -794774 -798414 -517555 -185082 78712 187643 32738 -271252 -336370 15353
39405A5353L98455k4425l76024k23842K19579M68897L11829j38068n68238n76388
$$ 15353 413808 389383 13359 -210483 9096 477993 789822 651754 83516 -492872
39395d92872p1014M01417K37755k86589l11745K84590O53702L17297j38528j71422
$$ -492872 -563886 -162469 75286 -211303 -523048 -238458 415244 732541 594013 422591
39385D22591j83652o03940q80822l41073N36109P48938L02017M9922K32228K47131
$$ 422591 238939 -365001 -1245823 -1586896 -1050787 -301849 168 50090 282318 529449
39375E29449j34294l70831j43198J56043J90824J71410K76315K60526k2503k73776
$$ 529449 395155 24324 -118874 37169 227993 399403 675718 936244 913741 639965
39365F39965k48849j26028r8888n7097O4125N5352j74000l64019l10813j43668
$$ 639965 391116 265088 166200 109103 173228 228580 54580 -309439 -620252 -763920
39355g63920k420J71266L35719K72019J7346p2088O9302K8731l50164n47610j28920
$$ -763920 -766340 -595074 -259355 12664 30010 -42078 27224 55955 -294209 -841819 -970739
39344i70739M95531O10180K07803r8281j7430J21934J5482j69283j42782K8120
$$ -970739 -475208 134972 342775 244494 227064 348998 364480 195197 52415 80535
39334H0535J9085k64706m73341j96678M37198P62824L90145j88549k07344K86603
$$ 80535 99620 -165086 -638427 -835105 -397907 364917 755062 566513 359169 645772
39324F45772N20824J78710j97056j86346j38735m07578o24462l68189M118m9799
$$ 645772 1166596 1345306 1148250 961904 823169 415591 -208871 -577060 -572942 -622741
39314f22741k67192l8241M39957M14712j17067l27871J12912N55974M82259K37924
$$ -622741 -889933 -928174 -488217 -73505 -190572 -518443 -405531 150443 632702 870626
39304H70626K46936K60192m5002l38807j77522J76433J71226q7279k3208L91412
$$ 870626 1117562 1377754 1332752 993945 816423 992856 1164082 1076803 1053595 1445007
39294A445007N09445j2241o84526q54728m89571l9126J79350J76694N6767j04998
$$ 1445007 1954452 1942211 1257685 402957 -86614 -125740 53610 230304 287071 182073
39284A82073j80934m7907J93907K39980k6249k73257r0953L89611N49845J02587
$$ 182073 1139 -46768 147139 387119 360870 87613 -3340 386271 936116 1038703
39274A038703m40788m24000N6419L27226J10950j62208o4156K73438M74836M04033
$$ 1038703 597915 173915 230334 557560 668510 506302 442146 715584 1190420 1594453
39264A594453J33366k27027m50407k63765K57239O33790N47891K01131p4152k36207
$$ 1594453 1727819 1500792 1050385 786620 1043859 1677649 2225540 2426671 2352519 2116312
39254B116312l40108k87073p8105J0115j62528l23546k56188j85077l02162l07449
$$ 2116312 1776204 1489131 1411026 1421141 1258613 935067 678879 493802 191640 -115809
39244a15809N9219L93682J73533l33486m02542O0365M61395M58193K43552o3624
$$ -115809 -56590 337092 510625 177139 -225403 -165038 296357 754550 998102 934478
39234I34478n39750r11501o86870k3296K90872j437k14524J56507O08096M50628
$$ 934478 394728 -516773 -1203643 -1226939 -936067 -937504 -1152028 -995521 -387425 63203
39224F3203j17069l74095j29292J94389K82921K00834P4718n2485j21280j14265
$$ 63203 -53866 -427961 -557253 -362864 -79943 120891 195609 143124 21844 -92421
39214i2421j19963j39316k3457K01764K24488q2627l59269k32570J40719L17651
$$ -92421 -212384 -351700 -375157 -173393 51095 -31532 -390801 -623371 -482652 -165001
39204a65001J55831j25109k80320j88011J42299M86732N40728L11538J16250N7946
$$ -165001 -9170 -134279 -414599 -602610 -460311 26421 567149 878687 994937 1052883
39194A052883j05630l91861m06366n0047J33017k10346n76741l84223L5479k6834
$$ 1052883 947253 555392 149026 98979 231996 21650 -555091 -939314 -903835 -930669
39184i30669m41016m05078K61823Q10609O54815J06163j75882K6648M30568O18734
$$ -930669 -1371685 -1776763 -1514940 -704331 -49516 56647 -119235 -92587 337981 956715
39174I56715L66843j19380l30494j04153L3717l90970r39981p67498J04499P25926
$$ 956715 1323558 1204178 873684 769531 803248 412278 -527703 -1295201 -1190702 -464776
39164d64776N21873k1275j93009K0210J81553J07371n0183j37020j15991k7891
$$ -464776 57097 35822 -157187 -136977 44576 151947 101764 -35256 -151247 -179138
39154a79138N796r0795j70964l9160K04858K84199J84299J31456J57652Q5931
$$ -179138 -173342 -264137 -435101 -474261 -269403 14796 199095 330551 488203 574134
39144E74134n6825o1214P156j30199l66706k18933L81570Q20916O02897j1964
$$ 574134 517309 456095 463251 333052 -33654 -252587 128983 949899 1552796 1540832
39134A540832m50137n24120l94966j88168J7239O4897j11748l51110m69924m42619
$$ 1540832 1090695 566575 171609 -16559 680 65577 -46171 -397281 -867205 -1309824
39124a309824k90866k9263K21690L42995M46369O49064O66527J48219n56587o33540
$$ -1309824 -1600690 -1629953 -1408263 -1065268 -618899 30165 696692 844911 288324 -345216
39114c45216K623M54791J44633l32815j91206L47657N48350L60529K80872L14856
$$ -345216 -342593 112198 256831 -75984 -267190 80467 628817 989346 1270218 1585074
39104A585074j0768o43124q69135l62799L17090N24895K68875j02323m29336o13503
$$ 1585074 1574306 931182 62047 -300752 16338 541233 810108 707785 278449 -335054
39094c35054m14088J63668N76079L42179k05482k82309K38917O06624K72685k85521
$$ -335054 -749142 -585474 -9395 332784 127302 -155007 83910 690534 963219 677698
39084F77698k64255K37695L09748m19168j127976q45449K52821J060299Q79977
$$ 677698 413443 651138 960886 541718 -586258 -1431707 -1178886 -118587 761390
39075G61390R4190m78107m80069j65176N7582L8212o8066p9057n6920j68139k89956
$$ 761390 855580 377473 -102596 -267772 -210190 -171978 -240044 -319101 -376021 -544160 -834116
39064h34116q6129L77892N13961N0659m12155k07126L77828N38839J82581o7674
$$ -834116 -920245 -542353 -28392 22267 -389888 -597014 -219186 319653 502234 434560
39054D34560J297n9252l67622l59412K13961O96453M44181k36964n90145m12206
$$ 434560 435857 376605 8983 -350429 -136468 559985 1004166 767202 177057 -235149
39044b35149p3047J20271J20403l4510k08337k03176p6324j29025l57598l32936
$$ -235149 -308196 -187925 -67522 -102032 -310369 -513545 -589869 -718894 -1076492 -1409428
39034a409428P6849L53223J28408j42490J03747N44019M16136k44971o04511k88528
$$ -1409428 -1332579 -979356 -850948 -993438 -889691 -345672 70464 -174507 -779018 -1067546
39024a067546J01589j063k30502R0388P79478R06118J25555o89737n71715J64577
$$ -1067546 -965957 -967020 -1197522 -1107134 -327656 578462 704017 14280 -557435 -392858
39014c92858L60572k28018n09630K19903J032623P09322l37525o72836m9372L58312
$$ -392858 -32286 -260304 -769934 -550031 482592 1191914 854389 181553 132181 490493
39004D90493k7137l62722p946L74341R5883l22482j61778J69264p7873n61673
$$ 490493 463356 100634 92688 467029 562912 240430 78652 247916 170043 -391630
38994c91630l91021L19526N92300J18223l79133l03393J36820M55557M14995J0124
$$ -391630 -782651 -463125 129175 247398 -131735 -435128 -298308 157249 572244 582368
38984E82368n02339o19752j54275L70632L95287J36709J25921K54013N5530l00894
$$ 582368 80029 -539723 -693998 -323366 71921 208630 334551 588564 644094 343200
38974C43200k16361K19194K57364k52715n40816j22020M60803M97399R2613j61121
$$ 343200 126839 346033 603397 350682 -190134 -312154 148649 646048 738661 577540
38964E77540n8520J02166K7349k67426n31332n01895j72335J36670J27582r8160
$$ 577540 519020 621186 648535 381109 -150223 -652118 -824453 -687783 -560201 -658361
38954f58361k09206r3157R6865K21531K27086Q8950n7016O2934M13452N02720
$$ -658361 -867567 -960724 -863859 -642328 -415242 -326292 -383308 -320374 93078 595798
38944E95798N4701m74523n06493j61111N6046P4133J42146J78696l2084j94267
$$ 595798 650499 175976 -330517 -491628 -435582 -361449 -219303 -40607 -72691 -266958
38934b66958J50204P17977P51993J95856k16160j14109R0962R4532J48841L41079
$$ -266958 -116754 601223 1353216 1549072 1332912 1218803 1309765 1404297 1553138 1894217
38924A894217K45562k63363n62881j94484L30832K39188l80601p53514m99907
$$ 1894217 2139779 1876416 1313535 1119051 1449883 1689071 1308470 554956 55049
38915E5049R599L19671M39518O03549P67992N97961l0123p04423q91045o21150
$$ 55049 64648 384319 823837 1427386 2195378 2793339 2763216 2058793 1167748 546598
38905E46598m05548l99805j66738M53279Q20708L97746l13559m52903o5784J22896
$$ 546598 141050 -258755 -425493 27786 848494 1246240 932681 479778 413994 536890
38895E36890o0297j44947l3914j29206l87063k40396L04427M44037j47651o68125
$$ 536890 476593 331646 297732 168526 -218537 -458933 -154506 289531 141880 -526245
38885e26245l52456L92153O44483K75666m7736R3624L92458L35546j47519o08336
$$ -526245 -878701 -486548 157935 433601 385865 479489 871947 1207493 1059974 451638
38875D51638n59765l7109M09777L94366J42455K3072m5444k84771m73340k79498
$$ 451638 -108127 -145236 264541 658907 801362 824434 778990 494219 20879 -258619
38865b58619O0532Q2492p7474M9564L27670K14945j68016j30324L55105N02184
$$ -258619 -198087 -115595 -193069 -143505 184165 399110 231094 100770 455875 958059
38855I58059J9790l93564k13990J39180J41956k1042J2544J01645l7481k96236
$$ 958059 977849 584285 370295 509475 651431 630389 642933 744578 707097 410861
38845D10861m05234k87794L7272M46317N36501O2799m48290k89761K28303J41634
$$ 410861 5627 -282167 -244895 201422 737923 800722 352432 62671 290974 432608
38835D32608n29518o75558O9878O47242K82361l21130k67066J40474K03406R4136
$$ 432608 -96910 -772468 -702590 -55348 227013 -94117 -361183 -220709 -17303 76833
38825G6833L02450N63126L56582r0907k52384k55953n02180p48944m46170L02199
$$ 76833 379283 942409 1298991 1208084 955700 699747 197567 -551377 -997547 -695348
38815f95348Q32083P51455J87778m58623o53431j29966N42859M75791j82027l29794
$$ -695348 136735 888190 1075968 617345 -36086 -166052 376807 852598 670571 340777
38805C40777K79205N25495j50999o65208j15822O11267L55840l71318m45306j00711
$$ 340777 619982 1145477 994478 329270 213448 824715 1180555 809237 363931 263220
38795B63220j88713l46900K39121R19235M32841p05173p47811M27152J051222
$$ 263220 74507 -272393 -33272 885963 1318804 613631 -134180 292972 1344194
38786A344194K82514o47249n95699p7158K7057j51653j64603j36270k26825j61588
$$ 1344194 1626708 979459 383760 306602 333659 182006 17403 -118867 -345692 -507280
38776e07280J26873K47082J43609K51490N45452M11634k12564n80549l48583k8508
$$ -507280 -380407 -133325 10284 261774 807226 1218860 1006296 425747 77164 48656
38766D8656O5088K18296L62033n2754p92142p60002K09223P83589J41583p08479
$$ 48656 113744 332040 694073 641319 -150823 -910825 -701602 81987 223570 -484909
38756d84909n68448J53319M04037K30568K93393M26854M0990n31792l97024M11507
$$ -484909 -1053357 -900038 -496001 -265433 27960 454814 495804 -35988 -433012 -21505
38746b1505R10113N61873j78904o48409n93708j34808K98076J86528m03121o89099
$$ -21505 888608 1450481 1271577 623168 29460 -105348 192728 379256 -23865 -712964
38736g12964k27987L53463K93929j47675k36804R121L0879j85530j73099Q6748
$$ -712964 -940951 -587488 -293559 -441234 -678038 -668917 -638038 -823568 -996667 -909919
38726i09919K09314K16229M05106N59584K35777k55756j76957L09353K31619n62983
$$ -909919 -700605 -484376 -79270 480314 716091 460335 283378 592731 824350 261367
38716B61367r84157l59370M89251N10184n1551k34698J07846L02934J05169R711
$$ 261367 -722790 -1082160 -592909 -82725 -134276 -368974 -261128 41806 146975 156686
38706A56686K77939M53549J37959l23248l39407O9382L43060J74472j63012l00025
$$ 156686 434625 888174 1026133 702885 363478 432860 775920 950392 787380 487355
38696D87355k44782k19250k56469j92429M1763L26424N11024N04637K67837j05246
$$ 487355 242573 23323 -233146 -425575 -383812 -57388 453636 958273 1226110 1120864
38686A120864l50292k83277n6661L5582m2678j02532r5645j29156j36883Q0044
$$ 1120864 770572 487295 430634 466216 423538 321006 225361 96205 -40678 39366
38676C9366M14835M59044J11659j90635j02474R1541j02639o38941r56996o88514
$$ 39366 454201 913245 1024904 834269 731795 823336 720697 81756 -875240 -1563754
38666a563754n2418M68530O44661O18191N89014M92466J02570n29484r42813p60356
$$ -1563754 -1616172 -1147642 -502981 115210 704224 1196690 1299260 769776 -173037 -933393
38656i33393j74525K86490L50068J18360k16635m35788k51523L50044Q33904O59051
$$ -933393 -1107918 -821428 -471360 -353000 -569635 -1005423 -1256946 -906902 -72998 586053
38646E86053L2329l53993k53137j1113J07371J21570m6614m42705o26726j68789
$$ 586053 618382 264389 11252 139 107510 229080 182466 -260239 -886965 -1055754
38636a055754M25337K56917m27427m03604N38416J070502L97806m47171l13891
$$ -1055754 -630417 -373500 -800927 -1204531 -666115 404387 802193 355022 41131
38627D1131K50489J26978l99378k58445M40059O02403J5056m40408l43344j61075
$$ 41131 291620 418598 19220 -239225 200834 803237 818293 377885 34541 -126534
38617a26534j09707J22538M06582J81050l64100l30497L61981O85512J53175m06249
$$ -126534 -236241 -113703 292879 473929 109829 -220668 141313 826825 980000 573751
38607E73751k66148J11046Q8741n4450J26594K70352r1940n38226l98093J16305
$$ 573751 307603 418649 507390 452940 579534 849886 757946 219720 -178373 -62068
38597f2068L22953J93319J70962K14287n0298m32493l56617J35099M06455K59734
$$ -62068 260885 454204 625166 839453 789155 356662 45 135144 541599 801333
38587H01333J41772K50054K23830r4426l28032k73628k73196n17241n74974r9807
$$ 801333 943105 1193159 1416989 1322563 994531 720903 447707 -69534 -644508 -744315
38577g44315M59814M21118j27832m39430j35342L57346M50640J11407k18286k16713
$$ -744315 -284501 136617 8785 -430645 -565987 -208641 241999 353406 135120 -81593
38567h1593k4008O576j72209j70878K84740P77604N75448k96731q39135l38994
$$ -81593 -105601 -99025 -271234 -442112 -157372 620232 1195680 898949 59814 -279180
38557b79180N41245N91981k14448o61884q9387O41786M94114j92840l37941J63231
$$ -279180 262065 854046 639598 -22286 -111673 530113 1024227 831387 493446 656677
38547F56677L88503n5309m85817l66638j02342j46124j60151K45143N98766K64620
$$ 656677 1045180 989871 504054 137416 35074 -111050 -271201 -26058 572708 837328
38537H37328l62695l10247M58804R12861M47399l14637n24542k29766l8190j41967
$$ 837328 474633 164386 623190 1536051 1983450 1668813 1144271 914505 876315 734348
38527G34348k19225q7449L9306n2942k48106k67352l0933K39791K79226Q4705
$$ 734348 515123 427674 466980 414038 165932 -101420 -132353 107438 386664 471369
38517D71369j23289k28206k99315k88671K6784N69589P82470L41021k43827k81831
$$ 471369 348080 119874 -179441 -468112 -441328 128261 910731 1251752 1007925 726094
38507G26094N4156K2001m46882o07761j36794L15339J65397k19198j90048J88430
$$ 726094 780250 802251 355369 -252392 -389186 -73847 91550 -127648 -317696 -129266
38497a29266L89265K57691L4547j43371k45801j21700K37042M60660L08496J28047
$$ -129266 259999 517690 552237 408866 163065 41365 278407 739067 1047563 1175610
38487A175610K85652M45891P2425n69401o64604o4619M83180M27802P1907p3397
$$ 1175610 1461262 1907153 1979578 1410177 745573 680954 1164134 1591936 1663843 1590446
38477A590446j4897n0625k31685l62717l01973p9690J06965j495l86193n90077
$$ 1590446 1575549 1524924 1293239 930522 628549 548859 655824 654329 268136 -321941
38467c21941k53925K87884M16514J44200K0359J51916P3075k65905k27728M02716
$$ -321941 -575866 -287982 128532 272732 293091 445007 518082 252177 24449 427165
38457D27165Q39005M32108k78695m08155r2230j14599m83705l95220L65830R21129
$$ 427165 1266170 1698278 1419583 1011428 919198 804599 320894 -74326 291504 1212633
38447A212633N19801m10691q70221n25335Q0192L21863J15506k02185l22859k03159
$$ 1212633 1732434 1321743 451522 -73813 6379 328242 443748 241563 -81296 -284455
38437b84455K2711K12981K52219N2988k87342m14625r7252L39311L41438n1290
$$ -284455 -261744 -48763 203456 256444 -30898 -445523 -542775 -203464 137974 86684
38427H6684j96999J53548M13478Q7079l97390l41828J53196M26918K74813M7471
$$ 86684 -110315 43233 456711 543790 146400 -195428 -42232 384686 659499 706970
38417G06970p2735k13257l42699l02815k16865k56225j47086M06528R63224Q09944
$$ 706970 634235 420978 78279 -224536 -441401 -697626 -844712 -438184 525040 1334984
38407A334984J10857k73739j11591j0787k29758k86578J5956J96783P9113J52799
$$ 1334984 1445841 1172102 1060511 1049724 819966 533388 549344 746127 825240 978039
38397I78039N08167M52516k06987n40519M7376O99555M21703l02382l31519L13332
$$ 978039 1486206 1938722 1731735 1191216 1238592 1938147 2359850 2057468 1725949 2039281
38387B039281O42523L24658m5082j17142j66182l43933m49976m32634l88079j82397
$$ 2039281 2681804 3006462 2961380 2844238 2678056 2334123 1884147 1451513 1063434 881037
38377H81037K34737L88890p2226n84468l96970J95202L32911L9430N2411L75700
$$ 881037 1115774 1504664 1432438 847970 451000 646202 979113 1018543 1070954 1446654
38367A446654K69908k83557m35052k1314M2766o21956j075833n37214L98897P54115
$$ 1446654 1716562 1433005 997953 976639 1019405 397449 -678384 -1215598 -816701 -62586
38357f2586N18908K64487J27568o1588j99026j36104m8111n6003N0095K86202
$$ -62586 456322 720809 848377 786789 587763 451659 403548 347545 397640 683842
38347F83842K41760j88118m53493k04987J40478J74229J32725K15763N0350m73298
$$ 683842 925602 737484 283991 79004 219482 393711 526436 742199 792549 319251
38337C19251o22938M7179P02825L87342m10838m90223J75499N09051J07903k78215
$$ 319251 -303687 -256508 446317 833659 422821 -67402 108097 617148 725051 446836
38327D46836j15908J81902J51834k0248l1122N1589J56888M28663P61141O83107
$$ 446836 330928 512830 664664 644416 613294 664883 821771 1250434 2011575 2694682
38317B694682N5054n66357o01283j61622J84560J18424j88088l77415k89186q4838
$$ 2694682 2749736 2183379 1582096 1420474 1605034 1723458 1535370 1157955 868769 783931
38307G83931n940k0041R8995K92484K00584j75699k87717Q7782L12584j57561
$$ 783931 777991 757950 856945 1149429 1350013 1174314 886597 974379 1286963 1129402
38297A129402p47637n29725K75547N31801j24238p90891o67502m5935L70340L96398
$$ 1129402 381765 -147960 127587 659388 535150 -255741 -923243 -969178 -598838 -202440
38287b02440K27272k5107k40273j94549Q3698K44813J64534J44664L23222L60398
$$ -202440 24832 -275 -240548 -435097 -351399 -106586 57948 202612 525834 886232
38277H86232M7848k20856l1373L32914K47755l32060p57585n10213J51354M83124
$$ 886232 934080 713224 681851 1014765 1262520 930460 172875 -337338 -185984 297140
38267B97140J11399n04766n83070L897N27825L70831j34878k31725J75855N21069
$$ 297140 408539 -96227 -679297 -675400 -147575 223256 88378 -143347 32508 553577
38257E53577N02427L61231K63359Q5047j04235k2423K00201M6910n01154p68120
$$ 553577 1056004 1417235 1680594 1765641 1661406 1638983 1839184 1886094 1384940 616820
38247F16820l80772J70897L33439K29512J76809R2161j02073p0288L03463M02670
$$ 616820 236048 406945 740384 969896 1146705 1238866 1136793 1066505 1369968 1772638
38237A772638k47714j003168q52709P4085O43329L28880j86533j94183O9491M6492
$$ 1772638 1524924 521756 -330953 -256868 386461 715341 528808 334625 404116 450608
38227D50608j71072q8410K87282M06528L1013l72519k95797Q6433K06785k5049
$$ 450608 279536 191126 478408 884936 915949 543430 247633 334066 540851 515802
38217E15802j06576K05589M24105Q8720m05210l46905J32958K04821l32284o72181
$$ 515802 409226 614815 1038920 1127640 722430 375525 508483 713304 381020 -291161
38207b91161k28420M98091P35325M96985K53214P0742k35088m57562k37139K42193
$$ -291161 -519581 -21490 713835 1210820 1464034 1534776 1299688 842126 604987 847180
38197H47180M46328K71474N6787o1881k23553l62570k66688p3776j10318k55795
$$ 847180 1293508 1564982 1621769 1559888 1336335 973765 707077 633301 522983 267188
38187B67188r7421K67860K77160j40526l62305n7917L14070L32896K67596M31145
$$ 267188 169767 437627 714787 574261 211956 154039 468109 801005 1068601 1499746
38177A499746M88916L8498n63304o49430k49619L7932K7266R5999L70798M57542
$$ 1499746 1988662 2027160 1463856 814426 564807 602739 630005 726004 1096802 1554344
38167A554344J52287j69227j50189K8204N1909J5485J73214M20779M41503K21224
$$ 1554344 1706631 1537404 1387215 1415419 1467328 1482813 1656027 2076806 2518309 2739533
38157B739533K3436p8224k57743n15012n63820k58072J54634L59689L36268K29994
$$ 2739533 2762969 2684745 2427002 1911990 1348170 1090098 1244732 1604421 1940689 2170683
38147B170683O6159j88672m03430l69822r6951J72954K63764K22862J37713m2926
$$ 2170683 2236842 2048170 1644740 1274918 1177967 1350921 1614685 1837547 1975260 1932334
38137A932334l66612o32758n00180O1395N77020N53504J28752o9117J94916L94299
$$ 1932334 1565722 932964 432784 494179 1071199 1624703 1753455 1684338 1879254 2273553
38127B273553M6851m71671m36407J27458N10426M19478K67027K68539R2225k84244
$$ 2273553 2320404 1848733 1412326 1539784 2050210 2469688 2736715 3005254 3097479 2813235
38117B813235k49860L47428O22044l6050q00889n80498K27995L66625k61711n70664
$$ 2813235 2563375 2910803 3532847 3496797 2695908 2115410 2343405 2710030 2448319 1877655
38107A877655k01700L914l22868l88631K17615O18327J26040m89462k32718N03111
$$ 1877655 1675955 1679869 1357001 968370 1185985 1804312 1930352 1440890 1208172 1711283
38097A711283O73467K66370O3810J62549m9068o07373p95355l05345L36243O19002
$$ 1711283 2384750 2651120 2714930 2877479 2828411 2221038 1425683 1120338 1456581 2075583
38087B075583N69208L40434k1651l14665k90294q0614K8145J61752N53165Q07054
$$ 2075583 2644791 2985225 2963574 2648909 2358615 2278001 2306146 2467898 3021063 3828117
38077C828117L12693n95747q26271r8081N76801L69242k36475l33512Q4544L73202
$$ 3828117 4140810 3545063 2718792 2620711 3197512 3566754 3330279 2996767 3081311 3454513
38067C454513L16443K20966J85081m0489m83400p51982n16323P6288N40857N16737
$$ 3454513 3770956 3991922 4177003 4136514 3653114 2901132 2384809 2461097 3001954 3518691
38057C518691J20007j49478L4367M05119M60990J69187l4443O8959K24406J93746
$$ 3518691 3638698 3489220 3523587 3928706 4389696 4558883 4524440 4593399 4817805 5011551
38047E011551N7711q0551k39641k83956M025M24583M74941J47293M93J97639K08621
$$ 5011551 5069262 4988711 4749070 4465114 4469139 4893722 5368663 5515956 5516449 5714088 5922709
38036E922709j34623j23909O14827J192643P04110j95840j37988Q54977J392013
$$ 5922709 5788086 5664177 6279004 7471647 8175757 7979917 7841929 8696906 10088919
38027A0088919Q47582J87759L29093Q37400Q93188O27098O76663J042560J246992
$$ 10088919 10936501 11124260 11453353 12290753 13183941 13811039 14487702 15530262 16777254
38018A6777254J263544J480682J929110K288100K595577L252844M262762N111996
$$ 16777254 18040798 19521480 21450590 23738690 26334267 29587111 33849873 38961869
38010C8961869N604283O249622P533909R285818J1165816J3390944J6453642K0342259
$$ 38961869 44566152 50815774 58349683 67635501 78801317 92192261 108645903 128988162
38002A28988162K4542157K8517702L1315197L0658498K3738319J0095041o563089
$$ 128988162 153530319 182048021 213363218 244021716 267760035 277855076 271291987
37995B71291987k0478737k8077819k9743021k7823886k4165952j9898071j6187955
$$ 271291987 250813250 222735431 192992410 165168524 141002572 121104501 104916546
37988A04916546j3786866j2181591j0316668q122891o479485n731178n200394
$$ 104916546 91129680 78948089 68631421 60508530 54029045 48297867 43097473
37981D3097473m341526l491024l099096k947057k612304k161961j881379j714669
$$ 43097473 38755947 35264923 32165827 29218770 26606466 24444505 22563126 20848457
37973B0848457j444868j137098j001711j045201j148208j226746j094261n41478
$$ 20848457 19403589 18266491 17264780 16219579 15071371 13844625 12750364 12208886
37965A2208886J76338L87090q4587n16604k87836J77336Q6979m75386p45846m95968
$$ 12208886 12385224 12772314 12687727 12171123 11883287 12060623 12147602 11672216 10926370 10430402
37955A0430402k27493j92942n8729K91602L84710n6005n38753m63895L2157L36184
$$ 10430402 10202909 10009967 9951238 10242840 10627550 10571545 10032792 9568897 9601054 9937238
37945I937238K35413J22427L66954P79342Q18682K91308k68515j16574P40655
$$ 9937238 10172651 10295078 10662032 11441374 12260056 12551364 12282849 12166275 12906930
37936A2906930J413505J219419N90378M50246R48986J433522J558222J689195
$$ 12906930 14320435 15539854 16130232 16580478 17529464 18962986 20521208 22210403
37928B2210403K112263K581513K956304L632720M876692O223393P100034P763822
$$ 22210403 24322666 26904179 29860483 33493203 38369895 44593288 51693322 59457144
37920E9457144R087650J1530466J4783146J8436515K2517571K6908292L0112343
$$ 59457144 68544794 80075260 94858406 113294921 135812492 162720784 192833127
37913A92833127K9009997K0807587O049285j0523681k2989209k8468078k8206221
$$ 192833127 221843124 242650711 248699996 238176315 215187106 186719028 158512807
37906A58512807k5012298k0752624j6360517j2726033j0394479q950557p627863
$$ 158512807 133500509 112747885 96387368 83661335 73266856 64316299 56688436
37899E6688436o279697n179827m302977l483492k913710k772054k653948k083557
$$ 56688436 50408739 45228912 40925935 37442443 34528733 31756679 29102731 27019174
37891B7019174j347054j096014j292963j259918o90999J9840M09626L62977k589
$$ 27019174 25672120 24576106 23283143 22023225 21332226 21352066 21761692 22124669 22122080
37882B2122080l61942k43178M43110J142502J407530J579632K142252K812462
$$ 22122080 21760138 21516960 21960070 23102572 24510102 26089734 28231986 31044448
37874C1044448L052578L128311L759408M977139O267260P619049R414534J1474199
$$ 31044448 34097026 37225337 40984745 45961884 52229144 59848193 69262727 80736926
37866H0736926J3368634J5608308J9285470K4385125K9457449L2797072L2620702
$$ 80736926 94105560 109713868 128999338 153384463 182841912 215638984 248259686
37859B48259686K6463614J2845625n464026k1760200l0622387l2005792k9374122
$$ 248259686 274723300 287568925 282104899 260344699 229722312 197716520 168342398
37852A68342398k5363303k0806695j6554305j3713474j2122174j0449316q165951
$$ 168342398 142979095 122172400 105618095 91904621 79782447 69333131 61167180
37845F1167180o175560n282841n150019n026302m581960l777458k700760j763600
$$ 61167180 54991620 49708779 44558760 39532458 34950498 31173040 28472280 26708680
37837B6708680j419827j551128j654628j581327j499020j297647p90701l83612
$$ 26708680 25288853 23737725 22083097 20501770 19002750 17705103 16914402 16530790
37829A6530790o80761j431843j724078j282287p33990m96046k95364J1012M4809
$$ 16530790 15850029 14418186 12694108 11411821 10677831 10181785 9886421 9897433 9942242
37820I942242l24092o11250n07422l38688l72387l49655j09308q784k62132m70159
$$ 9942242 9618150 9006900 8499478 8160790 7788403 7438748 7329440 7320656 7058524 6588365
37810F588365l03417q7964j86258l24369j17407K01242K11549Q7006K60977N76234
$$ 6588365 6284948 6196984 6010726 5686357 5568950 5770192 5981741 6068747 6329724 6905958
37800F905958M76719n8440m39321l49132j16022p6716q3579J05370L29998K74308
$$ 6905958 7382677 7324237 6884916 6535784 6419762 6343046 6259467 6364837 6694835 6969143
37790F969143K6827K2416L89326O61764L73660k30537m51886j22170J21223k10270
$$ 6969143 6995970 7018386 7407712 8069476 8443136 8212599 7760713 7638543 7759766 7549496
37780G549496o79417n83288n3956J57865j50910m15312k77326m6886l027O8937
$$ 7549496 6870079 6286791 6232835 6390700 6239790 5824478 5547152 5500266 5497239 5566176
37770E566176L24346M56045K36088n8541j55457k22762l75843k67063K98917P92575
$$ 5566176 5890522 6346567 6582655 6524114 6368657 6145895 5770052 5502989 5801906 6594481
37760F594481O26899O8652j52523R8106L32757K94394J79012R1946n8309j10615
$$ 6594481 7221380 7290032 7137509 7235615 7568372 7862766 8041778 8133724 8075415 7964800
37750G964800K65283R15095J204492Q83210M66036N09540R10959J199207J202034
$$ 7964800 8230083 9145178 10349670 11232880 11698916 12208456 13119415 14318622 15520656
37741A5520656J130794J220362J547200K060219K582901K900010L023072L286879
$$ 15520656 16651450 17871812 19419012 21479231 24062132 26962142 29985214 33272093
37733C3272093M031330N236057O577447P816855R071947J0730725J3113778J6199563
$$ 33272093 37303423 42539480 49116927 56933782 66005729 76736454 89850232 106049795
37725A06049795J9729661K3574970K7655468L1034329L1201846K5157624J2137893
$$ 106049795 125779456 149354426 177009894 208044223 239246069 264403693 276541586
37718B76541586m611975j9375690k7836019k9649606k7481264k4078319k0606373
$$ 276541586 271929611 252553921 224717902 195068296 167587032 143508713 122902340
37711A22902340j7241698j4234072j1875249j0005691q272082o762634n865714
$$ 122902340 105660642 91426570 79551321 69545630 61273548 54510914 48645200
37704D8645200n542147n238221m578891l714152k903035k192777j634195j374215
$$ 48645200 43103053 37864832 33285941 29571789 26668754 24475977 22841782 21467567
37696B1467567j340496j225600r78909r19653j160986j356108j260026j074606
$$ 21467567 20127071 18901471 17922562 17002909 15841923 14485815 13225789 12151183
37688A2151183r40195o15184p2997J38055l00769q13697p44389l83614l99777
$$ 12151183 11210988 10595804 10522807 10660862 10360093 9546396 8802007 8418393 8018616
37679H018616o58493n68045k96057m96997r27496o17586L97240Q48558K13910
$$ 8018616 7360123 6792078 6496021 5999024 5071528 4453942 4851182 5699740 5913650
37670E913650l89533o8152L41096k26335j092244q69967J71351M65433l09960
$$ 5913650 5524117 5455965 5797061 5570726 4478482 3608515 3779866 4245299 3935339
37661C935339p60387j05132O19893L56292l33359l76048R1681K29229o610l7124
$$ 3935339 3174952 3069820 3689713 4046005 3712646 3336598 3428279 3657508 3650898 3613774
37651C613774J16614m1623l70010k40741K52677L51289k7268j28612K16295J87040
$$ 3613774 3730388 3688765 3318755 3078014 3330691 3681980 3654712 3526100 3742395 3929435
37641C929435n06439q64827j94931N52803J91278p10364o43623M11968R28347
$$ 3929435 3422996 2558169 2363238 2916041 3107319 2396955 1753332 2165300 3093647
37632C093647K52089m65143k61393J33892k73070r41466o94630K73090O86535
$$ 3093647 3345736 2880593 2619200 2753092 2480022 1538556 843926 1117016 1803551
37623A803551K19871j48492J03028K52546k42608p01570l64283L07156M25662
$$ 1803551 2023422 1874930 1977958 2230504 1987896 1286326 922043 1229199 1654861
37614A654861J64687L52077Q88549P69042k23865r73327o34397J15283J32259
$$ 1654861 1819548 2171625 3060174 3829216 3605351 2632024 1997627 2112910 2245169
37605B245169n23307q32601l98337J32376K07828R0388J85284L34126K14691j7867
$$ 2245169 1721862 889261 490924 623300 831128 921516 1106800 1440926 1655617 1637750
37595A637750K626J98077J42385k74421o75065o82496k82261K84161P09098P16590
$$ 1637750 1640376 1838453 1980838 1706417 1031352 348856 66595 350756 1059854 1776444
37585A776444K73438k46218l73460j01993J00456p8300l98608m41769j63425J23260
$$ 1776444 2049882 1803664 1430204 1328211 1428667 1350367 951759 509990 346565 469825
37575D69825J80136N8821n1633l0723Q6841J25248o7886l71735m19747m9488L72093
$$ 469825 649961 708782 657149 626426 713267 838515 770629 398894 -20853 -70341 301752
37564C01752L34398j15056l74758j25982J67284p0957n84383n40623K36358Q74694
$$ 301752 636150 521094 146336 20354 187638 116681 -467702 -1008325 -771967 102727
37554A02727O25813n6951j80542L41007O39403K58983k27971k25774n45p4469
$$ 102727 728540 671589 491047 832054 1471457 1730440 1502469 1276695 1276150 1201681
37544A201681l25602l27731j57609j46073j23228K93638Q12954P26638P8937k83444
$$ 1201681 876079 548348 390739 244666 121438 415076 1228030 1954668 2033605 1750161
37534A750161j2657K42491j1360l00744r7692J86288r1157o05628m94184K39093
$$ 1750161 1737504 1979995 1968635 1667891 1570199 1756487 1665330 1059702 565518 804611
37524H04611O60659K90606k70811l37989p8486n7851l36296n08008l81182j57933
$$ 804611 1465270 1755876 1485065 1147076 1068590 1010739 674443 166435 -214747 -372680
37514c72680k5866M4695Q6458M4191j1173J41897M98526O47686K77824k41317
$$ -372680 -398546 -353851 -267393 -223202 -234375 -92478 406048 1053734 1331558 1090241
37504A090241j99104M43003Q24199K85947o64305r78737m24893K76065N46545
$$ 1090241 891137 1334140 2158339 2444286 1779981 801244 376351 652416 1198961
37495A198961M80348K39440k54477p40488n60100K77718P10310N0811q12198o00794
$$ 1198961 1679309 1918749 1664272 923784 363684 641402 1351712 1402523 590325 -10469
37485a0469L97648P15249q1093p97847m90418K16613K70114k52832n06042j99687
$$ -10469 387179 1102428 1021335 223488 -266930 -50317 219797 -33035 -539077 -738764
37475g38764K34501M53895M62173K74057l9361j31198K00528N12490K46630l44494
$$ -738764 -504263 -50368 411805 685862 646501 515303 715831 1228321 1474951 1130457
37465A130457m80631n7907J76037j66521m69702j05577N28826N68403p7883o69636
$$ 1130457 649826 591919 767956 601435 131733 26156 554982 1123385 1045502 375866
37455C75866o70716k62363J60283M57507N87769M49323J23262n3060P8384K23408
$$ 375866 -294850 -557213 -396930 60577 648346 1097669 1220931 1167871 1246255 1469663
37445A469663O0612k56569l24778r3309Q8809K030j81478k18685j03648N3451
$$ 1469663 1530275 1273706 948928 855619 944428 946458 764980 546295 442647 496098
37435D96098K16491L34156K53673o7777l77865l64566l7221K84255L20900M3050
$$ 496098 712589 1046745 1300418 1232641 854776 490210 452989 737244 1058144 1101194
37425A101194l88118o94741n74909m423N38437M69398j51898n77534l06087K35448
$$ 1101194 713076 18335 -556574 -560997 -22560 446838 294940 -282594 -588681 -353233
37415c53233L16297k5170q9835L32881N87570J91437l53818l19472J13482J90697
$$ -353233 -36936 -62106 -151941 180940 768510 959947 606129 286657 400139 590836
37405E90836j48989j79929L52952P24088L60432k24989k41948J46011J52874l39510
$$ 590836 441847 261918 614870 1338958 1699390 1474401 1232453 1378464 1531338 1191828
37395A191828o30360l25486J29300K21916O4960J5530Q2903P6484J3263K2951
$$ 1191828 561468 235982 365282 587198 652158 667688 750591 827075 840338 863289
37385H63289O4138L9219K7583J33694K34334J37286q5498j54683L9069K72480
$$ 863289 927427 966646 994229 1127923 1362257 1499543 1414045 1259362 1298431 1570911
37375A570911K28431j50609n41814n24295p6933L04208J91493j74126k03557J60008
$$ 1570911 1799342 1648733 1106919 582624 505691 809899 1001392 827266 623709 783717
37365G83717L34680j5659m67226m74942j17450J56462K00574J69449P7015j77349
$$ 783717 1118397 1102738 635512 160570 43120 199582 400156 569605 646620 469271
37355D69271m36344l69341L6998L73493K57363k68339p61809p17006j4108Q32371
$$ 469271 32927 -336414 -299416 74077 331440 63101 -698708 -1415714 -1429822 -597451
37345e97451J074258N55460q6177k35809k1048P1625l6591p5416l365j0157o7771
$$ -597451 476807 1032267 946090 710281 689233 760858 724267 648851 645486 635329 567558
37334E67558K3015K05679K53325K11131K72833K92578k6637m83284n37155j90485
$$ 567558 590573 796252 1049577 1260708 1533541 1826119 1799482 1316198 779043 588558
37324E88558n4623l48526m97578p5324M62370M72364P8756j32670m4051k7959
$$ 588558 533935 185409 -312169 -387493 74877 547241 625997 493327 449276 421317
37314D21317k11483l03303j48331L5303O5424O5939J87671L24828K71186J5612
$$ 421317 209834 -93469 -241800 -206497 -141073 -75134 112537 437365 708551 724163
37304G24163k41969l12650j95064m1031M0466R8359J91302K05919J2146k42662
$$ 724163 482194 169544 -25520 -66551 -26085 72274 263576 469495 481641 238979
37294B38979k75542j27883j33612l20904k67724J92464N54464L55047n8332l8661
$$ 238979 -36563 -164446 -298058 -618962 -886686 -694222 -139758 215289 156957 118296
37284A18296L24127L62322m3489k51704O9929L86947J82305k18439k41179j3723
$$ 118296 442423 804745 761256 509552 579481 966428 1148733 930294 689115 675392
37274F75392o0294l26701k53267K20793M49302O1272m46230m24374N6098M22142
$$ 675392 615098 288397 35130 255923 705225 766497 320267 -104107 -48009 374133
37264C74133L70201M2258l25949n33274l60704J85271O48087N36494m0558m97454
$$ 374133 744334 786592 460643 -72631 -433335 -248064 400023 936517 895959 398505
37254C98505n13966k89374o3175J73649L85847L60250Q1893j32260j15785j00300
$$ 398505 -115461 -404835 -468010 -294361 91486 451736 533629 401369 285584 185284
37244A85284k04816r7914L98662P45212L37786m69918o94424q3652N36528M64894
$$ 185284 -19532 -117446 281216 1026428 1364214 894296 199872 116220 652748 1117642
37234A117642J9985j47008o6393j83577m34960l12821K10808N19682K86976j4702
$$ 1117642 1137627 990619 924226 740649 305689 -7132 203676 723358 1010334 995632
37224I95632J19239M13884K66297k76882n72134l27785O8551K32812K38799J95210
$$ 995632 1114871 1528755 1795052 1518170 946036 618251 686802 919614 1158413 1353623
37214A353623q4678o18032r00283n09046K28480O53917O21555M30117J72107k29459
$$ 1353623 1268945 650913 -249370 -758416 -529936 123981 745536 1175653 1347760 1118301
37204A118301n15940l41224L2489K9382k41633j02167M74019O72513J66481l06426
$$ 1118301 602361 261137 293626 323008 81375 -20792 453227 1125740 1292221 985795
37194I85795j80420M2225j94576m47064j09472M01367L12952j70936k61362O9996
$$ 985795 805375 847600 653024 205960 96488 497855 810807 639871 378509 448505
37184D48505K05039N6907L7417N3331l07110o90012l10942N79247Q23789J49789
$$ 448505 653544 710451 747868 801199 494089 -195923 -506865 72382 896171 1045960
37174A045960m31039l17194j01781j89497j693O79620Q79782j0848r48804p25725
$$ 1045960 614921 297727 195946 6449 4756 684376 1564158 1553310 604506 -121219
37164a21219J45230L57013r2309j91987J64820J29309l84184m72829J02902M56151
$$ -121219 24011 381024 288715 96728 261548 390857 6673 -466156 -363254 92897
37154I2897J35555j20877K55746O65208M06394j54781k80958m4032J779j66967
$$ 92897 228452 107575 363321 1028529 1434923 1280142 999184 955152 956931 789964
37144G89964j55159L7663M8173j66961k88702j95238p9492p5038j43874k36359
$$ 789964 634805 672468 720641 553680 264978 69740 -9752 -84790 -228664 -465023
37134d65023k59851p1672K13100K06437j09964j35580M31007Q61432L57857n68754
$$ -465023 -724874 -796546 -583446 -377009 -486973 -622553 -191546 669886 1027743 458989
37124D58989o68555J66498O92052K06144m61225l88450L9094Q187k77327j01274
$$ 458989 -209566 -43068 648984 855128 393903 5453 44547 52734 -224593 -325867
37114c25867L67859L73572l839N6350O01770P01262L0o48291n56913j96969k07658
$$ -325867 41992 415564 411725 468075 1069845 1771107 1771137 1122846 565933 368964 161306
37103A61306l32953j14989J31836n2453k81231M8878N71477M49325j95237m34607
$$ 161306 -171647 -286636 -154800 -207253 -488484 -439606 131871 581196 385959 -48648
37093d8648n2481J77109j45501m35153j97599J95366K64747J97663L26815M50650
$$ -48648 -101129 75980 -69521 -504674 -702273 -506907 -242160 -44497 282318 732968
37083G32968K48705q3721j66474n0887j1285k7307M5029N0567k22381n60319n55042
$$ 732968 981673 897952 731478 680591 669306 641999 687028 737595 515214 -45105 -600147
37072f00147k03023J43094L30990N00060O49085N29983O9365m12204n57748l77446
$$ -600147 -803170 -660076 -329086 170974 820059 1350042 1419407 1007203 449455 72009
37062G2009j57749o3623J7303K09755L62131K09162j72756l38810p1470K57562
$$ 72009 -85740 -149363 -132060 77695 439826 648988 476232 137422 65952 323514
37052C23514K10669p2920j68038r0897j81145l54492j43209M28149O87898L00331
$$ 323514 534183 461263 293225 202328 21183 -333309 -476518 -48369 639529 939860
37042I39860k04483k51339l1371k7529j78806r5759J60544J31116k42206l86803
$$ 939860 735377 484038 452667 425138 246332 150573 311117 442233 200027 -186776
37032a86776J51193R99134J261746N68326l47596l87679N61023J429080J361312
$$ -186776 -35583 963551 2225297 2793623 2446027 2058348 2619371 4048451 5409763
37023E409763P79397N07331M01117j99784j008173j027371k72451O6673m78552
$$ 5409763 6189160 6696491 7097608 6897824 5889651 4862280 4589829 4656502 4177950
37014D177950q88148l90227K51254N6930n90954p32833l93133k59450l84004k74771
$$ 4177950 3289802 2899575 3150829 3207759 2616805 1883972 1490839 1231389 847385 572614
37004E72614J08341L72995L82333J86523k83329p76266o14593K05848N88181n3937
$$ 572614 680955 1053950 1436283 1622806 1339477 563211 -51382 154466 742647 688710
36994F88710o36597n4108R01318P82932r4060k68701L28188M26347j85920l79619
$$ 688710 52113 -1995 899323 1682255 1588195 1319494 1647682 2074029 1888109 1508490
36984A508490P6524O9607o38065p66289J75003Q18225J67152p71503p29139j01621
$$ 1508490 1585014 1654621 1016556 250267 425270 1243495 1410647 639144 -89995 -191616
36974a91616R5407m8220O5840K61186J43162M9716K96448L30462k47587o95788
$$ -191616 -96209 -144429 -78589 182597 325759 375475 671923 1002385 754798 59010
36964E9010l19704K35786J13466k24942L8029M23682K6070o49974m19068M69128
$$ 59010 -260694 -24908 88558 -136384 -98355 325327 351397 -298577 -717645 -248517
36954b48517O90742Q6689k06976J76632L80898R8427R4986N71722O05799j67960
$$ -248517 442225 528914 321938 498570 879468 977895 1072881 1644603 2250402 2082442
36944B082442p43039l61114K73328K25999k39630l26962J4637K92219L15422J47285
$$ 2082442 1339403 978289 1251617 1477616 1237986 911024 925661 1217880 1533302 1680587
36934A680587k28803o17131n50332k5833K97977R7559j09019P2191K26386L330
$$ 1680587 1451784 834653 284321 258488 556465 654024 545005 617196 843582 846912
36924H46912j60793N5633P2632n30834r34504k30395R05498J025729J01180m86064
$$ 846912 686119 741752 814384 283550 -650954 -881349 24149 1049878 1151058 664994
36914F64994j07218L53291J65132j53864P916K42349j1044l35794l7139N76591
$$ 664994 557776 911067 1076199 922335 930251 1172600 1161556 825762 788623 1365214
36904A365214O04039j6162m23583j70039K08704J42669j59802k09161k7539J3346
$$ 1365214 1969253 1953091 1529508 1359469 1568173 1710842 1551040 1341879 1314340 1327686
36894A327686j54612k61765j88010q7087o6214r3657k22335n29895p58497m33937
$$ 1327686 1173074 911309 723299 636212 569998 476341 254006 -275889 -1034386 -1468323
36884a468323M02726R45105N27987m14905q00276k72964L86876L75859j14079
$$ -1468323 -1065597 -120492 407495 -7410 -807686 -1080650 -693774 -317915 -431994
36875d31994l32180n7705K33249J53171j19456k04265n030L01761N20985N37607
$$ -431994 -764174 -821879 -588630 -435459 -554915 -759180 -764210 -462449 58536 596143
36865E96143L32354M2189j03524k6183R6808N7266j29749k86748l15025k59699
$$ 596143 928497 970686 867162 840979 937787 995053 865304 578556 263531 3832
36855C832j71597l4950J39253K42007J56682j04320l89486n15618l68765L8500
$$ 3832 -167765 -202715 -63462 178545 335227 230907 -158579 -674197 -1042962 -1004462
36845a004462N19746P48381M91346r3385m87932k96620L05799P21684N36950j03028
$$ -1004462 -484716 263665 755011 661626 173694 -122926 182873 904557 1441507 1338479
36835A338479o90164p91698l26649L77897P59181M83268j34070l84086j2271M18396
$$ 1338479 648315 -143383 -470032 -92135 667046 1150314 1016244 632158 619887 1038283
36825A038283K68226k92515n36930k24408R9839m8791m04569l93453M0713M06458
$$ 1038283 1306509 1013994 477064 252656 352495 303704 -100865 -494318 -453605 -47147
36815d7147L28075o0419l39275k08659K82457P38901P15246J78372l91676n13367
$$ -47147 280928 220509 -118766 -327425 -44968 693933 1409179 1587551 1195875 682508
36805F82508k17320J09756K41238K33536J74673J15806J66359L35574L49740j2838
$$ 682508 465188 574944 816182 1049718 1224391 1340197 1506556 1842130 2191870 2179032
36795B179032m57019m65659o6771J66662l1045k72132k01793j8054k2179j29099
$$ 2179032 1722013 1256354 1189583 1356245 1325200 1053068 851275 833221 811042 681943
36785F81943j79387k84235m45352k86760L12790P32007L76866l84444p26081n20140
$$ 681943 502556 218321 -227031 -513791 -201001 531006 907872 523428 -202653 -722793
36775g22793k38099M1575N87398J060995O88280l95935j001216n25182J71283
$$ -722793 -960892 -919317 -331919 729076 1417356 1021421 20205 -504977 -333694
36766c33694J28707l04034k21622L30825N49371K03749j47953j33585N8896K45270
$$ -333694 -204987 -509021 -730643 -399818 149553 353302 205349 71764 130660 375930
36756C75930M57551N64625L30740q4419k69031k41239l80054o21808m26226K49516
$$ 375930 833481 1398106 1728846 1644427 1375396 1134157 754103 132295 -293931 -44415
36746d4415O43493K55222l49750l16960L07934P18090M58638j15598m36084l54435
$$ -44415 599078 854300 504550 187590 495524 1213614 1672252 1556654 1120570 766135
36736G66135j34091q2101k53185l96407k30095J49852K91486k3961m04861l35146
$$ 766135 632044 549943 296758 -99649 -329744 -179892 111594 87633 -317228 -652374
36726f52374R4828L03507N5044k10028m3204L36637L58467n9177l68136j51901
$$ -652374 -557546 -254039 -198995 -409023 -452227 -115590 242877 183700 -184436 -336337
36716c36337L12500M75244K52301L901r5405k17663l70272k24324K77075N70490
$$ -336337 -23837 451407 703708 707609 612204 394541 24269 -200055 77020 647510
36706F47510J83801m81253o13966j12889L29296K63483K0743M4471K21045K00553
$$ 647510 831311 350058 -263908 -376797 -47501 215982 236725 281196 502241 702794
36696G02794l536j18194q6362r3181k28278l72654l61728j31583J98211L42934
$$ 702794 699258 581064 494702 401521 173243 -199411 -561139 -692722 -494511 -151577
36686a51577J43085j46657j44650O6571N1122k04062j81699K63495N28964K32882
$$ -151577 -8492 -155149 -299799 -233228 -182106 -386168 -567867 -304372 224592 457474
36676D57474p3732J72136M74928L8872p73628q34677k2856N40183K31753k02106
$$ 457474 383742 555878 1030806 1069678 296050 -538627 -561483 -21300 210453 8347
36666H347L844M18790K89178j58955j97610J37166K04590r2848k41126j02934
$$ 8347 12191 430981 720159 561204 363594 500760 705350 612502 371376 268442
36656B68442r9821l28923k99327K07184O74731N89151J32607j94694k35889j24949
$$ 268442 168621 -160302 -459629 -252445 422286 1011437 1144044 949350 713461 588512
36646E88512O6349K57800K17651j23358m10959k91397N2526J68886L1991L2546
$$ 588512 654861 912661 1130312 1006954 595995 304598 357124 526010 558001 590547
36636E90547K65799L04400j10082n36326l77196K38159N68262K69973j49021r9695
$$ 590547 856346 1160746 1050664 514338 137142 375301 943563 1213536 1064515 964820
36626I64820K46031K89720m2644k31403m5365Q6269j82540n01887l66603Q7214
$$ 964820 1210851 1500571 1457927 1226524 1181159 1267428 1084888 583001 216398 303612
36616C03612L18221J95320O2155R0454Q5656n4536j59827j46813j58547k47964
$$ 303612 621833 817153 879308 969762 1055418 1000882 841055 694242 535695 287731
36606B87731k67424j52919m158J44796K99636K86381j0781k32306P5997O31188
$$ 287731 20307 -132612 -136770 8026 307662 594043 583262 350956 426953 1058141
36596A058141O29456m4443n57164l88447p7374j98749l61470N617M88072K76296
$$ 1058141 1687597 1643154 1085990 697543 620169 421420 59950 65567 553639 829935
36586H29935m35269o63772j41358L77571L75170K09571K73378L55804K13078P3692
$$ 829935 394666 -269106 -410464 -32893 342277 551848 825226 1181030 1394108 1467800
36576A467800J38479J53170o5978j84457P7288L55659J86533j89879j76373K12036
$$ 1467800 1606279 1759449 1693471 1509014 1586302 1941961 2128494 1938615 1762242 1974278
36566A974278L52408k3524m44206m17091o6787J85761K26908K12321J52277q3030
$$ 1974278 2326686 2303162 1858956 1441865 1375078 1560839 1787747 2000068 2152345 2069315
36556B069315m02025n03426l29116j88186k61343k80143J4521L49416K73505j16262
$$ 2069315 1667290 1163864 834748 646562 385219 105076 119597 469013 742518 626256
36546F26256l13876k24855k51199m63030l60054K37004P04879N11777M1925n8605
$$ 626256 312380 87525 -163674 -626704 -986758 -749754 -44875 466902 508827 450222
36536D50222J19185Q4938j17284j00061K5157j54510m68842l48342J49126L65658
$$ 450222 569407 654345 537061 437000 462157 307647 -161195 -509537 -360411 5247
36526E247J47134M7809K89344L88495Q3504j97311j47843j07596l56830n65958
$$ 5247 152381 200190 489534 878029 961533 764222 616379 508783 151953 -414005
36516d14005l97325o7987J11621K17605L56016L79698L01710L87323N06488J14741
$$ -414005 -811330 -879317 -767696 -550091 -194075 185623 487333 874656 1381144 1495885
36506A495885p04455r91497l00325M59688L32886k53780k81020K38863M62668
$$ 1495885 791430 -200067 -500392 -40704 292182 38402 -242618 -3755 458913
36497D58913J50373j52923j73545j69348k04379m6297K11566K08292J0293L5773
$$ 458913 609286 456363 282818 113470 -90909 -137206 74360 282652 292945 328718
36487C28718K79605K94601l8615l59831m47160l88012j83136K01461M60465K79166
$$ 328718 608323 902924 864309 504478 57318 -330694 -513830 -312369 148096 427262
36477D27262m0752L1247L35797K54599j99516l67891o0574J77819M4908j26043
$$ 427262 386510 417757 753554 1008153 808637 440746 380172 557991 602899 476856
36467D76856j34465k25722l91032k05867L11858N17498J94334m0403J64732K46705
$$ 476856 342391 116669 -274363 -480230 -168372 349126 543460 503057 667789 914494
36457I14494k21835o46467l47790K75223L83630J1151j61825j5226m5185l47258
$$ 914494 692659 46192 -301598 -26375 357255 368406 206581 191355 146170 -201088
36447b01088m24017p6844K42687J55026j31090k27190o8287J74271L51712L53638
$$ -201088 -625105 -701949 -459262 -304236 -435326 -662516 -730803 -556532 -204820 148818
36437A48818J31889j59049k56872j19985K9305N0852N7567J42266J60105k0612
$$ 148818 280707 121658 -135214 -255199 -225894 -175042 -117475 24791 184896 164284
36427A64284k03264q0112K47780K86009j49610n33634k99686K71315L76175q8069
$$ 164284 -38980 -119092 128688 414697 265087 -268547 -568233 -296918 79257 -8812
36417h812l04016J82955O64045L36215m03577n47934j877M01115K48624k7830
$$ -8812 -312828 -129873 534172 870387 466810 -81124 -83001 318114 566738 538908
36407E38908q7501j07459j38240O4615L34899J12219n15504o73772l9008N47843
$$ 538908 451407 343948 205708 270323 605222 717441 201937 -471835 -510843 37000
36397C7000L59862j27553j02111L25217M80850K10565j33826l54943l99370j18348
$$ 37000 396862 269309 167198 492415 973265 1183830 1050004 695061 295691 177343
36387A77343L39726L72340j97790o09255k45333L28949K64278j83761j87613J70894
$$ 177343 517069 889409 691619 82364 -162969 165980 430258 246497 58884 229778
36377B29778J32919k79020l02889J03925J41633l15986l58606L81661R60603N82241
$$ 229778 362697 83677 -219212 -115287 26346 -289640 -648246 -266585 694018 1276259
36367A276259j57020k86663N5180P8144k48923k34650K79769O05235K53605l61009
$$ 1276259 1119239 832576 887756 965900 716977 482327 762096 1367331 1620936 1259927
36357A259927n33233j81018J49137L0363l51860n06184k88162l8213l8594j11121
$$ 1259927 726694 545676 694813 725176 373316 -132868 -421030 -459243 -497837 -608958
36347f08958K4767K53120K94853K47581L96330N75240L12570l17381o03582k01104
$$ -608958 -584191 -331071 -36218 211363 607693 1182933 1495503 1178122 574540 373436
36337C73436L22086K98404j29547l46575j73806L9842L2582j24578l03250m33454
$$ 373436 695522 993926 864379 517804 343998 383840 416422 291844 -11406 -444860
36327d44860l77894n4018L03574L33054O0474p6638J57672M30666K91594k04306
$$ -444860 -822754 -876772 -573198 -240144 -179670 -256308 -98636 332030 623624 419318
36317D19318n89906o00631l78580p7215L36241P19424O27073m2330n90214l07269
$$ 419318 -170588 -771219 -1149799 -1227014 -890773 -171349 455724 413394 -176820 -484089
36307d84089M24695N39249j59193o61097k77246L21730J89924m40202n96291l8664
$$ -484089 -59394 479855 320662 -340435 -617681 -295951 -106027 -546229 -1142520 -1181184
36297a181184N51655O43615L39208q7087m14644l45206J62737N38752K81080j64476
$$ -1181184 -629529 14086 353294 266207 -148437 -493643 -330906 207846 488926 324450
36287C24450j3313N23700N03390j61312m93407o2245L21090j1851n27188m60772
$$ 324450 311137 834837 1338227 1176915 683508 621263 942353 930502 403314 -57458
36277e7458J496K42154K21322K32647K17013K8441r3716L1110O5251k55073n48963
$$ -57458 -55962 186192 407514 640161 857174 885615 791899 823009 888260 633187 84224
36266H4224m15529j05851N6627L15437P88858Q08576n7618q91846n33775N59075
$$ 84224 -331305 -437156 -380529 -65092 723766 1532342 1474724 582878 49103 608178
36256F08178Q64697O5398o13585m36888j16388l08249m77653l1799M75033K51247
$$ 608178 1472875 1538273 924688 487800 371412 63163 -414490 -446289 28744 279991
36246B79991l37971l29124K89788O01791K22779j71140N7735N84327O49353R9892
$$ 279991 -57980 -387104 -97316 504475 727254 556114 613849 1198176 1847529 1947421
36236A947421m93016o00612k81670O2824K13920K27971J54020l8699k37614k17116
$$ 1947421 1454405 853793 572123 634947 848867 1076838 1230858 1192159 954545 737429
36226G37429j7264L2900j45255j92731N4936J84518r9004l25752M8010O37690
$$ 737429 720165 753065 607810 415079 470015 654533 555529 229777 277787 915477
36216I15477O16544K4429k97317o7725P9613k11400m10346q7541L05230J88093
$$ 915477 1532021 1556450 1259133 1191408 1271021 1059621 649275 561734 866964 1055057
36206A055057k46973m49745l14966n3939K62716N23167L97671j16613m10752r7440
$$ 1055057 808084 358339 43373 -10566 252150 775317 1172988 1056375 645623 548183
36196E48183K85168M1036n69920p00630j72593L56365L87829R4178j59391k40809
$$ 548183 833351 874387 304467 -396163 -568756 -212391 175438 269616 110225 -130584
36186a30584j54271L7211J60646J29471J10730K00372J52041j80250m05454j20525
$$ -130584 -284855 -247644 -86998 42473 153203 353575 505616 325366 -80088 -200613
36176b00613L62653M10865K2732k33739j14920J08097K58748L74852K72155k78859
$$ -200613 162040 572905 595637 361898 246978 355075 613823 988675 1260830 981971
36166I81971r01208q72412j66604M43379M65807K03741M8340l0885q6029J0956
$$ 981971 80763 -791649 -958253 -514874 -49067 154674 203014 172129 86100 97056
36156I7056J22214j06890m98515l90815K51042N74312J19406m37304l60041R5947
$$ 97056 219270 112380 -386135 -776950 -525908 48404 167810 -269494 -629535 -533588
36146e33588L39353M00164M89366L06603l30097p56126l41377L55680L41306k43329
$$ -533588 -194235 205929 695295 1001898 671801 -84325 -425702 -70022 271284 27955
36136B7955l84130J60400N75965L54795q5701k76790k77895k01863J4380J72746
$$ 27955 -356175 -195775 380190 734985 649284 372494 94599 -107264 -92884 79862
36126G9862q1428n29418n04995O0579M76734L78077J81058K08144J84015m6482
$$ 79862 -1566 -530984 -1035979 -975400 -498666 -120589 60469 268613 452628 406146
36116D06146j16810J03007J29348k38982m04305M1802N22039L76023o5812j12443
$$ 406146 289336 392343 521691 282709 -121596 -79794 442245 818268 752456 640013
36106F40013J03558l2195m39317m42503P9590M90658L71991J3221j55208p2252
$$ 640013 743571 711376 272059 -170444 -90854 399804 771795 785016 629808 557556
36096E57556R1556J56354o843l00842l73974r7643J24340p2929l87703l08407
$$ 557556 649112 805466 798623 497781 123807 26164 150504 77575 -310128 -618535
36086f18535L7751J01936j82531l54963j87063J40495N12728Q59546P87569L3797
$$ -618535 -580784 -478848 -661379 -1016342 -1203405 -1062910 -550182 309364 1096933 1130730
36076A130730p63267o55717J75971N61411J20986j88955K41787O00703O8153o89163
$$ 1130730 367463 -288254 -112283 449128 570114 381159 622946 1223649 1291802 602639
36066F02639n57214J91348L75699j59797m22307k1142K65180p3060m50100k96071
$$ 602639 45425 236773 612472 452675 30368 9226 274406 201346 -248754 -544825
36056e44825O160l6639q5611L06312O76132L22638m05665n29101J5863L07737
$$ -544825 -538665 -575304 -660915 -354603 321529 644167 238502 -290599 -274736 33001
36046C3001q043j82291K54810O03145J82553m24453k81517L11474K76974m27228
$$ 33001 24958 -157333 97477 700622 883175 458722 177205 488679 765653 338425
36036C38425o83773l7372N51870K58564l42054l17939J18536J11694l52743n01858
$$ 338425 -345348 -382720 169150 427714 85660 -232279 -113743 -2049 -354792 -856650
36026h56650r2300L12280L61520L21528L57549K42534j9848n0102J60898R2871
$$ -856650 -948950 -636670 -275150 46378 403927 646461 626613 576511 737409 830280
36016H30280l78259o18255k46765J79419P9320j77684N3926N31222M97916m3016
$$ 830280 452021 -166234 -412999 -233580 -154260 -331944 -278018 253204 751120 708104
36006G08104l28673n7356K34869J31507r9677j41698j45436k59551k25603J17004
$$ 708104 379431 322075 556944 688451 588774 447076 301640 42089 -183514 -66510
35996f6510L93021K58308K9300J77098M64864K62101l66039o14880j58412K66787
$$ -66510 326511 584819 614119 791217 1256081 1518182 1152143 537263 378851 645638
35986F45638o7913p36650p30318N7293O53211L96397j97906l39118j54135l17708
$$ 645638 577725 -158925 -889243 -831950 -178739 217658 19752 -319366 -473501 -791209
35976g91209p67364o18270M67567J523573J390644K14410p46827p00114j30217
$$ -791209 -1558573 -2176843 -1709276 -185703 1204941 1419351 672524 -27590 -157807
35967a57807R5104q4599n4995L89044O61456K50042m53233o03844m6196M73125
$$ -157807 -62703 -147302 -202297 186747 848203 1098245 645012 41168 -5028 468097
35957D68097L34711j52454k86548J8828K26432L7991k44335k75424j39268q1991
$$ 468097 802808 650354 363806 382634 609066 647057 402722 127298 -11970 -93961
35947i3961j09152p2849O7753K53187L95178L21071r5524n97854o48325j19563
$$ -93961 -203113 -275962 -208209 44978 440156 761227 665703 67849 -580476 -700039
35937g00039L94116K86732k46741m87913j59723K96565L96469J71630n3411j33284
$$ -700039 -305923 -19191 -265932 -753845 -913568 -617003 -220534 -48904 -102315 -235599
35927b35599j50456j53953n8736J88995M48221M72243K02136j02518j62278o0913
$$ -235599 -386055 -540008 -598744 -409749 38472 510715 712851 610333 448055 387142
35917C87142j04917k97486k79854P3620L62913K40752l2805o808K19147J54430
$$ 387142 282225 -15261 -295115 -221495 141418 382170 349365 342557 561704 716134
35907G16134k67491n37197l15673P7356J05407l04028o86779n40071J47908P93978
$$ 716134 448643 -88554 -404227 -326871 -221464 -525492 -1212271 -1752342 -1604434 -810456
35897h10456P52720R3389l69326r1635M24277L43424k32836m04870J17765N40963
$$ -810456 -57736 35653 -333673 -425308 -1031 342393 109557 -295313 -177548 363415
35887C63415K13276l90027m42429R031K60736P7829j06753k3081P3340l2692j40300
$$ 363415 576691 186664 -255765 -246734 14002 91831 -14922 -38003 35337 2645 -137655
35876a37655m8364N9844n9763k63977k14168R2510K75738R0609k21868k53841
$$ -137655 -186019 -126175 -185938 -449915 -664083 -571573 -295835 -205226 -427094 -680935
35866f80935k214J13164j28719l61740j32157L73466N18456J44109j76905j6355
$$ -680935 -683149 -569985 -698704 -1060444 -1192601 -819135 -300679 -156570 -333475 -349830
35856c49830K54816Q5053l55961m42611o8252K42019J70957j8231n8228p6755
$$ -349830 -95014 -9961 -365922 -808533 -876785 -634766 -463809 -482040 -540268 -617023
35846f17023j77004j07268K68958N32925K20174l99795n36266J05122Q91128R84484
$$ -617023 -794027 -901295 -632337 -99412 120762 -279033 -815299 -710177 180951 1165435
35836A165435K78775n31979p09940j95952L87816M11538r7544n19787l98126J0518
$$ 1165435 1444210 912231 202291 6339 394155 805693 708149 188362 -209764 -199246
35826a99246J01946k45760m87085j43556N13315P56956L08870l25403n04497k06282
$$ -199246 -97300 -343060 -830145 -973701 -460386 296570 605440 280037 -224460 -430742
35816d30742P8642P1342p977Q4767K09444J44718L2954J51074L63554K41956k41688
$$ -430742 -352100 -280758 -288735 -203968 5476 150194 183148 334222 697776 939732 698044
35805F98044n76362m24485p8978M2932M385Q8777K21698J16172j51640j98493
$$ 698044 121682 -302803 -381781 -338849 -334464 -245687 -23989 92183 -59457 -257950
35795b57950N5561K83428K95870K43707J78671j13398o17359q62584n40838k7036
$$ -257950 -202389 81039 376909 620616 799287 685889 68530 -794054 -1334892 -1361928
35785a361928J16688p0004q5410K34611N14519M44833J86058O1298J51694L23885
$$ -1361928 -1245240 -1315244 -1400654 -1166043 -651524 -206691 -20633 40665 192359 516244
35775E16244M18738K94249r3574n12271n64670j66796K44480K04905j68230l12223
$$ 516244 934982 1229231 1135657 623386 58716 -108080 136400 341305 173075 -139148
35765a39148L0951M53192M08569o5293l93485k07768K16768L88975K37134O6637
$$ -139148 -108197 344995 753564 688271 294786 87018 303786 692761 929895 996532
35755I96532K8193k0979j43631j95811j69115k73430m91827m46313n196L49832
$$ 996532 1024725 1003746 860115 664304 495189 221759 -270068 -716381 -721577 -371745
35745c71745J81495j90467j55868K28696L58656O7354j52416L3267L68194N32828
$$ -371745 -190250 -380717 -536585 -307889 50767 118121 -34295 -1028 367166 899994
35735H99994N35191L94232J067m57977n01849r1982J74590l4296k66337j15428
$$ 899994 1435185 1829417 1830484 1372507 870658 778676 953266 918970 652633 537205
35725E37205M1678k21976m73187r3786N10372L73138m69630q97400l35535M56902
$$ 537205 578883 356907 -116280 -210066 300306 673444 203814 -693586 -1029121 -572219
35715e72219N74347J43432j75011k18185k46155k63165m8744L28659N43485M66928
$$ -572219 2128 145560 -29451 -247636 -493791 -756956 -805700 -477041 66444 533372
35705E33372K14232j37997n17405o55768l24655K45492N27445L14793r0595l27079
$$ 533372 747604 609607 92202 -563566 -888221 -642729 -115284 199509 108914 -218165
35695b18165l42933k68133j69416m5649R8283K61255M00919L46251m7859n63698
$$ -218165 -561098 -829231 -998647 -1044296 -946013 -684758 -283839 62412 14553 -549145
35685e49145o63579j02378O25911P54228J68476m28659m03203M8795K85919J31560
$$ -549145 -1212724 -1315102 -689191 65037 233513 -195146 -598349 -549554 -263635 -132075
35675a32075k5204L5548M7070j71659l03676l8592L56883M09144J61898N4660
$$ -132075 -157279 -121731 -74661 -246320 -549996 -588588 -231705 177439 339337 393997
35665C93997J76722J40296k50749o38403n77191p7702M50735O01409K66460k53241
$$ 393997 570719 711015 460266 -178137 -755328 -833030 -382295 219114 485574 232333
35655B32333m24922j9284N31952N92681J25004l00476l05872j12063n0892r4775
$$ 232333 -192589 -211873 320079 912760 1037764 737288 431416 319353 268461 173686
35645A73686p2164O386P4942J74407K69967J81205r0814k39907q9504J07679N3998
$$ 173686 101522 107908 182850 357257 627224 808429 717615 477708 388204 495883 549881
35634E49881j39954j50377Q5778L22975L04828k9646m73333o16667k45753K65600
$$ 549881 409927 259550 345328 668303 973131 943485 470152 -146515 -392268 -126668
35624a26668L19945o0478k23132J06565L72116R0925l46124l02310J27463L69417
$$ -126668 193277 132799 -90333 16232 388348 479273 133149 -169161 -41698 327719
35614C27719K62452P6080r2338k97829l39094l2267K62667O8685l62413l44931
$$ 327719 590171 666251 573913 276084 -63010 -95277 167390 236075 -126338 -471269
35604d71269J39520L91002J15206j57189J7201L48899L86335J58515p5964k29967
$$ -471269 -331749 59253 174459 17270 34471 383370 769705 928220 852256 622289
35594F22289k32373N6570M50884M16102j79640o92615n10224Q2114K93221j17603
$$ 622289 389916 446486 897370 1313472 1133832 441217 -69007 13107 306328 188725
35584A88725o11341o08471r6295M90569P26870M99411K2888l78986n27501m31716
$$ 188725 -422616 -1031087 -1127382 -636813 90057 589468 612356 233370 -294131 -725847
35574g25847j72794J23952K83881K42562J53581J50968J15299q4571k70345k00233
$$ -725847 -898641 -774689 -490808 -248246 -94665 56303 171602 87031 -183314 -383547
35564c83547J3430J15131J69345L47893M31173J14685l08178k66359J31050K37219
$$ -383547 -370117 -254986 -85641 262252 693425 808110 499932 233573 364623 601842
35554F01842m511K1844L82640L00350m76885r79409l87716O65596R62132L07926
$$ 601842 597331 619175 1001815 1302165 825280 -154129 -541845 123751 1085883 1393809
35544A393809m85220p76260n28977L7011N33257M79568p8892l94863m1684L57804
$$ 1393809 908589 132329 -396648 -359637 173620 653188 574296 179433 137749 495553
35534D95553Q7921n06939o37798l34632j48979l3262M01258Q20725N42378j74233
$$ 495553 583474 76535 -561263 -895895 -1044874 -1078136 -676878 143847 686225 511992
35524E11992m04401r2455p4649m85716m65502K24664O06878R4697m73714j91089
$$ 511992 107591 15136 -59513 -545229 -1010731 -786067 -179189 -84492 -558206 -749295
35514g49295M97954O23371J87602r2564j064J21032J62244K47472K05285k02350
$$ -749295 -251341 372030 559632 467068 466004 587036 749280 996752 1202037 999687
35504I99687o54679n62473N3151N30494M16937q3049m85746m93890j28190L05569
$$ 999687 345008 -217465 -164314 366180 783117 700068 214322 -279568 -407758 -102189
35494a02189M39698K53446J19420K51614L56862J07103l10370m66355k97820p4775
$$ -102189 337509 590955 710375 961989 1318851 1425954 1115584 649229 351409 276634
35484B76634O6545J85385K61182K15336J24454J02570N6042j52699l82929l58039
$$ 276634 343179 528564 789746 1005082 1129536 1232106 1288148 1135449 752520 394481
35474C94481r4922P1094r4278m44524n96333k93969K92943O31214L66486j92193
$$ 394481 299559 370653 276375 -168149 -764482 -1058451 -765508 -134294 232192 39999
35464C9999m04733j37450J13585K6568j00353M8644K42011J39857q0021j2594
$$ 39999 -364734 -502184 -388599 -362031 -462384 -413740 -171729 -31872 -111893 -124487
35454a24487K99795M45278K58306l5348k05899k42192k50792l32287m49855l36833
$$ -124487 175308 620586 878892 843544 637645 395453 144661 -187626 -637481 -974314
35444i74314J95323P68595O99667k4548n35136k18366M21938N29304Q0104k95428
$$ -974314 -778991 -10396 689271 664723 129587 -88779 333159 862463 942567 647139
35434F47139l31088k90496l14331k53136q0930N8183J58732K80357L00380J43640
$$ 647139 316051 25555 -288776 -541912 -622842 -564659 -405927 -125570 174810 318450
35424C18450L6719R8499n938m58562p04225k03195N24307M90112k48710o18685
$$ 318450 355169 453668 447730 -10832 -715057 -918252 -393945 96167 -152543 -771228
35414g71228j40160M37173L82578J3206J0143L53451M91250J90842k49279m42130
$$ -771228 -911388 -474215 -91637 -78431 -68288 285163 776413 967255 717976 275846
35404B75846k59976J31226M12074L77274J01788k31256n22492o30172l55517J45637
$$ 275846 15870 147096 559170 936444 1038232 806976 284484 -345688 -701205 -555568
35394e55568L12108j5497j67214L54423Q99153N57264l34765o36558j66174J63028
$$ -555568 -243460 -258957 -426171 -71748 827405 1384669 1049904 413346 247172 410200
35384D10200l2361j18817J88420K68348j33206l09727P3664K13629m24746r82714
$$ 410200 377839 259022 447442 715790 582584 272857 346521 560150 135404 -847310
35374h47310n26931L53913M44774j91411m21418J53208P45070O76176J57227l04937
$$ -847310 -1374241 -1020328 -575554 -766965 -1188383 -1035175 -290105 386071 543298 238361
35364B38361n04125m04819j6098M37707O03972L58054j08325m60205l76961J60631
$$ 238361 -265764 -670583 -686681 -248974 354998 713052 604727 144522 -232439 -71808
35354g1808O10951L63027l28952n27719j1470L12982j11857n17920j13820N07335
$$ -71808 539143 902170 573218 45499 34029 347011 235154 -282766 -396586 110749
35344A10749L57267k39130k18930L79609N40537L8343l08766j71294j42597m40267
$$ 110749 468016 228886 9956 389565 930102 968445 659679 488385 345788 -94479
35334i4479m53445N0830M26962K99524J53507K98181K70349j66014m14704j12718
$$ -94479 -547924 -497094 -70132 229392 382899 681080 951429 785415 370711 257993
35324B57993J15192k58582o47203l00728M04265N85413K59880J45623L83235M19517
$$ 257993 373185 114603 -532600 -833328 -429063 156350 416230 561853 945088 1364605
35314A364605L3902l72185m99354m58955l50187j37557M2818p79r9646P2703M12520
$$ 1364605 1398507 1026322 526968 68013 -282174 -419731 -376913 -377692 -477338 -404635 7885
35303G885M96851K44104l5453k01808l65720m39719j95183J89803K34511q0963
$$ 7885 504736 748840 713387 511579 145859 -293860 -489043 -299240 -64729 -145692
35293a45692k37355j4046J96295J35903J13268L28599L78749m5890m79854l38485
$$ -145692 -383047 -397093 -200798 -64895 48373 376972 755721 709831 229977 -108508
35283a08508J16316J85147j27215j76411J64519K60841j68976m85447j23564M67737
$$ -108508 7808 192955 65740 -110671 53848 314689 145713 -339734 -463298 4439
35273D439M96546L1986j61132J79555M80262K57662k19973m28456l02994j48778
$$ 4439 500985 532971 371839 551394 1031656 1289318 1069345 640889 337895 189117
35263A89117j19253j04688o637J36619K50027K75238J61955o7524k76473l30893
$$ 189117 69864 -34824 -41461 95158 345185 620423 782378 714854 438381 107488
35253A07488k35933j00571m255N5026J08636J45816J04236k8528j13930K512K08957
$$ 107488 -128445 -229016 -233271 -178245 -69609 76207 180443 151915 37985 40497 249454
35242B49454J92828p3000j81115J01051L58742J02574m11116n06580j17456J81348
$$ 249454 442282 369282 188167 289218 647960 750534 339418 -167162 -284618 -103270
35232a03270J62126J91766L43797J25194n26001q20374l14927K21919m1156o04890
$$ -103270 58856 250622 594419 719613 193612 -626762 -941689 -719770 -760926 -1365816
35222a365816m03228M42279P80926K45419k57937q1409K08188r1862o14236m89769
$$ -1365816 -1769044 -1326765 -545839 -300420 -558357 -639766 -431578 -523440 -1137676 -1627445
35212a627445L47867J080031J031524L09297m83531q24880o14821j78998O7812
$$ -1627445 -1279578 -199547 831977 1141274 657743 -167137 -781958 -960956 -893144
35203h93144K9817p3078q1486m5249P276J45809K98671K38711m9223k55511j61228
$$ -893144 -863327 -936405 -1017891 -1063140 -1055864 -910055 -611384 -372673 -421896 -677407 -838635
35192h38635P8600K33772L32361M77190N37138K98743j58358m73346m05115r6992
$$ -838635 -760035 -526263 -193902 283288 820426 1119169 960811 487465 82350 -14642
35182a4642Q5462n0162k94979k55641J49084N16331M31974J7518k22051n4432
$$ -14642 70820 20658 -274321 -529962 -380878 135453 567427 584945 362894 308462
35172C08462K36608K89660R3231j19616k09991k38772l24901m69817m96776k11873
$$ 308462 545070 834730 927961 808345 598354 359582 34681 -435136 -931912 -1143785
35162a143785L05774O81512O43855L33495O3881p2701j49633j32418K9839J53678
$$ -1143785 -838011 -156499 487356 820851 884732 812031 662398 529980 559819 713497
35152G13497J2903k58566k95945m3280J54720M5019k29993l83246l03955p0072
$$ 713497 726400 467834 171889 128609 283329 328348 98355 -284891 -588846 -658918
35142f58918J66906K60716J73281J7498p4643o4555M4065J94895J87207j06617
$$ -658918 -492012 -231296 -58015 -40517 -115160 -179715 -135650 59245 246452 139835
35132A39835l69814j32225M15232M88026r1525m57998j9333N14351K46294l95774
$$ 139835 -229979 -362204 53028 541054 449529 -8469 -27802 486549 732843 337069
35122C37069l44299L34790N74986M0895n07462n90972n45576n43454k56360K60082
$$ 337069 -7230 327560 902546 943441 435979 -154993 -700569 -1244023 -1500383 -1240301
35112a240301M63553L65386N36782Q24672L66610p00991r93829m7135P01574J04087
$$ -1240301 -776748 -411362 125420 950092 1316702 615711 -378118 -425253 276321 380408
35102C80408q48550o58503L08516O04977N4574k94132r2164L2241p6049J11429
$$ 380408 -468142 -1126645 -818129 -213152 -158578 -452710 -544874 -512633 -588682 -477253
35092d77253N33863M47013j88776m61896K1599N08693L51003o1061j05608J13004
$$ -477253 56610 503623 314847 -147049 -125450 383243 734246 673185 567577 680581
35082F80581J54797M515q2046r3424j86333l41494l93255k45846O0596L34055
$$ 680581 835378 839893 757847 664423 478090 136596 -256659 -502505 -441909 -107854
35072a07854L06521k8636k56981n8286K46749J02380m19226o64901l12318K49402
$$ -107854 198667 170031 -86950 -145236 101513 203893 -215333 -880234 -1192552 -943150
35062i43150N12205L95809J24476p8090r7705n562j3555j37832q1092K56327M34193
$$ -943150 -430945 -35136 89340 11250 -86455 -92017 -105572 -243404 -324496 -68169 366024
35051C66024R0919l81263l59009M5857K12327L6235j9104J73621K54929J71855
$$ 366024 456943 75680 -283329 -237472 -25145 11090 -8014 165607 420536 592391
35041E92391K90719N47028L19520n01146j067766o98095J28492M39441L7601m29628
$$ 592391 883110 1430138 1749658 1248512 180746 -517349 -388857 50584 88185 -341443
35031c41443m29799q7898J64977J36074M569L8028K27958K86450P6258j33863
$$ -341443 -771242 -859140 -694163 -558089 -553520 -515492 -287534 -1084 75174 -58689
35021e8689n1560J89381K54714J05151o8216k02047k70959q0025L82348O31334
$$ -58689 -110249 79132 333846 438997 370781 168734 -102225 -182250 200098 831432
35011H31432K84444k58344l58478j16322o4254j27140J76055O02381L39901n73759
$$ 831432 1115876 857532 499054 382732 318478 191338 367393 969774 1309675 735916
35001G35916j059782n54117K22714M72366L65699L56543L11911j8799l62663m05695
$$ 735916 -323866 -877983 -655269 -182903 182796 539339 851250 832451 469788 64093
34991F4093l47606m03518l18295O5898L32535J60837q4095j2373J13715j9772
$$ 64093 -283513 -687031 -1005326 -939428 -606893 -446056 -530151 -542524 -428809 -448581
34981d48581j03368J59522L24275n9621m83481j76773N80502Q03060K74337k43268
$$ -448581 -551949 -392427 -68152 -127773 -611254 -788027 -207525 595535 869872 626604
34971F26604k26741J2275K0362j95013l69052k93050Q5732M87529L93409k42906
$$ 626604 399863 412138 432500 237487 -131565 -424615 -338883 148646 542055 299149
34961B99149o64744k65757M40880N13872k9956l52931j45816Q4345N6891J00534
$$ 299149 -365595 -631352 -190472 323400 293444 -59487 -205303 -120958 -64067 36467
34951C6467L33482L35455o5606m09037l26158m1495J29029K19248L03619K77167
$$ 36467 369949 705404 639798 230761 -95397 -136892 -7863 211385 515004 792171
34941G92171J59659J16491M4830k96747o66982n47108q2271R904l14179k31622
$$ 792171 951830 1068321 1113151 816404 149422 -397686 -479957 -470053 -784232 -1015854
34931a015854M79759Q21623J34256o79193m66478L86781O33108J14538k16666
$$ -1015854 -536095 285528 419784 -259409 -725887 -339106 294002 408540 191874
34922A91874Q607J41748j63561l75188j20855J90781J86056J21896K27893K10112
$$ 191874 200481 342229 178668 -196520 -317375 -126594 59462 181358 409251 619363
34912F19363r4772k58494j5548J47350j87716n06039j11224O37496P34610M6471
$$ 619363 524591 266097 250549 397899 210183 -295856 -407080 230416 965026 1011497
34902A011497m69649j86614L42683K99353k32348m94355j32219M22917N60543
$$ 1011497 541848 355234 697917 997270 764922 270567 138348 561265 1121808
34893A121808J54572l91730n87196l12224J00120K48128R9551n3056l7186m50
$$ 1121808 1276380 884650 297454 -14770 85350 333478 433029 379973 342787 342337
34883C42337j12081k69775k56700p7148L4281o6524k09298p7051L78889P54196
$$ 342337 230256 -39519 -296219 -373367 -339086 -405610 -614908 -691959 -313070 441126
34873D41126N84868l2055m44956k51796J53771J66315j21713j06968K87629L92779
$$ 441126 1025994 993939 548983 297187 450958 617273 495560 388592 676221 1069000
34863A069000j76859q24999p29212M7054O61575N58792K1010l21039k19650K1831
$$ 1069000 892141 67142 -662070 -615016 46559 605351 626361 305322 85672 107503
34853A07503j9024l46983n09105j92989K79047L66032J17710P5436L42491L85179
$$ 107503 88479 -258504 -767609 -960598 -681551 -315519 -197809 -122373 220118 605297
34843F05297j5238k88527J713L75265J97554k66064k97179J11697L29013J35804
$$ 605297 590059 301532 303245 678510 876064 610000 312821 424518 753531 889335
34833H89335p1375o6024n6496j54077k25919k91569m52410m62272m6103L91203
$$ 889335 817960 751936 695440 541363 315444 23875 -428535 -890807 -936910 -545707
34823e45707J73837m62630m87414L77376J110839Q41458M7301k96830j24143r2263
$$ -545707 -371870 -834500 -1321914 -944538 166301 1007759 1055060 758230 634087 541824
34813E41824m13711o33516m27862o506K84094L35436K30581J00992L6557p939
$$ 541824 128113 -505403 -933265 -939771 -655677 -320241 -89660 11332 47889 39950
34803C9950j43855l07177k57070Q2608M62292N76353L30371j57555n90847n95386
$$ 39950 -103905 -411082 -668152 -585544 -123252 453101 783472 625917 35070 -560316
34793e60316j28962K79370J32514k70112k34178K09253L18481j19707l99743o2115
$$ -560316 -689278 -409908 -277394 -547506 -781684 -572431 -253950 -373657 -773400 -835515
34783h35515L68800L04714J1144j5236N7503j52552m10251k66790P6318Q8521
$$ -835515 -466715 -162001 -150857 -166093 -108590 -261142 -671393 -938183 -861865 -773344
34773g73344j54186j11428K83600N32371L81266J25155Q2742K31239L61509K60633
$$ -773344 -927530 -1038958 -755358 -222987 158279 283434 366176 597415 958924 1219557
34763A219557j53314n96340n65663m2267L09119N0812l47609k74442M8258O5994
$$ 1219557 1066243 469903 -95760 -138027 171092 221904 -125705 -400147 -351889 -285895
34753b85895n6457K13784O42803M66207k82942o96976l83582K7569L8319J0744
$$ -285895 -342352 -128568 514235 980442 697500 524 -383058 -355489 -317170 -306426
$$ [...]
##END NTUPLES=NMR SPECTRUM
##END=
