##TITLE=31Pdec_CPA2002
 D2O, 24 sc
 21.2.2023
##JCAMPDX= 6.0         $$ Bruker NMR JCAMP-DX V2.0
##DATA TYPE= NMR SPECTRUM
##DATA CLASS= NTUPLES
##ORIGIN= UXNMR, Bruker Analytische Messtechnik GmbH
##OWNER= root
$$ XWIN-NMR		Version 3.5
$$ Tue Feb 21 14:14:56 2023 Russian Standard Time (UT+4h)  she@DPX200
##.OBSERVE FREQUENCY= 81.013821
##.OBSERVE NUCLEUS= ^31P
##.ACQUISITION MODE= SIMULTANEOUS
##.ACQUISITION SCHEME= undefined
##.AVERAGES= 24
##.DIGITISER RES= 16
##SPECTROMETER/DATA SYSTEM= spect
##.PULSE SEQUENCE= zgpg30
##.SOLVENT NAME= Pyr
##.SHIFT REFERENCE= (INTERNAL, Pyr, 0, 248.564)
##AUDIT TRAIL= $$ (NUMBER, WHEN, WHO, WHERE, WHAT)
$$ ##TITLE= Audit trail, XWIN-NMR		Version 3.5
$$ ##JCAMPDX= 5.01
$$ ##ORIGIN= Bruker BioSpin GmbH
$$ ##OWNER= she
$$ F:/spectra/data/she/nmr/P31/1/pdata/1/auditp.txt
$$ ##AUDIT TRAIL=  $$ (NUMBER, WHEN, WHO, WHERE, WHAT)
(   1,<2023-02-21 14:14:05.34 +0400>,<she>,<DPX200>,
      <created by zg, POWCHK disabled, PULCHK disabled
       configuration hash MD5:
       00 E9 B6 7A A2 85 ED C7 34 08 36 98 17 FE 4E 26
       data hash MD5: 32K
       12 50 3D 78 25 7E 80 AB 11 AF DD 56 86 3F 72 C5>)
(   2,<2023-02-21 14:14:07.78 +0400>,<she>,<DPX200>,
      <Start of raw data processing
       efp BC_mod = 2 LB = 1 FT_mod = 6 PKNL = 1 PHC0 = -10653.16 PHC1 = -733.3884 SI = 64K 
       data hash MD5: 64K
       9A A3 AE D5 CA FE 5B 50 07 AD AA F2 E2 DC 1A 07>)
(   3,<2023-02-21 14:14:25.62 +0400>,<she>,<DPX200>,
      <pk PHC0 = -377.0652 PHC1 = 907.3986 
       data hash MD5: 64K
       B1 F2 7C 12 42 5E D2 B9 02 E0 A2 F5 EA 2A 10 6B>)
(   4,<2023-02-21 14:14:28.56 +0400>,<she>,<DPX200>,
      <abs ABSG = 5 
       data hash MD5: 64K
       C8 3D F5 E8 19 77 83 7A 0D B2 FC B7 72 8D 62 AF>)
$$ ##END=
$$ 
$$ hash MD5
$$ 1C 86 04 C3 24 D1 22 79 D7 23 4D AB DC 32 24 22
##$RELAX= 
##$RELAX= 
##$RELAX= 
##$RELAX= 
##$RELAX= 
##$RELAX= 
##$RELAX= 
##$RELAX= 
##$RELAX= 
$$ Bruker specific parameters
$$ --------------------------
##$DU= <F:/spectra>
##$EXPNO= 1
##$NAME= <P31>
##$PROCNO= 1
##$TYPE= <nmr>
##$USER= <she>
##$AMP= (0..31)
100 100 100 100 100 100 100 100 100 100 100 100 100 100 100 100 100 100 
100 100 100 100 100 100 100 100 100 100 100 100 100 100 
##$AQSEQ= 0
##$AQ_mod= 1
##$AUNM= <au_zg>
##$AUTOPOS= <>
##$BF1= 81.014009
##$BF2= 200.13
##$BF3= 200.13
##$BF4= 200.13
##$BF5= 200.13
##$BF6= 200.13
##$BF7= 200.13
##$BF8= 200.13
##$BYTORDA= 1
##$CFDGTYP= 0
##$CFRGTYP= 5
##$CHEMSTR= <none>
##$CNST= (0..31)
1 1 145 1 1 1 1 1 1 1 1 1 1 1 1 1 1 1 1 1 1 1 1 1 1 1 1 1 1 1 1 1 
##$CPDPRG= <waltz16>
##$CPDPRG1= <>
##$CPDPRG2= <waltz16>
##$CPDPRG3= <>
##$CPDPRG4= <mlev>
##$CPDPRG5= <mlev>
##$CPDPRG6= <mlev>
##$CPDPRG7= <mlev>
##$CPDPRG8= <mlev>
##$CPDPRGB= <>
##$CPDPRGT= <>
##$D= (0..31)
0 1 0 0 0 0 0 0 0 0 0 0.03 2e-05 3e-06 0 0 0 0 0 0 0 0 0 0 0 0 0 0 0 0 
0 0 
##$DATE= 1676974444
##$DBL= (0..7)
120 120 120 11 120 120 24 19 
##$DBP= (0..7)
150 150 150 150 150 150 150 150 
##$DBP07= 0
##$DBPNAM0= <>
##$DBPNAM1= <>
$$ [...]
##$SUBNAM3= <"">
##$SUBNAM4= <"">
##$SUBNAM5= <"">
##$SUBNAM6= <"">
##$SUBNAM7= <"">
##$SUBNAM8= <"">
##$SUBNAM9= <"">
##$SW= 501.771253377433
##$SWIBOX= (0..15)
0 1 3 0 0 0 0 0 0 0 0 0 0 0 0 0 
##$SW_h= 40650.406504065
##$TD= 32768
##$TD0= 1
##$TE= 0
##$TE2= 300
##$TE3= 300
##$TEG= 300
##$TL= (0..7)
0 120 53 12 22 120 120 120 
##$TP= (0..7)
150 150 150 150 150 150 150 150 
##$TP07= 0
##$TPNAME0= <>
##$TPNAME1= <>
##$TPNAME2= <>
##$TPNAME3= <>
##$TPNAME4= <>
##$TPNAME5= <>
##$TPNAME6= <>
##$TPNAME7= <>
##$TPOAL= (0..7)
0.5 0.5 0.5 0.5 0.5 0.5 0.5 0.5 
##$TPOFFS= (0..7)
0 0 0 0 0 0 0 0 
##$TUNHIN= 0
##$TUNHOUT= 0
##$TUNXOUT= 0
##$USERA1= <user>
##$USERA2= <user>
##$USERA3= <user>
##$USERA4= <user>
##$USERA5= <user>
##$V9= 5
##$VALIST= <valist>
##$VCLIST= <CCCCCCCCCCCCCCC>
##$VD= 0
##$VDLIST= <DDDDDDDDDDDDDDD>
##$VPLIST= <PPPPPPPPPPPPPPP>
##$VTLIST= <TTTTTTTTTTTTTTT>
##$WBST= 1024
##$WBSW= 4
##$XGAIN= (0..3)
0 0 0 0 
##$XL= 0
##$YL= 0
##$YMAX_a= 7301
##$YMIN_a= -7630
##$ZGOPTNS= <>
##$ZL1= 120
##$ZL2= 120
##$ZL3= 120
##$ZL4= 120
##$ABSF1= 248.5645
##$ABSF2= -253.2056
##$ABSG= 5
##$ABSL= 3
##$ALPHA= 0
##$AQORDER= 0
##$ASSFAC= 0
##$ASSFACI= 0
##$ASSFACX= 0
##$ASSWID= 0
##$AUNMP= <proc_1d>
##$AZFE= 0.1
##$AZFW= 0.5
##$BCFW= 0
##$BC_mod= 2
##$BYTORDP= 0
##$COROFFS= 0
##$CY= -3
##$DATMOD= 1
##$DC= 0
##$DFILT= <>
##$DTYPP= 0
##$F1P= 0
##$F2P= 0
##$FCOR= 1
##$FTSIZE= 65536
##$FT_mod= 6
##$GAMMA= 0
##$GB= 0
##$INTBC= 1
##$INTSCL= 6.047779e-11
##$ISEN= 30
##$LB= 1
##$LEV0= 0
##$LPBIN= 0
##$MAXI= 10000
##$MC2= 0
##$MEAN= 0
##$ME_mod= 0
##$MI= 50
##$NCOEF= 0
##$NC_proc= -5
##$NLEV= 6
##$NOISF1= 182.463
##$NOISF2= 159.3651
##$NSP= 0
##$NTH_PI= 0
##$NZP= 0
##$OFFSET= 248.5645
##$PC= 4
##$PHC0= -11030.23
##$PHC1= 174.0102
##$PH_mod= 1
##$PKNL= yes
##$PPARMOD= 0
##$PSCAL= 0
##$PSIGN= 0
##$REVERSE= no
##$SF= 81.0140089999694
##$SI= 65536
##$SIGF1= 159.3651
##$SIGF2= -187.1042
##$SINO= 113.3802
##$SIOLD= 16384
##$SREGLST= <1H.CDCl3>
##$SSB= 0
##$STSI= 65536
##$STSR= 0
##$SW_p= 40650.406504065
##$SYMM= 0
##$S_DEV= 0
##$TDeff= 32768
##$TDoff= 0
##$TI= <>
##$TILT= no
##$TM1= 0
##$TM2= 0
##$TOPLEV= 0
##$USERP1= <user>
##$USERP2= <user>
##$USERP3= <user>
##$USERP4= <user>
##$USERP5= <user>
##$WDW= 1
##$XDIM= 65536
##$YMAX_p= 319685285
##$YMIN_p= -7615750
$$ End of Bruker specific parameters
$$ ---------------------------------
##NTUPLES= NMR SPECTRUM
##VAR_NAME=  FREQUENCY,     SPECTRUM/REAL,   SPECTRUM/IMAG
##SYMBOL=    X,             R,               I
##VAR_TYPE=  INDEPENDENT,   DEPENDENT,       DEPENDENT
##VAR_FORM=  AFFN,          ASDF,            ASDF
##VAR_DIM=   65536,         65536,           65536
##UNITS=     HZ,            ARBITRARY UNITS, ARBITRARY UNITS
##FACTOR=    0.620285442955139, 1,           1
##FIRST=     20137.2065510682, 0,            0
##LAST=      -20513.1999529968, 0,           0
##MIN=       -20513.1999529968, -7615750,    0
##MAX=       20137.2065510682, 319685285,    0
$$ Real data points
##PAGE= N=1
##DATA TABLE= (X++(R..R)), XYDATA
$$ [...]
43062 -189875 835951 1190877 696691 118603 198381 749547 1048440 882637 660704 541304
43052 541304 151059 -606282 -1126051 -937022 -426309 -182103 -58877 452891 1264045 1820959
43042 1820959 1997248 2105906 2120712 1655110 760990 33405 -217354 -273367 -358364 -308799
43032 -308799 -88306 -30592 -296693 -582317 -618863 -538671 -543540 -621142 -727688 -814040 -599029
43021 -599029 136752 943040 1039213 435295 6007 191688 410074 164692 -94423 138100
43011 138100 402072 -2738 -757556 -910285 -294185 276905 180697 -351593 -789697 -947189
43001 -947189 -954030 -970202 -1017240 -924120 -559207 -239761 -535780 -1371274 -1796585 -1170212
42991 -1170212 -138837 228925 -58961 -95045 450343 955340 1007972 1035891 1445513 1844257
42981 1844257 1604822 776770 1666 -244492 -31033 222466 125896 -335792 -730178 -629264
42971 -629264 -169125 86309 -133078 -522549 -704033 -667310 -579434 -485976 -410005 -482604
42961 -482604 -731184 -919038 -824740 -558683 -400709 -415576 -426450 -320746 -179036 -68200
42951 -68200 111907 428608 646917 396001 -305838 -914267 -976514 -716769 -664062 -815787
42941 -815787 -667554 -103932 333280 295024 150380 252353 229629 -376420 -1164526 -1298032
42931 -1298032 -699491 -112606 -12835 -123774 -84353 21166 -18815 -179099 -344279 -455859
42921 -455859 -400742 -105386 189442 120073 -269668 -561632 -563040 -459646 -337655 -47155
42911 -47155 338045 430197 113455 -224631 -295811 -340524 -671763 -1140345 -1365883 -1242876
42901 -1242876 -953752 -696328 -604252 -716857 -855598 -758353 -468636 -326067 -455740 -582888
42891 -582888 -475302 -200869 190241 775292 1312458 1201992 316310 -552058 -590181 -10123
42881 -10123 350771 242878 188222 516120 854997 745473 272471 -172349 -436136 -637867
42871 -637867 -843486 -971158 -970652 -910105 -856243 -772693 -598565 -380067 -226877 -126343 63403
42860 63403 341330 441909 195838 -99424 28995 582375 1049479 1060775 770516 499478
42850 499478 329791 216344 192878 241063 185384 -66895 -364969 -554826 -673471 -758725
42840 -758725 -713268 -528373 -384335 -348477 -256621 -81275 -61920 -204620 -63048 559490
42830 559490 1050643 701547 -224367 -743255 -418720 197389 435873 271558 59533 -4981
42820 -4981 90442 332817 593748 639425 465004 389996 579535 684082 270340 -495078
42810 -495078 -934335 -684588 -172980 -102491 -609265 -1160408 -1280496 -1115286 -1094117 -1229383
42800 -1229383 -1105513 -556188 43214 327954 430364 609026 694709 374075 -115845 -139543
42790 -139543 394432 753276 330996 -495497 -866122 -574215 -226414 -303671 -568497 -597984
42780 -597984 -468925 -502270 -584721 -294404 315172 631964 400828 211316 662264 1419150
42770 1419150 1640988 1131941 489119 186111 104271 16335 -47089 -70721 -176832 -274001
42760 -274001 -63543 379303 511473 88406 -430797 -551770 -363060 -142178 164320 598333
42750 598333 768705 360400 -223192 -309810 122459 479444 351084 -173563 -806334 -1215615
42740 -1215615 -1080731 -475973 -10845 -100410 -322891 -51511 522038 662606 217115 -262933
42730 -262933 -436439 -452785 -341117 63913 480909 280298 -530543 -1136984 -1012824 -532183
42720 -532183 -214655 -33416 186069 327442 342138 461845 670813 561364 104683 -94284
42710 -94284 211628 370246 -92003 -542330 -219342 428901 379653 -338667 -717471 -361452
42700 -361452 21219 -157397 -566418 -660163 -434719 -145174 127626 289779 127783 -279539
42690 -279539 -489324 -342448 -247322 -485468 -666915 -303169 416171 887017 903754 751636
42680 751636 633000 459483 185236 -46251 -128759 -75719 135618 524385 903038 1012991
42670 1012991 912624 932018 1147797 1205757 837052 289485 14550 114145 329417 413689
42660 413689 269112 -124684 -615226 -839101 -628285 -362855 -517208 -908866 -886923 -307214
42650 -307214 232052 286806 111932 18687 -198112 -708623 -1074819 -873485 -468222 -433682
42640 -433682 -546676 -176743 545157 872489 683115 601072 805210 735392 253782 87861
42630 87861 632960 1207822 1114100 671339 528449 627364 579859 471323 504797 365842
42620 365842 -230908 -801359 -744171 -342257 -225404 -195563 396802 1325168 1629083 1076432
42610 1076432 449924 254806 128383 -220175 -412304 -134617 290002 484291 549821 652035
42600 652035 643721 455615 345584 439342 507009 453894 505480 651817 503597 36421 -112390
42589 -112390 481706 1351405 1748378 1501888 917154 285869 -143382 -193474 -127355 -481496
42579 -481496 -1165017 -1318688 -534548 408608 606775 221963 -60145 -156404 -327721 -308169
42569 -308169 292422 995346 894702 26753 -626773 -517494 -56822 275470 480022 553934
42559 553934 287548 -211479 -505187 -557762 -781942 -1145317 -1011102 -210951 490078 479721
42549 479721 171985 235556 555230 628119 511389 622515 899087 915472 696071 694943
42539 694943 970168 1035665 656197 230525 175418 377243 508627 530842 583514 631180
42529 631180 544527 396808 378524 470366 470201 338738 242484 194477 -37409 -464622 -607018
42518 -607018 -73857 713019 861527 153487 -613278 -644725 -90538 372244 511149 596161
42508 596161 726024 681456 417965 190537 118415 42229 -110908 -193665 -138958 -48403 60125
42497 60125 238788 335593 145839 -147349 -163498 -5771 -186843 -723688 -921598 -369481
42487 -369481 411211 718916 584576 466211 460311 358406 176471 81152 2929 -180129
42477 -180129 -265579 -23465 300673 282626 -5930 -123355 17476 49004 -230775 -575047
42467 -575047 -654008 -362849 201945 756395 927697 693604 563815 899358 1243170 876148
42457 876148 -98345 -859664 -999841 -857584 -708942 -408029 -18146 -9447 -459185 -744790
42447 -744790 -479203 -120457 -136822 -185179 211965 695615 600040 128515 113015 704781
42437 704781 1174656 1107878 973753 1204309 1401369 957258 29086 -633952 -641367 -312904
42427 -312904 -152006 -297625 -507276 -464778 -74655 427041 658818 467594 72128 -234113
42417 -234113 -428679 -677257 -967589 -1018373 -631756 -38445 247857 -23744 -507290 -606416
42407 -606416 -191866 189703 -15422 -615411 -865923 -403160 342299 771423 805957 691511
42397 691511 440573 -49849 -462254 -235187 569455 1072983 589421 -495796 -1220109
42388 -1220109 -1171414 -719673 -324356 -128625 -197193 -598655 -1098410 -1232801 -924762 -645557
42378 -645557 -710543 -793927 -479757 58843 379279 502692 791664 1222439 1346601 1009376
42368 1009376 593646 423612 373233 240707 97879 30287 -106901 -379773 -516527 -288057
42358 -288057 61505 97798 -223081 -557826 -660024 -575338 -428977 -307169 -317354 -491110
42348 -491110 -625974 -482274 -161254 -28287 -191673 -311028 -70128 346010 440150 -3065
42338 -3065 -661763 -1007278 -815323 -362395 -149596 -397919 -803455 -860046 -436578 90123
42328 90123 342272 409855 608561 875497 750609 67761 -653389 -795274 -437217 -197742
42318 -197742 -361495 -607615 -679373 -827499 -1290988 -1750324 -1761690 -1474192 -1371333 -1420453
42308 -1420453 -1087498 -265033 400947 358832 -131304 -443518 -401202 -309907 -432411 -753540
42298 -753540 -1079510 -1108839 -613916 186900 672496 520081 105902 -116892 -315636 -870207
42288 -870207 -1541582 -1694284 -1255180 -777150 -516298 -154127 383925 573318 163024 -224852
42278 -224852 54569 667744 791319 294025 -251449 -549171 -816339 -1035526 -746341 148994
42268 148994 982554 1104936 642471 121438 -253339 -531997 -608736 -408054 -237358 -392737
42258 -392737 -571606 -292353 169701 -10300 -910587 -1496481 -964607 103603 486891
42249 486891 -140760 -1014896 -1406090 -1310407 -1046176 -762371 -522356 -449240 -542343 -576141
42239 -576141 -344947 115737 568226 678494 177831 -789104 -1541043 -1463508 -759690 -227935
42229 -227935 -257890 -471712 -436376 -223185 -45963 158014 438505 529666 240827 -148557
42219 -148557 -255912 -87682 161955 459766 685176 432013 -379445 -1018206 -758672 12465
42209 12465 248851 -279306 -766548 -681463 -424276 -411624 -363503 -16838 174856 -239839
42199 -239839 -806734 -778379 -322247 -274581 -782954 -1047300 -570088 95063 208778 -127820
42189 -127820 -299468 -121156 100903 221024 370908 464475 169492 -468149 -868047 -684036
42179 -684036 -339663 -386406 -615975 -356796 445779 1051746 948141 483673 194018 9290
42169 9290 -376881 -726883 -518532 117797 393850 -62677 -676271 -730681 -279972 87994
42159 87994 86487 -68281 -128629 -112858 -156980 -331394 -597529 -770186 -597928 -88945 334065
42148 334065 281073 -40188 -24958 514561 1063851 1079712 642368 189536 -132409 -468043
42138 -468043 -738075 -601167 -22594 517987 599296 337394 57234 -200855 -490040 -548172
42128 -548172 -112121 455815 458876 -111518 -429311 13427 641140 635719 134309 -13521
42118 -13521 499158 1035675 897114 116077 -736998 -1160745 -1020277 -553945 -197549 -155205
42108 -155205 -112819 327411 936336 1022419 433910 -84656 148905 831414 1146088 891498
42098 891498 603576 620913 595759 138188 -464856 -552223 31626 711786 880536 554424
42088 554424 189642 44284 -3173 -59731 22096 353719 728749 858756 747808 609361
42078 609361 523046 419056 321013 325867 363913 247670 -28413 -287417 -470681 -645860
42068 -645860 -678546 -256262 585965 1281377 1363247 1082154 1056768 1391516 1512912 974913
42058 974913 105029 -419153 -460287 -501845 -818143 -1017235 -709195 -254113 -300945 -755772
42048 -755772 -873839 -406237 62956 125913 136288 384350 450246 8096 -401560 -198431
42038 -198431 206699 112092 -248799 -225554 -55315 -408001 -928693 -679275 41946 -61857
42028 -61857 -1007840 -1220442 -94091 859152 430200 -321960 69558 996615 904964 -17810
42018 -17810 -212842 641537 1298757 1163630 1045780 1418986 1552968 959395 366530 510558
42008 510558 983539 1055383 852117 939763 1283616 1340414 889441 251491 -142707 -110806
41998 -110806 162985 243000 -78416 -440663 -426688 -291792 -595311 -1169664 -1199017 -417882
41988 -417882 517811 1014460 1122032 935673 300689 -502114 -650788 59089 677682 357108
41978 357108 -484403 -906892 -760848 -516220 -297140 59796 305518 -9358 -735421 -1242668
41968 -1242668 -1284491 -1156881 -1066788 -909649 -657455 -465333 -369803 -266648 -152328 -49360
41958 -49360 196385 676499 1098865 1082239 666182 194969 -137446 -266121 -7462 687198
41948 687198 1371380 1488388 1057260 559510 244593 -6806 -221720 -227831 -2790 279487
41938 279487 524232 668833 477305 -154769 -775444 -784019 -270953 48929 -211060 -692597
41928 -692597 -879017 -628184 -50032 658846 1123646 987660 382400 -162565 -399462 -567343
41918 -567343 -818324 -902995 -636727 -251745 1043 246414 644852 917255 600946 -263755
41908 -263755 -974095 -808670 164076 978188 687309 -485633 -1212679 -585578 725881
41899 725881 1327189 850400 171761 -4975 50166 -139838 -489191 -714887 -847197 -973634
41889 -973634 -992062 -977943 -1259409 -1738156 -1717425 -913665 -92891 -81144 -606180 -817367
41879 -817367 -564284 -355230 -299045 12473 575500 774791 330083 -214264 -242015 172958
41869 172958 545524 647999 604186 552069 469527 254243 -113474 -426872 -345203 198407
41859 198407 779905 910605 594185 223458 64006 129560 374646 604774 386098 -411344
41849 -411344 -1091473 -810661 184848 695411 124069 -795500 -1135060 -929231 -688382 -399061
41839 -399061 216522 811577 659292 -227192 -939626 -804592 -136217 341414 379826 239982
41829 239982 163620 144884 103317 29974 -29047 -16596 89594 222237 259183 143725 -79376
41818 -79376 -351004 -637548 -863748 -900151 -686876 -341511 -100916 -143775 -448148 -798928
41808 -798928 -947208 -779561 -335920 277279 893427 1240908 1076849 453723 -261262 -707583
41798 -707583 -775565 -520651 -50951 402698 558261 425762 357584 512534 519079 39682
41788 39682 -544777 -539060 38563 424585 220994 -66365 91936 382122 185571 -376170
41778 -376170 -567857 -96519 546873 841198 813902 720302 592428 366808 160144 149590
41768 149590 355083 715822 1185985 1591141 1631308 1266601 897021 879531 1027570 898034
41758 898034 448679 58037 -45113 5548 77798 226520 417356 423429 165186 -137050
41748 -137050 -303211 -383620 -349071 25152 670323 995729 607957 4105 4972 615231
41738 615231 1023319 747884 199096 -58220 -55326 -137090 -357910 -519319 -511831 -296396
41728 -296396 182678 741163 886827 400904 -223288 -342268 -5820 205149 73611 -32075
41718 -32075 134261 253339 -97056 -840273 -1456187 -1494151 -974974 -406312 -328172 -663222
41708 -663222 -698108 -30000 696451 533402 -412162 -1057062 -837149 -354785 -270724 -353341
41698 -353341 -163829 19802 -257241 -641417 -425327 227906 412572 -162233 -772632 -803316
41688 -803316 -521291 -420932 -453590 -372349 -357481 -724224 -1236142 -1254996 -593415 152783
41678 152783 263191 -278435 -760730 -564417 97975 451689 190484 -101369 171168 652503
41668 652503 499724 -343975 -1016928 -966194 -632315 -623728 -813090 -712391 -297680 69444
41658 69444 257421 398079 492764 449767 388300 475193 540938 258743 -328548 -803717 -879127
41647 -879127 -633446 -302127 -78980 -38357 -39515 134015 340491 95826 -643668 -1106685
41637 -1106685 -673747 101844 176295 -458917 -798441 -388113 73260 -24677 -264981 -44490
41627 -44490 384478 427101 198307 293604 778068 1122315 1045634 801737 629029 449211
41617 449211 191044 6347 55757 324336 654958 786491 508333 32202 -16981 627212
41607 627212 1304596 1124719 129461 -760483 -922286 -607290 -317717 -198808 -201771 -298813
41597 -298813 -298308 71169 635621 796681 362548 -104057 -102020 118983 113522 20933 214265
41586 214265 520396 470347 148824 103112 436646 651531 473497 211591 111038 -75648
41576 -75648 -561805 -1032566 -1054714 -665295 -210897 132139 335941 268881 -116815 -471254
41566 -471254 -341557 208649 608833 476911 42883 -215625 -148947 -9949 -76912 -339835
41556 -339835 -536793 -430466 -40275 388917 638264 692483 646741 515231 238132 -125032
41546 -125032 -323944 -145799 280956 519027 274861 -224306 -487957 -411981 -393124 -642376
41536 -642376 -725634 -180593 643781 921926 475647 -42601 -183981 -269467 -650022 -1038670
41526 -1038670 -1035969 -782030 -543585 -158206 439097 606431 -193590 -1238255 -1210865 -16620
41516 -16620 1053321 1133824 774135 758202 899668 640936 100431 -230341 -323463 -441113
41506 -441113 -532851 -476079 -537390 -889576 -1016979 -396288 477030 603297 -82872 -647871
41496 -647871 -538255 -154796 73132 287866 562393 492235 -65804 -502656 -279848 252743
41486 252743 433553 276301 285200 590079 873233 969212 966311 823878 422642 -56961
41476 -56961 -288915 -298019 -356300 -450589 -353736 -181693 -289199 -552556 -409903 167810 418483
41465 418483 -69734 -551590 -110296 934078 1380484 793311 3577 -164899 68060
41456 68060 59612 -181767 -143665 252541 489096 216726 -312038 -674366 -750510 -613394
41446 -613394 -280241 191022 574391 681896 580099 440398 307606 169711 91687 75714
41436 75714 -57918 -394151 -649772 -492129 -79138 73058 -193130 -448645 -314859 507
41426 507 74641 -59322 18462 439499 807408 731420 322152 -35542 -215202 -378249 -532662
41415 -532662 -401278 118581 621402 621505 220836 12565 279696 619952 521510 20350
41405 20350 -459418 -686979 -732884 -652154 -420808 -143896 1001 32752 95393 135927 -23595
41394 -23595 -287881 -340866 -174906 -167962 -469990 -716536 -617233 -446228 -561862 -749506
41384 -749506 -548368 -65302 112821 -156267 -292625 140202 744825 828979 350129 -97809
41374 -97809 -118508 81948 132450 -47665 -345698 -657545 -781077 -425379 337917 866308
41364 866308 631483 7835 -119885 445681 948724 775557 267012 104807 373211 689485
41354 689485 862813 869872 502653 -302991 -990992 -937658 -388502 -134581 -295109 -217511
41344 -217511 323109 686989 418297 -79319 -337533 -536944 -876169 -920212 -285001 554737
41334 554737 891075 814885 871992 1031724 821521 279212 -69825 -109318 -201712 -358939
41324 -358939 -146163 461245 871724 750857 447856 303290 155213 -150157 -331579 -164432
41314 -164432 46046 -101094 -518825 -827501 -836700 -527651 118750 907200 1305005 948213
41304 948213 153235 -393710 -376669 -47598 203317 235140 166630 170321 245134 180418 -126893
41293 -126893 -364268 -103713 556890 1026520 1035917 1020510 1427803 2004367 2145243 1711219
41283 1711219 1114826 739694 622714 626842 633462 608589 673414 997801 1455020 1589261
41273 1589261 1175387 598991 366686 429969 371842 123923 57963 382028 847187 1118732
41263 1118732 1125712 979846 817280 772647 863667 856894 475976 -217789 -844917 -1093471
41253 -1093471 -892648 -309779 402727 740714 379665 -275876 -444458 -22029 208216
41244 208216 -287635 -934050 -832073 -84594 317590 -116680 -742774 -727042 -129537 314351
41234 314351 188362 -237072 -515218 -527200 -445967 -466246 -651797 -880018 -894975 -581661
41224 -581661 -209261 -184379 -498950 -680877 -437058 -76583 -46371 -280324 -362229 -186381
41214 -186381 -34637 -35734 2508 148473 176530 20181 -9183 273901 552064 474336 231902
41203 231902 267298 585760 780333 663111 446952 287510 61427 -271782 -446204 -270690
41193 -270690 -11955 -116150 -615896 -1049150 -1005059 -587943 -237942 -188912 -276397 -286809
41183 -286809 -270216 -336771 -324078 15564 537158 769171 548223 266745 328946 647789
41173 647789 882960 908498 793601 552014 202090 -82354 -137571 6508 285657 711705
41163 711705 1102801 1013812 292899 -545068 -898708 -811626 -714361 -701554 -598013 -524683
41153 -524683 -745691 -1038829 -895385 -358568 12367 77843 292404 776438 974757 573024
41143 573024 52015 -110634 -149454 -399033 -575070 -325583 -19505 -236411 -791572 -1028761
41133 -1028761 -866779 -765053 -754824 -355398 443001 915372 619271 29563 -227616 -251332
41123 -251332 -516701 -1029264 -1333837 -1174724 -712461 -192477 212552 290014 -85343 -653131
41113 -653131 -919506 -731268 -459810 -485284 -721611 -833787 -724747 -536435 -295158 86357
41103 86357 442378 377405 -157036 -615058 -474548 91579 458059 303194 -196594 -763515
41093 -763515 -1182731 -1159617 -542518 229053 404469 -147234 -720584 -722708 -401015 -296451
41083 -296451 -387548 -253547 169758 500728 479897 209674 -137418 -506326 -858874 -1142007
41073 -1142007 -1336487 -1367875 -1094173 -581564 -217449 -291460 -619586 -829879 -825338 -694304
41063 -694304 -412718 5484 290101 248599 110680 131359 110284 -189319 -416896 -89578
41053 -89578 500911 583642 70563 -341871 -285832 -146092 -213859 -223924 -26602 47466 -117275
41042 -117275 -86597 293720 431278 -67037 -609867 -470692 91507 310257 104887 -7028
41032 -7028 84715 952 -308135 -449551 -326805 -307913 -543464 -691763 -468703 -16998
41022 -16998 373220 525116 348287 -21994 -79570 559188 1484744 1834067 1375786 723231
41012 723231 349472 -11377 -704516 -1441203 -1679872 -1379368 -953544 -675748 -475674 -207551
41002 -207551 143675 451003 505466 231930 -63533 88060 679387 1062041 684513 -179667
40992 -179667 -724226 -541002 -863 273356 90392 -218802 -266424 -34410 213203 365578
40982 365578 590654 917889 967707 436405 -301350 -535664 -183613 65046 -277620 -815453
40972 -815453 -855598 -359825 54672 -82839 -601986 -965591 -848564 -434707 -188325 -307763
40962 -307763 -492308 -397119 -152420 -96555 -138835 76958 380580 129096 -703109 -1164913
40952 -1164913 -553446 519406 903082 412816 -95024 21532 499622 736421 511897
40943 511897 32122 -398860 -638805 -802041 -1055552 -1237486 -957830 -296890 -1284 -538207
40933 -538207 -1293597 -1293647 -490262 314287 655805 781703 869434 673686 152626 -232430
40923 -232430 -147272 195479 487345 700517 791558 561458 103445 -116483 35248 54464
40913 54464 -420957 -990760 -1107405 -905347 -894141 -1128530 -1219666 -963350 -459171 210410
40903 210410 909807 1214481 810233 87102 -208212 43671 207290 -145341 -652498 -782352
40893 -782352 -608092 -594255 -858877 -1056499 -943085 -706167 -625709 -638253 -450046 -14492
40883 -14492 334002 305177 43993 -53407 206964 725081 1329150 1815121 1872187 1355387
40873 1355387 635789 271085 269460 135864 -245875 -358260 35952 337621 -10451 -600650
40863 -600650 -701481 -444996 -547374 -1027749 -1130417 -614106 -234738 -609553 -1330269 -1672681
40853 -1672681 -1606199 -1538716 -1485877 -1132990 -525657 -117957 -154054 -425196 -641602 -701399
40843 -701399 -592984 -355105 -173230 -242062 -467599 -513829 -203083 277014 571876 432317
40833 432317 -155178 -920175 -1426821 -1444974 -1187220 -998586 -887007 -614297 -176857 154056
40823 154056 267105 289293 174126 -314303 -1015977 -1281230 -839978 -334605 -475814 -995374
40813 -995374 -1053082 -478394 93678 272351 357143 616346 837469 873078 995333 1332131
40803 1332131 1501636 1222557 789333 514007 209403 -286092 -613965 -534789 -530508 -1010392
40793 -1010392 -1381795 -831870 279109 809932 463143 -11642 -174188 -337736 -549878
40784 -549878 -292176 453671 894072 639889 274624 212082 -32278 -789825 -1391038 -1167024
40774 -1167024 -528755 -229495 -234969 -152157 -123641 -407238 -657109 -530516 -441765 -771116
40764 -771116 -921619 -252214 581283 456621 -406573 -757036 -227339 340093 398547 275603
40754 275603 239975 193800 322670 847761 1121765 287115 -1093033 -1501300 -756246 -270664
40744 -270664 -646831 -738409 140258 774686 -3775 -1342344 -1720687 -1186650 -813430 -810131
40734 -810131 -652094 -420964 -525006 -569140 27722 639888 155455 -1076798 -1512536 -676810
40724 -676810 248527 337316 98929 312925 834324 1153513 1251681 1282597 1084985 580617
40714 580617 130552 4828 -71429 -429870 -897879 -1096060 -981768 -780730 -631569 -538513
40704 -538513 -461314 -304337 -30260 172119 112855 -23085 91866 320542 165763 -422090
40694 -422090 -840675 -648893 -161537 27021 -214000 -530857 -557074 -206163 310415 626902
40684 626902 557150 325075 261064 311627 146539 -296101 -746186 -1056469 -1280735 -1275240
40674 -1275240 -732515 234409 1007208 1190927 1055766 1039971 1161337 1150845 871146 388154
40664 388154 -117525 -352872 -103512 429577 763405 726279 614754 656225 689975 542359
40654 542359 321189 110579 -239476 -732094 -988443 -738816 -263025 13644 117192 338398
40644 338398 654965 781897 721107 823411 1224945 1554641 1377492 745907 123098 -171231
40634 -171231 -240313 -283052 -199091 205833 680307 605511 -194210 -1073511 -1322824 -1016991
40624 -1016991 -720421 -626068 -510786 -351801 -350000 -370747 -2677 716988 1198583 1084028
40614 1084028 659510 359888 334117 597073 1073337 1349569 962881 156829 -209869 225136
40604 225136 840177 928041 538004 113654 -145965 -190413 67005 409108 308274 -278723
40594 -278723 -615704 -193799 462016 568967 209939 25344 159660 230743 102692 -9786
40584 -9786 -71112 -237791 -441379 -508926 -592466 -963880 -1504255 -1882564 -2063239 -2122731 -1809738
40573 -1809738 -944089 -71140 40720 -481776 -754928 -447708 -184630 -454868 -869115
40564 -869115 -871886 -587266 -482113 -599414 -601958 -343669 -1421 236469 319550 254722 95192
40553 95192 -34608 -42001 35457 88869 37998 -134522 -352724 -445446 -277311 96895 453679
40542 453679 547809 238914 -384425 -952842 -1080598 -790145 -480350 -378757 -298100 -82872
40532 -82872 42451 -165002 -548368 -777128 -722899 -372229 265884 869188 886524 357743
40522 357743 167014 875182 1736077 1624789 606935 -272640 -533156 -616906 -759514 -549497
40512 -549497 143356 702355 629012 201792 -87331 -171955 -171755 -65065 94739 135662 170372
40501 170372 501751 938870 872965 300976 20412 396590 724256 408840 14966 304099
40491 304099 839448 594888 -354743 -852747 -389306 189273 -13347 -733352 -1105719 -874356
40481 -874356 -503958 -382331 -421333 -381847 -216842 -39893 21321 -117596 -432450 -731316
40471 -731316 -801680 -699956 -760107 -1164881 -1614250 -1654374 -1303227 -1043349 -1112249 -1140097
40461 -1140097 -723664 -77495 223956 -8874 -426162 -637519 -576341 -437167 -484234 -817588
40451 -817588 -1140632 -975677 -346029 74334 -152932 -560036 -496161 -163550 -242887 -732516
40441 -732516 -979658 -793999 -676308 -846993 -870477 -483798 -87038 -114837 -497466 -967263
40431 -967263 -1340261 -1340421 -768430 -7493 290843 157526 199347 417597 80342 -894668
40421 -894668 -1439338 -817477 254788 677561 429176 218817 311083 479992 643096 812553
40411 812553 816307 669047 772385 1212826 1425136 1120059 876071 1134539 1339181 909338
40401 909338 358248 465199 969875 1158054 1174636 1601415 2237483 2533490 2783643 3567787
40391 3567787 4475314 4948330 6033187 9324316 13964712 16648138 15354458 11565216
40383 11565216 7998211 5610379 3853258 2535279 1959853 1919088 1869410 1803332 1988273
40374 1988273 2143673 1748153 943323 372661 285218 426907 627448 901382 1137828 1218751
40364 1218751 1262446 1287433 922905 6731 -819318 -794069 -156903 130984 -242696 -571793
40354 -571793 -269424 306781 506403 335347 263136 375950 270977 -225671 -707818 -739404
40344 -739404 -433152 -201893 -153684 -105507 -79787 -311812 -723980 -900768 -754560 -686855
40334 -686855 -812727 -623646 100299 624641 210883 -697342 -1051032 -674543 -309878 -363084
40324 -363084 -517882 -549034 -596618 -555762 -80783 641156 932009 598175 98852 -328539
40314 -328539 -829746 -1147733 -731908 122987 339061 -359938 -999953 -932326 -703787 -766005
40304 -766005 -543158 361525 1166686 1165423 977976 1380914 1763374 1080401 -308632 -1120793
40294 -1120793 -1017933 -698948 -505581 -239755 -75984 -332800 -534017 -17603 674409
40285 674409 407290 -601521 -936819 -217119 359397 61301 -308149 -30340 254112
40276 254112 -181695 -750085 -510687 289973 731636 694447 764868 1036251 1008589 553393
40266 553393 133610 55747 169951 361850 771574 1378117 1773787 1561685 817811 59069
40256 59069 -216495 11189 286875 230564 -8624 -72402 -26390 -238790 -647635 -700371
40246 -700371 -195992 331319 363703 87406 -41017 -45081 -284926 -763579 -1022738 -729158
40236 -729158 -96590 328631 222630 -165851 -262577 132664 524633 337948 -293823 -712433
40226 -712433 -587318 -144370 340830 714216 667415 -8062 -791832 -788859 52375 771959
40216 771959 736960 410252 378411 388135 -18250 -549965 -614391 -277922 -36320 49093 266074
40205 266074 548822 558186 297347 14886 -340899 -939404 -1491649 -1515474 -1085775 -686669
40195 -686669 -408959 20949 462804 389651 -181685 -515216 -175221 384252 556601 383235
40185 383235 259806 275330 250674 153070 104606 135392 177714 170855 26891 -304045 -591461
40174 -591461 -401815 364663 1215580 1574813 1396952 1057432 776372 431743 -85657 -592676
40164 -592676 -792564 -612068 -246561 99571 397229 653702 705987 362798 -238916 -674624
40154 -674624 -756852 -774554 -990620 -1132507 -733360 128422 817190 896686 584026 376583
40144 376583 495962 806373 1058725 1077589 851334 550833 373040 317437 211248 -21521
40134 -21521 -226731 -192645 116128 501314 651108 361900 -269650 -897063 -1211447 -1128001
40124 -1128001 -714041 -139958 243238 84448 -486495 -817139 -486056 83677 110122 -565889
40114 -565889 -1328532 -1539040 -1111882 -412959 67800 -21486 -610769 -1174070 -1260938 -1021233
40104 -1021233 -910183 -973993 -825226 -288021 358742 804265 968261 816143 344045 -175118
40094 -175118 -347197 -166879 -3394 -23514 -55577 -79341 -317016 -670838 -629418 -41174
40084 -41174 505296 455075 45682 -112589 110247 351869 349848 128693 -235675 -654108
40074 -654108 -920899 -879352 -638205 -438392 -413435 -593077 -925151 -1166328 -1046559 -707845
40064 -707845 -620551 -844031 -810881 -200689 426099 390973 -65315 -146642 311575 710815
40054 710815 694383 597260 762576 996651 960938 677680 367124 90913 -169102 -288527
40044 -288527 -126369 204937 383566 207297 -180352 -421299 -343076 -204084 -389360 -848027
40034 -848027 -1097539 -904590 -628495 -630383 -686762 -411031 13330 72263 -229674 -352494
40024 -352494 -79052 184023 118838 -9699 150198 447654 479805 188648 -110198 -171005
40014 -171005 -46315 70128 62100 -34187 -101975 -93615 -71677 -53158 60063 251876 258724
40003 258724 -74698 -442967 -427440 -115754 28804 -96737 -84199 304864 754970 898410
39993 898410 821664 802158 833766 714595 419815 116857 -87864 -226090 -370807 -582748
39983 -582748 -870072 -1139640 -1290015 -1354081 -1399350 -1327264 -990914 -463993 78383 672642
39973 672642 1396117 1950168 1901062 1360689 883211 598937 89684 -674604 -1020266 -626914
39963 -626914 -195044 -411374 -836973 -642943 -24278 89835 -437263 -725140 -288063 254346
39953 254346 222419 -122240 -127029 220828 378040 96900 -288038 -342926 9349 482253
39943 482253 703128 557483 327800 356981 560601 539228 243160 145865 510127 836925
39933 836925 477923 -388330 -898895 -645727 -193418 -242179 -649752 -689302 -132016 395935
39923 395935 262897 -322171 -615650 -306813 189436 384875 282828 145509 3158 -327605
39913 -327605 -862341 -1325110 -1391445 -953734 -217613 398859 597619 514070 532581 725240
39903 725240 747714 435200 143412 191215 300801 51485 -345742 -293345 247869 634640
39893 634640 438005 -34226 -247648 -37819 449662 983774 1220482 873462 181460 -150906
39883 -150906 223818 829122 1013856 783873 644555 838414 1112682 1125601 765564 150174
39873 150174 -422579 -606866 -344141 8048 93643 -11991 -16808 104121 163370 196524
39863 196524 452704 921069 1214277 1046790 588328 228297 182426 423027 790623 1034236
39853 1034236 918034 491562 175299 372130 970474 1386280 1184595 565115 100789
39844 100789 38221 59419 -187225 -544264 -570742 -184793 231038 355094 249543 121386
39834 121386 87727 262437 706301 1119641 971885 219187 -458053 -489670 -164753 -112252
39824 -112252 -335735 -345675 -79071 -11148 -320849 -582377 -463308 -188279 -76413 -96827
39814 -96827 -143939 -294738 -480683 -349829 152547 474065 206028 -199973 -46381 509412
39804 509412 634143 49529 -589604 -690967 -494891 -537823 -813627 -905792 -695047 -483883
39794 -483883 -476443 -501388 -327513 -21389 141116 23966 -224029 -371989 -368351 -318926 -254894
39783 -254894 -112368 -941 -224820 -789934 -1121107 -694044 143858 503109 169819 -70425
39773 -70425 416279 1173117 1312978 708019 -31495 -475839 -646636 -545702 -133934 190958
39763 190958 -191482 -1196851 -1899823 -1638251 -785117 -97717 247869 553985 902920
39754 902920 1063482 912129 539027 73519 -270194 -178967 344307 738290 490594 -134826
39744 -134826 -411426 -95691 393813 670844 738294 626048 215881 -385710 -733937 -562174
39734 -562174 -132767 118215 56268 -154910 -286290 -166585 177677 420335 246976 -158565
39724 -158565 -259598 100433 468437 444474 204636 121690 192497 154785 -45608 -196142
39714 -196142 -99312 270320 747549 1005624 814127 368189 119771 222872 462899 750219
39704 750219 1189276 1556077 1345053 611781 83557 11085 -320869 -1272577 -1834655 -981064
39694 -981064 519865 949927 98549 -504381 49337 837872 770334 199384 28039 186783
39684 186783 56569 -243881 -125872 259087 187393 -339135 -504052 -36698 269701 -222180
39674 -222180 -991388 -1101869 -459458 226352 442501 289857 29593 -250962 -426994 -201479
39664 -201479 552378 1466291 1917134 1597759 766421 -44542 -482733 -554632 -470090 -391052
39654 -391052 -316294 -165267 53296 204309 211479 220297 414402 653632 537629 5474
39644 5474 -346585 105834 1120879 1720351 1343963 538461 233198 562051 777122 285203
39634 285203 -603974 -1105628 -880054 -289416 133809 181299 -75979 -498655 -835492 -708647
39624 -708647 -3854 789979 1016298 678766 446607 701540 1015413 858374 393916 103452
39614 103452 -44914 -437611 -986217 -1128577 -695854 -169872 57385 120766 193265 120047
39604 120047 -167475 -368892 -302424 -246705 -411892 -471049 -74458 490882 646639 303322
39594 303322 -159235 -480748 -614224 -415819 215732 944355 1232905 994895 630402 452391
39584 452391 459921 594476 764680 676309 151243 -396786 -367153 101145 232639 -207273
39574 -207273 -524669 -215624 199152 10488 -527661 -585818 -14149 509937 513315 253618
39564 253618 145108 211860 276525 260041 111592 -207436 -508394 -480239 -173540 -29959
39554 -29959 -221849 -335052 -21057 385297 354549 38483 100895 707903 1236620 1130692
39544 1130692 577546 92950 -157313 -263581 -124919 402679 1007704 1059495 351232 -613855
39534 -613855 -1191904 -1191275 -797268 -214379 381054 744072 728700 511805 421913 540163
39524 540163 640582 524962 240510 -69410 -356364 -612446 -753604 -697309 -505985 -326542
39514 -326542 -196936 -28347 203854 374546 382788 310759 300441 337006 284232 106082 -70342
39503 -70342 -88941 145861 616535 1026607 823028 -198221 -1284950 -1268884 -2304 1230894
39493 1230894 1218702 344576 -34031 535736 1178416 1146917 790888 713674 746870 404590
39483 404590 -142939 -288251 36439 280951 150949 -19589 131226 484453 703950 670455
39473 670455 473180 222463 46088 78856 280397 395596 260067 61142 134582 521485
39463 521485 867562 817200 429657 112345 159123 469595 766024 946869 1089969 1211456
39453 1211456 1223213 1103057 934941 805034 799879 999643 1260557 1173529 601693 117179
39443 117179 379340 1094978 1221213 362340 -665869 -962451 -616330 -232421 21394
39434 21394 297912 475778 381018 289752 510672 696718 297557 -442040 -682323 -166847
39424 -166847 496846 769463 717305 537195 228259 -82176 -107620 76072 39347 -246891
39414 -246891 -236001 327924 908312 903415 430180 23070 -57190 129166 460653 687165
39404 687165 440840 -294804 -997281 -1237615 -1228129 -1380563 -1603010 -1488895 -1031022 -668020
39394 -668020 -625357 -587436 -134812 685612 1339623 1348890 841917 436224 438492 391969 -207385
39383 -207385 -960652 -988808 -309011 8130 -646394 -1501337 -1517764 -790763 -187032 -64474
39373 -64474 -81913 25992 193165 349682 393094 49606 -625944 -890346 -198629 766465
39363 766465 823054 -28713 -599701 -280232 177678 -17140 -524845 -617896 -366580 -346297
39353 -346297 -615032 -705052 -400693 73911 482167 666238 356829 -557553 -1589263 -1959520
39343 -1959520 -1428859 -503265 185675 387892 166522 -263001 -543036 -386324 70683
39334 70683 393940 430460 456653 629490 680567 438896 289364 631573 1096343 908756
39324 908756 40849 -639084 -601671 -414766 -775285 -1310164 -1131427 -347863 -68078 -748760
39314 -748760 -1458559 -1267288 -596520 -437070 -759185 -650323 160903 885826 887575 464529
39304 464529 138676 -94395 -367101 -417996 -55765 281555 60812 -502240 -730734 -465414
39294 -465414 -159505 -58711 88900 418196 638232 577597 536308 741726 838462 363817
39284 363817 -481167 -979707 -762279 -162444 293613 439549 447400 516458 715430 985112
39274 985112 1179034 1160388 914562 557192 269657 238166 510540 826306 799218 448294
39264 448294 281069 533325 640227 27431 -787547 -699330 323271 999631 533535 -251533
39254 -251533 -235554 346162 532508 316491 480192 1005296 966834 155226 -416036 -54516
39244 -54516 582367 573401 -3941 -528399 -803680 -872980 -528945 189312 528446 -99218
39234 -99218 -1122701 -1498886 -1089940 -558936 -187794 278809 759278 792190 443781 362355
39224 362355 726022 935514 622075 217775 173344 283079 220476 162159 365675 566103
39214 566103 323830 -310562 -927523 -1321877 -1530576 -1535082 -1340012 -1185354 -1277546 -1408345
39204 -1408345 -1207494 -703997 -275840 -73962 119044 389297 431849 26294 -476814 -496542
39194 -496542 -15219 313640 7217 -574818 -717094 -335681 -19325 -97503 -235835 -169516
39184 -169516 -240515 -736549 -1194103 -1015577 -440378 -153169 -148836 152223 723787 829307
39174 829307 269954 -206663 -126949 -47642 -538001 -1184374 -1330254 -1174963 -1286203 -1480149
39164 -1480149 -1141057 -428336 -193493 -674483 -1145379 -1042688 -670276 -490379 -399205 -145715
39154 -145715 63854 -77551 -347304 -274692 87103 181313 -237614 -724034 -710580 -168267
39144 -168267 471129 835225 839914 550199 106973 -207399 -114847 304990 592621 423185
39134 423185 26629 -95964 211278 639220 858003 842937 749045 685641 673087 655630
39124 655630 523273 279689 190244 557763 1305006 1962179 2125260 1793015 1263530 873386
39114 873386 806078 937617 898129 521927 173608 313895 792390 978503 631277 204945
39104 204945 165413 411782 551818 382167 -91547 -759259 -1331177 -1476067 -1204900 -823043
39094 -823043 -442165 42150 458032 459948 278164 619975 1470184 1784258 962907 -115254
39084 -115254 -334654 21381 -115323 -781676 -958059 -262281 483060 582340 382214 466959
39074 466959 717466 667167 276426 -94078 -156345 146261 663802 1041355 991185 672014
39064 672014 486322 486639 397920 218524 239220 385923 188888 -368432 -609328 -124205
39054 -124205 602217 941189 965291 1053868 1146746 996804 794933 880710 1061937 872801
39044 872801 366170 4306 -151978 -443272 -769404 -516582 393350 1069736 781202 35089
39034 35089 -96874 547463 1123329 1093145 870068 899075 808898 87047 -842872 -1033783
39024 -1033783 -423039 -2892 -369384 -858878 -607632 145926 510918 307862 186478
39015 186478 516768 940767 1080767 984299 712430 175726 -343536 -173638 781638 1585615
39005 1585615 1345659 402349 -147792 89464 444367 257521 -270881 -508022 -257547
38996 -257547 121053 290634 309827 373873 407067 156127 -325230 -581396 -337428 65793
38986 65793 144823 -6403 67443 343321 307256 -115376 -283183 162978 618644 371373
38976 371373 -306301 -579528 -301998 -118416 -364275 -561933 -185685 607433 1263138 1464165
38966 1464165 1245161 786034 331528 82391 -46245 -361261 -906047 -1257738 -1045525
38957 -1045525 -497477 -188733 -327681 -566144 -517477 -227002 -58650 -266271 -749465 -1148213
38947 -1148213 -1154983 -819399 -538019 -625200 -912601 -956482 -655858 -400092 -478646 -641998
38937 -641998 -524317 -243817 -158665 -183801 95374 618506 778601 363988 -26571 115289
38927 115289 445888 436721 304215 550629 924028 713712 -23198 -436575 -188099 92586
38917 92586 -68325 -246281 19746 333311 63879 -609953 -962726 -766948 -473524 -475147
38907 -475147 -673173 -721844 -383320 245217 650181 327122 -469291 -816751 -331813 217934
38897 217934 63390 -328151 5823 911989 1296871 837113 409265 590492 789172 378088
38887 378088 -202940 -197591 262395 495161 374116 291812 290083 38215 -410365 -600542
38877 -600542 -464324 -447184 -719891 -903313 -781094 -657309 -690747 -496973 87846 384481
38867 384481 -279277 -1403662 -1801282 -1188377 -495388 -433946 -541942 -93295 681973 963737
38857 963737 582214 164060 114486 122319 -182817 -612755 -731341 -449870 -57004 137315
38847 137315 1503 -394600 -790454 -903770 -708474 -432228 -240501 -112286 -74722 -297724
38837 -297724 -807500 -1317752 -1524815 -1430888 -1246420 -1122491 -1096403 -1135359 -1101662 -830840
38827 -830840 -377144 -39541 -29830 -258965 -539456 -814362 -1077060 -1257167 -1313440 -1271575
38817 -1271575 -1090587 -712121 -313292 -208354 -366962 -371104 -54257 181410 -12909 -338465
38807 -338465 -289458 61151 187895 -91460 -398383 -373405 -109833 56727 -42576 -251049
38797 -251049 -215670 249950 833725 963316 554289 244655 580728 1233048 1443098 1072091
38787 1072091 722329 875360 1382611 1845105 2061690 1985654 1615038 1131352 911296 1190251
38777 1190251 1785118 2240673 2234832 1861601 1529930 1496790 1525116 1221385 700359 528434
38767 528434 885106 1245174 1160220 867106 720051 518118 -22580 -532233 -416127 236009
38757 236009 839244 1177878 1374180 1231687 466850 -482902 -764617 -293153 170601 194447
38747 194447 91827 53375 -212006 -686579 -783451 -289125 214836 295663 270787 416788
38737 416788 390901 31005 -48335 595259 1337040 1353472 859768 641941 800531 860793
38727 860793 802264 1017275 1393268 1363764 877083 480244 365254 127810 -349195 -519467
38717 -519467 -14787 699107 892660 452681 -98364 -222762 180628 742447 928258 555074
38707 555074 32585 -95463 203573 509079 554555 445314 336142 274753 354955 637793
38697 637793 894925 808708 468554 293780 420471 562881 544571 524521 560910 395590
38687 395590 -95867 -602877 -771392 -596225 -229781 253165 663924 651079 190768 -179063
38677 -179063 -8223 422998 533253 308528 235059 457724 574730 364411 184408 377442
38667 377442 686047 632603 226743 -113002 -209855 -273309 -402281 -382552 -134435 13368
38657 13368 -206389 -499688 -344033 275893 808062 795965 294667 -375565 -929305 -1078752
38647 -1078752 -597351 308719 974618 958339 586270 499433 785900 935479 614466 87749
38637 87749 -206455 -142805 182572 693596 1220214 1392866 1002167 360423 -27917 -115947
38627 -115947 -279513 -599968 -607334 19593 836492 1105614 710869 193702 -39172 -94056
38617 -94056 -161318 -197270 -197160 -338897 -596792 -608806 -243922 71488 -27845 -261597 -200037
38606 -200037 -3014 -73647 -236345 22233 590333 772995 376724 28170 197299 559921
38596 559921 645640 547189 598611 804948 981196 1085399 1059941 695438 17368 -499264
38586 -499264 -462723 -71979 198547 172452 -18689 -211767 -244187 663 342368 398254
38576 398254 119034 -144938 -284492 -624961 -1209927 -1491461 -1156834 -663875 -418470 -52550
38566 -52550 743136 1252977 610738 -666612 -1111950 -285356 676273 707460 150047 37668
38556 37668 684666 1484476 1762612 1412276 818406 404549 256687 182062 129599 304021
38546 304021 697239 867529 561741 217473 319367 542024 206847 -560472 -886977 -412296
38536 -412296 208454 240264 -272642 -796373 -966322 -730217 -231461 233131 417767 398849
38526 398849 412063 469371 457235 496731 768876 1077850 1082042 883202 857246 980344 909251
38515 909251 651647 492506 322719 -170124 -628738 -261268 837719 1512451 1080915
38506 1080915 227021 -103709 84998 306265 528308 899152 1082896 690701 57315
38497 57315 -167731 -29955 -187102 -868436 -1514593 -1537270 -1002519 -419492 -123321 -36713
38487 -36713 33948 19939 -299591 -761719 -761623 -97152 474463 158027 -626375 -745883 -62116
38476 -62116 348780 -116302 -708643 -607053 -133658 -9153 -160579 -66673 254853 374538
38466 374538 195922 -36076 -116905 177840 1019071 1927324 1922909 886265 50141 373946
38456 373946 1157524 1196243 588600 238332 176033 -220941 -692517 -319381 721638 1105818
38446 1105818 341510 -514353 -545418 -179924 -136372 -234781 2750 387837 480691 401298
38436 401298 544738 896994 1168876 1242454 1074089 586698 64848 178003 1112206 2066920
38426 2066920 2116766 1280222 316520 -216494 -273377 -14172 321971 435472 266577 111085
38416 111085 148169 143071 -45037 -36505 487880 1087079 1059715 490374 154032 383365 657381
38405 657381 462547 6591 -210019 -114978 -1497 -10279 -29738 30232 186639 528820
38395 528820 1096048 1604242 1608301 1054603 435676 245719 484338 861004 1234146 1547566
38385 1547566 1556038 1082758 485705 342001 583721 491704 -222455 -867771 -701341 48648
38375 48648 597585 694651 698678 775279 675709 310134 -25544 -101404 -14644 79318 145076
38364 145076 142280 59244 71831 322386 566187 428366 4958 -211755 -41927 158129
38354 158129 38900 -359546 -807612 -1071561 -870726 -104097 782839 1091746 672445 71323
38344 71323 -186915 -60280 309445 848176 1350187 1505908 1334679 1189011 1187274 1084390
38334 1084390 824876 687924 698827 489155 22691 -157131 194301 488428 170199 -389319
38324 -389319 -469678 -55987 341022 596564 971514 1363035 1299670 729491 200947 122585
38314 122585 318466 459514 518375 605445 675806 625431 503602 466810 606858 889326
38304 889326 1183876 1335800 1277909 1068689 787141 456482 110349 -176967 -385256 -545118
38294 -545118 -583153 -338214 173791 671679 891156 825564 633078 472411 461395 580639
38284 580639 587888 291424 -59610 17546 575840 1140310 1361358 1366394 1347423 1261755 1124211
38273 1124211 1110460 1144206 907148 527589 641444 1359973 1823114 1365172 544939 310988
38263 310988 656403 938608 1123819 1723845 2667109 3215412 3050147 2612930 2290374 2024927
38253 2024927 1813933 1820702 1850029 1462299 786245 482875 691729 756397 260021 -413318
38243 -413318 -857958 -1197350 -1441657 -1120960 -188271 425332 -49396 -1030880 -1355120 -870058
38233 -870058 -417862 -441859 -491908 -136594 410165 764986 881274 831663 527759 -64906
38223 -64906 -691930 -996382 -819352 -282720 270995 462317 212965 -130346 -198874 -31390
38213 -31390 115660 200993 285198 156198 -413523 -1053581 -1016916 -197262 565124 487779
38203 487779 -216455 -722590 -605899 -114292 343808 590551 653072 678877 853207 1172298
38193 1172298 1362395 1233486 1000743 989270 1121099 1023134 605868 180645 -29971 -140098
38183 -140098 -262136 -277634 -128337 -17246 -70639 -69032 183506 442299 336641 -38681
38173 -38681 -245244 -166165 -135780 -349773 -545519 -440369 -163671 -16947 -42947 -94896
38163 -94896 -166097 -363424 -619533 -685324 -425606 31579 430759 552240 292649 -249588
38153 -249588 -774343 -1015271 -999245 -965225 -1025104 -1023961 -761482 -259030 222215 381063
38143 381063 127036 -281652 -394688 -1408 595131 872289 669365 321589 174430 161409
38133 161409 13595 -263342 -376101 -207486 -55528 -273530 -792787 -1167980 -1075056 -632919
38123 -632919 -211754 -31211 -5950 75230 284195 466398 425824 219995 197286 611185
38113 611185 1236920 1573973 1457280 1222114 1161433 1114699 833707 484258 396940 473566
38103 473566 305293 -130051 -361435 -131662 227804 352434 391486 673313 1104270 1292408
38093 1292408 1135431 920484 878590 961964 1090226 1328938 1704477 2027018 2049905 1744403
38083 1744403 1322689 1009792 858666 796015 775666 794636 779241 618958 393013 383735
38073 383735 685762 959979 837169 451434 252445 363923 514556 584490 757530 1041681
38063 1041681 1127988 937563 851054 1097154 1335348 1224154 1029162 1199804 1617699 1772894
38053 1772894 1523992 1196375 1016246 904736 794016 723807 630891 428060 283222 435481
38043 435481 732228 749907 413469 89053 -19734 -143981 -451767 -675818 -515475 -127435
38033 -127435 98554 84382 72060 158047 131953 -134926 -360491 -123423 568291 1187294
38023 1187294 1273717 961694 738096 807853 984844 1129022 1288379 1382229 1216377 953988
38013 953988 1054076 1484864 1566575 1016039 555979 843264 1323047 1045863 287958 257013
38003 257013 1189489 1882732 1466901 616046 365937 554544 309496 -415748 -765128 -325061
37993 -325061 306246 458075 249714 194077 380357 489235 443250 579926 1056326 1405516
37983 1405516 1031571 87349 -529743 -236389 493579 769993 454652 238205 601353
37974 601353 1194834 1402607 1111240 649908 260960 -14876 -55923 352300 1128235 1714948
37964 1714948 1548336 744802 116740 304344 1019996 1462291 1396962 1338056 1581373 1701074
37954 1701074 1371661 1055999 1230938 1430294 916924 11663 -241911 303470 647264
37945 647264 226745 -231599 70528 750406 887501 384951 -17263 180143 736687 1140799
37935 1140799 1147522 889021 708762 835415 1124402 1274700 1294522 1424739 1586876 1386630
37925 1386630 809232 402549 517628 836310 939905 892817 948288 1121399 1387787 1857005
37915 1857005 2395024 2539631 2176189 1815465 1788493 1713419 1280378 982105 1360441 2014317
37905 2014317 2180764 1944918 1980169 2319352 2355320 2022003 1991557 2502468 2862081 2494056
37895 2494056 1820438 1661921 2204746 2941765 3322970 3170201 2700045 2364704 2471686
37886 2471686 2829085 2976325 2821744 2767022 3121801 3707733 4178909 4470160 4783757 5339222
37876 5339222 6241989 7418514 8629285 9744931 11035408 12958515 15632099 18754879
37868 18754879 22098005 25859261 30485328 36279246 43032390 49673042 54331907 55301213
37860 55301213 52281002 46572186 39975855 33670296 28075241 23303115 19408549 16392494
37852 16392494 14231351 12847157 11963526 11172827 10308542 9601191 9268000 9056941 8458667
37843 8458667 7391405 6413844 6059930 6117012 5915194 5366662 5242583 6053683 7072352
37834 7072352 7169584 6459588 6194682 6842686 7272803 6459497 5115695 4651893 5079149
37825 5079149 5131516 4287325 3452343 3440885 3855793 3962828 3855694 4102138 4723498 5150382
37815 5150382 4992519 4439555 4007948 4103627 4676713 5202901 5251085 5134752 5642276 6986055
37805 6986055 8414773 9105562 9104495 9102911 9548784 10288984 10949607 11420324 11980527 13003169
37795 13003169 14485594 15998887 17320108 18929380 21458006 24763665 28142585 31515519
37787 31515519 35775262 41741309 49384881 58489400 69593866 83782247 101875499 124437893
37779 124437893 152498027 187419085 228879905 271951021 306216853 319685285 306265876
37772 306265876 270708434 225650213 183061614 148234684 120787211 98980835 81808155
37765 81808155 68472390 58079196 50056589 43914286 38741859 33827278 29508848 26451522
37757 26451522 24312526 22163893 20047850 18898362 18869515 18976301 18671478 18589102 19224322
37748 19224322 19948397 20014025 19633069 19264927 18591878 17126198 15323554 14146732 13786455
37739 13786455 13652505 13478174 13632937 14347759 15344254 16367517 17565335 19227196 21586968
37730 21586968 24976368 29748636 35857492 42706490 49384802 54768039 57515902 56557674
37722 56557674 51900547 44802837 37048169 30112942 24786097 21059205 18259649 15689381
37714 15689381 13327350 11650064 10728086 9952441 8857445 7755778 7173999 6993024 6635410
37705 6635410 5950754 5424311 5476683 5928589 6263101 6165782 5706979 5180146 4866366 4844782
37695 4844782 4947987 4930119 4675030 4230911 3739637 3386268 3269827 3221444 2934155 2428159
37685 2428159 2162970 2437143 2894197 2966372 2622037 2240985 1893817 1314880 605827 347081
37675 347081 785115 1415829 1669750 1583502 1479255 1401866 1279277 1289355 1598847 1980422
37665 1980422 2137433 2201074 2441529 2666279 2433011 1789530 1289804 1260479 1507976 1780395
37655 1780395 2046864 2220705 2070959 1620426 1277628 1340977 1625509 1772403 1706834 1606356
37645 1606356 1594135 1635640 1634474 1540653 1452238 1591931 2016055 2399780 2368062 2007922 1734839
37634 1734839 1665589 1538262 1324785 1419885 1959262 2395838 2161109 1438287 837375 545161
37624 545161 322459 215105 631133 1571111 2337907 2365824 1970331 1838153 2005747 1891877
37614 1891877 1326927 951456 1318152 2071503 2480908 2475419 2569746 2920568 3147348 3154264
37604 3154264 3418400 4175743 4962081 5406272 5934382 7135968 8886873 10734273 12771327
37595 12771327 15396882 18487700 21659586 25267507 30262949 36849568 43877778 49681095
37587 49681095 52972819 52992654 49652932 43886609 37251186 30855960 25053694 20147392
37579 20147392 16608065 14354883 12606442 10863214 9397244 8411457 7460490 6226128
37571 6226128 5164590 4730140 4545481 4048805 3454867 3306923 3477675 3415022 3098895
37562 3098895 2968721 3076325 3048424 2791561 2569017 2446523 2260208 2056534 2007283 2000636
37552 2000636 1864102 1824117 2138079 2456506 2250556 1732630 1574348 1772041 1643105 1024656
37542 1024656 609331 849431 1314286 1478086 1448241 1492883 1440164 1036583 490235 233116
37532 233116 426981 957014 1572624 1850471 1467180 739244 409238 640189 770257 392768
37522 392768 43996 291329 732660 641110 190127 181659 738191 1132431 956044 651163
37512 651163 651011 691833 382391 -60972 -153977 77815 165957 -62496 -264500 -147986 102587
37501 102587 146181 5174 14611 316190 653240 754124 730064 886195 1199894 1243087
37491 1243087 733544 -551 -293094 150002 949860 1483662 1512594 1320462 1281770 1401820
37481 1401820 1355286 940105 358907 -26076 -110141 -57538 60943 405535 1028025 1574779
37471 1574779 1569140 983861 333794 122279 342713 641607 825753 980537 1145981 1189850
37461 1189850 1111684 1186070 1558806 1899967 1780684 1295906 959301 987868 1053104 825686
37451 825686 430489 198039 230828 401044 577626 695777 766573 915128 1210500 1406424
37441 1406424 1154192 573795 231480 341961 400551 -45740 -616737 -560901 198718 950063
37431 950063 1056793 558466 -54515 -347281 -253691 -132418 -428569 -1065737 -1367685 -900064
37421 -900064 -192961 -196049 -1092781 -2070160 -2270105 -1634960 -809475 -484256 -798337 -1150526
37411 -1150526 -731398 475942 1433025 1181952 41091 -847415 -1003250 -978148 -1238815
37402 -1238815 -1433123 -1080362 -410910 -38425 -99126 -163112 100234 512780 692018 581537
37392 581537 528813 782747 1036320 749831 -23906 -514432 -160741 692711 1325330 1463707
37382 1463707 1172005 399146 -711591 -1428950 -1167093 -445286 -307522 -878443 -1332540
37373 -1332540 -1246066 -1029243 -926010 -609820 -76617 55392 -361502 -492320 255150 1204709
37363 1204709 1322316 615243 -79028 -295221 -250095 -214849 -190330 -101645 81903 302257
37353 302257 288321 -226962 -980883 -1298436 -979978 -599545 -644362 -883969 -909287 -713749
37343 -713749 -363525 269922 983004 1112066 492988 -110000 -147481 -131815 -587472 -929953
37333 -929953 -413532 443925 594439 181372 223489 821635 1063608 715633 608973 1075146
37323 1075146 1318003 851779 396195 644488 1103560 976085 462965 315555 578421
37314 578421 625299 200464 -292769 -448003 -250496 141676 584549 914708 1015377 914176
37304 914176 683586 363619 78895 8167 95242 42193 -232858 -388626 -117991 430222
37294 430222 903982 1175212 1258189 1043089 469522 -136009 -249464 259989 927819 1167697
37284 1167697 858215 388878 154845 123493 22853 -133494 -32778 336363 479203 110821
37274 110821 -286691 -114994 399278 532255 193111 20284 313639 579315 341055 -201150
37264 -201150 -570213 -545115 -97358 632846 1080681 637816 -372082 -769404 -23800 970784
37254 970784 1180899 824283 726972 880980 634101 14960 -172879 420072 1250412 1778536
37244 1778536 2031500 2118471 1911011 1448184 1047962 782051 401079 -27809 -40441 396954
37234 396954 630159 277059 -159915 -121835 131322 71349 -151136 -22985 399244 634296
37224 634296 656326 835687 1062692 767057 -52669 -617792 -507324 -302776 -616518 -1049242
37214 -1049242 -753826 292264 1233326 1446622 1148583 876864 834151 854426 682723 172926
37204 172926 -545417 -1023485 -848991 -124940 603420 953257 1028523 1081220 1092748 859087
37194 859087 351554 -187896 -488949 -493860 -344480 -166877 70906 412361 676706 577605
37184 577605 136249 -264770 -369675 -317923 -239182 55414 619258 963691 646989 29848
37174 29848 -186246 -22090 -102695 -530961 -711620 -431648 -250522 -475690 -558624 -15477
37164 -15477 737901 1044158 909461 670893 338556 -78002 -142762 344025 724802 352777
37154 352777 -308320 -330967 249818 601187 452468 282851 265845 78492 -210518 -105005
37144 -105005 333849 478545 284738 381221 743859 458234 -677372 -1467473 -1011541 -71021
37134 -71021 194420 -24677 163991 641030 543092 -79065 -226086 380892 807585 393129
37124 393129 -277532 -385473 -101510 -186078 -824282 -1444611 -1503166 -1007803 -318472 265470
37114 265470 659700 860415 763615 259163 -428013 -720875 -294968 422294 681847 286066
37104 286066 -290634 -598856 -643840 -603378 -538193 -510726 -622914 -757851 -606722 -153680
37094 -153680 172465 77126 -153325 -102773 98310 -54051 -676465 -1311622 -1533676 -1370109
37084 -1370109 -993038 -354621 551971 1272543 1165717 171567 -992786 -1564249 -1456008
37075 -1456008 -1090909 -762122 -489686 -376321 -632859 -1123373 -1282359 -779578 -25645
37066 -25645 321525 216942 219205 631842 1043402 897877 250546 -323453 -464005 -374993
37056 -374993 -397210 -492467 -362577 23270 287818 108576 -362062 -677615 -585236 -191981
37046 -191981 252864 560760 654596 615961 657565 865574 1006927 812173 425858 302330
37036 302330 605490 976087 991069 623975 154270 -145477 -123964 197284 542209 580874
37026 580874 354716 250984 397482 400689 -36458 -526066 -434767 217616 702628 436875
37016 436875 -397864 -1109148 -1145466 -497521 331556 724205 469714 -85772 -458668 -484038
37006 -484038 -266698 98968 523180 811077 858922 842280 907449 814265 284754 -373548
36996 -373548 -496993 -5730 383039 136544 -307778 -130876 737285 1533349 1671747 1425107
36986 1425107 1445026 1899639 2381821 2577353 2678604 2997220 3432640 3639716 3610815 3682793
36976 3682793 3905867 3843499 3245843 2540866 2265930 2288004 2066882 1527781 1134475 1128130
36966 1128130 1236856 1223314 1197873 1207989 1007618 513663 70898 -70631 -170199 -493725
36956 -493725 -720713 -357020 435445 951170 867820 589010 572864 730466 692754 385024
36946 385024 76100 -19603 21162 -18475 -212034 -390159 -338871 -99266 25173 -157766
36936 -157766 -457199 -544264 -363335 -97087 185579 563298 961055 1129530 996203 753209
36926 753209 506916 153392 -256055 -385691 -120427 131017 27358 -73454 409699 1290331
36916 1290331 1694979 1231803 532114 363269 645849 734284 366687 -115972 -358115 -359026
36906 -359026 -244945 -32640 258239 478188 471012 237582 -74761 -284758 -282194 -94930
36896 -94930 148187 352444 511793 626956 693401 794031 1010318 1172993 962479 412489
36886 412489 22668 121371 411678 484435 463232 653007 825038 523155 -30535 -107115
36876 -107115 364078 592360 169417 -251744 -8807 515531 569499 255480 265350 672552
36866 672552 840050 491049 86048 6181 42745 -65824 -163886 -44974 175395 351313
36856 351313 548763 687659 386467 -405629 -1002811 -760196 -15601 346467 142378 23311
36846 23311 321864 507768 120313 -399544 -371863 63496 237221 73387 159195 683908
36836 683908 1079359 970741 786750 957315 1072268 491793 -552121 -1191497 -1137648 -957819
36826 -957819 -1091873 -1262272 -1096569 -788221 -766438 -1045323 -1250596 -1101378 -612433 21562
36816 21562 533071 702637 540958 265057 30532 -173317 -348100 -426646 -425491 -417449 -330681
36805 -330681 -65263 178097 76589 -221556 -130193 546177 1242852 1376867 1081109 869122
36795 869122 902419 969360 941184 878315 854558 957767 1270087 1618581 1620416 1232887 937208
36784 937208 1075136 1356170 1371653 1201477 1074400 847346 391414 115394 406760 830156
36774 830156 674089 150465 192023 1012715 1707144 1512567 755368 224507 206522 510990
36764 510990 941956 1303719 1287656 782069 125389 -222331 -120831 274360 752289 1120366
36754 1120366 1273098 1331227 1495347 1661170 1450072 762638 37263 -230100 -32927 233335
36744 233335 245483 9174 -240623 -306811 -245285 -263625 -341339 -175055 270180 451127
36734 451127 -57500 -765080 -770296 -21189 574926 399255 -153448 -416691 -337190 -291069
36724 -291069 -474742 -817079 -1147085 -1188988 -745500 -112373 73221 -370533 -911638 -1045455
36714 -1045455 -848436 -578234 -264115 -18575 -185569 -718547 -925077 -376564 361885
36705 361885 483611 26896 -402575 -617863 -843791 -1003122 -802703 -424824 -380156 -670182
36695 -670182 -777167 -525751 -301124 -340109 -456800 -587123 -931074 -1344857 -1265194 -585453
36685 -585453 -21829 -176361 -720338 -982331 -922001 -947668 -1063145 -854304 -257945 253176
36675 253176 357494 285029 339754 393779 145385 -330491 -597548 -382904 124075 503417
36665 503417 483152 84249 -437086 -719341 -524132 13281 430229 368277 -90402 -630965
36655 -630965 -1122758 -1578377 -1778298 -1352542 -394587 369522 347541 -201660 -567508 -546611
36645 -546611 -562334 -846743 -1007826 -647534 -43957 169626 -138809 -450306 -326503 38918
36635 38918 160031 -84191 -388414 -511907 -533811 -582734 -591134 -478442 -370757 -405777 -443805
36624 -443805 -239205 146062 374360 307870 199941 319439 590855 739613 653162 467811
36614 467811 382966 485942 703663 867745 862640 711128 474028 144312 -242620 -491219
36604 -491219 -436638 -199233 -37937 -4136 25264 58053 55889 221680 764509 1329128 1187284
36593 1187284 243762 -608929 -521657 256570 780031 628103 244264 137478 233316 155943
36583 155943 -168639 -437903 -417981 -274661 -363169 -729360 -994795 -853187 -503919 -349867
36573 -349867 -420662 -467246 -531924 -913152 -1504736 -1730933 -1378988 -999860 -1137397 -1570648
36563 -1570648 -1708343 -1383362 -839605 -243382 322671 615487 479984 220295 282321 632516
36553 632516 824958 622735 219322 -87432 -130875 135322 579969 884300 838313 569612
36543 569612 298129 51052 -166992 -193946 -9777 58885 -194884 -453526 -357105 -116849
36533 -116849 -137182 -260521 -92 589591 909940 699165 342589 227236 297241 361007
36523 361007 393759 412239 406383 447867 535546 390161 -174903 -761007 -799536 -437143 -397280
36512 -397280 -895000 -1349457 -1355144 -1249331 -1364441 -1352646 -787327 16616 387026 247767
36502 247767 110348 209749 200383 -179641 -568473 -399289 300321 848301 745399 335125
36492 335125 321759 723732 794382 139546 -634994 -813436 -611294 -672332 -888786 -583398
36482 -583398 247457 797932 692344 492042 658925 800632 400396 -350916 -957781 -1312503
36472 -1312503 -1467850 -1215598 -491561 165416 169040 -326346 -703410 -717269 -550436 -274045
36462 -274045 151954 464835 301281 -153779 -256612 226919 779639 848265 554721 440333
36452 440333 709910 1009483 922611 477283 62797 -55119 45376 220582 499040 838238
36442 838238 890006 411256 -193217 -223639 373620 903009 895518 694211 825593 1269015
36432 1269015 1710989 2103550 2498385 2626445 2179104 1393637 892559 931829 1133622 980254
36422 980254 350138 -409350 -776759 -510213 50349 280415 11995 -248978 -54046 312809
36412 312809 236287 -340433 -830540 -757450 -251101 210909 270252 -128311 -760233 -1242373
36402 -1242373 -1293796 -968021 -579921 -398023 -438648 -525715 -522268 -515654 -708995 -1064494 -1220859
36391 -1220859 -962764 -568112 -343495 -34656 735873 1555586 1516530 575643 -179765 -22178
36381 -22178 396862 114340 -672403 -982892 -530785 -4570 5579 -345743 -598837 -517703
36371 -517703 -128853 344038 561224 404745 175130 172620 261002 186922 92890 261358
36361 261358 544350 551309 275958 43613 -59155 -209759 -394759 -425876 -351129 -382582
36351 -382582 -482427 -472810 -445271 -570146 -636463 -347708 37751 -10391 -438705 -707076 -712987
36340 -712987 -878332 -1249499 -1303496 -867706 -485601 -546909 -729734 -677571 -585401 -656896
36330 -656896 -562652 6597 690154 923902 734094 546728 474242 309922 42263 -127530
36320 -127530 -187128 -298897 -426647 -344476 -21260 283273 314069 21795 -478981 -958873
36310 -958873 -1126263 -820344 -185841 392080 515743 30471 -749980 -1137697 -717068 73078
36300 73078 369926 -25403 -434530 -345878 -141427 -395429 -918922 -1089912 -855368 -731806
36290 -731806 -874210 -821347 -330662 112505 -28188 -544265 -801501 -648003 -518625 -639880
36280 -639880 -624673 -107759 578147 787530 458021 133038 105675 93543 -76722 -65607
36270 -65607 306056 527833 145386 -382075 -316447 141484 134469 -453597 -834044 -645371
36260 -645371 -456095 -618221 -607993 -83834 293893 -86288 -618912 -338903 515682 849306
36250 849306 395368 -10344 143053 373473 213238 -51427 -109158 -311889 -997417 -1681395
36240 -1681395 -1652398 -1046691 -605432 -542684 -430454 -204011 -407413 -1102438 -1342921 -448774
36230 -448774 727719 751332 -364175 -1110199 -628715 161137 126014 -366990 -255756 369684
36220 369684 457085 -212131 -684151 -419586 -55916 -196741 -462017 -322964 -25727 15789
36210 15789 49056 429334 784348 556579 -8662 -240148 -139081 -286670 -810807 -1245479
36200 -1245479 -1371988 -1422077 -1390355 -917260 -78696 380904 -22510 -809783 -1136851 -789146
36190 -789146 -246125 31841 36574 -21374 -99060 -312571 -581785 -502506 176443 1024079
36180 1024079 1278883 835739 427236 562495 776855 396300 -383589 -818020 -731359 -594444
36170 -594444 -597688 -393472 158306 642216 669202 297069 -274315 -935206 -1443272 -1461494
36160 -1461494 -1022472 -535107 -172609 287123 834934 972027 408365 -401032 -792608
36151 -792608 -661472 -365367 -153638 -45721 -54065 -174140 -283520 -317783 -410784 -633368
36141 -633368 -758922 -541622 -95401 247095 349428 325687 271616 158343 -44200 -295687
36131 -295687 -515863 -612960 -556771 -467923 -505012 -618408 -595370 -418410 -354220 -546965 -731726
36120 -731726 -555517 -58357 345599 295667 -213709 -856421 -1202761 -1040111 -576815 -255863
36110 -255863 -324425 -677462 -1082031 -1340250 -1246743 -706570 4478 415692 466393 627364
36100 627364 1183150 1689123 1490258 601096 -294800 -645833 -506625 -245049 -109169 -161329
36090 -161329 -376861 -641603 -768681 -655208 -396120 -167402 -2000 246415 658177 1012111
36080 1012111 949227 443593 -50723 -97406 189473 330295 120235 -171069 -200735 120570
36070 120570 683743 1258061 1501482 1231631 752275 578159 752093 789749 413395 -57855
36060 -57855 -235544 -179374 -127269 -84704 -12549 -89672 -393577 -582341 -327416 114747 202601
36049 202601 -110140 -307154 -15248 561343 941225 849210 393618 -36065 -65934 312930
36039 312930 755730 1026358 1249497 1524887 1582512 1178015 608675 376276 444439 326059
36029 326059 -89996 -312535 -690 490445 582624 207314 -212596 -342926 -234397 -99659
36019 -99659 -17386 79664 212356 247378 40576 -329051 -576967 -520729 -279541 -106884
36009 -106884 -127597 -300787 -506184 -582926 -431926 -171496 -25328 19579 207095 560298
35999 560298 752496 622771 464593 503057 459474 76984 -249213 42940 743930 1052137
35989 1052137 662217 77228 -211994 -268453 -289910 -206758 51341 326244 521211 757654
35979 757654 1031898 1074724 763931 331578 -25347 -353099 -564311 -332329 305031 701811
35969 701811 433429 -7959 97993 607403 762151 381832 69978 162437 206638 -183152
35959 -183152 -561517 -293042 399590 667812 230015 -281327 -300962 -112046 -279068 -674775
35949 -674775 -614137 124308 924524 1109531 710605 257897 92888 131701 112136 -152426
35939 -152426 -619821 -954494 -806168 -315610 -86891 -433181 -941615 -1088358 -962986 -950393
35929 -950393 -986273 -712403 -218767 9990 -118781 -190496 -33675 19755 -208445 -404728
35919 -404728 -338526 -249410 -333031 -299105 161656 806645 1123802 954148 529130 108785
35909 108785 -144680 -141393 33968 157573 161524 185812 250693 204088 106524 246319 581880
35898 581880 642508 270026 -29572 142369 433077 350378 76524 65978 168679 -149321
35888 -149321 -863715 -1328343 -1144160 -572532 -87075 49099 -188235 -547763 -565075 -85478
35878 -85478 382527 290517 -113457 -115865 394695 809604 739488 425430 131560 -215335
35868 -215335 -583198 -646331 -336252 -68882 -110333 -173802 32095 295360 307719 178972
35858 178972 133409 50096 -213777 -321092 154449 937173 1207399 640103 -151063 -401393
35848 -401393 -114185 78307 -195308 -627107 -744993 -553570 -406805 -387732 -211872 182884
35838 182884 386732 151766 -94159 159865 639940 608250 -4640 -422353 -113938 509678
35828 509678 757944 543053 251151 97893 8613 -81036 -157775 -244144 -337826 -359062 -319888
35817 -319888 -361390 -468426 -387607 -26017 319041 358917 193781 44269 -122904 -379189
35807 -379189 -501798 -266450 100413 195235 50988 17644 85851 -137401 -681929 -981085
35797 -981085 -678905 -241978 -313680 -708182 -614115 182254 831875 480042 -590593 -1328794
35787 -1328794 -1235511 -773376 -473103 -274051 -21316 -14195 -509215 -1069174 -1059383 -580372
35777 -580372 -246589 -179127 32723 389006 346404 -174830 -472416 -130877 323034 323562
35767 323562 153485 308029 538954 279714 -351512 -723509 -640043 -431677 -265970 -22773
35757 -22773 244924 335827 315468 363228 331489 30709 -216024 6676 346116 33751
35747 33751 -884950 -1496527 -1344478 -989241 -967604 -994277 -646064 -152548 51806 35433
35737 35433 65808 26176 -295521 -670717 -738918 -592524 -532376 -476480 -155526 282116 428162
35726 428162 291619 273299 470771 525968 248172 -65285 -87003 111702 263166 276930
35716 276930 246887 254113 283523 246192 67039 -155221 -148944 200555 609287 710110 534346
35705 534346 404393 404018 300191 16533 -185214 -135698 -61448 -248666 -607236 -780571
35695 -780571 -594573 -270559 -241470 -745133 -1467608 -1679636 -1016373 -65320 248469 -105269
35685 -105269 -214021 372866 859356 369793 -655758 -1054651 -628308 -277786 -482312
35676 -482312 -667870 -387658 -159678 -513558 -972526 -802623 -256030 -158871 -554200 -707737
35666 -707737 -390690 -198420 -433091 -565657 -190771 235554 149529 -194138 -171194 192583
35656 192583 276044 -212024 -879827 -1183985 -930228 -285427 376870 662784 469511 118404
35646 118404 3061 164730 359937 416430 346991 248894 249215 377422 365378 -136699 -940024
35635 -940024 -1273567 -708911 185341 530302 207264 -206476 -298699 -84196 368946 960289
35625 960289 1320985 1152412 719248 440580 154428 -508629 -1181205 -1117005 -528842 -525681
35615 -525681 -1408010 -2057741 -1591118 -686937 -471509 -822931 -754812 -29690 602866 587335
35605 587335 110949 -465014 -961044 -1160826 -910827 -489189 -307842 -255920 72624 527685
35595 527685 473023 -200597 -837616 -1009915 -1068255 -1362405 -1552913 -1227878 -733265 -746441
35585 -746441 -1240366 -1474058 -994769 -168705 371882 440725 298577 200653 173572 166604
35575 166604 224439 421715 684871 796650 622863 256255 -113216 -357031 -361400 -17303
35565 -17303 529641 791032 433541 -206857 -481372 -282323 -105969 -205049 -215048 123592
35555 123592 409915 231045 -36724 277788 1031814 1363369 944251 468722 640138 1234539
35545 1234539 1571656 1481453 1283906 1075909 637505 13715 -355200 -228983 109297 310160
35535 310160 399305 523194 538324 186562 -458693 -1035609 -1337698 -1448068 -1441588 -1226404
35525 -1226404 -769162 -277554 -19324 -50707 -224526 -408455 -595539 -797736 -908937 -763218
35515 -763218 -363137 35523 188065 156982 158795 150200 -121386 -563678 -621155 -8125 749569
35504 749569 935374 606773 427924 614321 630645 69889 -698275 -1050647 -900441 -625523
35494 -625523 -465371 -341516 -158917 6632 16186 -171760 -413898 -431911 -93322 335744
35484 335744 438762 211034 113210 444431 923138 1064163 756664 295083 19252 64506
35474 64506 289857 354577 66037 -304755 -331037 -71465 -6737 -277225 -505972 -552014
35464 -552014 -817515 -1436943 -1774302 -1297945 -481038 -184760 -495995 -826424 -866076 -758045
35454 -758045 -572556 -315963 -269476 -603958 -843779 -476346 97348 102294 -269480 -110268
35444 -110268 597487 817721 186694 -306999 59940 563064 287694 -371286 -478739 -113124
35434 -113124 -19863 -175708 114860 875744 1342272 1225527 1082291 1241730 1272795 843631
35424 843631 351518 291703 580936 878146 1063660 1044631 592873 -187968 -653781 -356329
35414 -356329 311574 647066 554154 490178 719976 1091960 1405869 1543711 1349335 852624
35404 852624 536149 860963 1527576 1746405 1314869 854387 813619 866730 647464 464394
35394 464394 717419 1079122 974648 582890 567030 930714 989713 549058 241673 419402
35384 419402 538656 135158 -330418 -278697 -67885 -391983 -995287 -951870 -151926 434427
35374 434427 182429 -300256 -122455 637906 1147803 956036 407694 19522 -146249 -369186
35364 -369186 -717541 -816910 -308074 521653 886169 471754 -65652 35927 545393 565728
35354 565728 -151583 -882546 -1012093 -786047 -708581 -756350 -621028 -351061 -288441 -543758
35344 -543758 -870039 -952520 -642380 -78535 296671 112753 -385901 -502883 -9455 460891
35334 460891 249144 -425383 -792166 -524399 7647 330480 315084 93500 -133486 -209093
35324 -209093 -162291 -185298 -312281 -278219 90117 532495 689910 627784 705835 1023850
35314 1023850 1309118 1296109 937062 310507 -362661 -658391 -282886 439817 730010 208019
35304 208019 -583197 -740039 -51436 721162 727722 32899 -543867 -557687 -448255 -674397
35294 -674397 -849307 -355411 495762 766528 323951 53358 422141 743956 338474 -403142
35284 -403142 -760751 -797963 -967889 -1166484 -1022709 -722022 -687978 -757773 -523811 -219914
35274 -219914 -362233 -716922 -608507 -168523 -241491 -968130 -1479935 -1237923 -728588 -487118
35264 -487118 -307354 123964 567012 711245 698912 700866 537878 168809 3082 268021
35254 268021 580803 591342 522334 613914 598190 267756 19941 215778 500710 442228
35244 442228 362178 744716 1219666 1040170 317647 -169807 -270451 -546748 -1036539 -1010219
35234 -1010219 -287340 209660 -192574 -821976 -686757 -23107 83987 -641260 -1302255
35225 -1302255 -1169087 -577909 -203743 -65927 251352 749567 947843 597887 25982
35216 25982 -311585 -299421 -90775 152915 285260 167426 -135824 -295394 -87352 255795
35206 255795 285456 -104023 -549963 -642264 -308771 197443 542573 565415 411969 368177
35196 368177 468884 425312 89285 -243670 -268964 -171994 -291571 -477590 -301459 192765
35186 192765 544451 692472 1076157 1757069 2097629 1646707 795191 166536 -153671 -363292
35176 -363292 -402721 -191492 -24553 -173919 -380226 -279923 -70106 -162658 -400134 -277254
35166 -277254 159799 313619 -31852 -402780 -388375 -154975 -24491 -20008 -57930 -178045
35156 -178045 -316785 -188183 312867 813916 844213 395186 -77719 -135685 247674 676625
35146 676625 689857 246002 -165336 -58561 457964 858686 905984 845053 877270 831438
35136 831438 523441 118045 -109116 -151357 -177693 -217906 -171151 -39200 50664 32347 -18942
35125 -18942 11199 152650 308918 330435 176542 -22175 -135206 -195015 -260462 -210757 109789
35114 109789 584220 896014 898191 680340 310655 -181214 -572623 -587265 -363846 -392567
35104 -392567 -796101 -1050807 -704747 -48870 282197 134382 -134787 -284685 -422931 -650911
35094 -650911 -863945 -949134 -893707 -680374 -362922 -251773 -667133 -1400851 -1778125 -1478529
35084 -1478529 -1011743 -1068825 -1591169 -1863662 -1482195 -830766 -492482 -542007 -671361 -753673
35074 -753673 -900885 -1048073 -889359 -320050 376498 919244 1306324 1527624 1355734 765227
35064 765227 271702 370161 780779 790142 314996 35376 344184 770293 754052 453272
35054 453272 314655 274803 -26771 -506391 -736647 -677934 -705014 -913271 -989734 -850329
35044 -850329 -810416 -942800 -860465 -446036 -225776 -540059 -819165 -338879 573100 824958
35034 824958 48176 -885078 -1036603 -542383 -225919 -447762 -783002 -717808 -293106 11660
35024 11660 -135241 -532868 -655053 -262480 275341 420017 146350 -85450 -16964 126841
35014 126841 142333 198793 420075 518922 258308 -42065 30575 240472 30246 -507984
35004 -507984 -666950 -221949 171741 -42826 -518456 -583141 -193604 149391 133625 -172882
34994 -172882 -633348 -1080921 -1200966 -847011 -411035 -439287 -884481 -1152545 -933974 -585310
34984 -585310 -563818 -839449 -1072252 -1123364 -1149023 -1289326 -1442293 -1356664 -915564 -323540
34974 -323540 65680 157541 203877 365363 412002 125270 -204374 -92236 405237 720219
34964 720219 576246 323241 351088 580896 725945 686163 461558 30153 -417423 -461862
34954 -461862 -12058 414816 363189 142275 382606 1032134 1342233 906657 226541 36247
34944 36247 413438 819003 807208 432909 48331 -81437 39940 199233 165999 -130057
34934 -130057 -580581 -1024989 -1359692 -1554928 -1644279 -1695692 -1705113 -1506064 -902779 14792
34924 14792 762237 835724 272554 -273493 -192274 352826 580613 90736 -561881 -606013
34914 -606013 -162060 -64690 -547527 -782313 -134493 696648 530407 -561019 -1240647 -731742
34904 -731742 164743 284303 -323414 -668587 -288033 296511 509902 453380 549084 920295
34894 920295 1343729 1528969 1298138 734764 240767 167767 327383 221464 -146008 -160517
34884 -160517 441117 999351 795560 95342 -289901 -227144 -296971 -657009 -698598 -81495
34874 -81495 618046 746563 506463 497136 725594 709000 350813 68892 69237 57705 -211141
34863 -211141 -542265 -630457 -465668 -250203 -146185 -215378 -393673 -441770 -151210 298876
34853 298876 416759 -24174 -648940 -871884 -529635 -23767 109400 -264571 -720903 -699587
34843 -699587 -175365 219203 -67741 -783178 -1186400 -985229 -540208 -161081 258133 729922
34833 729922 855925 427729 -59719 -24086 301731 153624 -627786 -1308881 -1249341 -705488
34823 -705488 -363960 -407029 -439773 -217482 -15909 -156862 -469011 -501111 -164768 151375
34813 151375 169314 127171 385255 844194 1079298 958818 758363 640756 412673 -40290
34803 -40290 -410809 -338340 69489 345840 197209 -258515 -673536 -711951 -238933 507902
34793 507902 998996 858156 208710 -514255 -969231 -1003332 -572475 123596 549009 267770
34783 267770 -471899 -906484 -632514 -53495 207172 91154 22834 177381 217760 -122783
34773 -122783 -515776 -440371 -17145 1973 -728600 -1485559 -1281878 -178663 729508 692615
34763 692615 132743 -158018 -143086 -358090 -889367 -1169739 -823545 -193128 179386 230802
34753 230802 271447 436835 549625 446709 180739 -120225 -381084 -482141 -215156 456807
34743 456807 1144516 1281823 734154 -11178 -399656 -387750 -270931 -122595 234788 740474
34733 740474 976044 662935 15970 -499357 -550645 -92570 527646 620880 -211243 -1370520
34723 -1370520 -1718125 -981555 -148372 -88157 -395153 -210366 346657 438988 -68657 -409355
34713 -409355 -154860 218829 220124 38236 8153 -6345 -281540 -731183 -1104460 -1322644
34703 -1322644 -1318021 -928352 -289323 39923 -270752 -848412 -1161495 -1223720 -1330622 -1382065
34693 -1382065 -1001813 -215097 477560 692302 474589 88997 -148175 75832 760120
34684 760120 1372498 1368679 920433 677878 803501 797195 414353 142174 415953 903271
34674 903271 1072322 1034977 1179910 1272888 727224 -283150 -827074 -542116 -178358 -409374
34664 -409374 -811489 -664364 -204709 -231676 -760244 -1002931 -673640 -399854 -624461 -920674
34654 -920674 -790561 -443023 -268066 -123953 246840 554893 399689 59361 148111 659642
34644 659642 1025818 1036854 1018078 1075895 871870 348772 72817 485062 1193645 1384262
34634 1384262 756850 -206200 -817446 -864036 -713604 -770408 -893525 -587327 165222 666034
34624 666034 413701 -144845 -274825 -26669 1608 -284224 -462013 -517626 -879104 -1455783
34614 -1455783 -1568383 -1069565 -624411 -538267 -269264 369167 522252 -356222 -1319557 -1185699
34604 -1185699 -402643 -422355 -1464910 -2178724 -1636940 -529545 17846 -111267 -315459
34595 -315459 -336892 -380219 -530635 -621563 -547641 -339051 -34015 251393 254935 -157784 -711163
34584 -711163 -921734 -561845 186560 941706 1339136 1147900 415031 -450959 -898780 -675139
34574 -675139 -55388 408546 385517 13626 -308362 -314043 -56610 196484 191375 -111178
34564 -111178 -477014 -601667 -433233 -183584 38028 372145 820890 1016779 744923 443494
34554 443494 657367 1133247 1102585 474829 28545 213515 485112 232496 -264889 -361882
34544 -361882 -50141 174090 119015 -14896 -126969 -247017 -247392 -37473 93757 -185309
34534 -185309 -682407 -901583 -721119 -430015 -217424 -59887 2804 -84127 -164056 -81564
34524 -81564 18734 -19425 -12719 162086 94950 -618978 -1559820 -1882102 -1446368 -882702
34514 -882702 -584885 -366053 -136716 -150009 -390029 -412199 -57853 254981 202578 -22243
34504 -22243 -185850 -362399 -547168 -464092 -83966 140901 -90319 -449564 -456904 -106718
34494 -106718 250031 354225 172769 -122055 -196515 77155 266064 -136064 -830235 -942007
34484 -942007 -279582 326405 226366 -196241 -287532 -86014 8797 -15921 41494 96060
34474 96060 5498 -42413 139994 371699 508903 796823 1310416 1497644 915745 67861
34464 67861 -168727 295157 789392 843939 508599 -58057 -672010 -961050 -738217 -391467
34454 -391467 -324809 -239578 349754 1110739 1234110 698745 325887 509291 752975 657194
34444 657194 511574 563908 474681 -10195 -466780 -428964 -147277 -144425 -357308 -301642 105023
34433 105023 428594 368921 77020 -197244 -407471 -574643 -628239 -534896 -439787 -527517
34423 -527517 -765139 -877939 -623101 -59063 501075 777617 697214 332513 -166344 -579952
34413 -579952 -766351 -842425 -992448 -1068554 -727508 -75248 273235 54535 -177119 119829
34403 119829 584399 484777 -140990 -562872 -466309 -292606 -432765 -699105 -733271 -444987
34393 -444987 55410 507242 455665 -306230 -1192853 -1324199 -707776 -293365 -617166 -1052671
34383 -1052671 -809036 -74697 401437 445253 521588 845484 1035973 714954 51381 -440287
34373 -440287 -473375 -253735 -179461 -308753 -280284 98003 408681 132042 -563339 -1023487
34363 -1023487 -1025070 -907119 -789855 -369646 333057 748378 606508 337326 242737 -2521
34353 -2521 -504070 -571024 234812 1106081 1012224 292648 168585 867952 1344934 920027
34343 920027 144821 -234885 -233324 -108291 292100 1052510 1631509 1447697 728074 228682
34333 228682 289553 597738 739207 592644 260393 -64134 -194782 -135527 -90056 -131513
34323 -131513 -30437 373953 813896 891581 615608 344615 282632 338161 430379 592176
34313 592176 745978 717016 567395 601759 878951 1010168 686950 170183 -71773 -51483
34303 -51483 -181710 -535036 -643676 -215314 336656 410689 27682 -267595 -205970 -65838
34293 -65838 -111511 -189518 -97412 -22861 -264456 -660790 -676904 -118550 515702 574227 24966
34282 24966 -506595 -480123 -45298 225789 95021 -108071 -42090 157773 170409 44182
34272 44182 104242 372564 458265 101411 -475514 -875838 -944302 -764698 -481494 -258858
34262 -258858 -207466 -219684 -72810 197967 269002 6150 -295116 -344999 -270217 -321396 -396281
34251 -396281 -202104 214988 441309 204892 -317181 -724338 -785589 -619642 -564226 -800024
34241 -800024 -1073791 -971836 -526721 -271292 -522345 -909701 -883988 -428159 51334 291901
34231 291901 266090 -49021 -536058 -759086 -451673 -76240 -309091 -979823 -1175414 -548682
34221 -548682 131874 74615 -459327 -664445 -356694 -22656 81702 216925 496883 529838
34211 529838 13859 -680169 -902821 -544434 -86980 142328 383121 935121 1551550 1689160
34201 1689160 1242149 653918 302338 150479 76618 125931 232064 107002 -256142 -340348
34191 -340348 176598 737864 507314 -460535 -1217704 -1102847 -405129 224969 518315 569631
34181 569631 522595 513611 609265 616115 259366 -299327 -471178 37991 842903 1409108 1614005
34170 1614005 1552684 1194176 606338 201271 296805 602298 555871 74056 -397250 -491883
34160 -491883 -228707 220663 688568 930534 746032 271320 -100287 -160377 -46771 48237
34150 48237 81936 25850 -202745 -529071 -633816 -271788 386278 874727 916153 727314
34140 727314 785623 1249339 1674992 1487815 756754 233340 430747 910615 823158 22588
34130 22588 -762184 -868303 -408025 66505 235230 139192 -77338 -292757 -432344 -551308
34120 -551308 -747420 -875056 -598513 71454 579214 484298 95003 49093 427542 753328
34110 753328 788362 781814 861093 746113 312908 -42808 46580 374257 514653 407711
34100 407711 230185 18424 -144852 103586 885316 1552628 1337934 439281 -207545 -227321
34090 -227321 -156771 -395924 -593198 -408503 -191261 -392852 -819742 -1004253 -922893 -825596
34080 -825596 -689743 -388141 -142835 -270505 -644756 -879383 -865590 -675106 -158906 800228
34070 800228 1766951 2051822 1518283 660184 -39061 -394892 -337115 12660 176943 -187779
34060 -187779 -680871 -603359 33989 557051 647173 624219 673734 545083 188991 -37310
34050 -37310 -47562 -192086 -454878 -258088 484509 871688 216011 -850025 -1195694 -693391
34040 -693391 -159660 -101967 -289611 -428283 -522609 -540400 -337175 -37352 -5711 -287969
34030 -287969 -454326 -158568 420991 841996 906041 767737 621680 398829 -130976 -896998
34020 -896998 -1344140 -1025237 -307817 -25461 -344993 -529310 -75093 502156 483808 44985
34010 44985 -94223 223134 523268 553633 489039 332127 -171068 -871718 -1102756 -533279
34000 -533279 283676 551451 173166 -227836 -109573 386605 641050 277157 -390821 -714432
33990 -714432 -474210 -62786 131322 176361 237054 140305 -299624 -759933 -673474 50140
33980 50140 903923 1314784 1045822 251571 -551651 -775529 -396274 -109373 -454268 -1024791
33970 -1024791 -1050825 -532549 -146764 -137955 -45556 384646 741636 664433 415937 375422
33960 375422 405801 141983 -349317 -565239 -151070 677558 1252464 1019682 136009 -610681
33950 -610681 -712225 -574073 -848971 -1371924 -1400687 -847009 -484374 -741710 -1041176 -722875
33940 -722875 5822 534826 736396 816638 701706 226344 -310519 -436120 -260622 -332337
33930 -332337 -714186 -801222 -257641 370579 365360 -136095 -307304 203981 758769 629750
33920 629750 65617 -67603 380724 550101 -111808 -879686 -751430 -6572 125455 -706222
33910 -706222 -1415107 -1043861 -90666 287607 -146671 -599072 -441662 116537 530148 580818
33900 580818 413799 231397 133095 138898 231275 350419 396952 343736 372183 706744 1174063
33889 1174063 1192350 528308 -169282 -93081 582396 890418 429519 -136796 -147136 143785
33879 143785 122579 -226162 -429098 -271131 36279 243943 255808 82971 -124926 -176028
33869 -176028 -146838 -320217 -625427 -536294 149561 823993 814487 324218 120630 466029
33859 466029 872798 865844 518697 169436 -41118 -208071 -408067 -511874 -280820 258454
33849 258454 604467 241696 -639554 -1231625 -1041928 -381154 208426 567594 747635 713606
33839 713606 564258 619968 918659 1025578 708292 351512 295679 279122 51335 -11273
33829 -11273 417205 812871 500819 -214621 -495767 -262464 -93534 -56820 276823 687626
33819 687626 361935 -648622 -1140240 -433407 610671 887347 552163 445385 645224
33810 645224 541949 62276 -116315 360942 943603 916043 295662 -271338 -283503 183072
33800 183072 737136 1154096 1481785 1741917 1764353 1469619 1138480 1124653 1364246 1459389
33790 1459389 1248269 1012943 1079833 1468263 1998291 2519739 2946054 3217609 3293567 3120315
33780 3120315 2699876 2289520 2308047 2793492 3181933 2976669 2426355 2102054 1996372 1607087
33770 1607087 836746 205372 124550 498698 1084133 1680340 1916694 1485183 731377 398487
33760 398487 612227 753834 521059 370852 598844 780156 621493 595950 1048441 1354084
33750 1354084 835558 22209 20219 890463 1618866 1610258 1261933 981383 580271 -41304
33740 -41304 -417615 -231159 57793 -163584 -773629 -1171346 -1172455 -1116440 -1165404 -1031869
33730 -1031869 -552743 -134166 -297500 -935591 -1362180 -1138724 -559604 -158276 -8339
33721 -8339 157141 318744 158723 -302034 -575274 -415355 -188438 -230435 -293855 -69009
33711 -69009 165786 15944 -216626 58728 617250 556768 -322639 -1077365 -921656 -282241
33701 -282241 -25796 -198132 -225294 8496 108716 80635 437535 1221634 1668345 1254814
33691 1254814 509684 243330 392108 289499 -137022 -206705 399126 1057604 1064467 565674
33681 565674 204847 196579 236964 127143 -32386 -218833 -564846 -956549 -947472 -279883
33671 -279883 728458 1471500 1583258 1121244 434483 -35634 -3055 454621 999587 1385305
33661 1385305 1586709 1581769 1249780 634160 115576 80761 457653 772753 705061 440568
33651 440568 383529 608123 783086 688307 588967 851281 1299141 1331031 747352 81238
33641 81238 -93868 157225 415818 531967 584925 513395 263126 115686 364119 761166
33631 761166 775694 328973 -193326 -564579 -821680 -841082 -448149 50254 123963 -106887
33621 -106887 26312 601299 851284 379032 -152929 -63825 284727 128298 -495530 -888395
33611 -888395 -729579 -329499 -46868 -13265 -281124 -751018 -1086291 -1112381 -1113950 -1345300
33601 -1345300 -1515151 -1226657 -662173 -294114 -144003 95226 402116 528895 612818 980738
33591 980738 1380983 1150761 274028 -404211 -262737 348123 704654 573560 191181 -201078
33581 -201078 -466386 -505734 -365609 -216512 -69744 226933 572081 513152 -200457 -1215776
33571 -1215776 -1952988 -2176634 -2004724 -1594193 -1072795 -601486 -235451 169220 692055
33562 692055 1105798 1133411 864594 655196 622133 493612 39130 -561035 -930389 -949869
33552 -949869 -795043 -577044 -223984 184638 260121 -216846 -823756 -905402 -434580 -31889
33542 -31889 -52456 -153037 -6282 76375 -295792 -799262 -772960 -201017 299893 420495
33532 420495 468107 669075 777867 622710 535107 884379 1515144 1965643 1991316 1603164
33522 1603164 870632 37950 -389340 -116198 447381 574486 143841 -203032 38201
33513 38201 531446 584181 104786 -314308 -224584 159344 373476 284984 35734 -291764
33503 -291764 -609570 -638246 -221485 250935 191086 -375278 -767076 -520770 88331 526753
33493 526753 603754 414024 83065 -185533 -167808 20258 -30046 -358539 -420012 141257
33483 141257 897808 1223603 1106694 924397 763295 515432 372786 599619 952669 920929
33473 920929 478552 63638 -127596 -276233 -408193 -312232 -49397 7567 -224347 -387199
33463 -387199 -292579 -222089 -390351 -503796 -168662 492614 929947 801303 325919 -31330
33453 -31330 -146957 -367214 -932754 -1455806 -1354955 -754185 -381620 -456615 -376209 158596
33443 158596 493277 127371 -258524 205946 1090602 1223124 436246 -327251 -514987 -476909
33433 -476909 -479083 -303872 -5306 -55656 -474807 -703113 -574598 -526949 -620637 -328495
33423 -328495 360539 633380 142966 -324928 -79211 407693 327742 -269171 -785791 -976062
33413 -976062 -880367 -411485 338893 830518 704521 311150 171810 359858 763349 1353680
33403 1353680 1787622 1459597 474919 -164896 57901 395413 117956 -291794 -143390
33394 -143390 102402 -334366 -990027 -768248 226937 802555 504104 74769 62586 172410
33384 172410 188094 421569 897783 1032924 540217 -79312 -299642 -183907 36345 363046
33374 363046 730562 879757 803583 816765 998616 1086808 1043424 1108156 1137897 610983 -413464
33363 -413464 -1043007 -704329 29228 256289 -85374 -401818 -418556 -393471 -535117 -706352
33353 -706352 -682139 -401293 -4881 198153 -64890 -680581 -1140709 -1050329 -530752 -19411
33343 -19411 167640 -6469 -360249 -591647 -516493 -320214 -363244 -638656 -688631 -236010
33333 -236010 339750 405717 -171017 -889842 -1183866 -960525 -581045 -394781 -342202 -72779
33323 -72779 526355 1070180 1100380 649505 152810 -121525 -268044 -383838 -335852 -10028
33313 -10028 428456 685663 657725 502028 421482 411538 251101 -173390 -572945 -512049 -14191
33302 -14191 389239 372962 245279 398384 672100 647424 295493 -96172 -398339 -573633
33292 -573633 -391604 211209 669812 350364 -487797 -943218 -683573 -234940 -15145 175632
33282 175632 503657 677993 533233 413269 563210 681152 511113 366923 555243 738215
33272 738215 479059 75225 167216 699646 955409 603315 80353 -168615 -247535 -373110
33262 -373110 -394443 -150426 26292 -331005 -1041018 -1318587 -717710 308965 977957 1016322
33252 1016322 675337 174982 -430197 -947045 -1124089 -1101474 -1283585 -1602295 -1434690 -559540
33242 -559540 328580 541596 391591 626774 1176989 1235495 545443 -154691 -167828 281085
33232 281085 522252 376928 236876 416901 767349 936287 846812 794638 1012919 1245722
33222 1245722 1021574 365300 -147441 -187294 -64718 -66471 52109 442730 578312 -4266
33212 -4266 -772269 -830881 -257502 53351 -229321 -530349 -437514 -245684 -246167 -228497 39875
33201 39875 421741 698813 766148 502800 4469 -125228 553357 1392761 1291645 326915
33191 326915 -232479 224338 830829 717333 287362 334200 720879 779357 463336 287798
33181 287798 443516 626814 540157 109275 -554915 -1084155 -1062915 -578119 -181202 -105363
33171 -105363 -17034 261616 408574 247519 58442 -74839 -486277 -1110434 -1252045 -681478
33161 -681478 -154237 -237088 -420847 -99892 360437 353654 104393 120689 220322 24598
33151 24598 -174468 16640 246866 131435 187283 921572 1561177 1025847 -210741 -654064
33141 -654064 -17953 506526 240286 -138153 496 271781 170614 -134111 -383010 -710383
33131 -710383 -1084991 -1063123 -558046 -165803 -296313 -583935 -539089 -228623 38165 193495
33121 193495 264945 179988 -37458 -238122 -412824 -599396 -575196 -166694 227631 82965
33111 82965 -358250 -402698 -66904 -22046 -331499 -264022 394808 870096 641308 200155
33101 200155 62713 -55258 -444029 -618875 -106173 627896 810039 445534 73016 -156166
33091 -156166 -483413 -934716 -1283911 -1391259 -1192328 -693293 -284708 -535267 -1287570 -1592909
33081 -1592909 -1060852 -572949 -945159 -1565470 -1311631 -309916 326083 239532 154965 466394
33071 466394 622197 199336 -341255 -429070 -230604 -221849 -383779 -312779 131185 677601
33061 677601 1010982 1022882 792732 494451 267519 98977 -108869 -348774 -488239 -435014
33051 -435014 -223245 44464 252431 314858 239990 89476 -144702 -461060 -628010 -341924
33041 -341924 258483 583273 357695 55739 191592 493501 314281 -319612 -700260 -500941
33031 -500941 -230856 -403365 -756954 -699968 -231384 46077 -219804 -667387 -767102 -564900
33021 -564900 -563181 -908037 -1087440 -664175 10391 252691 43816 -13098 265593 346268
33011 346268 -22795 -232069 230459 834090 767486 244203 165210 659475 915456 533541
33001 533541 95129 65731 -204 -601149 -1318540 -1417725 -971522 -629695 -533004 -250375
32991 -250375 265547 462238 114844 -206860 39942 586072 821229 677477 540972 513380
32981 513380 316833 -108351 -423498 -401659 -203668 -24931 134830 188137 -119880 -718520
32971 -718520 -1039068 -753396 -369631 -568170 -1148410 -1256194 -625896 54018 165913 -57884
32961 -57884 -105517 -24362 -206895 -648892 -940752 -887790 -699296 -571442 -444186 -219505
32951 -219505 62685 331302 546659 611034 427955 108458 -83919 -74256 -69677 -203419
32941 -203419 -283532 -87791 230394 287020 -17558 -386358 -559180 -580052 -519572 -249933
32931 -249933 226719 499450 238503 -178101 -62517 565931 971184 847229 773007 1131196
32921 1131196 1273418 480666 -727170 -1147407 -579174 -44221 -276139 -840495 -996737
32912 -996737 -691336 -317672 -74757 14110 -113051 -359928 -408225 -168663 38442 11267
32902 11267 -22441 89710 55824 -333935 -722737 -696272 -436829 -361118 -384607 -116675 370543
32891 370543 551657 223153 -215934 -334943 -158126 6316 -46763 -280135 -493746 -535345
32881 -535345 -528801 -766619 -1234810 -1463585 -1114284 -517943 -278520 -457664 -535901 -165222
32871 -165222 387246 602757 266530 -381343 -852378 -763489 -180082 389020 502629 260506
32861 260506 93068 145491 127289 -201815 -650949 -849448 -751630 -707974 -997902 -1414452
32851 -1414452 -1484735 -1108738 -727702 -689815 -724036 -400151 106471 233104 -75764 -313105
32841 -313105 -298591 -431393 -836452 -972747 -507142 55276 142831 -30631 21455 201757
32831 201757 179700 162806 514291 910250 754625 281895 348622 1111677 1767817 1757653
32821 1757653 1447334 1355465 1388879 1201128 789680 395350 187244 268052 613059 858681
32811 858681 599642 51563 -84243 381684 810154 702884 422491 506328 754480 577737
32801 577737 -56137 -610008 -755240 -643530 -484466 -331959 -278763 -422129 -576311 -399688
32791 -399688 83497 402467 210191 -328574 -854156 -1254903 -1584692 -1748801 -1576799 -1150982
32781 -1150982 -775214 -562091 -284191 237443 771997 888970 447183 -280154 -895688
32772 -895688 -1132812 -909903 -374205 97932 160622 -170433 -553293 -655513 -328062 415171
32762 415171 1307310 1816348 1607442 1010943 637718 533214 198288 -492134 -981189 -850097
32752 -850097 -358425 150876 788983 1605431 2088942 1801299 1124595 752507 726359 582990
32742 582990 212776 -54275 -48020 126224 398938 624007 395316 -399625 -1070244 -879023
32732 -879023 -141910 194546 -33761 -78621 407107 829652 676189 292391 260379 587084
32722 587084 872583 843391 459040 -112186 -462248 -309564 14461 -69641 -488966 -581023
32712 -581023 -150762 230495 196136 131472 392799 646172 463096 43926 -154009 -101762
32702 -101762 -58410 -88819 -127654 -230302 -412145 -491318 -339883 -28331 392806 855148
32692 855148 953832 278626 -738541 -1007796 -181825 792346 960616 520877 159366 -55630
32682 -55630 -368497 -517647 -119228 494310 682614 501028 485391 648594 549901 250548
32672 250548 302746 733555 888283 482577 58484 90413 277805 129291 -225233 -257671
32662 -257671 180165 676214 768781 426002 49762 68045 476704 822773 713748 206235
32652 206235 -431622 -1079992 -1601698 -1599958 -844277 168414 617139 357288 23693 50303
32642 50303 121776 -161857 -566751 -587718 -224258 76387 138233 264506 649980 941225
32632 941225 624006 -290545 -1192845 -1480654 -1089274 -420295 77788 195941 23798 -132859
32622 -132859 -36680 148703 11939 -442585 -597775 -76322 494473 186200 -855864 -1466036
32612 -1466036 -1030750 -301868 -286449 -922872 -1366717 -1178103 -678839 -351995 -347491 -477375
32602 -477375 -400996 57282 593794 664896 197171 -277688 -372888 -298680 -334117 -376703 -371809
32591 -371809 -617422 -1135883 -1287271 -644120 216718 499206 339065 379486 582378 410817
32581 410817 -27504 -59531 334038 390116 -174000 -703976 -713019 -587121 -769625 -993340
32571 -993340 -851142 -535846 -446485 -506096 -430094 -339320 -543673 -902921 -920275 -447269
32561 -447269 74621 126172 -322350 -765083 -622177 159421 945454 1038266 495727 71317
32551 71317 247649 634048 537904 -109725 -703566 -743556 -373895 -83317 -50729 34884
32541 34884 484749 1100930 1357737 1061328 558988 218170 8979 -216369 -356633 -270423
32531 -270423 -79202 71411 294785 644564 800261 525678 169144 163234 273914 10183
32521 10183 -394506 -211296 560415 1022268 642740 -38150 -288312 -125911 5979 -50036
32511 -50036 -233829 -607916 -1157427 -1554152 -1526846 -1231850 -945118 -662402 -318566 -101153
32501 -101153 -158089 -221100 73584 616420 931542 784384 391584 63662 -121627 -289536
32491 -289536 -565953 -907668 -1089687 -941025 -612501 -464615 -650559 -968640 -1156708 -1144191
32481 -1144191 -968208 -633243 -128576 524687 1215308 1626015 1373496 545582 -109695
$$ [...]
##END NTUPLES=NMR SPECTRUM
##END=
