##TITLE=31Pdec_CPA-2
 D2O, 24 sc
 10.7.2024
##JCAMPDX= 6.0         $$ Bruker NMR JCAMP-DX V2.0
##DATA TYPE= NMR SPECTRUM
##DATA CLASS= NTUPLES
##ORIGIN= UXNMR, Bruker Analytische Messtechnik GmbH
##OWNER= root
$$ XWIN-NMR		Version 3.5
$$ Wed Jul 10 13:54:14 2024 Russian Standard Time (UT+4h)  she@DPX200
##.OBSERVE FREQUENCY= 81.013821
##.OBSERVE NUCLEUS= ^31P
##.ACQUISITION MODE= SIMULTANEOUS
##.ACQUISITION SCHEME= undefined
##.AVERAGES= 24
##.DIGITISER RES= 17
##SPECTROMETER/DATA SYSTEM= spect
##.PULSE SEQUENCE= zgpg30
##.SOLVENT NAME= CDCl3
##.SHIFT REFERENCE= (INTERNAL, CDCl3, 0, 198.062)
##AUDIT TRAIL= $$ (NUMBER, WHEN, WHO, WHERE, WHAT)
$$ ##TITLE= Audit trail, XWIN-NMR		Version 3.5
$$ ##JCAMPDX= 5.01
$$ ##ORIGIN= Bruker BioSpin GmbH
$$ ##OWNER= she
$$ F:/spectra/data/she/nmr/P31/2/pdata/1/auditp.txt
$$ ##AUDIT TRAIL=  $$ (NUMBER, WHEN, WHO, WHERE, WHAT)
(   1,<2024-07-10 13:53:03.46 +0400>,<she>,<DPX200>,
      <created by zg, POWCHK disabled, PULCHK disabled
       configuration hash MD5:
       00 E9 B6 7A A2 85 ED C7 34 08 36 98 17 FE 4E 26
       data hash MD5: 32K
       7E 1B 33 26 3B EF DB 46 E0 FA 0B 32 42 45 98 21>)
(   2,<2024-07-10 13:53:05.89 +0400>,<she>,<DPX200>,
      <Start of raw data processing
       efp BC_mod = 2 LB = 1.5 FT_mod = 6 PKNL = 1 PHC0 = 2635.342 PHC1 = 71.88692 SI = 64K 
       data hash MD5: 64K
       C5 6F 45 FF 8E CC C7 45 59 05 9E 05 53 04 CF E6>)
(   3,<2024-07-10 13:53:33.32 +0400>,<she>,<DPX200>,
      <pk PHC0 = 14.84875 PHC1 = -32.2 
       data hash MD5: 64K
       B3 10 72 D7 26 89 EE D7 BD ED 1E 7A 8A E3 8B 7A>)
(   4,<2024-07-10 13:53:50.45 +0400>,<she>,<DPX200>,
      <abs ABSG = 5 
       data hash MD5: 64K
       42 EF 18 D7 A5 8B 8C 5F A7 3C 4C 4F 84 32 29 16>)
$$ ##END=
$$ 
$$ hash MD5
$$ 1A 6C 01 0C 1D FB AA A6 A4 19 39 09 1D 48 DE F7
##$RELAX= 
##$RELAX= 
##$RELAX= 
##$RELAX= 
##$RELAX= 
##$RELAX= 
##$RELAX= 
##$RELAX= 
$$ Bruker specific parameters
$$ --------------------------
##$DU= <F:/spectra>
##$EXPNO= 2
##$NAME= <P31>
##$PROCNO= 1
##$TYPE= <nmr>
##$USER= <she>
##$AMP= (0..31)
100 100 100 100 100 100 100 100 100 100 100 100 100 100 100 100 100 100 
100 100 100 100 100 100 100 100 100 100 100 100 100 100 
##$AQSEQ= 0
##$AQ_mod= 1
##$AUNM= <au_zg>
##$AUTOPOS= <>
##$BF1= 81.014009
##$BF2= 200.13
##$BF3= 200.13
##$BF4= 200.13
##$BF5= 200.13
##$BF6= 200.13
##$BF7= 200.13
##$BF8= 200.13
##$BYTORDA= 1
##$CFDGTYP= 0
##$CFRGTYP= 5
##$CHEMSTR= <none>
##$CNST= (0..31)
1 1 145 1 1 1 1 1 1 1 1 1 1 1 1 1 1 1 1 1 1 1 1 1 1 1 1 1 1 1 1 1 
##$CPDPRG= <waltz16>
##$CPDPRG1= <>
##$CPDPRG2= <waltz16>
##$CPDPRG3= <>
##$CPDPRG4= <mlev>
##$CPDPRG5= <mlev>
##$CPDPRG6= <mlev>
##$CPDPRG7= <mlev>
##$CPDPRG8= <mlev>
##$CPDPRGB= <>
##$CPDPRGT= <>
##$D= (0..31)
0 1 0 0 0 0 0 0 0 0.06 0 0.03 2e-05 3e-06 0 0 0.0002 0 0 0 0 0 0 0 0 0 
0 0 0 0 0 0 
##$DATE= 1720605182
##$DBL= (0..7)
120 120 120 11 120 120 24 19 
##$DBP= (0..7)
150 150 150 150 150 150 150 150 
##$DBP07= 0
##$DBPNAM0= <>
##$DBPNAM1= <>
##$DBPNAM2= <>
$$ [...]
##$SUBNAM3= <"">
##$SUBNAM4= <"">
##$SUBNAM5= <"">
##$SUBNAM6= <"">
##$SUBNAM7= <"">
##$SUBNAM8= <"">
##$SUBNAM9= <"">
##$SW= 400.765351723535
##$SWIBOX= (0..15)
0 1 3 0 0 0 0 0 0 0 0 0 0 0 0 0 
##$SW_h= 32467.5324675325
##$TD= 32768
##$TD0= 1
##$TE= 0
##$TE2= 300
##$TE3= 300
##$TEG= 300
##$TL= (0..7)
0 120 53 12 22 120 120 120 
##$TP= (0..7)
150 150 150 150 150 150 150 150 
##$TP07= 0
##$TPNAME0= <>
##$TPNAME1= <>
##$TPNAME2= <>
##$TPNAME3= <>
##$TPNAME4= <>
##$TPNAME5= <>
##$TPNAME6= <>
##$TPNAME7= <>
##$TPOAL= (0..7)
0.5 0.5 0.5 0.5 0.5 0.5 0.5 0.5 
##$TPOFFS= (0..7)
0 0 0 0 0 0 0 0 
##$TUNHIN= 0
##$TUNHOUT= 0
##$TUNXOUT= 0
##$USERA1= <user>
##$USERA2= <user>
##$USERA3= <user>
##$USERA4= <user>
##$USERA5= <user>
##$V9= 5
##$VALIST= <valist>
##$VCLIST= <CCCCCCCCCCCCCCC>
##$VD= 0
##$VDLIST= <DDDDDDDDDDDDDDD>
##$VPLIST= <PPPPPPPPPPPPPPP>
##$VTLIST= <TTTTTTTTTTTTTTT>
##$WBST= 1024
##$WBSW= 4
##$XGAIN= (0..3)
0 0 0 0 
##$XL= 0
##$YL= 0
##$YMAX_a= 27694
##$YMIN_a= -27168
##$ZGOPTNS= <>
##$ZL1= 120
##$ZL2= 120
##$ZL3= 120
##$ZL4= 120
##$ABSF1= 198.0616
##$ABSF2= -202.7028
##$ABSG= 5
##$ABSL= 3
##$ALPHA= 0
##$AQORDER= 0
##$ASSFAC= 0
##$ASSFACI= 0
##$ASSFACX= 0
##$ASSWID= 0
##$AUNMP= <proc_1d>
##$AZFE= 0.1
##$AZFW= 0.5
##$BCFW= 0
##$BC_mod= 2
##$BYTORDP= 0
##$COROFFS= 0
##$CY= -3
##$DATMOD= 1
##$DC= 0
##$DFILT= <>
##$DTYPP= 0
##$F1P= 0
##$F2P= 0
##$FCOR= 1
##$FTSIZE= 65536
##$FT_mod= 6
##$GAMMA= 0
##$GB= 0
##$INTBC= 1
##$INTSCL= 9.790993e-09
##$ISEN= 30
##$LB= 1.5
##$LEV0= 0
##$LPBIN= 0
##$MAXI= 10000
##$MC2= 0
##$MEAN= 0
##$ME_mod= 0
##$MI= 50
##$NCOEF= 0
##$NC_proc= -6
##$NLEV= 6
##$NOISF1= 182.463
##$NOISF2= 159.3651
##$NSP= 0
##$NTH_PI= 0
##$NZP= 0
##$OFFSET= 198.0616
##$PC= 4
##$PHC0= 2650.191
##$PHC1= 39.68692
##$PH_mod= 1
##$PKNL= yes
##$PPARMOD= 0
##$PSCAL= 0
##$PSIGN= 0
##$REVERSE= no
##$SF= 81.0140089999434
##$SI= 65536
##$SIGF1= 159.3651
##$SIGF2= -187.1042
##$SINO= 113.3802
##$SIOLD= 16384
##$SREGLST= <1H.CDCl3>
##$SSB= 0
##$STSI= 65536
##$STSR= 0
##$SW_p= 32467.5324675325
##$SYMM= 0
##$S_DEV= 0
##$TDeff= 32768
##$TDoff= 0
##$TI= <>
##$TILT= no
##$TM1= 0
##$TM2= 0
##$TOPLEV= 0
##$USERP1= <user>
##$USERP2= <user>
##$USERP3= <user>
##$USERP4= <user>
##$USERP5= <user>
##$WDW= 1
##$XDIM= 65536
##$YMAX_p= 400251854
##$YMIN_p= -4463977
$$ End of Bruker specific parameters
$$ ---------------------------------
##NTUPLES= NMR SPECTRUM
##VAR_NAME=  FREQUENCY,     SPECTRUM/REAL,   SPECTRUM/IMAG
##SYMBOL=    X,             R,               I
##VAR_TYPE=  INDEPENDENT,   DEPENDENT,       DEPENDENT
##VAR_FORM=  AFFN,          ASDF,            ASDF
##VAR_DIM=   65536,         65536,           65536
##UNITS=     HZ,            ARBITRARY UNITS, ARBITRARY UNITS
##FACTOR=    0.49542278885378, 1,            1
##FIRST=     16045.7642231865, 0,            0
##LAST=      -16421.768244346, 0,            0
##MIN=       -16421.768244346, -4463977,     0
##MAX=       16045.7642231865, 400251854,    0
$$ Real data points
##PAGE= N=1
##DATA TABLE= (X++(R..R)), XYDATA
$$ [...]
44147 83277 360320 926787 1252588 1157075 859985 624193 484230 292608 -31817 -336435
44137 -336435 -375863 -140417 69279 -11830 -308239 -587895 -821908 -1110584 -1311156 -1080577
44127 -1080577 -403242 199603 194706 -389320 -1094386 -1587138 -1856523 -1967655 -1908787 -1720237
44117 -1720237 -1562737 -1553646 -1622571 -1576954 -1266297 -708554 -131131 163361 81877 -158799
44107 -158799 -335131 -524028 -898960 -1295123 -1302207 -857689 -428076 -408571 -585844 -448823
44097 -448823 129371 795533 1213697 1379166 1442250 1461807 1392921 1167220 761685 316946
44087 316946 159255 515133 1190233 1720132 1866574 1763684 1546812 1124524 479231 -61370
44077 -61370 -139050 159529 418593 460317 543860 948905 1561847 1973160 1864119 1233927
44067 1233927 377271 -267033 -367552 28608 475819 492131 -7302 -650247 -966405 -787624
44057 -787624 -335152 24440 105315 21281 -11999 14932 -138111 -638898 -1282182 -1635821
44047 -1635821 -1487519 -1022240 -534645 -134153 162321 231275 -10441 -322324 -310780 29122
44037 29122 208813 -129088 -688173 -892736 -669581 -524067 -819111 -1305584 -1522577 -1413999
44027 -1413999 -1305229 -1401197 -1575916 -1646594 -1622505 -1603183 -1589020 -1519512 -1430948 -1449378 -1606902
44016 -1606902 -1734011 -1593486 -1129062 -552522 -153455 -21850 22042 226878 659777 1139113
44006 1139113 1378319 1215553 767495 364777 270688 434399 560872 432977 119897 -125403
43996 -125403 -109554 146976 407388 382327 24113 -331313 -273537 180004 558341 503888
43986 503888 195528 73314 302026 685092 976027 1062484 933842 685895 496574 396403
43976 396403 151073 -385317 -899545 -942045 -602318 -468448 -807960 -1171139 -1036423 -539402
43966 -539402 -239928 -347829 -519425 -374593 59177 445102 499792 225541 -116411 -261443
43956 -261443 -216366 -213726 -355820 -458236 -358078 -199593 -207754 -302610 -192079 193716 594660
43945 594660 753705 670298 514447 455062 573878 789616 874483 703060 454086 375970
43935 375970 388421 169873 -333537 -751317 -732865 -326823 173450 525603 558490 167029
43925 167029 -482635 -938428 -925518 -713665 -769702 -1138259 -1457713 -1547540 -1633897 -1897336
43915 -1897336 -2099231 -1877828 -1254253 -617761 -266610 -152235 -73291 41983 105447 26813
43905 26813 -161898 -307908 -250323 25111 341291 497113 483118 463203 550452 717259
43895 717259 941596 1251539 1499189 1286082 391184 -787150 -1516098 -1502710 -1130068 -867627
43885 -867627 -762244 -674302 -683779 -925523 -1216674 -1232022 -987265 -801384 -793463 -770354 -668762
43874 -668762 -746636 -1151727 -1564025 -1517056 -966624 -357867 -164095 -448738 -843268 -919132
43864 -919132 -615378 -253433 -54708 199466 776670 1387924 1396885 690533 -90196 -365303
43854 -365303 -243706 -68390 227458 836291 1440455 1454275 852085 237979 32107 39654
43844 39654 -52184 -182762 -164109 -95814 -227886 -567556 -867493 -925490 -731517 -392678
43834 -392678 -39990 258614 568938 961821 1252092 1067925 351967 -383200 -558033 -198757
43824 -198757 155488 169154 17800 -62468 -168972 -447200 -684582 -558009 -198079 -119146
43814 -119146 -509927 -921896 -849387 -375924 -3735 -16750 -292350 -626637 -912339 -1013790
43804 -1013790 -814149 -485312 -426105 -779838 -1225239 -1389974 -1275855 -1121640 -1037204 -962936
43794 -962936 -836915 -607844 -211422 278908 609602 663316 696763 1020130 1513202 1712321
43784 1712321 1368104 711030 161060 -54862 -1181 87973 15022 -190449 -306432 -205837
43774 -205837 -5204 159318 323536 493284 455502 66668 -421655 -655657 -708366 -960951
43764 -960951 -1483792 -1902084 -1927519 -1698340 -1509015 -1492642 -1667588 -2026296 -2442812 -2690871
43754 -2690871 -2658026 -2396261 -1953883 -1368960 -826285 -546565 -466650 -286219 106021 491063
43744 491063 639956 527082 225430 -100410 -101443 442044 1120248 1148676 338264 -564586
43734 -564586 -770386 -364797 -52681 -244250 -696473 -900610 -588955 31568 426132 264847
43724 264847 -154289 -271121 -52514 -6900 -337328 -604109 -458952 -184988 -153652 -230005
43714 -230005 -149239 -46572 -125689 -192405 -45325 30576 -257824 -547928 -255281 563621
43704 563621 1376841 1951137 2316746 2235156 1508501 688883 617548 1222367 1587854 1326700
43694 1326700 1054894 1278390 1618935 1537850 1151905 867614 738643 642047 654597 818568
43684 818568 892244 723435 557920 638967 807587 811210 700897 624987 538860 407225 375145
43673 375145 450870 352809 -24310 -329505 -265840 -51861 -40891 -207160 -350016 -465748
43663 -465748 -551419 -403867 -32210 99390 -268562 -631435 -380759 269306 638816 630113
43653 630113 705403 919988 749888 6095 -748759 -967308 -807380 -753020 -898269 -921987
43643 -921987 -594621 -74737 254283 172218 -134639 -300691 -308165 -557800 -1223118 -1821879
43633 -1821879 -1786842 -1240617 -778403 -654465 -652886 -615916 -553684 -309615 273311 818842
43623 818842 658479 -249283 -1171568 -1524209 -1422761 -1161464 -741610 -214544 61028 -72296
43613 -72296 -214496 25234 443992 625574 588726 613860 664668 454920 -16529 -399608
43603 -399608 -435228 -188747 102859 200657 -20582 -414031 -614574 -432417 -90598 59349
43593 59349 -95709 -446260 -799711 -875496 -476141 132234 343428 -28099 -463779 -524513
43583 -524513 -507589 -881265 -1455943 -1703431 -1612125 -1567412 -1585642 -1400174 -1208736 -1514074
43573 -1514074 -2138713 -2222632 -1465557 -613679 -319979 -233540 217321 744114 651628 17349
43563 17349 -377647 -201749 50092 -102902 -516598 -829535 -967121 -950340 -595054 196888
43553 196888 1025582 1264808 776880 107003 -130089 98451 335212 274032 85031 38728
43543 38728 35376 -232693 -725382 -986910 -734362 -258833 -68305 -321355 -803814 -1291970
43533 -1291970 -1691849 -1927982 -1961564 -1892387 -1827793 -1672365 -1250497 -624783 -97465 107933
43523 107933 9253 -243130 -446542 -383321 -36657 251460 119741 -296596 -480663 -206973
43513 -206973 217009 460053 560359 652576 665837 548834 484023 573770 582450 327537 78137
43502 78137 169663 427594 422525 149824 -36952 -79637 -254848 -559584 -642588 -471612 -488512
43491 -488512 -852052 -1059534 -672600 34719 552307 844704 1111835 1200746 848209 307829
43481 307829 124219 329808 407632 70268 -416898 -734335 -846560 -753301 -388833 56820
43471 56820 153717 -197665 -568048 -589150 -397093 -261534 -143327 70197 224751 179356
43461 179356 173851 498877 972046 1170859 1081528 1071685 1237682 1227416 816006 283812 36393
43450 36393 101910 187698 67542 -226557 -464754 -380794 69482 518276 444574 -212110
43440 -212110 -840981 -771747 -32652 699236 882298 639994 470253 645833 1064139 1542246
43430 1542246 1983945 2231162 2026780 1326712 504601 1178 -182012 -393213 -741351
43421 -741351 -898465 -610280 -125192 128377 116235 153923 341305 332207 -239538 -1260464
43411 -1260464 -2171714 -2468969 -2137041 -1592424 -1196008 -894091 -459037 3005 91773 -261858
43401 -261858 -558992 -367214 100985 387095 509776 811901 1214440 1195327 598187 -45956
43391 -45956 -218475 -29775 123466 170139 295924 487162 493390 169260 -372108 -864529
43381 -864529 -987507 -517261 390511 1172487 1341371 952421 437131 83277 -127029 -277076
43371 -277076 -377550 -455584 -571528 -721061 -845947 -916538 -891834 -673902 -254851 159040
43361 159040 337146 289858 204066 199139 304566 552399 858201 918824 532837 -15081
43351 -15081 -212214 13569 203898 35186 -237142 -169171 274329 715645 811688 542584
43341 542584 159120 -39317 27293 98042 -155770 -676597 -1016074 -881756 -499228 -282071
43331 -282071 -307733 -307384 -69669 316410 558821 400502 -132983 -630237 -594819 13043
43321 13043 686815 966011 927419 895209 890652 697008 340700 128537 201495 362637 387926
43310 387926 245366 -25505 -384306 -682116 -733208 -569776 -410741 -339033 -259612 -210954
43300 -210954 -388698 -735652 -847739 -517686 -97658 -42630 -304349 -483161 -425722 -338669
43290 -338669 -381162 -467850 -486430 -444348 -350902 -160272 109627 349322 485209 530198 524113
43279 524113 531419 635309 788803 757682 415453 22572 -49505 151171 195182 -122701
43269 -122701 -516912 -648294 -536086 -379367 -249395 -190313 -387722 -922615 -1478136 -1599991
43259 -1599991 -1223169 -703044 -359517 -235055 -272339 -421346 -501660 -266592 209128 434970
43249 434970 56788 -610632 -870358 -450186 209254 520573 395490 203953 237830 400041
43239 400041 401419 125600 -242722 -400285 -222076 110124 312511 344260 441678 731944
43229 731944 956365 775691 274601 -95602 -84998 116299 273117 427250 636816 674772
43219 674772 303403 -294880 -679612 -691531 -559022 -511230 -569561 -714715 -956628 -1169764
43209 -1169764 -1118972 -757094 -306069 30586 242128 334798 210135 -148680 -534817 -698193
43199 -698193 -575053 -281021 10351 158970 164714 176045 235503 99510 -402491 -896633
43189 -896633 -791050 -151921 232608 -96266 -599679 -487870 228310 874625 1030763 813954
43179 813954 409697 -144842 -700380 -961750 -817409 -426840 35247 454031 628127 381499
43169 381499 -132756 -518501 -584275 -497359 -501774 -706585 -1103245 -1514508 -1563803 -1014060
43159 -1014060 -151140 459628 600202 494761 325819 45781 -298234 -472552 -428824 -425192
43149 -425192 -638199 -964424 -1318676 -1780021 -2286747 -2532733 -2370372 -2020985 -1703910 -1367965
43139 -1367965 -987572 -787955 -903764 -1088467 -1037215 -766395 -436736 -64334 326660 532896
43129 532896 465665 386195 528409 697566 578321 251071 43346 16246 -39490 -198023
43119 -198023 -324015 -324905 -187915 126414 531374 680485 317701 -334947 -857125 -1181432
43109 -1181432 -1514156 -1819853 -1805702 -1401895 -878823 -476571 -249359 -247742 -485599 -736019
43099 -736019 -750846 -710045 -1064243 -1874956 -2682901 -3084602 -3054276 -2647576 -1855892 -918267
43089 -918267 -331090 -276967 -368276 -199493 134554 288314 136035 -245870 -786981 -1349592
43079 -1349592 -1687291 -1740307 -1767795 -1949829 -2075006 -1876167 -1468328 -1183805 -1153477 -1301405
43069 -1301405 -1546625 -1728219 -1554574 -986997 -497681 -534245 -834243 -722465 -82029 428670
43059 428670 247088 -393794 -838361 -784725 -438475 -91238 161672 330074 394124 335711
43049 335711 207765 105415 85611 141782 252898 424451 649088 849210 923246 857124
43039 857124 727601 584386 402808 174842 -29297 -122222 -67208 111123 307548 352516
43029 352516 158111 -179988 -548992 -1004332 -1567070 -1914645 -1636912 -861776 -245969 -174603
43019 -174603 -329918 -296507 -228245 -530501 -1137587 -1558481 -1535678 -1255600 -938378 -574009
43009 -574009 -90043 483104 1024074 1320039 1162600 672506 364523 567881 928339 866514
42999 866514 401079 60543 61923 122434 112996 305035 776905 1109423 980435 646718
42989 646718 500272 478419 261231 -191958 -621117 -799809 -656543 -267052 70660 1857
42979 1857 -423994 -720441 -606600 -356738 -248847 -79028 345989 615109 218833 -558391
42969 -558391 -897759 -549305 -72890 51343 -45991 -110670 -202939 -385126 -444866 -259857
42959 -259857 -86324 -159093 -288464 -181599 58117 77618 -237532 -712489 -1184428 -1557869
42949 -1557869 -1653064 -1315224 -694697 -196624 -102026 -349707 -665816 -791331 -633800 -341092
42939 -341092 -208928 -399072 -757630 -981462 -912140 -597907 -164432 250684 505889 542443
42929 542443 450147 364386 335425 355267 425480 509030 499977 337610 75202 -228908 -559041
42918 -559041 -797314 -718870 -302207 122132 252716 210256 297564 483773 441418 64852
42908 64852 -355205 -502817 -318544 112664 666565 1099972 1156494 905318 753891 945842
42898 945842 1201222 1033754 338609 -482457 -947121 -942500 -732298 -540238 -213021 515523
42888 515523 1399504 1678931 1020870 177316 177380 970066 1478435 1057133 244007 -163098
42878 -163098 -120236 -5805 144572 458549 666475 400028 -124301 -330815 -106007 159357
42868 159357 281021 453435 697677 720396 455384 244026 300933 433317 468003 535554
42858 535554 707987 738903 442520 42680 -117041 5614 216307 354153 335095 155317
42848 155317 1375 115259 412559 509297 279646 82354 244125 628008 929848 1078731
42838 1078731 1089489 862679 464325 289137 545270 825726 614540 22072 -411413 -473444
42828 -473444 -386270 -294105 -147865 -56748 -249785 -629187 -800440 -644277 -474524 -511823
42818 -511823 -545807 -267792 317637 911308 1138649 757800 -63463 -697465 -644710 -194254
42808 -194254 -98114 -534530 -866783 -594166 -54926 120070 -148803 -464750 -569874 -495858
42798 -495858 -320856 -160887 -248212 -651430 -1027381 -1001368 -715012 -644975 -908983 -1104302
42788 -1104302 -887983 -425334 -154862 -298927 -694609 -984366 -930646 -631322 -417511 -472614
42778 -472614 -646669 -760740 -930506 -1341337 -1813452 -1928524 -1607986 -1246285 -1156256 -1142539
42768 -1142539 -801805 -81626 634661 922395 687927 219230 -59887 44570 330386
42759 330386 470859 443405 527248 845795 1137958 1122640 884240 664131 415331 -103772
42749 -103772 -780224 -1023154 -395349 782586 1669742 1716364 1100973 394721 -29263 -194314
42739 -194314 -276389 -315616 -180639 229919 760227 1007937 679790 -9900 -425652 -133772
42729 -133772 630542 1252353 1404130 1234105 984981 748385 633109 812309 1204396 1392711
42719 1392711 1130600 709187 526829 489845 215961 -294857 -636460 -628644 -519324 -466952
42709 -466952 -268173 196936 640244 766495 682296 596570 400518 -75838 -606514 -799020
42699 -799020 -662712 -528699 -480630 -321870 -103627 -179651 -591968 -859141 -633490 -216418
42689 -216418 -126271 -428563 -798676 -1018987 -1083130 -980913 -728887 -509185 -450207 -355552
42679 -355552 6470 408626 363101 -146766 -532603 -353052 126572 342185 148577 -129767
42669 -129767 -211132 -146103 -125046 -207337 -302925 -337455 -370517 -509307 -682001 -590926 -38044
42658 -38044 736418 1216383 1117925 572705 -162173 -916701 -1494391 -1661976 -1429798 -1123337
42648 -1123337 -990930 -907701 -622890 -126289 384496 723937 767223 495866 149268 71367
42638 71367 213408 100302 -439060 -869314 -692946 -266192 -292755 -709738 -772943 -240748
42628 -240748 239396 110142 -366022 -671323 -785534 -948289 -1077001 -921022 -575993 -389413
42618 -389413 -443580 -489829 -355570 -137986 -15206 -66505 -236055 -325539 -118692 338198
42608 338198 710071 787113 759852 877978 1018823 886142 520078 281939 355788 553039
42598 553039 623561 495719 164757 -400824 -1119075 -1715400 -1903951 -1609832 -1019018 -490275
42588 -490275 -365549 -706305 -1202278 -1462614 -1397625 -1200307 -996665 -713809 -325919 -23292
42578 -23292 -5230 -219184 -439031 -543435 -591014 -640452 -632645 -507445 -341555 -264544 -282046
42567 -282046 -313426 -388633 -611551 -862911 -786252 -279883 199220 144682 -293024 -478982
42557 -478982 -145882 327871 542703 550449 553371 556209 568077 769524 1153001 1314441 970556
42546 970556 430252 175028 193506 133450 -79450 -215836 -197557 -126545 47684 424691
42536 424691 766873 701826 325425 119167 201147 167309 -154390 -287221 243147 1192984
42526 1192984 1884637 1989046 1712342 1347019 948105 446093 -123300 -571394 -714905
42517 -714905 -593156 -474275 -542496 -644099 -506434 -135156 238946 548601 911173 1250777
42507 1250777 1256988 841467 322392 -18121 -293219 -730453 -1256773 -1583162 -1545449 -1178008
42497 -1178008 -601658 -27644 254511 96019 -348671 -785659 -1037655 -1081889 -974354 -830448
42487 -830448 -744981 -634572 -300414 248183 679336 676826 281419 -213772 -595321 -842999
42477 -842999 -1003233 -1058796 -894114 -388244 362103 945789 948189 386934 -317936 -787132
42467 -787132 -888747 -567645 164284 984440 1371219 1156042 699468 364925 129970 -76434
42457 -76434 -9680 550683 1316975 1735698 1621270 1243439 879730 606783 497203 677946
42447 677946 1087421 1390203 1281010 817219 379057 288612 474273 576264 444438 395793
42437 395793 769349 1340768 1535549 1224048 886901 875655 952861 808956 613916 679311
42427 679311 887978 893301 689363 562130 584988 546613 335523 86951 -20649 116755
42417 116755 524468 1032514 1283645 1102675 740299 531776 490510 485552 577171 819033
42407 819033 947489 719208 424399 578952 1146586 1535797 1392908 960433 593424 354621
42397 354621 201786 161639 128673 -163437 -733304 -1161487 -1041203 -462941 134785 471489
42387 471489 598288 633125 517936 125283 -462170 -940910 -1158766 -1355705 -1793762 -2248247
42377 -2248247 -2250238 -1828690 -1507429 -1431475 -1090751 -239558 515480 572800 252796 197540
42367 197540 305849 66141 -373118 -368717 128125 544049 697970 932860 1187678 885945
42357 885945 -44787 -926264 -1372055 -1720551 -2113547 -2050116 -1334127 -612794 -369054 -143960
42347 -143960 546488 1214042 1127681 499714 93570 46751 -64768 -281684 -254344 -43053
42337 -43053 -104742 -481551 -701232 -524069 -182615 142591 491933 731486 591286 224094
42327 224094 185176 672763 1240921 1451769 1406239 1418635 1511528 1475398 1198163 742015
42317 742015 249337 -112152 -243909 -209457 -114024 71258 378678 593891 406210 -155020
42307 -155020 -651709 -659727 -123903 679586 1364304 1657387 1589311 1434029 1322334 1033428
42297 1033428 382617 -323078 -537804 -154650 366319 569550 451010 294459 280240 334874
42287 334874 257089 -28060 -306719 -279050 16813 200004 98369 18929 231643 499802
42277 499802 489819 366390 505093 812478 869218 641375 485296 470384 276465 -167277
42267 -167277 -503929 -551792 -551000 -602345 -389515 202924 625646 262445 -723191 -1512001
42257 -1512001 -1510952 -866681 -178300 99487 -7601 -122515 66193 560127 1214975 1922714
42247 1922714 2460136 2445557 1832830 1233185 1224378 1457556 1078409 51699 -634747 -293111
42237 -293111 596646 1175283 1252076 1105936 773943 161293 -440437 -555565 -151369 368736
42227 368736 699441 801953 676704 352603 24603 -130357 -207753 -368921 -488674 -302597
42217 -302597 184544 704817 1039411 1088078 801445 356793 242710 788510 1670851 2213830
42207 2213830 2120160 1613963 983236 362577 -102545 -308492 -449715 -850052 -1464874 -1867471
42197 -1867471 -1792309 -1390144 -894208 -362196 155742 508727 645366 664951 548629 98551
42187 98551 -709810 -1543252 -2028614 -2067843 -1741592 -1156768 -556645 -330024 -640182 -1154595
42177 -1154595 -1349631 -1014564 -327240 428418 1028258 1301000 1197088 875098 572214
42168 572214 380578 248901 172379 250002 533764 904289 1127083 1019045 597394 100392
42158 100392 -190787 -213412 -191695 -421721 -1010264 -1793242 -2406283 -2450271 -1784211 -766900
42148 -766900 -60069 -30296 -425077 -757006 -865238 -893271 -849670 -543269 5868 427796
42138 427796 455332 276609 201249 146399 -235746 -953905 -1505964 -1418030 -763625 -15477
42128 -15477 485763 754476 923289 989358 886502 713233 726450 1028408 1333605 1198042
42118 1198042 519023 -321722 -885462 -1092475 -1068526 -762452 -36945 900464 1532778 1630010
42108 1630010 1507991 1499870 1448563 1020589 331867 -112643 -68097 187589 291207 231562
42098 231562 243660 451971 750837 955427 985515 924280 901683 895659 716418 271275 -230010
42087 -230010 -457411 -295840 111037 557440 848584 768780 232725 -498931 -951189 -857993
42077 -857993 -360921 200163 556197 583015 294338 -146237 -470490 -420800 125946 1022373
42067 1022373 1809364 2009672 1599068 1025806 654799 447632 363518 694430 1583622 2492984
42057 2492984 2723146 2387091 2309715 2907532 3675292 3939340 3710517 3579191 4027189 5008590
42047 5008590 6078374 6905708 7715490 9022042 10821840 12524769 14042141 16328142
42039 16328142 20192576 25301634 31413297 39734273 50965242 61929592 66547224 61593936
42031 61593936 50214975 38514448 29831591 23646973 18699253 14852172 12124890 9981874
42023 9981874 8159028 6949448 6277845 5505846 4446465 3640533 3373783 3303549 3268661
42014 3268661 3526399 3889657 3577074 2372170 1129021 653799 777031 954445 1068504
42005 1068504 1141738 937122 438494 190746 572825 1149820 1268235 921351 551267 353277
41995 353277 236736 151154 30979 -266324 -597261 -487604 137687 581279 231264 -539394
41985 -539394 -867772 -549571 -159990 -189061 -558768 -929259 -1066710 -922896 -636232 -414556
41975 -414556 -267108 -25973 259084 293368 100611 172031 716604 1204692 1107069 684342
41965 684342 514011 604866 607906 602714 929494 1373345 1284414 579181 -28744 37272 553958
41954 553958 917804 799749 257456 -403604 -742873 -505948 35723 344031 271403 176316
41944 176316 379837 850245 1446018 2083566 2582363 2714303 2526709 2292416 2042512 1493755
41934 1493755 567991 -357123 -886022 -1000143 -855146 -479320 123211 804680 1393497
41925 1393497 1782189 1784078 1201923 244851 -421990 -368736 34671 71818 -406263 -858192
41915 -858192 -824810 -471826 -225097 -137461 98433 584272 971694 908893 513996 158786
41905 158786 -93748 -478000 -937033 -992520 -463348 52972 -140992 -866544 -1254141 -868071
41895 -868071 -173430 200938 214814 213552 327057 394515 317662 197105 150973 179367 214312
41884 214312 221898 263041 456441 809594 1099126 1045750 627665 100913 -291707 -482680
41874 -482680 -463960 -238875 35018 80287 -164740 -395761 -289497 114544 537075 844443
41864 844443 1091805 1243415 1136487 815421 657126 930767 1344247 1318126 738106 139571
41854 139571 -11800 61174 -141271 -566764 -654800 -200335 314168 419846 265894 232609
41844 232609 287631 121084 -280021 -595384 -648114 -612560 -768259 -1247689 -1949019 -2519026
41834 -2519026 -2552448 -2008989 -1299631 -797876 -485811 -264579 -254101 -427035 -313584 380139
41824 380139 1104090 1054735 329816 -171046 -14068 270506 94143 -431001 -900793 -1217408
41814 -1217408 -1416375 -1343268 -909147 -368214 3384 260513 538450 719175 671768 606577
41804 606577 836368 1295625 1590520 1471758 1044884 572989 260195 196384 358018 628304
41794 628304 845493 843365 542426 105233 -126455 -38837 48839 -153471 -409167 -310987
41784 -310987 -7406 -55884 -549069 -937471 -837973 -488268 -221923 -33533 67589 -203009
41774 -203009 -926664 -1649192 -1919871 -1846741 -1774565 -1723111 -1486377 -1001197 -301406 597852
41764 597852 1477485 1931845 1951114 2110369 2761431 3388526 3250880 2375157 1405437 723333
41754 723333 262663 207 31552 211028 237495 117254 136953 387645 667324 800807
41744 800807 717069 305409 -431590 -1154076 -1466860 -1359287 -1075679 -717546 -324867 -136854
41734 -136854 -311599 -541240 -424172 -82147 98516 196019 618403 1284657 1577368 1208963
41724 1208963 589892 210686 142899 267088 523113 798269 984771 1235933 1742960 2231480
41714 2231480 2202657 1745042 1514537 1744279 1887413 1508602 928202 600734 395916 -12554
41704 -12554 -458469 -522393 -211997 67853 70709 -136804 -423242 -662543 -696424 -523316
41694 -523316 -390158 -443288 -463229 -218004 105772 139648 -135474 -400400 -434293 -255071
41684 -255071 72776 462198 686568 539355 137100 -151925 -106064 173392 458979 603765
41674 603765 562192 371967 162367 86001 181861 303437 196657 -265198 -832135 -964665
41664 -964665 -376374 547527 1110735 1076420 811547 665373 561808 312304 -35566 -372025
41654 -372025 -741352 -1132997 -1298944 -1039430 -496965 36435 423318 634807 657422 652297
41644 652297 923304 1448230 1707381 1316401 606368 197345 173284 102000 -228459 -544993
41634 -544993 -582603 -457668 -446283 -658002 -1020661 -1390727 -1612489 -1613534 -1472051 -1297466
41624 -1297466 -1102712 -907827 -847669 -994833 -1188495 -1244545 -1221791 -1256954 -1272178 -1129017
41614 -1129017 -953762 -971306 -1090642 -1036558 -879277 -1013648 -1520729 -1950564 -1931363 -1662872
41604 -1662872 -1551466 -1615170 -1566486 -1340847 -1197313 -1269807 -1280873 -852170 -8510 776204
41594 776204 1084364 1032972 1124507 1597896 2075494 1988337 1258613 375274 -177581 -360315
41584 -360315 -412588 -471850 -512233 -527817 -549136 -474321 -109586 470372 757195 306418 -563402
41573 -563402 -908003 -246653 729697 924007 184059 -574392 -587342 -45213 478054 811139
41563 811139 1002970 847892 208578 -431691 -390233 268386 773777 707928 491201 623809
41553 623809 916289 819872 234275 -393773 -678850 -691505 -715321 -815720 -770079 -388065
41543 -388065 182777 537392 409707 -62902 -486480 -554795 -247219 186549 396321 238108
41533 238108 -14836 70517 536344 941215 931777 667463 505190 527530 637794 873948
41523 873948 1298118 1755197 2065804 2287514 2466558 2365227 1860975 1397374 1492177 1914992
41513 1914992 1954560 1484912 1127670 1252111 1454232 1269543 825696 447178 104996 -324818
41503 -324818 -635117 -569613 -291969 -186173 -355805 -619666 -812555 -806857 -463159 91678
41493 91678 315428 -230133 -1273703 -2065454 -2173000 -1783562 -1290684 -907351 -708037 -746927
41483 -746927 -984557 -1231499 -1274373 -1030504 -577328 -75575 350700 691083 987954 1215859
41473 1215859 1293996 1197027 957697 613529 292844 252363 567404 846453 611024 -12943
41463 -12943 -375829 -170463 217633 405166 560095 893886 1053533 589093 -192377 -438350
41453 -438350 173364 1028627 1330858 917221 227167 -258663 -400801 -378450 -416212 -541304
41443 -541304 -645877 -743498 -935279 -1070594 -801676 -212101 -14213 -681039 -1638528 -1872876
41433 -1872876 -1249295 -666329 -864075 -1616108 -2240371 -2396114 -2105787 -1413704 -411367
41424 -411367 624689 1453992 2103587 2632444 2809737 2322349 1264972 174952 -465586
41415 -465586 -624222 -604284 -674603 -876606 -1117744 -1331602 -1470570 -1383939 -874442 -1298
41405 -1298 778382 978050 609129 185775 162541 488422 755685 669872 306425 -22581
41395 -22581 -96245 4021 22227 -119582 -198118 -18903 239643 198794 -241200 -769761
41385 -769761 -990443 -712975 11100 883760 1384805 1103165 188577 -711161 -1075183 -910385
41375 -910385 -471289 140745 880634 1472222 1554795 1116382 548198 220007 167831 251528
41365 251528 438900 772626 1132340 1244993 1030383 812524 1004728 1588239 2083807 2107778
41355 2107778 1782752 1473520 1298381 1130182 965453 989525 1254854 1542884 1613738 1411847
41345 1411847 998490 501731 181965 283612 689506 952110 833309 595861 553027 555263
41335 555263 249366 -279536 -525051 -264587 104160 106344 -179565 -282787 -11317 302261
41325 302261 250416 -135875 -419347 -241277 283481 648879 443791 -219096 -797473 -884597
41315 -884597 -600244 -314733 -101339 278544 855694 1261552 1215479 892509 535705 -9396
41305 -9396 -953331 -1938192 -2289015 -1896697 -1347052 -1080978 -940801 -724969 -625415 -748920
41295 -748920 -701892 -171057 434195 498702 133158 -19450 212451 370082 236632 209710
41285 209710 571699 936112 810743 371937 250827 671564 1145646 1050797 321846 -505750
41275 -505750 -876441 -767345 -617489 -757128 -1072853 -1277565 -1283018 -1160130 -961720 -798407
41265 -798407 -866007 -1139399 -1266440 -1051829 -773837 -671543 -465774 96014 563322 368178
41255 368178 -136185 -80750 532214 798778 407412 154901 574257 1000134 648954 -134138
41245 -134138 -477354 -261731 821 145569 389877 658577 671311 579673 805197 1284365
41235 1284365 1488363 1167501 539233 -181342 -862913 -1143390 -682582 201996 710954
41226 710954 472723 -190497 -907641 -1592017 -2052607 -1923304 -1273129 -790852 -1007899 -1662834
41216 -1662834 -2115057 -2101270 -1821596 -1521157 -1250986 -908615 -366177 311131 739190 549597
41206 549597 -86767 -554098 -517845 -275811 -248711 -406286 -404682 -83298 385119 710433
41196 710433 702636 381209 -27010 -273907 -297595 -166021 88321 377714 425387 56918
41186 56918 -419849 -514906 -263880 -223527 -662737 -1175905 -1273568 -964075 -525984 -79128
41176 -79128 322806 487952 327585 113568 193068 560758 914103 990974 702597 139102
41166 139102 -377768 -467484 -125660 204104 177949 -34885 -64038 177496 534711 900546
41156 900546 1226233 1446561 1601992 1808669 1927986 1588175 794872 168664 218953 704977
41146 704977 1121982 1476622 2043175 2626584 2725980 2321593 1856844 1471381 920302 315985
41136 315985 219176 708958 995501 412619 -639398 -1228877 -1082483 -736554 -630928 -557777
41126 -557777 -122122 580297 991839 752994 174767 -69656 281949 789913 906983 653624
41116 653624 433340 354020 170836 -125228 -181347 87880 222689 -109416 -528366 -424628
41106 -424628 219862 905338 1335780 1618669 1811273 1737251 1356197 954712 797326 821025
41096 821025 815423 700371 479554 113928 -353011 -660353 -545220 -81615 363308 536688
41086 536688 534365 583229 709926 735805 550505 258769 23926 -130271 -274005 -381308
41076 -381308 -298633 83306 701789 1379317 1935574 2230855 2200924 1918482 1562900 1267276
41066 1267276 1039980 880585 883530 1102070 1333231 1186313 457180 -592969 -1386900 -1488744
41056 -1488744 -952751 -263894 70036 -80743 -423989 -568124 -363746 47536 413634
41047 413634 524570 282372 -203182 -584399 -536512 -150430 92943 -105441 -454782 -465696
41037 -465696 -156510 -44829 -396671 -831416 -860125 -527573 -233769 -127522 -33675 128945
41027 128945 250618 345184 570457 839609 763989 163381 -627599 -1140667 -1245874 -1092880
41017 -1092880 -815200 -472824 -73134 526215 1491296 2582831 3138322 2798579 2032709
41008 2032709 1590765 1614271 1666445 1476941 1190765 942914 674160 419014 341320 389831
40998 389831 319067 163957 284018 760500 1133129 974567 415650 -126824 -436685 -464537
40988 -464537 -134517 458389 883284 791342 389846 172461 258734 313585 74369 -352000
40978 -352000 -724582 -916737 -861447 -480328 192560 904671 1298075 1151482 557518 -119563
40968 -119563 -542947 -690285 -743827 -712634 -397222 193526 674496 730605 492760 237790
40958 237790 -32993 -394025 -604070 -361362 136501 340845 84921 -242802 -343150 -432549
40948 -432549 -847104 -1519878 -2062912 -2185226 -1888687 -1416680 -1103323 -1084122 -1069866 -617477
40938 -617477 279664 1093682 1356995 1115107 673856 198987 -215564 -365282 -148488 204680
40928 204680 433119 646704 1086552 1569590 1591832 1065912 583265 717736 1301864 1664401
40918 1664401 1471003 1034566 774409 667290 447075 171342 228462 722779 1199753 1234474
40908 1234474 1043595 1140994 1529293 1700684 1432055 1053884 788073 381159 -262357 -601605
40898 -601605 -174443 544782 658502 76787 -417745 -323197 26604 190160 247285 391598
40888 391598 450807 259692 116394 376197 837446 997668 762166 461011 275844 101274
40878 101274 -62374 -38712 123104 69356 -374268 -918733 -1171283 -1075562 -862624 -733233
40868 -733233 -708642 -674547 -495941 -186226 30450 -41158 -294383 -467282 -506413 -530689
40858 -530689 -496923 -279459 -97895 -385373 -1059391 -1420486 -1104842 -676396 -794971 -1186289
40848 -1186289 -1078895 -434828 -173 -144148 -399994 -349242 -257224 -442037 -595596 -284666
40838 -284666 243116 339480 -139563 -729290 -1055896 -1142014 -1043378 -696264 -247766 -109455
40828 -109455 -457571 -948924 -1123280 -889202 -471123 -77019 226034 472099 772833 1185146
40818 1185146 1497093 1346289 710203 72028 -138297 -113898 -391754 -1076992 -1668045 -1703017
40808 -1703017 -1292219 -852369 -520216 -82506 559287 1111453 1212588 919672 668076
40799 668076 719138 843384 702371 386176 287472 473538 532709 182616 -281163 -413770
40789 -413770 -283094 -358098 -827743 -1384027 -1689602 -1724600 -1575493 -1178843 -463463 425973
40779 425973 1205991 1651217 1655579 1286193 878362 849999 1218310 1462442 1101540 311731
40769 311731 -260468 -231700 205664 659746 947115 1059713 964340 609495 60727 -472135
40759 -472135 -737379 -589481 -116885 383591 655139 708213 721420 758080 723176 584302
40749 584302 448059 365497 228147 -56684 -418782 -730624 -923390 -910134 -555011 119642
40739 119642 795982 1104335 972717 623668 294081 95773 84145 277196 602189 966533
40729 966533 1373916 1817693 2076751 1844598 1147875 436038 96792 29659 -102442 -321063
40719 -321063 -334599 -106173 -74036 -574170 -1256625 -1418518 -883475 -214728 33215 -40669
40709 -40669 10917 301170 556344 602824 541693 463726 347766 294538 504096 873645 937400
40698 937400 436384 -286748 -697826 -676983 -469122 -225087 87766 425571 651409 767021
40688 767021 891930 1004652 941057 670315 373470 239578 351963 724427 1225013 1508142
40678 1508142 1303351 798869 487286 589351 858913 973801 856635 581870 267949
40669 267949 130343 317375 573524 403660 -234053 -716415 -503886 151913 554421 426607
40659 426607 97546 -64803 -62780 -96678 -241794 -380091 -338329 -65196 282819 476158
40649 476158 461146 375004 298744 178127 45492 79853 314667 517993 524847 453631 422062
40638 422062 337022 202445 303100 720015 963802 569558 -149782 -480361 -311763 -171058
40628 -171058 -278161 -232074 188685 532966 339313 -166204 -442817 -375373 -219539 -48692
40618 -48692 273996 654235 741533 435197 116820 223135 733042 1207322 1274006 963130
40608 963130 552280 191039 -182188 -563297 -744562 -602193 -339904 -201294 -65167 359667
40598 359667 988773 1368505 1283496 1042448 1053530 1371090 1749949 1900923 1624648 963695
40588 963695 300942 42345 161591 361442 647433 1235347 1818810 1606210 447649
40579 447649 -679531 -852925 -391631 -218154 -433962 -353803 198201 507857 36676 -841968
40569 -841968 -1461861 -1696405 -1861900 -2175297 -2594265 -2916629 -2839763 -2203980 -1338725 -847907
40559 -847907 -873882 -922623 -634395 -325629 -413783 -670235 -565944 -177235 -170064 -839618
40549 -839618 -1661718 -1993756 -1843090 -1641150 -1504250 -1125639 -393450 251115 288152 -218705
40539 -218705 -698226 -786712 -704723 -825209 -1114546 -1245025 -1131508 -1050189 -1205721 -1440842
40529 -1440842 -1482993 -1304052 -1107701 -1058056 -1123642 -1146885 -1027589 -874606 -944721 -1331884
40519 -1331884 -1754638 -1805153 -1402864 -835681 -357807 33368 372508 527782 376043 4675
40509 4675 -414290 -814403 -1154116 -1289454 -1125636 -820163 -641711 -647029 -661208 -588160 -589157
40498 -589157 -872632 -1372629 -1737212 -1686984 -1348846 -1116705 -1132790 -1069801 -605582 26986
40488 26986 286142 108925 76550 631723 1444247 1822030 1544458 988297 545673 232257
40478 232257 -122080 -530716 -775364 -594572 32814 749700 1091842 996075 872817 1017843
40468 1017843 1155026 832380 122225 -420154 -454754 -181109 50300 126883 98404 4699
40458 4699 -92425 -118417 -121029 -197312 -242358 -45468 279289 298322 -105825 -428078 -186485
40447 -186485 367275 571405 250627 -138326 -241247 -247608 -451762 -724229 -689203 -257463
40437 -257463 264954 546402 538204 429050 403129 449348 373499 37805 -398678 -579903
40427 -579903 -354403 23140 181051 29515 -239102 -454678 -606517 -708054 -702945 -551814
40417 -551814 -292173 44161 486290 1031487 1536807 1752093 1484074 784749 11682 -397369
40407 -397369 -334773 -155486 -258237 -582030 -710347 -467612 -175106 -227782 -609092 -942466
40397 -942466 -877616 -336445 447011 1010569 979702 483141 111480 280505 766895 1053426
40387 1053426 965536 712175 441953 108321 -242009 -382002 -204817 107093 306854 328089
40377 328089 253235 170660 106585 14515 -147667 -256535 -59483 461660 895260 822158
40367 822158 358736 11100 40850 261165 429168 528207 639810 805216 1020220 1132563
40357 1132563 836525 96976 -535301 -471096 122736 581473 740570 1027616 1490524 1498680
40347 1498680 729789 -223727 -674435 -691026 -656547 -527617 -110051 371020 573186 556882
40337 556882 477194 167337 -393237 -657821 -281218 104051 -271733 -1015172 -1065400 -322280
40327 -322280 228939 15740 -499612 -818189 -1027396 -1154999 -857280 -186289 161267 -128995
40317 -128995 -426649 -150779 325896 353383 19559 -147003 -52811 3495 -74597 -182131
40307 -182131 -334746 -515949 -487580 -192200 -30579 -299104 -697277 -863388 -1014188 -1485656
40297 -1485656 -1986582 -1964781 -1477094 -1043675 -816113 -534791 -162954 109941 399941 965159
40287 965159 1539599 1552123 1079142 853595 1134008 1257264 652215 -284061 -763323 -646358
40277 -646358 -436394 -466423 -532823 -304594 190099 565409 503424 137497 -96183 -58626
40267 -58626 -146374 -700026 -1401207 -1651676 -1413894 -1204628 -1303511 -1478026 -1527494 -1561479
40257 -1561479 -1597565 -1400841 -957184 -642947 -624325 -483207 207969 1231914 1984424 2164278
40247 2164278 1905536 1425467 869028 403093 189197 259350 515652 778162 814198 514405
40237 514405 101152 -53515 113883 304981 296828 141918 -105020 -479924 -819861 -800813
40227 -800813 -459705 -263332 -403664 -447551 -25656 532096 686504 501188 482782 813243
40217 813243 1201308 1370009 1289025 1037960 808100 907804 1384110 1758281 1524154 808974
40207 808974 171257 -127257 -241573 -279276 -211106 -184993 -410541 -699441 -612975 -153833
40197 -153833 153906 7169 -286695 -332085 -157188 3120 78264 70600 -114129 -484874
40187 -484874 -825700 -963186 -1005918 -1135403 -1316573 -1387574 -1312122 -1198282 -1146212 -1142688 -1026203
40176 -1026203 -593265 94641 592074 543218 225499 242959 660440 896614 601950 145439
40166 145439 -43939 -146711 -531486 -1008836 -1030322 -482856 186538 594484 769615 871878
40156 871878 918521 868086 729548 507508 181648 -249151 -793202 -1432790 -1929836 -1856120
40146 -1856120 -1098506 -212740 67326 -339567 -806743 -759017 -196695 526108 1094565 1311484
40136 1311484 1095173 578632 40160 -358782 -609319 -633075 -314236 172897 409117 298980
40126 298980 296539 788960 1490829 1785376 1512747 1055859 725389 464396 205783 132411
40116 132411 396671 847329 1238058 1509133 1666757 1590739 1250018 981236 1199011 1812435
40106 1812435 2239773 2090130 1560210 1044968 665192 407611 436257 863849 1345839 1354868
40096 1354868 907086 625721 947698 1602721 2064648 2201049 2203416 2140256 1947783 1721949
40086 1721949 1633099 1578174 1277027 775818 542174 912292 1641785 2143129 2047436 1454972
40076 1454972 762547 327191 201918 147204 -33771 -225233 -231666 -210711 -547551 -1219574
40066 -1219574 -1647734 -1430395 -941392 -834235 -1114166 -1132983 -501366 413743 1038588 1277375
40056 1277375 1386981 1428545 1223878 804110 545526 739546 1248730 1738288 2087634 2380814
40046 2380814 2588626 2516381 2114100 1637799 1370803 1290521 1145092 804543 405707 165560
40036 165560 168191 348275 582748 755590 794863 698833 528458 386159 396788 620305
40026 620305 908439 936792 532058 -52763 -347991 -179354 171938 371794 451755 715029
40016 715029 1304470 1981666 2338504 2190683 1763389 1466596 1450650 1450326 1172561 755099
40006 755099 629128 936963 1347221 1527719 1529253 1522900 1404524 949053 223551 -460347
39996 -460347 -961775 -1386567 -1727971 -1719685 -1185773 -369365 233705 308737 -69714 -577711
39986 -577711 -906376 -921868 -639359 -106839 607097 1305601 1684402 1582069 1141603 623213
39976 623213 146897 -260624 -493354 -451471 -233823 -30383 133444 324937 433534 269176
39966 269176 -45992 -95020 311448 882649 1244570 1352623 1352763 1254223 960101 500151
39956 500151 53389 -188705 -94227 330097 824800 1013285 807268 543715 571157 820871
39946 820871 921539 622345 2313 -589656 -723308 -241716 446028 683274 334119 -72017
39936 -72017 -163538 -281844 -829765 -1463664 -1526937 -1048998 -629760 -414018 76287 976497
39926 976497 1669262 1651702 1229102 946956 798375 446410 -113232 -572776 -761475 -677846
39916 -677846 -298621 242704 501726 204610 -258887 -297515 6119 -12003 -602278 -1200583
39906 -1200583 -1185797 -624157 -17104 367532 600743 726605 639961 330453 21143 -26941
39896 -26941 214210 499028 530937 236225 -184796 -493067 -651876 -768626 -845414 -724600
39886 -724600 -325747 163435 432659 386307 277069 448709 941361 1421550 1555175 1357758
39876 1357758 1055144 709732 234923 -261692 -505248 -526875 -740825 -1307804 -1751404 -1568880
39866 -1568880 -976566 -606556 -610600 -565398 -242357 62781 114293 180672 595674 1168069
39856 1168069 1349974 869667 -23312 -858497 -1326899 -1429913 -1376429 -1323914 -1217406 -952339
39846 -952339 -623534 -416798 -287415 -13761 397544 657792 646035 609826 749529 888335
39836 888335 790630 566662 475216 505534 472040 408320 518486 745633 720213 261153 -283873
39825 -283873 -376234 92811 645985 723279 286067 -183936 -308585 -252827 -354728 -484561
39815 -484561 -159535 680230 1433417 1575003 1288566 1089097 1112889 1145260 1142713 1282863
39805 1282863 1525706 1503993 943109 -19759 -975164 -1553510 -1628523 -1372613 -1087557 -871522
39795 -871522 -545828 -16561 481017 692903 696490 677609 566912 247223 -56229 -34140
39785 -34140 144017 -7403 -563160 -1068995 -1187066 -1009166 -665209 -127786 423414 544697
39775 544697 128787 -339728 -438561 -354478 -444309 -609331 -534223 -277537 -146802 -145206 -14081
39764 -14081 246782 357539 271720 303438 656853 1156290 1538489 1725757 1713456 1477681
39754 1477681 1153278 1061188 1345822 1731064 1840437 1679519 1604397 1814746 2045671 1857357
39744 1857357 1175637 433566 119643 246381 385770 232696 -24850 13982 446179 974116
39734 974116 1255550 1200187 970722 833270 968048 1280114 1415974 1102488 452737 -179251
39724 -179251 -584685 -778588 -774897 -553407 -272184 -223847 -444207 -589035 -386171 -47107
39714 -47107 -13131 -384001 -809954 -912708 -621242 -103479 426173 771095 802728 580525
39704 580525 344416 272910 272452 85402 -403606 -1028348 -1499974 -1649493 -1507358 -1198839
39694 -1198839 -808749 -355030 131547 558141 853549 1076739 1344016 1620034 1699243 1487970
39684 1487970 1193572 1072820 1072283 945379 704753 666288 951906 1243755 1235291 1075754
39674 1075754 1083092 1213721 1180281 981085 886788 890338 600820 -168982 -1054245 -1569232
39664 -1569232 -1617769 -1398046 -1074727 -770870 -642797 -694976 -689777 -469792 -191856 -21799
39654 -21799 171107 521012 803227 758453 597792 704771 921200 680604 -82543 -704880
39644 -704880 -689753 -352789 -248240 -343273 -199064 260799 629382 603191 309332 34301
39634 34301 -64599 60664 374444 672644 698234 457489 250603 271998 332502 135571
39624 135571 -261968 -451520 -161975 366970 591408 246059 -340744 -593951 -352892 -57892
39614 -57892 -185165 -631694 -876787 -691823 -378183 -221970 -55067 374623 849004 900476
39604 900476 506765 144132 97820 130998 -2423 -121067 7866 182772 64831 -246581
39594 -246581 -387937 -369810 -539149 -885656 -907394 -360831 288350 463437 219379 61048
39584 61048 226906 491093 582333 502171 424488 462413 550220 498949 248686 77617 342264
39573 342264 919698 1191835 796725 149190 -53854 360762 1014479 1534133 1769590 1619039
39563 1619039 1075431 420443 4176 -165626 -299807 -356055 -88231 428698 746405 623065
39553 623065 306398 123725 110012 162950 254836 336161 288376 113422 -41972 -116821 -139903
39542 -139903 14786 517124 1143405 1365063 1065976 785046 985135 1421388 1536125 1188745
39532 1188745 675232 281285 156309 409144 955672 1409988 1460064 1244009 1073415 941978
39522 941978 649877 289755 203165 447234 647995 474273 41419 -228810 -30290 545149
39512 545149 1061760 1139952 866312 665808 713355 742535 584423 536484 867585 1260899
39502 1260899 1200093 727008 346947 289526 337722 333834 363996 431984 438746 548142 1079427
39491 1079427 1901840 2410418 2305158 1956133 1748973 1506633 922557 206120 -176139
39482 -176139 -213416 -327361 -662621 -820756 -425903 328766 895295 999093 861887 819603
39472 819603 908835 952881 929330 999155 1158059 1161822 957759 899283 1241149 1649250 1594427
39461 1594427 1100913 694007 669480 834383 953680 1023111 1073843 1125871 1352499 1834552
39451 1834552 2151207 1794931 1075991 928373 1579230 2151194 2016733 1796200 2305900
39442 2305900 3110821 3047325 1904264 678796 231262 502520 1077576 1696305 2030470
39433 2030470 1725858 1001498 593257 747523 820052 262306 -523865 -811527 -586183 -366115
39423 -366115 -288687 -34057 452166 803566 876832 1022402 1531372 2208460 2692912 2878835
39413 2878835 2809606 2459916 1901371 1448517 1294784 1124977 460331 -597744 -1304146
39404 -1304146 -1087077 -204835 574642 790212 610328 468604 607726 965654 1310790
39395 1310790 1429873 1304261 1155217 1234503 1540067 1808475 1793409 1469876 976487 479712
39385 479712 113150 -77053 -169661 -244663 -202485 149104 778992 1359444 1594990 1493103
39375 1493103 1233501 936454 684722 607163 749416 963963 1114849 1312319 1742402 2298062
39365 2298062 2584408 2337448 1725478 1201045 1093528 1307576 1388277 988356 334699 69857
39355 69857 493291 1133824 1293357 870755 364020 153277 137529 100935 81967 227813
39345 227813 529226 871795 1191414 1446877 1578348 1607853 1643320 1668502 1477135 975994
39335 975994 448430 327316 722960 1316096 1729425 1887445 1951178 1978547 1796828 1294454
39325 1294454 740425 591657 921238 1263702 1202176 901864 781016 829176 688514 392819
39315 392819 509310 1317165 2247546 2508889 2047797 1525682 1464686 1775275 2086097 2165769
39305 2165769 1922565 1302989 433574 -260671 -326154 256186 959075 1153077 695483 44490
39295 44490 -245067 -79181 209599 377325 536169 860142 1245396 1431061 1332575 1086813
39285 1086813 853891 738929 832313 1132360 1453884 1593580 1582432 1605041 1671115 1569768
39275 1569768 1207193 797119 601855 641829 816087 1176075 1829791 2572712 2869100 2374468
39265 2374468 1381779 576502 352065 489922 508195 168829 -393526 -845553 -830143 -165232
39255 -165232 883559 1633952 1593637 1045664 758294 1076415 1599101 1843353 1860407 1940256
39245 1940256 2014154 1763351 1209453 788396 786976 1007771 1097274 993463 929376 1116068
39235 1116068 1496408 1740012 1494962 766158 21580 -226477 76132 600182 1140115
39226 1140115 1766767 2453147 2879942 2791548 2324004 1801479 1398419 1178123 1241156 1560135
39216 1560135 1819870 1740763 1491104 1449836 1562427 1287084 318267 -896928 -1557403 -1285725
39206 -1285725 -382197 544515 1040237 1018056 714075 442635 318105 246369 201106 352544
39196 352544 807294 1364103 1711156 1783198 1742042 1676045 1533937 1328363 1184203 1168400
39186 1168400 1260218 1483878 1838820 2075036 1817115 1038058 198381 -213596 -98320 376215
39176 376215 1034839 1649098 1891781 1621407 1069580 525483 16306 -450036 -562229 -36981
39166 -36981 821108 1308800 1099090 511509 25732 -132815 62345 499443 856354 845775
39156 845775 642951 712001 1095625 1271881 887713 241606 -183336 -279673 -154417 175389
39146 175389 572223 659003 374891 330666 1054579 2080183 2381805 1672442 721754 351448
39136 351448 626105 1136011 1576410 1810066 1724354 1311933 724319 118521 -381064 -562377
39126 -562377 -268604 276127 617509 662718 784485 1187350 1545271 1519009 1287877 1224564
39116 1224564 1315243 1313566 1292311 1576226 2155227 2601143 2664926 2600725 2730908 2982506
39106 2982506 3101587 3129271 3343860 3766438 4032976 3876130 3514858 3361279 3472426 3561889
39096 3561889 3512753 3534122 3695393 3658004 3162932 2528296 2259687 2306628 2181359 1806115
39086 1806115 1710992 2203409 2817249 2943299 2678142 2617909 2987175 3417104 3556416 3492028
39076 3492028 3455610 3426174 3235308 2919253 2756653 2952570 3398947 3805527 4021099 4122693
39066 4122693 4161151 3978305 3462715 2899442 2778515 3204379 3760579 4070276 4229129 4513951
39056 4513951 4923312 5264283 5490861 5642904 5578303 5114320 4417976 3953087 3987187 4363408
39046 4363408 4783495 5107019 5332413 5480509 5581170 5666672 5748647 5875329 6150214 6557076
39036 6557076 6840190 6750449 6370385 5998440 5746625 5467486 5056339 4598195 4228370 4081738
39026 4081738 4344758 5047211 5780149 5973709 5574106 5130302 5067435 5208983 5231725 5247573
39016 5247573 5571029 6121095 6459724 6366699 6041641 5737150 5483652 5228711 5010915 4899760
39006 4899760 4908887 5039682 5311393 5700277 6111501 6436120 6625037 6749100 6979272 7378417
38996 7378417 7696914 7603429 7231871 7222566 7971223 9073083 9841104 10165645 10430940 10740560
38986 10740560 10805901 10632142 10713412 11326191 12131687 12769441 13389615 14234723 15113260 15754183
38976 15754183 16362423 17308321 18496536 19578119 20622790 22013144 23764740 25551318
38968 25551318 27401198 29751477 32712786 35885632 39100384 42777537 47308721 52632098
38960 52632098 58732930 66012165 74734254 84609530 95466656 107995924 123325064 142166621
38952 142166621 164863553 191917010 223814053 260337949 300055469 339508655 372074711
38945 372074711 388821806 383065200 355444604 314031805 268945734 227023480 190948180
38938 190948180 161238730 137475205 118421127 102679697 89608623 79064192 70485298
38931 70485298 62972089 56135380 50146394 45003551 40418299 36381916 33145298 30571734
38923 30571734 28141222 25689813 23542315 21805090 20157779 18527939 17325682 16691548
38915 16691548 16086843 15052584 13915465 13263546 13059138 12773918 12200051 11639824 11351161
38906 11351161 11206205 10941325 10490635 10034779 9864659 10159277 10758284 11209855 11184816
38897 11184816 10806430 10466410 10362195 10303838 9942338 9147530 8206204 7627496 7650167 7980144
38887 7980144 8153199 8072888 7965891 7914190 7810717 7775189 8156456 8971801 9759019 10201407
38877 10201407 10512208 10947640 11350152 11531723 11739288 12288556 13014495 13568962 14054048
38868 14054048 14846173 15923734 16895974 17650910 18470431 19501073 20603092 21769163 23200236
38859 23200236 24867799 26493718 28133838 30302820 33259046 36583162 39797243 43087553
38851 43087553 47090931 52239836 58658234 66469842 75838758 86879130 99911728 115723993
38843 115723993 135249970 159045956 187170424 218856681 251110895 277472329 289653620
38836 289653620 282342890 257282793 222434137 186763901 155522805 129704835 108555863
38829 108555863 91532568 78239976 67851016 59445600 52646600 47401796 43283954
38822 43283954 39521437 35780580 32491553 30174638 28683222 27346426 25726892 23996905
38814 23996905 22580446 21621211 20898437 20185154 19552246 19242373 19291741 19424649 19396965
38805 19396965 19312618 19433591 19755307 20017933 20182251 20646894 21812415 23561674 25387144
38796 25387144 27013946 28710782 30919490 33703293 36696077 39601291 42651623 46493639
38788 46493639 51604121 57875386 64844421 72337169 80825554 91107346 103693567 118633729
38780 118633729 135978754 156284490 180530697 209639055 244174095 284000609 326984781
38773 326984781 367125308 394678612 400251854 380686743 341542052 293609766 246674732
38766 246674732 205826452 172034093 144502595 122174606 104106543 89514135 77722885
38759 77722885 68048314 59905027 53063751 47488938 42816865 38355016 33815557 29719135
38751 29719135 26744828 24875156 23474579 22038176 20539060 19147549 17951918 16954282
38743 16954282 16065425 15065389 13781840 12350374 11131991 10343652 9912550 9697284 9671827
38734 9671827 9820366 9981766 9912511 9495133 8862392 8310910 8041018 7946596 7729045 7268659
38724 7268659 6784585 6530900 6430789 6159617 5546844 4754615 4071336 3647506 3434673
38715 3434673 3292034 3151246 3116422 3330359 3677151 3754359 3315119 2656242 2354338 2633826
38705 2633826 3193197 3649081 3920743 4122643 4316602 4522781 4821189 5263405 5744543
38696 5744543 6096235 6279654 6393179 6511737 6599415 6582262 6459777 6327689 6279210 6269780
38686 6269780 6131681 5801064 5488223 5496748 5880832 6412878 6868020 7140930 7076737 6501162
38676 6501162 5589715 4911014 4784320 4794147 4350504 3630768 3460885 4179461 5128518 5530938
38666 5530938 5418148 5268607 5105006 4587812 3883614 3728465 4418041 5274814 5471419
38657 5471419 5020736 4570034 4487741 4609095 4770313 5127035 5849320 6794868 7607191 7997093
38647 7997093 7924854 7680903 7770988 8491981 9561476 10339704 10476367 10212868 10046636 10265429
38637 10265429 10822728 11478976 12007746 12407829 12939721 13811757 14849752 15678490 16224135
38628 16224135 16790149 17613899 18649493 19884596 21535099 23685879 25978391 27961459
38620 27961459 29669085 31632784 34385261 38128247 42810504 48308978 54501320 61304625
38612 61304625 68746289 77042952 86643341 98123991 111907938 128113227 146838890
38605 146838890 168588537 194250433 224658611 260104378 299507620 338900906 370588395
38598 370588395 385340848 377436571 348562702 306827879 261817473 220135449 184374650
38591 184374650 154660740 130369189 110808663 95158556 82404016 71669972 62643909
38584 62643909 55412414 49758356 44923575 40304458 36044005 32529938 29576980 26634172
38576 26634172 23650741 21134725 19329863 17878511 16407451 14961823 13706169 12632281
38568 12632281 11740403 11112314 10614977 9902305 8911200 8009928 7459354 7079473 6658646
38559 6658646 6308008 6115110 5793739 5057857 4120029 3463734 3266470 3334972 3457931 3533331
38549 3533331 3472703 3265925 3072580 3034474 3084475 3111626 3161808 3259783 3198171 2787820 2225505
38538 2225505 1935835 2078037 2425716 2697328 2807656 2829212 2889237 3076362 3298403 3290703
38528 3290703 2923335 2432322 2173886 2209246 2309276 2306843 2225944 2067472 1695326 1045819
38518 1045819 348675 24259 318709 1022799 1590163 1631956 1306990 1122278 1343208 1743576
38508 1743576 1969840 1980070 2027991 2335371 2871447 3385440 3633068 3643701 3701161 3921239
38498 3921239 3979341 3531993 2799296 2338676 2279012 2240347 2034723 1890601 1842144 1518431
38488 1518431 861433 472025 778453 1344200 1528655 1407450 1420404 1445208 943073 -104204
38478 -104204 -1058926 -1430356 -1306709 -1006667 -757326 -687924 -721325 -516496 102558 773171
38468 773171 1042419 1008577 1047192 1105743 857032 411258 229430 390191 586132 799173
38458 799173 1272059 1792201 1771035 1186988 730065 794568 1001329 952152 781075 675184
38448 675184 519198 356414 560543 1166690 1636831 1678484 1678376 1902447 1932308 1447177
38438 1447177 949221 1057257 1582510 1966880 2174339 2438864 2543454 2136367 1473944
38429 1473944 1073029 839642 313459 -378463 -607424 -235648 224904 464147 676991
38420 676991 954468 1070904 1029255 1181956 1593971 1835727 1643646 1303577 1130805 985160
38410 985160 558690 -172570 -973880 -1549704 -1609278 -1056214 -232017 321724 422837 289302
38400 289302 41821 -419567 -1000458 -1339756 -1284035 -1011463 -567804 231304 1233894 1791080
38390 1791080 1497169 712274 35825 -378224 -657187 -748371 -568538 -349652 -367667 -471171
38380 -471171 -299771 121049 405320 397138 357559 503421 667360 551759 145008 -246514
38370 -246514 -332785 -155954 -59448 -298119 -703854 -872671 -692051 -478899 -511237 -646211
38360 -646211 -573733 -274404 -13486 17464 -136398 -316829 -380242 -265786 -72610 -8213
38350 -8213 -154402 -374070 -545095 -739939 -1018419 -1195506 -1056834 -738641 -642225 -941939
38340 -941939 -1359555 -1480921 -1180800 -698581 -377146 -342977 -382689 -151246 430055 1018236
38330 1018236 1184476 881015 462692 250274 214063 149488 25110 -13559 48415 -5525
38320 -5525 -314827 -701042 -934986 -1127585 -1545396 -2043870 -2082625 -1494113 -880958 -908171
38310 -908171 -1443613 -1804776 -1703914 -1489484 -1490009 -1590404 -1551582 -1353900 -1076458 -755004
38300 -755004 -504989 -502854 -699323 -800289 -660773 -460538 -378083 -342106 -236929 -122996
38290 -122996 -116014 -228491 -411890 -581303 -595879 -441456 -374904 -564293 -667319 -225322
38280 -225322 550291 948535 781358 604559 751140 844241 597303 395833 591513 839380
38270 839380 718344 455710 388701 230531 -365043 -947044 -844503 -309940 -182259 -559424
38260 -559424 -711397 -290334 251176 528623 674025 754349 545617 150247 108117 554058
38250 554058 901221 725570 388216 382751 587743 625557 553832 725772 1221680 1794687
38240 1794687 2177677 2171027 1660051 813664 77015 -237955 -197022 -15703 138858 81082
38230 81082 -259322 -525822 -195708 665962 1338001 1329180 902341 516103 243320 22031
38220 22031 -37613 27135 -112510 -486833 -570000 -83438 424817 376452 88815 205831
38210 205831 560330 437873 -176656 -484026 -93860 391201 268786 -365509 -929921 -1144285
38200 -1144285 -1165543 -1180623 -1156204 -928484 -433255 113463 323718 67233 -302162 -353152
38190 -353152 -107363 86393 104265 156719 378840 622285 688097 530021 207519 -176669
38180 -176669 -514279 -822192 -1248906 -1798253 -2211343 -2316028 -2266918 -2188610 -1880312 -1248617
38170 -1248617 -724149 -738253 -1037413 -1112310 -1086015 -1438343 -1963559 -1887626 -1137959 -594885
38160 -594885 -738678 -885456 -320796 504776 637511 20054 -533904 -534491 -274654 -154969
38150 -154969 -176062 -188570 -161418 -45536 280331 750311 1020956 811730 252888 -194228
38140 -194228 -155819 300093 719966 733283 443559 237994 275472 402613 537360 765387
38130 765387 978641 846182 364304 33470 169213 393631 201788 -282639 -580361 -616361
38120 -616361 -648226 -598610 -100250 766607 1382446 1403101 1167694 1069175 970753 574310
38110 574310 23711 -254401 -128615 169150 448577 701789 858338 706022 159231 -568062
38100 -568062 -1155174 -1430049 -1354697 -878092 18857 1115700 1945796 2139249 1755507 1179053
38090 1179053 701329 325853 -15904 -245186 -249049 -86512 73340 166366 258037 385183
38080 385183 490017 508714 444881 351594 272090 170591 -72534 -497474 -880542 -864821
38070 -864821 -353507 360739 929727 1240300 1280825 965979 321433 -336041 -677867 -729697
38060 -729697 -735891 -790417 -868537 -1079131 -1510812 -1872424 -1690133 -944873 -196004 28875
38050 28875 -291526 -851346 -1347832 -1531522 -1270716 -773573 -493908 -611222 -811960 -762038
38040 -762038 -558879 -487536 -543517 -481499 -205897 148634 429084 521785 302668 -206097
38030 -206097 -688278 -803134 -592346 -398666 -394900 -415753 -258627 68222 418311 622140
38020 622140 512431 59765 -464653 -680322 -527713 -299533 -167346 61476 542973 992453
38010 992453 960420 401301 -292453 -763415 -943869 -873377 -563533 -130165 181923 253248
38000 253248 213291 193166 127543 -29589 -56606 293488 833823 1002023 485695 -371007
37990 -371007 -911470 -834723 -420650 -157838 -281790 -688305 -1161760 -1542557 -1676638 -1392732
37980 -1392732 -720852 -68297 85806 -249919 -562272 -516034 -394016 -605218 -1002401 -1089588
37970 -1089588 -772493 -425862 -231193 36881 463175 766109 849598 1062434 1552383 1849135
37960 1849135 1588681 1244626 1500150 2158277 2412830 2119023 2007327 2486561 2971517
37951 2971517 2772487 2082162 1580730 1443871 1307262 1045837 1019632 1447085 1927991 1849974
37941 1849974 1155592 485915 480187 1041219 1499576 1520536 1518219 1912979 2294928 1860074
37931 1860074 598743 -552781 -883113 -677098 -556597 -574391 -401195 -38439 181552
37922 181552 135808 3836 -85947 -126610 -31258 272425 580905 576695 250256 -103593 -278282
37911 -278282 -287181 -155430 129140 462962 688019 820768 1004830 1247333 1402067 1375950
37901 1375950 1162756 765817 316288 136336 376317 702896 715239 578581 791202 1336776
37891 1336776 1591621 1207751 593972 273944 199709 38861 -207651 -295938 -243120 -316446
37881 -316446 -570922 -737381 -601525 -260719 42062 184642 224810 280299 372608 380774
37871 380774 203744 -39664 -102132 74826 294749 408351 487958 597652 588022 287476
37861 287476 -241054 -786847 -1202368 -1384264 -1208208 -692803 -116054 252652 470445 771612
37851 771612 1167204 1422284 1414314 1279011 1148143 948195 586263 212481 124261 393961
37841 393961 713306 725953 496912 488821 971303 1606000 1823198 1508777 1040792 696956
37831 696956 393120 74675 -33343 214004 579503 759014 762744 749700 729434 681803
37821 681803 713559 804556 671977 237171 -55725 170643 573170 564539 257638 299696
37811 299696 825703 1253052 1188647 871829 548072 83807 -490766 -701260 -336943 97406
37801 97406 141003 117216 534229 1140027 1250740 770281 187901 -287632 -848922 -1360651
37791 -1360651 -1282865 -522591 295929 710452 1000939 1518419 1949064 1769754 1112221 625957
37781 625957 629696 874902 1063601 1124225 966844 443871 -272862 -626256 -232111 672700
37771 672700 1503259 1893095 1863177 1633070 1489310 1704641 2300322 2893829 3029898 2730684
37761 2730684 2523720 2831043 3516676 4200516 4869840 5916335 7559628 9446345 10899704
37752 10899704 11426792 10922652 9573603 7765757 6018430 4766878 4094294 3729612 3346266
37743 3346266 2823823 2220187 1588989 923893 281150 -137414 -131716 244138 678566 948854
37733 948854 1186692 1617231 2062624 1980677 1132032 -14930 -765299 -931952 -841417 -738732
37723 -738732 -538639 -179553 123473 131359 -135833 -510218 -891278 -1217847 -1399656 -1438410
37713 -1438410 -1481765 -1592000 -1567558 -1163553 -430706 289551 649819 506679 -11749 -514854
37703 -514854 -575682 -154686 279894 241073 -232084 -688527 -825290 -701571 -460957 -135190
37693 -135190 228646 491753 577959 546489 447814 259676 16367 -167335 -276775 -447120
37683 -447120 -735061 -955631 -837405 -278185 561049 1303871 1521604 1054678 236514 -374696
37673 -374696 -554292 -538969 -571515 -579383 -428184 -225707 -148564 -156855 -115714 -37452 50319
37662 50319 320507 903972 1504909 1612407 1142572 588030 447177 732241 1118531 1346194
37652 1346194 1343001 1142298 861376 672625 663835 777447 955650 1250743 1691012 2107743
37642 2107743 2213176 1849316 1120732 324047 -215447 -315047 -53936 267399 353477 154060
37632 154060 -97936 -91392 277642 783393 1053182 914751 546779 261434 195528 274438
37622 274438 400476 542964 662120 687355 608694 486942 335446 92202 -224834 -409948
37612 -409948 -218701 361064 1031730 1425844 1449438 1360042 1451267 1694622 1801992 1620019
37602 1620019 1280722 932077 572172 286932 372068 930092 1539605 1681322 1386046 1087649
37592 1087649 912459 577587 38554 -258977 5816 544521 859697 838452 688855 559838
37582 559838 520138 676443 973156 1049976 658224 113741 -22888 317845 630595 506510
37572 506510 83492 -264313 -446653 -704307 -1215889 -1763470 -1846467 -1208786 -232925 391798
37562 391798 464705 474013 830061 1211917 1032851 334459 -245620 -319344 -92286 155010
37552 155010 451393 851837 1175946 1260610 1185248 1039473 728493 226401 -215518 -361237
37542 -361237 -310589 -292332 -296525 -161953 99162 339121 570393 940380 1384925 1544042
37532 1544042 1138964 325886 -417010 -717023 -569279 -194139 270116 802618 1224755
37523 1224755 1137554 391577 -503125 -802615 -400483 73028 105974 -148411 -372400 -658925
37513 -658925 -1155853 -1498900 -1216185 -567015 -328960 -680185 -905192 -444483 309535 645988
37503 645988 526319 430718 487627 348637 -119476 -568591 -710237 -676244 -647030 -502838
37493 -502838 -128599 219537 200101 -108818 -303320 -164157 209676 688196 1188293 1477445
37483 1477445 1281979 722509 339711 493566 943285 1190754 1038821 621283 86509
37474 86509 -474290 -894090 -1006200 -851322 -628138 -456265 -328966 -241573 -204265 -177986
37464 -177986 -154676 -245958 -538201 -926557 -1246363 -1473660 -1618465 -1549929 -1182840 -745947
37454 -745947 -572725 -662205 -722795 -615928 -466696 -368508 -300870 -329683 -543595 -778552
37444 -778552 -771446 -617019 -671203 -946656 -1060899 -897662 -810640 -960268 -982830 -658216
37434 -658216 -402499 -632172 -1055876 -1140102 -952655 -941774 -1102424 -1015590 -633788 -385638
37424 -385638 -445724 -469062 -187169 215491 488294 655893 780534 749468 517315 266121
37414 266121 115252 -85429 -482816 -944803 -1221346 -1213991 -984560 -697697 -635128 -993221
37404 -993221 -1512412 -1586588 -992205 -311580 -336817 -1134819 -1966318 -2130770 -1678165 -1216729
37394 -1216729 -1165702 -1353060 -1355316 -1072956 -774777 -609179 -386860 -13882 177711 -100363
37384 -100363 -493288 -358520 318922 868820 872654 654940 645192 742513 659616 500268 539723
37373 539723 672672 549185 154924 -168683 -260458 -314437 -472367 -575956 -453357 -215722
37363 -215722 -111119 -217696 -419945 -622635 -859095 -1159487 -1383988 -1305099 -919665 -573045
37353 -573045 -605549 -921075 -1116886 -1023702 -839634 -692698 -434728 -44567 133229 -122672
37343 -122672 -467578 -450107 -228747 -356123 -916885 -1391058 -1456294 -1428371 -1649334 -1834497
37333 -1834497 -1436594 -482087 368929 612714 433440 331752 464242 570870 449197
37324 449197 232409 144203 197047 279276 374719 482359 434355 75385 -412604 -670482
37314 -670482 -668670 -719097 -900885 -861183 -388384 196287 535267 787830 1265971 1769852
37304 1769852 1797342 1301373 722620 292974 -161554 -649184 -801608 -492221 -214799 -465079
37294 -465079 -1016081 -1196142 -767679 -204140 -114085 -614431 -1277350 -1545188 -1193089 -481230
37284 -481230 134633 442899 558596 601374 497163 196932 -87340 -43866 406179 1040025
37274 1040025 1518206 1562055 1078554 258485 -504812 -903175 -893813 -585698 -104112 345126
37264 345126 470816 171244 -263982 -422724 -221235 53561 114840 -59018 -308302 -487684
37254 -487684 -549235 -523286 -442325 -262227 81644 501695 763305 761410 656638 590935 429355
37243 429355 27620 -371466 -359014 18661 209140 -163933 -851168 -1340011 -1395442 -1088991
37233 -1088991 -596343 -213322 -285634 -766552 -1048159 -650299 36451 150651 -518641 -1284854
37223 -1284854 -1511364 -1318628 -1157051 -1143583 -1143072 -1132443 -1103744 -894774 -497584 -261582
37213 -261582 -373415 -420061 9355 537311 470992 -76170 -306403 -14828 97798 -342894
37203 -342894 -662922 -175312 719301 1140971 988117 877819 1118712 1447505 1629368 1644063
37193 1644063 1337497 538788 -438868 -993563 -1006627 -905044 -911922 -810823 -571241 -591064
37183 -591064 -1042416 -1499976 -1568823 -1460894 -1575344 -1849238 -1919034 -1680075 -1315715 -951843
37173 -951843 -622783 -451595 -551584 -801458 -931926 -785720 -382537 132992 501293 508648
37163 508648 279256 192048 364487 480352 306683 67158 29225 23947 -247749 -644720
37153 -644720 -729685 -373049 142087 529384 690204 600312 352710 230443 380370 483939
37143 483939 137225 -478540 -725939 -343178 270645 692912 970370 1272642 1436249 1194402
37133 1194402 664997 286033 313658 599785 848669 925520 885451 805336 659106 367173
37123 367173 -55713 -462530 -708821 -755041 -605301 -275762 84167 200234 -10494 -245644
37113 -245644 -163895 146102 285854 98189 -168185 -262835 -230814 -208710 -144813 111554
37103 111554 531476 838100 730721 202369 -346060 -424980 8129 469890 561697 475398
37093 475398 617551 889237 755288 39189 -748445 -1001533 -641641 -28522 476272 710621
37083 710621 718559 724971 933651 1234473 1278392 921889 402341 7735 -189346 -188795 52818
37072 52818 431092 648478 569294 414539 408207 438183 291629 36580 -92478 -56062 2957
37061 2957 48606 183275 422275 637954 731063 726136 704948 723997 759417 696033 460608
37050 460608 189451 122196 300257 552972 807404 1148791 1493715 1526655 1153030 729105
37040 729105 605148 694884 740705 721225 682319 445704 -91262 -546309 -394879 338493
37030 338493 1097218 1430391 1282776 792278 230920 46729 452824 965673 857733 148697
37020 148697 -348640 -104258 504357 847033 819699 644835 339251 -156742 -587454 -595635
37010 -595635 -238868 63405 49406 -183834 -416662 -484126 -296559 53416 260382 131434
37000 131434 -111460 -106829 123296 217646 25072 -229854 -407673 -732631 -1390447 -2095376
36990 -2095376 -2360417 -2094398 -1637732 -1225818 -733950 -75946 426405 367273 -152725 -584734
36980 -584734 -623774 -539742 -667775 -864358 -786330 -530840 -560377 -955789 -1151403 -632197
36970 -632197 358653 1063949 1032921 476651 -109850 -444528 -561995 -600216 -588768 -432839
36960 -432839 -79227 345703 631255 693096 585379 331705 -74930 -480131 -610215 -428745
36950 -428745 -243635 -286750 -380290 -256128 -46626 -140972 -599029 -1019222 -1043908 -759042
36940 -759042 -519869 -576537 -943142 -1440273 -1751059 -1589120 -958693 -188004 368557 598925
36930 598925 593399 484661 402451 443147 561589 594423 502440 471169 620578 740148 554814
36919 554814 203803 143526 478078 682115 245277 -584304 -1044098 -827758 -459143 -556539
36909 -556539 -1020544 -1232283 -890046 -313029 50911 89250 -71655 -327396 -589494 -722002
36899 -722002 -676739 -573420 -499164 -349109 -16069 372085 556667 399352 -78918 -751871
36889 -751871 -1328403 -1440281 -1040067 -555338 -368880 -315927 -65043 165074 -180841 -1029740
36879 -1029740 -1515683 -1048231 -95025 452739 345213 373 -262325 -519646 -854350
36870 -854350 -1106310 -1080686 -738634 -162848 445828 769145 622223 207186 -97077 -168254
36860 -168254 -138983 -36363 247435 610822 719906 450257 75722 -113535 -134784 -127574
36850 -127574 -110431 -111403 -309069 -792017 -1312342 -1506234 -1284234 -836714 -354907 66973
36840 66973 340503 417247 410218 509641 742442 914293 813427 424553 -46150 -332608
36830 -332608 -342319 -252129 -310778 -543274 -739431 -714668 -444247 22314 550920 823369
36820 823369 555704 -75651 -522166 -528325 -399769 -421581 -392777 -86197 168033 -139697
36810 -139697 -897584 -1436405 -1345872 -816283 -213636 274458 589120 792014 1090027 1491632
36800 1491632 1523965 784038 -267748 -660695 -159111 433327 397139 -64595 -389553 -479291
36790 -479291 -547748 -617184 -625068 -678188 -787097 -694532 -372235 -302852 -789761 -1360745 -1418452
36779 -1418452 -1149755 -1142495 -1370175 -1310123 -936575 -787497 -999862 -1059284 -708337 -401377
36769 -401377 -535111 -812700 -765232 -454004 -259837 -327458 -583846 -993495 -1419641 -1496353
36759 -1496353 -1039638 -417120 -145147 -232931 -254403 15536 363731 516979 464949 349023
36749 349023 235749 96044 -81768 -218935 -174797 133805 628656 1118795 1441378 1512204
36739 1512204 1318421 993808 821233 949907 1144258 1051330 708012 515654 693893 1052607
36729 1052607 1345129 1512566 1492564 1164295 659553 364598 367976 238993 -348104 -1068905
36719 -1068905 -1375622 -1224199 -995607 -883277 -772633 -618618 -525348 -470175 -309515 -70354
36709 -70354 85374 203790 520885 1031228 1371569 1271414 910360 679910 714379 782295
36699 782295 598089 177026 -136742 -44470 301056 398847 -15131 -637346 -961692 -796946
36689 -796946 -271471 442404 1126182 1414108 1073611 368242 -159886 -271361 -143152 38358
36679 38358 256324 424123 349106 77384 -31768 232713 635113 856683 937366 1072507
36669 1072507 1105092 602055 -462282 -1390202 -1410779 -573764 295091 587083 542749 680285
36659 680285 929551 817897 361639 127361 294664 302547 -244652 -886575 -985455 -607566
36649 -607566 -165785 363689 1126239 1608936 1083314 -207739 -1174608 -1336856 -1354516 -1843378
36639 -1843378 -2438132 -2495676 -2101235 -1789896 -1685564 -1495134 -1094312 -596882 -20202 637532
36629 637532 1101074 1054997 647062 362971 382143 407121 207550 28625 283206 992490
36619 992490 1707838 1972899 1764073 1426438 1228127 1108899 911725 692581 634891 771403
36609 771403 986055 1202133 1379494 1448299 1454130 1580671 1755070 1503612 633218 -222827
36599 -222827 -353666 -53514 -180072 -742146 -897820 -469283 -351235 -966610 -1392090 -787757
36589 -787757 194709 403387 -74181 -234228 211394 629651 674801 628019 565840 192276
36579 192276 -390183 -628274 -407329 -203138 -177396 84830 692615 1079105 871845 473344
36569 473344 391351 574879 802147 1164046 1701147 2030787 1835081 1390851 1187938 1302702
36559 1302702 1513382 1734513 1946822 1954941 1617378 1146946 851576 726402 570929 341005
36549 341005 137218 11024 -13699 81144 148522 -37138 -362782 -392219 -44113 126167
36539 126167 -325167 -1039648 -1330836 -1065668 -620363 -200146 278884 758439 992460 913057
36529 913057 661758 324932 -4284 -47955 311939 620208 319660 -380130 -677840 -311143
36519 -311143 75550 -82768 -471738 -462005 -40474 308077 388552 437900 543623 405716
36509 405716 -176951 -885119 -1156383 -786547 -137992 206477 -52700 -705891 -1230040 -1230390
36499 -1230390 -767352 -281699 -166038 -381213 -524901 -310997 79882 223254 -14105
36490 -14105 -320068 -360462 -199239 -178377 -474033 -899997 -1112368 -923435 -454892 -41774
36480 -41774 78150 35188 199369 707037 1211917 1206178 521766 -543189 -1476176 -1851184
36470 -1851184 -1546928 -837336 -187661 154945 286575 328064 214924 -45548 -177134 16736
36460 16736 300263 335490 219907 311710 603075 694516 405442 -1804 -270653 -407338
36450 -407338 -367887 72366 878601 1537118 1604462 1250617 963130 909636 897261 791627
36440 791627 633595 446218 269147 316946 728932 1161835 1044496 374852 -107077 196589
36430 196589 942821 1253075 771379 -24330 -517239 -585773 -453510 -250379 26137 307595
36420 307595 493181 616117 741086 760599 544091 249308 187272 352335 409105 238920
36410 238920 141420 283610 297608 -212778 -1000118 -1442844 -1383261 -1244197 -1291291 -1231776
36400 -1231776 -731944 2456 432818 308845 -135385 -521730 -696934 -779422 -914497 -988914
36390 -988914 -659988 192949 1103527 1360575 788611 -35434 -459952 -442141 -394208 -557695
36380 -557695 -810537 -1018027 -1259239 -1584376 -1732836 -1326652 -397010 431943 490651 -171023
36370 -171023 -767546 -672392 -149292 58580 -270272 -618122 -502798 -45377 393388 756497
36360 756497 1160098 1471209 1393035 906917 347266 46406 97283 419881 848218 1156950
36350 1156950 1192884 1017062 803037 605330 344489 -3949 -339274 -556352 -633845 -603111
36340 -603111 -505283 -364619 -164157 84875 219064 31026 -380289 -562255 -256374 135528
36330 135528 -40151 -823318 -1511443 -1491898 -925391 -445014 -408962 -666942 -899461 -923099
36320 -923099 -721378 -424551 -281307 -453199 -788792 -972328 -953631 -1037683 -1426780 -1870521
36310 -1870521 -1999137 -1875763 -1905479 -2213054 -2464311 -2421114 -2327068 -2482738 -2703593 -2553630
36300 -2553630 -1968544 -1277681 -686946 -131294 366964 598507 507405 278860 3315 -378379
36290 -378379 -696064 -562463 6740 396881 137231 -497078 -950510 -1103712 -1120780 -915989
36280 -915989 -314150 438885 865077 875239 729793 482856 1293 -508782 -594666 -263127
36270 -263127 -35088 -140710 -194120 110234 490421 564723 390862 177821 -114457 -474101
36260 -474101 -507860 76883 876703 1164901 752282 80895 -409913 -586361 -394692 170000
36250 170000 819502 1113813 964535 687025 472276 128722 -530802 -1344495 -2009564 -2397259
36240 -2397259 -2506137 -2339965 -2033849 -1894512 -2047942 -2161337 -1799470 -1047155 -515474
36231 -515474 -626426 -1061540 -1087003 -384173 587846 1100800 928475 505042 348618 477529
36221 477529 482066 83068 -524023 -900068 -850594 -623797 -616427 -899747 -1099112 -826197
36211 -826197 -204372 179974 -96679 -844469 -1509010 -1726647 -1512563 -1062397 -606422 -399380
36201 -399380 -580793 -959945 -1102101 -733279 -5406 653183 879424 603484 80722 -277958
36191 -277958 -227581 110201 422120 545121 531473 441445 273220 105037 82445 181310
36181 181310 177674 -26259 -215492 -158754 37345 60328 -178172 -417447 -356585 26420
36171 26420 471261 665741 472841 -935 -525600 -927690 -1137356 -1105044 -792677 -289551
36161 -289551 166089 366859 303416 127730 8183 20087 81817 4180 -260152 -432451
36151 -432451 -197599 282096 443104 68375 -358091 -338664 -124677 -343413 -1002466 -1405267
36141 -1405267 -1131301 -606908 -469066 -742526 -966033 -878042 -626347 -430246 -363190 -428852
36131 -428852 -571768 -599093 -328192 129727 409148 284545 -95646 -420910 -550766 -564306
36121 -564306 -563784 -529639 -368453 -55319 295382 505171 474552 245430 -63165 -350922
36111 -350922 -571982 -698847 -637507 -190428 761472 1920605 2552345 2080627 739582
36102 739582 -585686 -1213604 -1150610 -733651 -182150 306663 409875 23448 -455261 -587151
36092 -587151 -499960 -636420 -996924 -1107440 -763853 -341297 -232625 -393522 -634902 -979253
36082 -979253 -1440490 -1742011 -1588563 -1064789 -501367 -75347 223807 364301 274947 22375
36072 22375 -232852 -433994 -625099 -792739 -853055 -762081 -534820 -207907 138996 405740
36062 405740 572182 657478 552789 116652 -471801 -736520 -484219 -110416 -73759 -305173
36052 -305173 -460192 -541207 -843554 -1370657 -1723669 -1600916 -1096175 -504496 -122925 -199774
36042 -199774 -737312 -1349720 -1654379 -1790117 -2176126 -2777344 -3078341 -2861969 -2507369 -2321644
36032 -2321644 -2070626 -1490693 -839455 -515887 -429064 -188221 258125 583470 573104 283350
36022 283350 -205550 -819960 -1286112 -1242940 -655556 86548 524846 448151 -74196 -744937
36012 -744937 -1156214 -1114406 -891339 -941883 -1321582 -1586782 -1361215 -828905 -517297 -661264
36002 -661264 -921783 -781394 -167820 429109 543033 316880 266470 478773 401972 -383411
35992 -383411 -1501624 -2210082 -2270709 -2007841 -1643869 -1067160 -305528 235188 244258 -55450
35982 -55450 -184192 20641 283388 253338 -130855 -575491 -675707 -314329 153552 227753
35972 227753 -205738 -801168 -1205923 -1386008 -1450438 -1386995 -1135464 -786064 -544673 -554989
35962 -554989 -816469 -1170639 -1322662 -1056096 -544471 -276804 -498664 -860753 -828091 -349027
35952 -349027 107083 144168 -149511 -400444 -356493 -28444 410664 767114 969249 1148266
35942 1148266 1488369 1931455 2146113 1902029 1370577 886669 484186 -85098 -833715
35933 -833715 -1319875 -1154744 -556612 -120271 -98896 -219529 -228346 -256438 -449652 -538629
35923 -538629 -140796 609174 1091353 927096 416759 134711 273894 554420 678694 676609
35913 676609 756058 942615 1024330 885733 755018 956337 1463965 1907241 2041500 1989687
35903 1989687 1942378 1882366 1774800 1766142 1919472 1957054 1607905 1087151 866910 1030081
35893 1030081 1214332 1173381 1007410 807412 484690 81541 -122599 -9809 170233 185357
35883 185357 138354 193044 239019 75382 -262029 -589301 -841857 -1052713 -1194209 -1214644
35873 -1214644 -1123386 -936989 -699112 -611629 -874290 -1279703 -1307077 -824005 -335910 -251029
35863 -251029 -281651 6090 401188 380328 15445 -100660 210155 487608 427896 299054
35853 299054 359146 395890 153862 -196893 -354769 -333885 -313027 -322372 -379912 -652610 -1126121
35842 -1126121 -1356859 -965489 -229873 217977 195447 71266 117763 192647 110815 -76178
35832 -76178 -296834 -594091 -872017 -840762 -446520 -74760 -54663 -211451 -235627 -264245
35822 -264245 -635995 -1162317 -1185178 -503073 217714 254629 -254100 -556032 -272247 231538
35812 231538 418605 194723 -118150 -189827 33458 314107 322861 -66834 -667570 -1209041
35802 -1209041 -1599150 -1845293 -1851002 -1527259 -1047438 -733749 -703163 -868911 -1237939 -1848778
35792 -1848778 -2387210 -2301224 -1505233 -625639 -291380 -463803 -724237 -908591 -1081053 -1118192
35782 -1118192 -791123 -197673 298357 572810 836411 1175999 1317903 969329 197664
35773 197664 -606314 -1008848 -807081 -231126 147583 -44023 -515030 -627384 -196219 316001
35763 316001 479377 440573 575572 859140 911823 593980 228171 143239 222014 91891
35753 91891 -327618 -703563 -765625 -673256 -715068 -815835 -661215 -251299 52880 83093
35743 83093 56022 86384 -25319 -264828 -170370 426889 876366 539471 -173670 -338544
35733 -338544 74495 154051 -530629 -1283468 -1343063 -895703 -599397 -616813 -604210 -330785
35723 -330785 115127 528967 704623 548370 266226 163749 124619 -290195 -1001040 -1188294
35713 -1188294 -346051 864862 1355547 921744 288583 58689 173938 318308 315835 113950
35703 113950 -207710 -394744 -315225 -242844 -505334 -951941 -1161641 -1081746 -1007684 -983024
35693 -983024 -721449 -164988 357464 624046 742040 786828 669407 496055 597728 995678
35683 995678 1261660 1141230 892997 732892 396567 -328711 -1021374 -1115647 -747413 -543592
35673 -543592 -666997 -657459 -269877 113573 140858 71266 310550 685986 662104 168830
35663 168830 -242815 -134027 293114 539160 391002 -21180 -497597 -843805 -857173 -543437
35653 -543437 -244944 -246706 -322828 -11630 689399 1291354 1505786 1524313 1480411 1137388
35643 1137388 431307 -120922 -46015 328532 280743 -263480 -625751 -331029 301140 641571
35633 641571 461938 2681 -398124 -576546 -605277 -689676 -906414 -1054967 -902732 -514545
35623 -514545 -151208 74621 193812 115713 -301011 -901058 -1267296 -1173919 -773695 -314657
35613 -314657 81380 347893 453062 491980 576572 643906 600014 568957 697852 830704
35603 830704 767610 713866 937729 1066286 425773 -818372 -1621547 -1448774 -966318 -908306
35593 -908306 -989368 -622747 -114863 -240348 -921709 -1245429 -767316 -20381 371385 396219
35583 396219 279920 6275 -476701 -972155 -1245524 -1277724 -1158247 -979624 -925070 -1144175
35573 -1144175 -1419573 -1288011 -671087 -88778 -37547 -415172 -786892 -979965 -1130939 -1309156
35563 -1309156 -1411914 -1398153 -1370146 -1377378 -1295624 -963860 -378199 273683 745929 915333
35553 915333 857873 751725 725824 811020 955837 1015171 824464 432634 176407 305229
35543 305229 564536 424039 -217255 -823776 -872213 -482444 -180166 -189527 -243966 -55682
35533 -55682 315538 647220 888944 1133413 1347150 1329236 976984 464966 72334 -104940
35523 -104940 -185479 -301678 -487027 -742434 -1064364 -1365200 -1494674 -1404745 -1184541 -887342
35513 -887342 -479721 -45713 156968 23860 -177361 -159881 -79770 -344918 -977892 -1474032
35503 -1474032 -1382153 -797055 -178853 105357 -50635 -543443 -1060162 -1179329 -744602 -118596
35493 -118596 157180 -13663 -194942 -27911 276027 240788 -206355 -654470 -806173 -848935
35483 -848935 -1069999 -1368847 -1451768 -1344785 -1331527 -1431864 -1362497 -1073665 -881782 -885471
35473 -885471 -674452 73058 1045124 1699231 1912076 1841447 1450847 697276 -13503 -171120
35463 -171120 89873 171530 -45010 -67900 271371 424374 -4242 -568123 -633910 -304634
35453 -304634 -155196 -319834 -402087 -176298 147311 373627 592400 887691 1115200 1122977
35443 1122977 975864 831406 740672 663546 569226 460993 390469 469255 762738 1146195
35433 1146195 1360365 1241134 838684 331388 -90508 -289194 -262738 -176890 -186757 -195065
35423 -195065 77171 695690 1289843 1350873 738958 -181545 -892841 -1138308 -1023349 -834829
35413 -834829 -795575 -876419 -781602 -251073 510011 869644 466935 -256862 -562834 -387821
35403 -387821 -354486 -741939 -1028548 -786018 -462193 -674427 -1124489 -999576 -289716 150825
35393 150825 -66566 -320347 -68766 277866 80446 -524607 -951055 -1075388 -1188491 -1317733
35383 -1317733 -1252904 -1113149 -1252265 -1589398 -1591947 -1035651 -331615 54827 152340 283812
35373 283812 587950 894922 896380 359174 -639241 -1617001 -2017956 -1737024 -1206147 -921460
35363 -921460 -996805 -1187574 -1217663 -1046772 -889091 -961444 -1190301 -1280714 -1125378 -943500
35353 -943500 -892907 -809400 -558935 -361129 -401493 -363436 173636 993787 1419261 1212889
35343 1212889 810744 612335 537917 398672 207605 -65019 -579849 -1224816 -1538889 -1316979
35333 -1316979 -919457 -700952 -516375 -126779 288563 446668 455841 511156 377412 -231108
35323 -231108 -905586 -850395 -19226 646382 366303 -517402 -1037036 -764576 -146874 171249
35313 171249 38922 -186160 -101082 346525 857211 1111277 1064711 898029 746694 600015
35303 600015 444281 347539 339880 322164 185194 -34925 -194220 -209556 -142102 -124423 -229623
35292 -229623 -401612 -504575 -457090 -326588 -283969 -461422 -842039 -1255754 -1478391 -1383590
35282 -1383590 -1034023 -605548 -218841 108081 347835 415399 304207 184488 237437 399843
35272 399843 389892 44235 -430188 -631680 -417809 -109226 -126122 -433326 -537823 -152261
35262 -152261 347881 406847 100214 47345 461456 744378 293609 -647649 -1329515 -1434836
35252 -1434836 -1232456 -948554 -520221 8605 381191 598774 1031266 1758051 2182201
35243 2182201 1724776 679770 -76460 -148924 35844 -19497 -216622 -137934 307454 787486
35233 787486 972335 834139 567342 372637 301110 189687 -227074 -1013399 -1833501 -2179681
35223 -2179681 -1860274 -1203256 -733656 -690176 -891646 -1029413 -1010221 -978449 -1041906 -1076750
35213 -1076750 -895276 -576357 -469173 -765953 -1182214 -1244912 -880844 -519525 -541655 -806712
35203 -806712 -885537 -645262 -381222 -368104 -490342 -423882 -51479 448948 861941 1109444
35193 1109444 1167280 996850 668243 412536 377219 402136 245076 5776 66391 539043
35183 539043 1032962 1121994 802321 295426 -306227 -852856 -871922 -51185 1060257 1428825
35173 1428825 774689 -65814 -238710 151889 482130 540150 529578 487116 278078 13323
35163 13323 -74845 -111271 -427269 -939316 -1176189 -998643 -825269 -982226 -1215837 -1063151
35153 -1063151 -439066 316198 776350 727221 332142 40219 108094 232779 -46319 -626017
35143 -626017 -931878 -750177 -471037 -368268 -170944 361026 920573 1123606 1119970 1269985
35133 1269985 1484597 1386014 967319 599142 426833 213446 -165744 -453914 -378721 -41222
35123 -41222 213213 195956 44026 10643 116178 66342 -378455 -1011003 -1376056 -1353598
35113 -1353598 -1240333 -1199232 -1026693 -646908 -406164 -536789 -693772 -460448 -37234 63592
35103 63592 -180282 -323070 -172967 34273 173915 425234 818295 1026478 795787 275988
35093 275988 -230064 -608816 -910741 -1186486 -1450647 -1671553 -1761917 -1683558 -1499660 -1197258
35083 -1197258 -618161 212273 876902 1007817 780274 608205 514037 246874 -115206 -236418
35073 -236418 -153348 -230717 -429969 -255935 385591 902310 897830 775160 1039567 1468320
35063 1468320 1481285 1011708 487900 150328 -111837 -333321 -342118 -93975 191331 307644
35053 307644 285366 296407 442639 625027 581073 157484 -411505 -672926 -480523 -148136
35043 -148136 18162 88396 247823 427843 443023 311729 192448 131515 85423 68447
35033 68447 80534 5572 -236802 -540824 -749482 -806497 -676170 -321247 106980 304876
35023 304876 219559 156968 292413 382062 226581 77378 191581 289854 -30274 -537407
35013 -537407 -602021 -132999 305182 381295 430320 770961 1085891 875056 232224 -263003
35003 -263003 -331847 -286358 -464433 -680951 -488436 113165 528033 263587 -425960 -860091
34993 -860091 -796797 -625937 -680451 -774384 -628348 -381824 -336627 -431275 -350019 -30025 281626
34982 281626 403997 355478 173205 -111669 -351086 -388415 -269109 -140760 -9460 198128
34972 198128 425490 568162 667045 786792 815704 640061 398427 296277 301159 306553 429916
34961 429916 789363 1129543 1086685 743866 510571 515974 544460 508265 512371 477301 210469
34950 210469 -111246 -62225 314233 422835 -59056 -723790 -1018471 -906472 -746955 -850250
34940 -850250 -1287690 -1784504 -1722188 -712371 701217 1439531 1194838 792226 973615
34931 973615 1429023 1474588 1127052 900367 939026 999319 1026833 1123189 1110918 747402 296564
34920 296564 312275 833528 1270608 1129378 462790 -374897 -1018765 -1161382 -769629 -292465
34910 -292465 -292561 -823891 -1471637 -1949493 -2262168 -2325061 -1933898 -1217398 -662027 -512642
34900 -512642 -528719 -486915 -517103 -726871 -893298 -829155 -728844 -812367 -888790 -644108 -172239
34889 -172239 175069 364061 705107 1299662 1819531 1935928 1693064 1314154 849994 221082
34879 221082 -488756 -980390 -1011851 -634902 -130181 252454 478165 695529 1049074 1493948
34869 1493948 1764270 1567074 895305 152819 -148077 102519 479481 512967 255284 191672
34859 191672 572486 1034218 1031828 531465 56506 38860 339964 533023 478121 375357
34849 375357 323209 158199 -153153 -265547 121326 751023 1048385 826842 444558 234185
34839 234185 108610 -135528 -409015 -453019 -216019 92009 242148 158332 -59617 -182512
34829 -182512 -25341 339163 656048 837186 1065546 1466009 1877833 2095267 2142390 2145796
34819 2145796 2115659 2019366 1876092 1598977 982993 103961 -502054 -393379 199418 682938
34809 682938 842643 907366 1004838 1013099 950490 1066665 1436634 1806757 1941266 1818342
34799 1818342 1431201 768439 114477 -24514 454911 988170 975520 488965 102815 175118
34789 175118 552571 906330 1116163 1283075 1469685 1488201 1019226 39667 -957808 -1407386
34779 -1407386 -1319044 -1201409 -1301482 -1287483 -860103 -307081 -104247 -201547 -112511 374169
34769 374169 949620 1252615 1247360 1069786 800902 535792 442089 552139 639000 495879
34759 495879 249416 180900 267749 159589 -289992 -689626 -539422 95120 597607 510480
34749 510480 1035 -443477 -540763 -304318 127855 502031 473365 -49401 -644715 -761210
34739 -761210 -355120 109264 280284 251909 241980 240234 114324 -136704 -375308 -462712 -349155
34728 -349155 -137462 -53438 -215753 -475597 -647849 -796584 -1034942 -1164744 -899139 -383264
34718 -383264 -23188 217668 787355 1665587 2144877 1846204 1373435 1412236 1633880 1195440
34708 1195440 84061 -794152 -856260 -484076 -268292 -206555 34076 479323 855016 1013894
34698 1013894 1031181 973042 818236 581187 338314 120061 -122758 -424342 -723733 -910871
34688 -910871 -964757 -1015837 -1186637 -1360583 -1250559 -785547 -285552 -96531 -161819 -146626
34678 -146626 93599 398656 630163 863547 1188922 1513346 1674339 1641947 1510504 1348030
34668 1348030 1135705 856223 606113 572044 836343 1223021 1443905 1418207 1320787 1274761
34658 1274761 1161101 827833 333861 -133778 -445160 -524421 -342095 -52737 59459 -35614
34648 -35614 20134 491678 1122691 1460525 1435023 1298899 1151065 902575 627612 541054
34638 541054 636945 720061 791214 1008347 1241650 1109189 585531 169765 236790 545859
34628 545859 631494 429083 261115 362373 628081 755817 546619 157606 40411 437113
34618 437113 974206 1041176 551423 -40608 -482311 -977701 -1551738 -1730118 -1233741 -541462
34608 -541462 -270883 -318164 -141832 325096 630787 584391 495920 569448 565218 246556 -225051
34597 -225051 -562899 -747382 -931783 -1149015 -1304811 -1338296 -1237096 -979521 -588230 -205841
34587 -205841 -41907 -229015 -686452 -1084897 -1052797 -555295 9161 250000 235600 295210
34577 295210 463129 435455 93971 -258193 -298284 -42375 335613 762788 1144493 1246802
34567 1246802 996025 725775 806068 1111253 1161971 754322 142427 -390727 -794012 -1011851
34557 -1011851 -865613 -387758 18821 45390 -100478 -46451 136775 65270 -285706 -469944
34547 -469944 -210250 232453 486403 523141 471232 294933 -48362 -385750 -596912 -892313
34537 -892313 -1445853 -1924544 -1841177 -1301128 -912080 -926691 -968044 -726910 -436037 -397331
34527 -397331 -461252 -334137 -110896 -122090 -414098 -698970 -714856 -400719 147964 669036
34517 669036 837587 622367 382972 383057 423436 258528 126435 410130 911036 988232 442123
34506 442123 -224138 -525677 -529549 -506083 -485329 -440710 -566668 -1007961 -1501016 -1616914
34496 -1616914 -1273578 -754427 -306411 22654 198058 135482 -99995 -217162 55868 698478
34486 698478 1411975 1864095 1897572 1553703 978485 364142 -52960 -83364 214296 503675
34476 503675 502553 331617 381562 820087 1377890 1657562 1523064 1155155 860911 860147 1110675
34465 1110675 1305313 1193173 924086 873453 1090453 1195862 951839 630571 568731 612738
34455 612738 369615 -123145 -377185 -111097 405512 726632 658099 234241 -423092 -1042995
34445 -1042995 -1246650 -900973 -325216 39567 79906 -20741 -134552 -283809 -437624 -462223
34435 -462223 -322523 -157969 -92016 -89911 -49796 86111 349983 741035 1135810 1334127
34425 1334127 1271561 1068108 802080 403937 -103659 -445108 -386882 -74996 162464 271739
34415 271739 465860 796343 1027489 975523 706756 348256 -24816 -258175 -207315 -82484
34405 -82484 -342820 -1019649 -1486362 -1218047 -493424 20275 114121 31823 -146025 -541903
34395 -541903 -984869 -1068196 -778175 -544636 -550698 -512091 -313112 -306940 -675748 -996913 -861736
34384 -861736 -503989 -332996 -213717 188489 592308 335573 -579178 -1319184 -1273472 -766764
34374 -766764 -493371 -656976 -965124 -1153926 -1162286 -960487 -552100 -125832 31341 -174289
34364 -174289 -524781 -665365 -380525 226920 799296 1060399 1112855 1276274 1614032 1815699
34354 1815699 1628530 1186220 754215 364529 -48342 -315359 -183893 227979 474878
34345 474878 369019 218913 317738 466633 297424 -88464 -177039 229546 669558 590732
34335 590732 58698 -347636 -266183 78578 271147 248302 293034 579129 889883 831054
34325 831054 268044 -482395 -901143 -725758 -173603 297848 428476 315530 187021 145795
34315 145795 181399 315313 606763 1026485 1404677 1534514 1340069 980589 771778 905784
34305 905784 1216935 1321998 1043151 595451 304381 264818 361546 472683 502002 341390
34295 341390 3430 -286082 -326608 -207132 -123431 -14801 327115 807199 1025609 817551
34285 817551 480094 301839 154016 -216857 -719360 -1033685 -1067740 -1012351 -1001834 -976260
34275 -976260 -866710 -695679 -482153 -229964 -23748 19199 -102000 -298622 -528456 -753046
34265 -753046 -827974 -653260 -392870 -283664 -224905 136486 829644 1379546 1378801 981153
34255 981153 598547 322437 -63730 -622644 -1119499 -1313256 -1143006 -628903 173158 1070755
34245 1070755 1785581 2187520 2361327 2406004 2288913 1931353 1331915 591819 -72951 -365054
34235 -365054 -131542 387429 683597 446477 -163994 -726649 -939033 -795687 -544962 -500151
34225 -500151 -738938 -958821 -804386 -361640 -88315 -184039 -335512 -266934 -218479 -536611
34215 -536611 -1020421 -1129232 -775079 -450562 -499311 -683717 -662904 -531182 -563771 -646846
34205 -646846 -334069 537841 1540186 2022151 1683243 782914 -111497 -579731 -638358 -611112
34195 -611112 -723937 -904465 -1004568 -1073932 -1271912 -1591273 -1847593 -1933567 -1916328 -1833809
34185 -1833809 -1534981 -843142 152337 1054987 1453335 1263069 781086 393773 240017
34176 240017 182272 65753 -105491 -269120 -430703 -574401 -562208 -301053 38742 170722
34166 170722 63364 -42917 -41899 -150851 -538503 -959406 -1016937 -716677 -492722 -656248
34156 -656248 -1034870 -1228156 -1039976 -570585 -45626 333025 503458 618676 862400 1091012
34146 1091012 878674 118805 -653463 -879835 -760460 -961767 -1566709 -1848255 -1279237
34137 -1279237 -294915 298246 320433 198031 197015 195354 152062 286903 659701 936536
34127 936536 773367 229855 -326874 -572076 -408044 12831 350109 310737 -73955 -487565
34117 -487565 -662865 -565493 -269906 162051 652015 1120544 1554888 1914639 2008214 1689008
34107 1689008 1162176 823123 755640 679185 459897 342968 521189 778047 794458 595607
34097 595607 467446 590719 943104 1399789 1748262 1758457 1417117 963796 571392 168157
34087 168157 -309902 -737064 -1040094 -1360972 -1753139 -1967165 -1802628 -1435346 -1103230 -711004
34077 -711004 -106598 456106 557823 218312 -131548 -228803 -177204 -117353 -50985 15677
34067 15677 54751 118157 199536 102616 -242125 -477814 -249877 176330 215614 -152328 -332713
34056 -332713 -22967 360429 345873 34743 -174612 -104237 217199 750159 1348101 1720374
34046 1720374 1742597 1612430 1521624 1390829 1094870 723378 441173 286415 241989 291766
34036 291766 290319 25977 -454245 -828612 -924522 -890774 -850188 -713912 -482759 -369030
34026 -369030 -423422 -406984 -259963 -305634 -695338 -1043018 -983908 -746394 -744714 -911484 -907340
34015 -907340 -737316 -638697 -539409 -183194 286915 413352 105777 -248132 -411343 -578247
34005 -578247 -907455 -1194828 -1223392 -1130475 -1180735 -1348885 -1345607 -1005045 -511301 -207402
33995 -207402 -198974 -225470 -46614 116642 -182350 -898583 -1396994 -1262736 -824898 -583199
33985 -583199 -516324 -383849 -337766 -645590 -1033827 -941625 -348372 216655 424468 348128
33975 348128 1385 -668678 -1316669 -1411075 -1027565 -777771 -805384 -568573 118888 580363
33965 580363 272861 -336367 -460524 -82619 242078 295064 267569 169395 -185576 -673056
33955 -673056 -887364 -705276 -410189 -233947 -124571 3357 87026 42564 -108504 -238682
33945 -238682 -141892 304548 875347 1111349 897203 674185 811486 1040473 875938 351830
33935 351830 -106291 -351599 -555009 -692312 -550436 -252149 -234500 -587734 -867923 -700498
33925 -700498 -169267 493692 1151601 1543040 1311796 546213 -114851 -236173 -87131 -54321
33915 -54321 42474 536481 1105031 1034847 275936 -375810 -314443 151360 380317 295610
33905 295610 286552 452123 450296 124564 -164264 -64414 189405 61045 -518956 -1015986
33895 -1015986 -981528 -576300 -234616 -71484 75403 176316 -3590 -415445 -620185 -366757
33885 -366757 20522 108948 -4007 124315 551554 805023 537147 -20349 -435768 -629697
33875 -629697 -774806 -835431 -582604 -67601 264865 92694 -372926 -682720 -712664 -718062
33865 -718062 -901540 -1171387 -1357114 -1446677 -1490157 -1411675 -1089278 -589084 -173583 -27526
33855 -27526 -44059 54035 384661 734692 747592 290633 -378139 -819469 -786066 -406410
33845 -406410 -44140 24359 -138259 -174237 191216 771178 1034121 713874 201327 150017
33835 150017 731610 1470841 1812124 1637997 1182701 673251 220505 -86814 -192889 -159712
33825 -159712 -111730 -92254 -39065 122292 406349 733200 911197 736753 226985 -275343
33815 -275343 -353712 76478 667166 990616 975486 935145 1137413 1418678 1347335 768108
33805 768108 21414 -451986 -556271 -465740 -305537 -147143 -161606 -429413 -644717 -384124
$$ [...]
##END NTUPLES=NMR SPECTRUM
##END=
