##TITLE=31Pdec_CPA-1
 D2O, 24 sc
 10.7.2024
##JCAMPDX= 6.0         $$ Bruker NMR JCAMP-DX V2.0
##DATA TYPE= NMR SPECTRUM
##DATA CLASS= NTUPLES
##ORIGIN= UXNMR, Bruker Analytische Messtechnik GmbH
##OWNER= root
$$ XWIN-NMR		Version 3.5
$$ Wed Jul 10 13:44:56 2024 Russian Standard Time (UT+4h)  she@DPX200
##.OBSERVE FREQUENCY= 81.013821
##.OBSERVE NUCLEUS= ^31P
##.ACQUISITION MODE= SIMULTANEOUS
##.ACQUISITION SCHEME= undefined
##.AVERAGES= 24
##.DIGITISER RES= 17
##SPECTROMETER/DATA SYSTEM= spect
##.PULSE SEQUENCE= zgpg30
##.SOLVENT NAME= CDCl3
##.SHIFT REFERENCE= (INTERNAL, CDCl3, 0, 198.062)
##AUDIT TRAIL= $$ (NUMBER, WHEN, WHO, WHERE, WHAT)
$$ ##TITLE= Audit trail, XWIN-NMR		Version 3.5
$$ ##JCAMPDX= 5.01
$$ ##ORIGIN= Bruker BioSpin GmbH
$$ ##OWNER= she
$$ F:/spectra/data/she/nmr/P31/2/pdata/1/auditp.txt
$$ ##AUDIT TRAIL=  $$ (NUMBER, WHEN, WHO, WHERE, WHAT)
(   1,<2024-07-10 13:43:41.50 +0400>,<she>,<DPX200>,
      <created by zg, POWCHK disabled, PULCHK disabled
       configuration hash MD5:
       00 E9 B6 7A A2 85 ED C7 34 08 36 98 17 FE 4E 26
       data hash MD5: 32K
       B1 F1 3D D2 AB AC 72 1B 24 2C 05 C2 43 8C 46 11>)
(   2,<2024-07-10 13:43:45.03 +0400>,<she>,<DPX200>,
      <Start of raw data processing
       efp BC_mod = 2 LB = 1.5 FT_mod = 6 PKNL = 1 PHC0 = 2581.429 PHC1 = 221.0869 SI = 64K 
       data hash MD5: 64K
       E5 56 B5 CA 54 52 69 DB E6 0C 54 47 27 85 18 B9>)
(   3,<2024-07-10 13:44:16.96 +0400>,<she>,<DPX200>,
      <pk PHC0 = 53.91295 PHC1 = -149.2 
       data hash MD5: 64K
       47 61 73 53 BD 99 7F 91 BB 93 78 35 20 BA A8 CC>)
(   4,<2024-07-10 13:44:21.07 +0400>,<she>,<DPX200>,
      <abs ABSG = 5 
       data hash MD5: 64K
       C1 26 B1 E2 2B A8 94 95 26 23 46 E4 4E F5 8C 06>)
$$ ##END=
$$ 
$$ hash MD5
$$ 99 BF CE CA E5 EE DF 76 43 86 D5 F8 CB 97 50 1E
##$RELAX= 
##$RELAX= 
##$RELAX= 
##$RELAX= 
##$RELAX= 
##$RELAX= 
##$RELAX= 
##$RELAX= 
$$ Bruker specific parameters
$$ --------------------------
##$DU= <F:/spectra>
##$EXPNO= 2
##$NAME= <P31>
##$PROCNO= 1
##$TYPE= <nmr>
##$USER= <she>
##$AMP= (0..31)
100 100 100 100 100 100 100 100 100 100 100 100 100 100 100 100 100 100 
100 100 100 100 100 100 100 100 100 100 100 100 100 100 
##$AQSEQ= 0
##$AQ_mod= 1
##$AUNM= <au_zg>
##$AUTOPOS= <>
##$BF1= 81.014009
##$BF2= 200.13
##$BF3= 200.13
##$BF4= 200.13
##$BF5= 200.13
##$BF6= 200.13
##$BF7= 200.13
##$BF8= 200.13
##$BYTORDA= 1
##$CFDGTYP= 0
##$CFRGTYP= 5
##$CHEMSTR= <none>
##$CNST= (0..31)
1 1 145 1 1 1 1 1 1 1 1 1 1 1 1 1 1 1 1 1 1 1 1 1 1 1 1 1 1 1 1 1 
##$CPDPRG= <waltz16>
##$CPDPRG1= <>
##$CPDPRG2= <waltz16>
##$CPDPRG3= <>
##$CPDPRG4= <mlev>
##$CPDPRG5= <mlev>
##$CPDPRG6= <mlev>
##$CPDPRG7= <mlev>
##$CPDPRG8= <mlev>
##$CPDPRGB= <>
##$CPDPRGT= <>
##$D= (0..31)
0 1 0 0 0 0 0 0 0 0.06 0 0.03 2e-05 3e-06 0 0 0.0002 0 0 0 0 0 0 0 0 0 
0 0 0 0 0 0 
##$DATE= 1720604620
##$DBL= (0..7)
120 120 120 11 120 120 24 19 
##$DBP= (0..7)
150 150 150 150 150 150 150 150 
##$DBP07= 0
##$DBPNAM0= <>
##$DBPNAM1= <>
$$ [...]
##$SUBNAM3= <"">
##$SUBNAM4= <"">
##$SUBNAM5= <"">
##$SUBNAM6= <"">
##$SUBNAM7= <"">
##$SUBNAM8= <"">
##$SUBNAM9= <"">
##$SW= 400.765351723535
##$SWIBOX= (0..15)
0 1 3 0 0 0 0 0 0 0 0 0 0 0 0 0 
##$SW_h= 32467.5324675325
##$TD= 32768
##$TD0= 1
##$TE= 0
##$TE2= 300
##$TE3= 300
##$TEG= 300
##$TL= (0..7)
0 120 53 12 22 120 120 120 
##$TP= (0..7)
150 150 150 150 150 150 150 150 
##$TP07= 0
##$TPNAME0= <>
##$TPNAME1= <>
##$TPNAME2= <>
##$TPNAME3= <>
##$TPNAME4= <>
##$TPNAME5= <>
##$TPNAME6= <>
##$TPNAME7= <>
##$TPOAL= (0..7)
0.5 0.5 0.5 0.5 0.5 0.5 0.5 0.5 
##$TPOFFS= (0..7)
0 0 0 0 0 0 0 0 
##$TUNHIN= 0
##$TUNHOUT= 0
##$TUNXOUT= 0
##$USERA1= <user>
##$USERA2= <user>
##$USERA3= <user>
##$USERA4= <user>
##$USERA5= <user>
##$V9= 5
##$VALIST= <valist>
##$VCLIST= <CCCCCCCCCCCCCCC>
##$VD= 0
##$VDLIST= <DDDDDDDDDDDDDDD>
##$VPLIST= <PPPPPPPPPPPPPPP>
##$VTLIST= <TTTTTTTTTTTTTTT>
##$WBST= 1024
##$WBSW= 4
##$XGAIN= (0..3)
0 0 0 0 
##$XL= 0
##$YL= 0
##$YMAX_a= 29332
##$YMIN_a= -28516
##$ZGOPTNS= <>
##$ZL1= 120
##$ZL2= 120
##$ZL3= 120
##$ZL4= 120
##$ABSF1= 198.0616
##$ABSF2= -202.7028
##$ABSG= 5
##$ABSL= 3
##$ALPHA= 0
##$AQORDER= 0
##$ASSFAC= 0
##$ASSFACI= 0
##$ASSFACX= 0
##$ASSWID= 0
##$AUNMP= <proc_1d>
##$AZFE= 0.1
##$AZFW= 0.5
##$BCFW= 0
##$BC_mod= 2
##$BYTORDP= 0
##$COROFFS= 0
##$CY= -3
##$DATMOD= 1
##$DC= 0
##$DFILT= <>
##$DTYPP= 0
##$F1P= 0
##$F2P= 0
##$FCOR= 1
##$FTSIZE= 65536
##$FT_mod= 6
##$GAMMA= 0
##$GB= 0
##$INTBC= 1
##$INTSCL= 9.790993e-09
##$ISEN= 30
##$LB= 1.5
##$LEV0= 0
##$LPBIN= 0
##$MAXI= 10000
##$MC2= 0
##$MEAN= 0
##$ME_mod= 0
##$MI= 50
##$NCOEF= 0
##$NC_proc= -6
##$NLEV= 6
##$NOISF1= 182.463
##$NOISF2= 159.3651
##$NSP= 0
##$NTH_PI= 0
##$NZP= 0
##$OFFSET= 198.0616
##$PC= 4
##$PHC0= 2635.342
##$PHC1= 71.8869
##$PH_mod= 1
##$PKNL= yes
##$PPARMOD= 0
##$PSCAL= 0
##$PSIGN= 0
##$REVERSE= no
##$SF= 81.0140089999434
##$SI= 65536
##$SIGF1= 159.3651
##$SIGF2= -187.1042
##$SINO= 113.3802
##$SIOLD= 16384
##$SREGLST= <1H.CDCl3>
##$SSB= 0
##$STSI= 65536
##$STSR= 0
##$SW_p= 32467.5324675325
##$SYMM= 0
##$S_DEV= 0
##$TDeff= 32768
##$TDoff= 0
##$TI= <>
##$TILT= no
##$TM1= 0
##$TM2= 0
##$TOPLEV= 0
##$USERP1= <user>
##$USERP2= <user>
##$USERP3= <user>
##$USERP4= <user>
##$USERP5= <user>
##$WDW= 1
##$XDIM= 65536
##$YMAX_p= 407777552
##$YMIN_p= -4149764
$$ End of Bruker specific parameters
$$ ---------------------------------
##NTUPLES= NMR SPECTRUM
##VAR_NAME=  FREQUENCY,     SPECTRUM/REAL,   SPECTRUM/IMAG
##SYMBOL=    X,             R,               I
##VAR_TYPE=  INDEPENDENT,   DEPENDENT,       DEPENDENT
##VAR_FORM=  AFFN,          ASDF,            ASDF
##VAR_DIM=   65536,         65536,           65536
##UNITS=     HZ,            ARBITRARY UNITS, ARBITRARY UNITS
##FACTOR=    0.49542278885378, 1,            1
##FIRST=     16045.7642231865, 0,            0
##LAST=      -16421.768244346, 0,            0
##MIN=       -16421.768244346, -4149764,     0
##MAX=       16045.7642231865, 407777552,    0
$$ Real data points
##PAGE= N=1
##DATA TABLE= (X++(R..R)), XYDATA
$$ [...]
41383G80210n8797k32290m52859l19422J04167J87725k71384n82630j97309L54676
41373f87913K63936k53745l26006J30831L27911l109j59237K72905O51614L49107
41363E66294j82685j58196K78658L64555k9576k85089p0171K61073L40109K10374
41353A295346k4032l95197p31120o27302l3751N08129N04760J12609j63573j41585
41343C04284l2345J1158Q1754K46818L55807K48445J6738j12087j21722k36015
41333G62835n16207o37405l12417J87981K97866n8624l52068k38297k2525o2147
41323i51008j34715J40332N46102N02794m4414n17647n10345k06722R1351L67218
41313g17054O06755N43765M7591m78992m69946R0483O07436N63437P7146l08305
$$ plain form
41383 780210 721413 489123 36264 -283158 -178991 8734 -262650 -845280 -1042589 -687913
41373 -687913 -423977 -677722 -1003728 -872897 -544986 -548095 -707332 -434427 217187 566294
41363 566294 383609 225413 504071 868626 839050 553961 483790 744863 1084972 1295346
41353 1295346 1271314 876117 144997 -482305 -516056 -7927 496833 609442 445869 304284
41343 304284 271939 283097 364851 611669 967476 1215921 1232659 1120572 998850 762835
41333 762835 246628 -390777 -703194 -515213 -217347 -275971 -628039 -866336 -888861 -951008
41323 -951008 -1085723 -945391 -399289 103505 59091 -458556 -968901 -1175623 -1084272 -717054
41313 -717054 -110299 433466 481057 2065 -467881 -377398 230038 793475 870621 562316
41303E62316k80763n8164k0364j96980k90394j45993N5036J30845J62988K71993
41293A90520L60473K80774O0540k32317o07350q99914p17714k0320N37403L63617
41283f84288j62887j62154M47904Q27098M86510m1114j14684Q1594J4407k72021
41273D20365l12718m6840J08748n5214k73287k65066q9263M8528Q3659J05723
41263b75365K39348N19511P54736N89137q7594q32170j005200m96469J04039J62152
41253c27875k97177o48094l67506M07246J026089R83651L82209k64569n92112
41244C01862o31131n58476m30693k47486q9062k4459J8435J39587K83905L08944
41234i28574K01710J05845J35712K45779K86748J52963j00781k68765j79289R7566
$$ plain form
41303 562316 281553 223389 203025 6045 -284349 -430342 -375306 -244461 -81473 190520
41293 190520 550993 831767 892307 659990 52640 -847274 -1564988 -1585308 -1047905 -684288
41283 -684288 -847175 -1009329 -561425 265673 752183 711069 596385 677979 692386 420365
41273 420365 107647 60807 169555 114341 -158946 -424012 -513275 -464747 -381088 -275365
41263 -275365 -36017 483494 1238230 1827367 1739773 907603 -97597 -594066 -490027 -327875
41253 -327875 -625052 -1273146 -1640652 -1233406 -207317 776334 1158543 893974 301862
41244 301862 -329269 -887745 -1318438 -1565924 -1654986 -1679445 -1661010 -1521423 -1237518 -928574
41234 -928574 -726864 -621019 -485307 -239528 47220 200183 99402 -169363 -348652 -251086
41224b51086K89886K06720o9528k75228j86409K02994N89794N13923j55504q85601
41214b0039r41667k84768L20524K87015n4571k9522L67306N33154K15307j42789
41204B49950j05896J69738K75163J20781r7229k49165l04415j85370J16163L65631
41194C55351K99127j9678k78472l21303k44860j13864J24617L63102K71579k59144
41184A76455p96872p78005j94221L81151M83598K57423J70474L96027O36960N10443
41174A243433j5912n80638p70641n03870p4224J98511L02745M13606M95333K63207
41164I71550l55794r36862r59921m22012J59360L35261J34995j14624j81239o0206
41154a429492J29931K46251J75894p1036k98108k53638P7425L50288J85133l22408
$$ plain form
41224 -251086 38800 245520 175992 -99236 -285645 -82651 507143 1021066 865562 -20039
41214 -20039 -961706 -1246474 -925950 -638935 -693506 -723028 -355722 177432 392739 249950
41204 249950 144054 313792 588955 709736 612507 363342 58927 -126443 -10280 355351
41194 355351 654478 634800 356328 35025 -209835 -323699 -199082 164020 435599 176455
41184 176455 -620417 -1398422 -1592643 -1211492 -727894 -470471 -299997 96030 732990 1243433
41174 1243433 1227521 646883 -123758 -627628 -701852 -503341 -200596 213010 708343 971550
41164 971550 615756 -321106 -1281027 -1703039 -1543679 -1208418 -1073423 -1188047 -1369286 -1429492
41154 -1429492 -1299561 -1053310 -877416 -948452 -1246560 -1500198 -1422773 -1072485 -887352 -1209760
41144a209760n91557k34989M03612O74655M79760K95487L44554K80579q9344l20985
41134C2012k3426L93278K58942l24809o45145m55272k13273k24908k35668n4886
41124a493155N2393q7176j50783J39188M82368M34676P1727j87491j80967m5526
41114i64746J28915K92004K49509r4316m02966k31085L13279N86620J70511o30152
41104e82427j118848q71047n3681P49584J011352O94892K40248N8594J15133J09328
41094C53128n9046j97395j40297K7748Q6983q0503l52621m12393k6882O16500
41084a84778R56011N91870k59735r55100j029569n49652O1109M40400N45737N41735
41074A58028M63411J31264m74051r47045q87150m78239k15290j12067K48184P97049
$$ plain form
41144 -1209760 -1801317 -2036306 -1632694 -958039 -478279 -182792 161762 442341 352997 32012
41134 32012 8586 401864 660806 335997 -309148 -764420 -977693 -1202601 -1438269 -1493155
41124 -1493155 -1440762 -1527938 -1678721 -1539533 -1057165 -622489 -550762 -738253 -919220 -964746
41114 -964746 -835831 -543827 -294318 -388634 -791600 -1022685 -709406 -122786 47725 -582427
41104 -582427 -1701275 -2572322 -2626003 -1876419 -865067 -170175 70073 128667 243800 353128
41094 353128 294082 96687 -43610 -15862 71121 -9382 -362003 -774396 -801278 -184778
41084 -184778 771233 1363103 1103368 148268 -881301 -1430953 -1369844 -929444 -383707 158028
41074 158028 621439 752703 278652 -668393 -1555543 -2033782 -2249072 -2361139 -2112955 -1315906
41064a315906Q27715J07927n27285k85333M05401N56353R3889j63215J54370N15410
41054C69326M54576K00482Q7605n897k74592n27562m99814k96817j98870k52850
41044i44413l10592k78225j39371P6402K10108Q2143j86509k11911J45340N58104
41034i98924O72823N15051K86423M1052j94339k33093K0761K88833K06122j65572
41024D39137l83098j76623K55599N27909M73544K28022K4934l2638m0808j57032
41014A158946l84462n23257l73587K4715L83682M13314R5119k89783m38198l18339
41004b51850j22761K6792J61186K46611J36460j39657k84700j32031Q0528P4748
40994b04674l5873K5735K18918K83366J96974J65868K24377K01615M4913j57877
$$ plain form
41064 -1315906 -488191 -380264 -907549 -1192882 -787481 -231128 -137239 -300454 -146084 369326
41054 369326 823902 1024384 1111989 1106092 831500 303938 -195876 -492693 -691563 -944413
41044 -944413 -1255005 -1533230 -1672601 -1596199 -1386091 -1303948 -1490457 -1702368 -1557028 -998924
41034 -998924 -326101 188950 475373 516425 322086 88993 109754 398587 604709 439137
41024 439137 56039 -120584 135015 662924 1136468 1364490 1389424 1356786 1315978 1158946
41014 1158946 774484 251227 -122360 -97645 286037 699351 794470 504687 66489 -251850
41004 -251850 -374611 -347819 -186633 59978 196438 56781 -227919 -359950 -279422 -204674
40994 -204674 -240547 -214812 4106 287472 484446 650314 874691 1076306 1121219 963342
40984I63342m15027p26602q10696l59499M22289R33383Q63136M18229r2891m85899
40974G09765n60697k39186J35215J41640n1298P5515M48809L87384k86351q34526
40964g3730o51074q1664K26804K11597J39611J672k68301l96795j77696O7081
40954a002495j2977j68723K065K94567K24573j17210k10641K4621J62828L5781
40944g67611n3902P3472K04730J45194l0689j94738k61976q7302L49437O93411
40934G0026N58383Q9943k11426j64417K1804K41628N26474O43928K78824l33039
40924A722128n73505l71103l22003o62215p88392k10767N90256Q10863M27453
40915F22715N6321m4692j99003n71077p87990m93928R0629M28931L19747O6047
$$ plain form
40984 963342 548315 -178287 -988983 -1348482 -926193 7190 870326 1288555 1195664 709765
40974 709765 149068 -90118 45097 186737 135439 210954 659763 1047147 760796 -73730
40964 -73730 -724804 -806468 -579664 -368067 -228456 -226784 -495085 -891880 -1069576 -1002495
40954 -1002495 -1015472 -1184195 -1182130 -887563 -662990 -780200 -990841 -966220 -803392 -767611
40944 -767611 -821513 -748041 -543311 -398117 -428806 -623544 -885520 -972822 -623385 70026
40934 70026 628409 718352 506926 342509 364313 605941 1132415 1776343 2055167 1722128
40924 1722128 1148623 777520 455517 -206698 -995090 -1205857 -615601 195262 622715
40915 622715 679036 634344 435341 -135736 -923726 -1417654 -1327025 -898094 -578347 -512300
40905e12300L5622K28773L47041K01479o5886j68904K3323M07100P46477P96647
40895B039372M64311n3304m15032n15392n57759o53288o01970k78162L7684L8272
40885d95268j11192m0639K10695K80897J04560p714R5652K22465K24103J64826
40875F48385N4349j91100m51772m56638k11948n627O8378J79501L08636K18891
40865A61055q559M9392M30763N82006J98138k43441k06853R8295J45615l9624
40855A166787l5618J68236J45017k13729m66906k74059J19563K29171p0913m47435
40845C20114n00343j79738J58455J36940j99056m47459l79225j79668o6034M9465
40835a286549K88892M50579K54418j76293m00266k04102J75353L64483K08735
$$ plain form
40905 -512300 -476678 -247905 99136 300615 234729 65825 89148 496248 1242725 2039372
40895 2039372 2503683 2450379 2035347 1519955 962196 308908 -293062 -571224 -533540 -495268
40885 -495268 -606460 -647099 -436404 -155507 -50947 -58661 36991 259456 483559 648385
40875 648385 702734 511634 59862 -396776 -608724 -614351 -545973 -366472 -57836 161055
40865 161055 152496 201888 632651 1214657 1412795 1169354 962501 1060796 1206411 1166787
40855 1166787 1131169 1299405 1444422 1230693 763787 489728 609291 838462 767549 320114
40845 320114 -180229 -359967 -201512 -64572 -263628 -711087 -1090312 -1269980 -1336014 -1286549
40835 -1286549 -997657 -547078 -292660 -468953 -869219 -1073321 -897968 -533485 -324750
40826c24750j55319m25248l59989l837L53869M97641M48181K68214o1439m38272
40816b00949n63834k98653J02115L25697L71025L55153K08353j11702l32410k06246
40806c51451J6531r0424m17505m23004K8615M27452L55691K0593j71215j83084
40796g87801j79827r2782K36121O02619N48286j3990n80316o14343j48113L42813
40786f87333N36564N01924L74290J08204k86371n15844l24723N9781J46865j53363
40776b40006m14134l01917K3520K33595K40149J20155o7200j88030l7057L39121
40766b91804N70255M35412J57743J3912n3916j75926k29358j12500m1921j92604
40756G9293l24376j86182m691q4541k05213m243K73268J10670l14674k87784K64050
$$ plain form
40826 -324750 -480069 -905317 -1265306 -1269143 -915274 -417633 30548 298762 237323 -200949
40816 -200949 -764783 -1063436 -961321 -635624 -264599 90554 298907 187205 -145205 -351451
40806 -351451 -334920 -425344 -842849 -1265853 -1237238 -809786 -454095 -433502 -604717 -787801
40796 -787801 -967628 -1060410 -824289 -221670 326616 312626 -267690 -882033 -1030146 -687333
40786 -687333 -150769 351155 725445 833649 547278 31434 -293289 -233508 -86643 -240006
40776 -240006 -654140 -956057 -932537 -698942 -458793 -338638 -405838 -593868 -630925 -291804
40766 -291804 278451 713863 871606 885518 831602 655676 426318 313818 271897 79293
40756 79293 -245083 -431265 -435956 -520497 -725710 -729953 -456685 -346015 -660689 -948473 -684423
40745f84423N38941O1208n79607n84424n171M92344N44119L33927J62964J34346
40735D14224J44093j1333l78145o33635m04244J39764L71927J5507n27372p97925
40725a667139p86565o10415j88456M16826P86687P01977N32936O29408O96912
40716E12171L15260k41077l42013J4601K18829O072k39834k11382r8336r0077
40706a55786M954L23125N31400K45056l52429o66312m01136J37871M31531K50948
40696C49222k17540n87633n66172j50861L52481N36371K47656j90585k27591K87083
40686a67569Q03991O48297j10708o77493n27577n3416L5110l25617n63263l06901
40676a245146J84531M48100L54882J25402L048J0487l6679k70506n06546l94379
$$ plain form
40745 -684423 -145482 -84274 -663881 -1248305 -1253476 -761132 -217013 116914 279878 414224
40735 414224 558317 546984 168839 -464796 -869040 -729276 -357349 -341842 -869214 -1667139
40725 -1667139 -2453704 -3064119 -3252575 -2835749 -2049062 -1347085 -814149 -184741 512171
40716 512171 827431 586354 244341 258942 477771 483843 244009 32627 -65709 -155786
40706 -155786 -150832 172293 703693 948749 596320 -69992 -471128 -333257 98274 349222
40696 349222 131682 -455951 -1022123 -1172984 -820503 -284132 -36476 -227061 -454652 -167569
40686 -167569 636422 1284719 1174011 496518 -31059 -84475 -49365 -374982 -938245 -1245146
40676 -1245146 -1060615 -612515 -257633 -132231 -129183 -118696 -155375 -425881 -932427 -1326806
40666a326806O6659L97674K57856m0697J0757L25119L52591m1525l51509k04923
40656e54804J06297J16393j53083l32602k62612r6800J2705N4905N8035P2786
40646i78780K05598M72527O57516N10007R5494k10494j37073J60486K55434r0938
40636I39777o48958r20210o39761n7536L23744K61936l4229j84552q598L53207
40626f15180N74229M15940p888k64947n9219L57295M26848j4670m91112m59941
40616a38645L1293M28076L20366j51018n20361n01251k17306K3780J03502J48169
40606d73395K21673J56188j52542m38413l35263Q8775L70965K68624L6094j3559
40596b70853P1703Q2830K1021K5781R1141R9344N6994Q9704K24942L14662J66528
$$ plain form
40666 -1326806 -1260147 -862473 -604617 -645314 -634557 -309438 43153 1628 -349881 -554804
40656 -554804 -448507 -332114 -485197 -817799 -1080411 -1177211 -1164506 -1109601 -1051566 -978780
40646 -978780 -773182 -300655 356861 866868 962362 751868 614795 775281 1030715 939777
40636 939777 290819 -629391 -1269152 -1326688 -1002944 -741008 -775237 -959789 -968387 -615180
40626 -615180 -40951 374989 367101 102154 42935 400230 827078 812408 321296 -138645
40616 -138645 -107352 320724 641090 490072 -30289 -531540 -748846 -725066 -621564 -473395
40606 -473395 -251722 -95534 -248076 -686489 -1021752 -932977 -562012 -293388 -257294 -270853
40596 -270853 -199150 -116320 -95299 -69518 21623 120967 177961 267665 492607 807269 973797
40585I73797k76910q01523r77816n67058P9467L01036o4741m50553l35353O7048
40575b052606K08885J8794j08612L7677K95383N10778O67797O51842L26286j03618
40565D52606k25846k6880L6876k75263o14554n72751k47111J537Q6997J75501
40555a208888K97054L02763J57126K1975L3981J42047J77309K7916k22691l30465
40545f01873j65018O5750L7586k36666l99384k47248J584L4870j77623m23829
40535b111851m48629p3921N83243R70996N97937j96273m55746J40871P63889N77171
40525C47687j17126m65877l49975l04572m21178k26895L40487O92081N21841K52942
40515B69415K67333L31037J41816j06262j19943k8850j02581k99108m57378o06357
$$ plain form
40585 973797 696887 -104636 -1082452 -1649510 -1570043 -1269007 -1333748 -1784301 -2119654 -2052606
40575 -2052606 -1843721 -1824927 -1933539 -1895862 -1600479 -1089701 -421904 229938 556224 452606
40565 452606 226760 199880 236756 -38507 -653061 -1225812 -1472923 -1471386 -1384389 -1208888
40555 -1208888 -911834 -609071 -451945 -429970 -395989 -253942 -76633 -48717 -271408 -601873
40545 -601873 -766891 -701141 -663555 -900221 -1299605 -1546853 -1545269 -1510399 -1688022 -2111851
40535 -2111851 -2560480 -2634401 -2051158 -1080162 -482225 -678498 -1134244 -993373 -229484 347687
40525 347687 230561 -235316 -585291 -889863 -1311041 -1537936 -1197449 -505368 16473 269415
40515 269415 536748 867785 1009601 903339 783396 754546 651965 352857 -104521 -710878
40505g10878p35930n96754j01832L70958M43860K32825N0107n6439r9248J37413
40495a065918O93651J054671P32315J1558m26061m31485l66790l28077o1092L77657
40485A90429N42367K90342n055o4119k3928k9434K216N3694p9832l61259m34509
40474H0912j80946N3193p902j86115j96497j3987K71171N72625O33956J97749
40464A224159m57815o66799l22527j09251m15092o31864j27972O17332O53389
40455b36440K4889k85911J53926O41778M50140j64565m46182j81573J63761J39140
40445B58963k02351m59402l44614J5470K24132J02679n6733J02243M29513L98103
40435D68003j61068p48209p74330k56441K60505L81272K57780K77917N07167O11477
$$ plain form
40505 -710878 -1446808 -2043562 -2145394 -1774436 -1330576 -1097751 -1047644 -1104083 -1203331 -1065918
40495 -1065918 -372267 682404 1414719 1426277 1000216 568731 201941 -126136 -187228 190429
40485 190429 732796 1023138 1018083 953964 930036 900602 902818 956512 876680 515421 80912
40474 80912 -100034 -46841 -54743 -240858 -437355 -451342 -180171 392454 1026410 1224159
40464 1224159 766344 99545 -222982 -332233 -747325 -1379189 -1507161 -889829 -236440
40455 -236440 -211551 -497462 -343536 298242 748382 583817 137635 -43938 119823 258963
40445 258963 56612 -402790 -747404 -731934 -507802 -405123 -461856 -359613 69900 468003
40435 468003 306935 -441274 -1215604 -1472045 -1211540 -830268 -572488 -294571 212596 824073
40425H24073L57086j3289j12129L413q7381m74962o99216m07801J14349L61060
40415a34797K75100J73063K22710L49804M86229N42218K90116l20528q51114q07882
40405B24919l25106O018n8273k30200k89566l56502m75141m18583j06170J91044
40395a837560K85618L65605O08045Q01073O34654J74876k03648k60286j06739
40386D61638m8114k54285n11628l81041K09984O77542M37998k35007m84100k2716
40376a49729N07611M76087L3660l03509l50333j95851J18175M61630N07813J73182
40366A278736j24517m5982J18764q3258n10625o38380l57513n2881L7393N4621
40356c23642J19657J39834O7457k705m0392r1144q6016N4487J45775q9051n46526
$$ plain form
40425 824073 1181159 1167870 1055741 1059154 971773 496811 -202405 -610206 -495857 -134797
40415 -134797 140303 313366 536076 885880 1372109 1914327 2204443 1883915 1032801 224919
40405 224919 -100187 -94169 -152442 -382642 -672208 -1028710 -1503851 -1922434 -2028604 -1837560
40395 -1837560 -1551942 -1186337 -578292 222781 857435 1032311 828663 568377 461638
40386 461638 413524 159239 -352389 -733430 -523446 154096 592094 357087 -127013 -149729
40376 -149729 357882 833969 867629 564120 213787 17936 136111 597741 1105554 1278736
40366 1278736 1154219 1108237 1227001 1143743 633118 -5262 -362775 -415656 -378263 -323642
40356 -323642 -203985 -64151 3306 601 -39791 -130935 -216951 -162464 -16689 -105740 -652266
40345f52266p72387n30703o2442K79612L86409L32579K30506K20426L75179N48539
40335C55452N15767K86810P3195l8097j24018j68390q8628l1765k64180o61031
40325a44885o90259j22702N51492O89889K71412j64758k11245L5486K28898J77610
40315F20938j8970j31902p9019k1534j06098j80325J2684L65122M45793J21789
40305A028478j92833j38776M0631r9674m73323n72635k50409O2686J6967j71014
40295g49902j02098K22142M68735M54548K87437J19540K2966P3271K82459M11973
40285A491071J25577n31389j011565q23306j01655N47611O85811L59218j15819
40276F25554m52187n06552l26178j22095m7021j5243J03484J97717P9430j27652
$$ plain form
40345 -652266 -1424653 -1955356 -2017798 -1738186 -1351777 -1019198 -788692 -568266 -193087 355452
40335 355452 871219 1158029 1231224 1193127 1069109 900719 812091 780326 516146 -144885
40325 -144885 -835144 -957846 -406354 283535 554947 390189 178944 214430 443328 620938
40315 620938 601968 470066 391047 369513 263415 83090 95774 460896 906689 1028478
40305 1028478 835645 696869 737500 637826 164503 -408132 -658541 -595855 -578888 -749902
40295 -749902 -852000 -629858 -161123 293425 580862 700402 723368 796639 1079098 1491071
40285 1491071 1616648 1085259 73694 -749612 -851267 -303656 382155 741373 625554
40276 625554 173367 -333185 -659363 -781458 -828479 -843722 -740238 -542521 -463091 -590743
40266e90743j08591J26983K38961J37828J31152L24958L55588J6117l02980k10541
40256A18732N0991P1976J5142K50831N08924J74032o04943r03445l31287L41337
40246c07710K52255l87328o81302k76857K95453M00836K2431l36837k55599J81881
40236a092777N20886M73017K29326J36349J96282J30179j48552m28309n31988
40227e15587m41809j33069L44701O44561M32701k7806r4611L27948N95657K65941
40217A398627k88062n03497l63505j23309K13809O39193P49532K15829n81247
40208A357370r46615p62413m73725l16732j23529J33354J71475r5783l21217j82304
40198a560119J97113M19663K32968k55395o17894m22376K75798Q45643P51231
$$ plain form
40266 -590743 -699334 -572351 -333390 -195562 -64410 260548 616136 632253 329273 118732
40256 118732 169723 241699 256841 507672 1016596 1190628 585685 -317760 -649047 -307710
40246 -307710 -55455 -442783 -1124085 -1400942 -1105489 -704653 -682222 -1019059 -1274658 -1092777
40236 -1092777 -571891 -98874 130452 266801 463083 593262 444710 16401 -515587
40227 -515587 -957396 -1090465 -745764 -101203 331498 303692 209081 537029 1132686 1398627
40217 1398627 1110565 607068 243563 120254 334063 973256 1722788 1938617 1357370
40208 1357370 410755 -351658 -825383 -1142115 -1265644 -1132290 -960815 -1056598 -1377815 -1560119
40198 -1560119 -1363006 -943343 -710375 -965770 -1583664 -2006040 -1730242 -884599 -133368
40189a33368K21786n4936J74251N06891N25436K57915o0792l12485m39193l53247
40179C32258p4776K10348L28880K44383J8449j97870k04964L419J33972j5623
40169G78476j91771n6892K04421J23856k47756l36994M2371L38016P7099m48735
40159B82091o63845m78875j87216P9400L30746L73236n226n52640p05907l07073
40149a835309J72260K54508M5839Q484K91330N38471M07412Q1508M4995L74448
40139C83946N51459J62621m60401o31178k07326K93544M40077L17237J51633l5157
40129I66455k13727j99982Q410Q3868j50700l86667k84803J796R7722l7478j80525
40118b95631k57049k87683j14139L57008P51705N78706j5133l31523o0614L21792
$$ plain form
40189 -133368 88418 33482 207733 714624 1240060 1497975 1437183 1124698 685505 332258
40179 332258 257482 467830 796710 1041093 1059542 861672 656708 660127 794099 778476
40169 778476 586705 529813 734234 858090 610334 273340 315711 653727 730826 282091
40159 282091 -381754 -860629 -1047845 -968445 -637699 -264463 -269689 -822329 -1528236 -1835309
40149 -1835309 -1663049 -1408541 -1362702 -1354218 -1062888 -524417 -117005 -35497 9498 383946
40139 383946 935405 1098026 637625 6447 -200879 92665 532742 849979 1001612 966455
40129 966455 752728 552746 561156 645024 494324 107657 -177146 -175350 -77628 -115106 -295631
40118 -295631 -552680 -840363 -954502 -597494 154211 732917 717784 386261 325647 647439
40108F47439K85815k4048q8791K16691M83431L13684k18371o45962n64082m7927
40098C57879L71334K64316j72614l50007o2144K55393J74119j34257k32675j02040
40088C69304q1409k20998j65485K12277M81300K29316l10031n47298l05564M6963
40078b91625J61607M1350j95447m79251n92973k17278N55641J078050Q74173K76684
40068A210931n4055l6664r7103l10370k36137K82047P37977O61910K35095j26743
40058B266888l88800o73430p64754l78768K33110M86780K54833j6626k8175o641
40048I84417j99941l86316j88948L25839O64783M84273l9433m34959m28382j74035
40038F07298k5778j28720l03066l31585k25583j01735P2656L99013P51626Q10543
$$ plain form
40108 647439 933254 909206 820415 1037106 1520537 1834221 1615850 969888 405806 357879
40098 357879 729213 993529 820915 470908 408764 664157 838276 704019 471344 369304
40088 369304 287895 66897 -98588 113689 594989 824305 514274 -33024 -338588 -291625
40078 -291625 -130018 -88668 -284115 -763366 -1356339 -1573617 -1017976 60074 934247 1210931
40068 1210931 1156876 1120212 1023109 712739 476602 758649 1496626 2158536 2393631 2266888
40058 2266888 1878088 1204658 439904 61136 294246 781026 1035859 1019233 991058 984417
40048 984417 784476 398160 209212 535051 1199834 1684107 1644674 1209715 781333 607298
40038 607298 581520 452800 149734 -181851 -407434 -509169 -436513 -37500 714126 1524669
40028A524669M73300M4615j30021r6173j64019l93159m50282j08826K99633K25807
40018A225544l19444o73889l91484J07303J06124l84958o60360l48982J08240
40009a231906J75391m6295j06535J12119L52706M08999K70123r398l04492m01775
39999g81063k16085Q3990L17257M69977N03161K83422p4830j52592J58932L36146
39989I28315n5020o28499o88456k22103J99789L32361M12463M82276K66353j80933
39979H46546l60275q4666J81983J1598l86990n20170k38114K04380M57236L19938
39969D31466o8599k50497L0518L61755J43295m82722p36867l15391K13861L26342
39959c46839K23217K63784L01046O0808k54547k53507M0209L07083M13975L92413
$$ plain form
40028 1524669 1997969 2042584 1912563 1816390 1652371 1259212 808930 700104 999737 1225544
40018 1225544 906100 232211 -159273 -51970 54154 -330804 -991164 -1340146 -1231906
40009 -1231906 -1056515 -1102810 -1209345 -1097226 -744520 -335521 -65398 -74796 -379288 -781063
39999 -781063 -997148 -913158 -595901 -125924 377237 660659 585829 433237 592169 928315
39989 928315 873295 244796 -443660 -665763 -465974 -133613 278850 761126 1027479 846546
39979 846546 486271 401605 583588 595186 208196 -311974 -550088 -345708 111528 431466
39969 431466 362867 112370 142888 504643 647938 165216 -571651 -887042 -673181 -346839
39959 -346839 -123622 140162 441208 502016 247469 -6038 34171 341254 755229 1147642
39949A147642J73599k60684o38192o59433l79511p4955J14619K01714J91197R2242
39939i1762p3664l42172o30310n40383J73153R29938Q06893j12104o45758j49987
39929f76156N69718N52210Q7148L1633L94199N50158L78605J98307n5463n78889
39919A451470r23647n37334J21766J17384m28858n04769Q3232M19051R5339j45860
39909b52226J80966M57099J50075k09605k2097L08286J65934j44904j738L66466
39899I98256K88312j45382k47924Q6700K73369N9342j50421p8020M334j75971
39889I12595m40553m77019k55181L7987K28606K23468M5511j43689j97628j47979
39879b13882r9883n2210L5142R7705M0225j34819l62933n41322m71692l2303N02602
$$ plain form
39949 1147642 1321241 1060557 422365 -237068 -616579 -691534 -576915 -375201 -184004 -91762
39939 -91762 -165426 -507598 -1137908 -1678291 -1505138 -575200 231693 119589 -526169 -676156
39929 -676156 -106438 445772 532920 564553 958752 1508910 1887515 2085822 2030359 1451470
39919 1451470 527823 -9511 112255 229639 -199219 -703988 -620756 -201705 -106366 -252226
39909 -252226 -71260 385839 535914 326309 304212 612498 778432 633528 631790 998256
39899 998256 1286568 1141186 893262 979962 1253331 1312673 1162252 1084232 1088566 912595
39889 912595 472042 -4977 -260158 -222171 6435 229903 275414 131725 -65903 -213882
39879 -213882 -313765 -365975 -330833 -233128 -192903 -327722 -690655 -1231977 -1703669 -1735972 -1233370
39868a233370O36493L01344j0822L4699J66191O2429o8024J02163L73192L01557
39858F65852q1126l31820k52314l7518J32545K39527K44935J23963k213o4081
39848F37750k03268m24886l64791J55299O07350L60868l58995p30609m76116j06189
39838i03587r641M6335L36487O57221O54304K95910j83175n23904n36591k48547
39828d15188J1160o919m8964K72652P42186P16678R3438m74627m94644k22149
39818A73623j12163j98709l04468m03512m57823k97820K4628J44838n7634k05018
39808a694058l8014J36160J111j72242K2608L96647M35716J17858p3828J11454
39798g56588M06731M82016L03844R794k66206l93253k93138l2454K52659M70050
$$ plain form
39868 -1233370 -596877 -295533 -306355 -271656 -105465 -43036 -111060 -8897 364295 665852
39858 665852 584726 252906 592 -36926 95619 335146 580081 704044 701831 637750
39848 637750 434482 9596 -355195 -199896 407454 768322 409327 -321282 -797398 -903587
39838 -903587 -913228 -866893 -530406 126815 781119 1077029 893854 369950 -166641 -415188
39828 -415188 -404028 -410947 -459911 -187259 554927 1271605 1365043 890416 395772 173623
39818 173623 61460 -137249 -441717 -845229 -1303052 -1600872 -1576244 -1431406 -1489040 -1694058
39808 -1694058 -1732072 -1595912 -1594801 -1767043 -1744435 -1347788 -912072 -794214 -868042 -756588
39798 -756588 -349857 132159 436003 445797 179591 -213662 -506800 -539254 -286595 183455
39788A83455N20473K94154j28511m47832m92394m13502l69927k72948o8273K6590
39778a168715j05351j42702K25349P10898P47699K94986j24426j51646M5000J23601
39768D54693p0348m73171q02730o61274r252N55876M37095j10563k76571J67995
39758g88250O16284O05910M16935M21541M34151J56315j79122j44534J62066K45150
39748A946446o0157m24263n39266m34304k82449j86699j64601j28907P3070M00798
39738A99668N09812J65431l35395m90030k87958j95646m04662n17430j75384L56657
39728a174937N48600L30691J14897J79250L60547L82190K11288p865j70623k29156
39718E44882j35004Q6004K79553L12749K22433R9455r7814m39223p65503p65436
$$ plain form
39788 183455 703928 998082 869571 421739 -70655 -484157 -854084 -1127032 -1195305 -1168715
39778 -1168715 -1274066 -1416768 -1191419 -480521 267178 562164 437738 286092 331092 454693
39768 454693 384345 -88826 -891556 -1552830 -1562082 -1006206 -569111 -679674 -956245 -788250
39758 -788250 -171966 433944 850879 1272420 1706571 1862886 1683764 1539230 1701296 1946446
39748 1946446 1886289 1462026 922760 488456 206007 19308 -145293 -274200 -201130 199668
39738 199668 709480 874911 539516 49486 -238472 -434118 -838780 -1356210 -1531594 -1174937
39728 -1174937 -626337 -295646 -180749 -1499 359048 741238 952526 944661 774038 544882
39718 544882 409878 495882 775435 1088184 1310617 1410072 1312258 873035 107532 -657904
39708f57904l89490N266O9751j09469j68729L4570K80961L21639J62705n076j727
39697d57503K37890N81579O82082K58522m79018q87675n89314K0517K19888j46841
39687e59873n25018m23786j85K91278L26727K86903K08388k7507l00590k84093
39677a007756J1588J24247j91548n17319l36545K03825N25467M60518L60584L83838
39667A6899K26966k50197o24156m77927l5109J69719M0322o5209M5666J69799
39657g83227J09705l0022l9540J20613L22579M15809L42718K07835J85916K53326
39647A105712J35025k89818o70134n66463p8375K51963J60651o8532j11633o001
39637a37605J00948K45153M41253M65486J47380k92636m82255l70533k20990k20223
$$ plain form
39708 -657904 -1047394 -1042128 -972377 -1081846 -1250575 -1216005 -935044 -613405 -450700 -455776 -457503
39697 -457503 -219613 361966 1044048 1302570 823552 -64123 -653437 -632920 -413032 -559873
39687 -559873 -1084891 -1508677 -1508862 -1217584 -890857 -603954 -395566 -423073 -723663 -1007756
39677 -1007756 -996168 -871921 -1063469 -1580788 -1917333 -1713508 -1188041 -727523 -366939 16899
39667 16899 243865 -6332 -630488 -1108415 -1143524 -973805 -933483 -998692 -953026 -783227
39657 -783227 -673522 -703544 -743084 -622471 -299892 115917 458635 666470 852386 1105712
39647 1105712 1240737 950919 280785 -285678 -364053 -112090 48561 -19971 -131604 -137605
39637 -137605 -36657 208496 649749 1115235 1262615 969979 487724 117191 -103799 -324022
39627c24022l17981l79764k82979N4234N01909O58059K59936l57350n40800j37275
39617h66033K87359K21424r5880o9656L31311M85486K0180n89472o18402p4268
39607i67951L27769J75836q7602J25364O21435O71556R3847m31444l06328J52962
39597C75444J92642l17194p42084n62977O117L83610K98765o3131l70890l93795
39587a193493p8323L87609O24194L77761j65254n10841l63218Q1478L95382L89757
39577e4948K31723J32635O9776r6558l24809l87104j94336L4243M6658j04121
39567f46841j59928k9897J32651K05166K19083J74541q361k42659k51570M701
39557f03114J37623j32347m65306l38897J34418L25590K2944k95144k57608j10331
$$ plain form
39627 -324022 -642003 -1021767 -1304746 -1250512 -748603 -90544 169392 -187958 -728758 -866033
39617 -866033 -578674 -357250 -453130 -522786 -191475 294011 314191 -275281 -893683 -967951
39607 -967951 -640182 -464346 -551948 -426584 194851 866407 960254 528810 222482 375444
39597 375444 568086 250892 -491192 -1054169 -1048052 -664442 -365677 -428808 -799698 -1193493
39587 -1193493 -1271816 -884207 -260013 117748 -47506 -558347 -921565 -840087 -444705 -54948
39577 -54948 176775 309410 379186 282628 -42181 -429285 -623621 -589378 -542720 -646841
39567 -646841 -806769 -836666 -704015 -498849 -279766 -105225 -113586 -356245 -607815 -603114
39557 -603114 -465491 -597838 -1063144 -1402041 -1267623 -942033 -919089 -1214233 -1471841 -1582172
39547a582172j35890j00619K51448N85701M49500O2307j6585J76907J24756j86062
39537c70709j75663K93959N66054K02769l12510l44956m3860K5275k17289l89991
39527g66921l03372o3333K78487O81090Q69792O08779J26530j35773j00359j8592
39517A176328k5010j15098l62071o93704o69123m6261N93300M53346k96478o56639
39507f41410j78919N00154O81197M52852K13405j4858l51870o23076o10775m06326
39497i79626j64029J56228N01300N84999L84056L44429O64278P95125K08971o71141
39487A824590r47299m73997K8508L5745k17673l10957k21773j26808k3082J76987
39477b55759L94759M57856L26892J15976o2146j92990l06029l50664j99865J23380
$$ plain form
39547 -1582172 -1718062 -1818681 -1567233 -981532 -532032 -469725 -486310 -309403 -184647 -370709
39537 -370709 -546372 -252413 313641 516410 203900 -141056 -184916 -159641 -376930 -766921
39527 -766921 -1070293 -1133626 -855139 -174049 695743 1304522 1431052 1295279 1194920 1176328
39517 1176328 1151318 1036220 674149 -19555 -688678 -734939 -141639 311707 15229 -641410
39507 -641410 -820329 -320175 361022 813874 1027279 1012421 660551 37475 -573300 -979626
39497 -979626 -1143655 -987427 -486127 98872 482928 827357 1491635 2286760 2495731 1824590
39487 1824590 877291 403294 431802 467547 249874 -61083 -282856 -409664 -432746 -255759
39477 -255759 139000 596856 923748 1039724 977578 784588 478559 127895 -71970 51410
39467E1410L05244O5620l77725m79414r1962L05709K64327p8835l10676k86489
39457f32791j06514J45073L53436L50769K10878K51710M81773M53029P948l09901
39447A205410p9142K53077R1219k75253j49883L76040N95250L68081J90379J42284
39437B717462k17621p99391q56059k20849K89083J54301m7352K95683P60027O19564
39427B694848M5305k25315l6565J12055q4466m42154o90837o70323k99419K16159
39417F19288L76435K0902l08015j03780L19676L43361L7295m8073J15943J5804
39407A388836m45589p24251n08913j70909j19914k46191k48577p3976J94883M92609
39397d61992O16334L24166j94380l55777L9704M54024L63815J5448J0336L86059
$$ plain form
39467 51410 356654 422274 44549 -434865 -526827 -221118 43209 -35626 -346302 -632791
39457 -632791 -739305 -594232 -240796 109973 320851 572561 1054334 1507363 1515311 1205410
39447 1205410 1126268 1379345 1470564 1195311 1045428 1421468 2016718 2384799 2575178 2717462
39437 2717462 2499841 1700450 844391 623542 912625 1066926 1019574 1315257 2075284 2694848
39427 2694848 2740153 2514838 2478273 2590328 2505862 2063708 1372871 702548 403129 619288
39417 619288 995723 1016625 708610 604830 924506 1267867 1305162 1257089 1373032 1388836
39407 1388836 943247 218996 -289917 -460826 -580740 -826931 -1075508 -1149484 -954601 -461992
39397 -461992 154342 478508 284128 -71649 -31945 422079 785894 801342 811678 1197737
39387A197737N94014L12260j66158m14223l84834k92331k17711m4171K83031N94466
39377A462080O38828L41916j13433m58864n54551m27424j71478J14231L25363
39368A156668L82763K75946M5097k41834m59208m63084k55064k6053P5927J31186
39358F22344K60507L60446K42886k1732j57174q5198k4764j28350k52869j99264
39348F16832Q047J98255K62154J85450J9461q4631M1289L50394N53587M32519
39338B583357P8115k61023m43449m73101m26314m38286n98165p44472n58519k2609
39328a304466M24333M22465J87995J60940L12416K28247j46127l32206n6174K63313
39318A60736Q5942m65323p60429m69272J33063O04689P39934N32005Q7551k97673
$$ plain form
39387 1197737 1791751 2104011 1937853 1523630 1138796 846465 628754 584583 867614 1462080
39377 1462080 2100908 2442824 2329391 1870527 1315976 888552 717074 831305 1156668
39368 1156668 1539431 1815377 1860474 1618640 1159432 696348 441284 415231 491158 622344
39358 622344 882851 1243297 1486183 1464451 1307277 1222079 1197315 1068965 816096 616832
39348 616832 624879 823134 1085288 1270738 1290199 1205568 1246857 1597251 2150838 2583357
39338 2583357 2661472 2400449 1957000 1483899 1057585 619299 21134 -723338 -1281857 -1304466
39328 -1304466 -880133 -457668 -269673 -108733 203683 431930 285803 -46403 -102577 160736
39318 160736 246678 -218645 -979074 -1448346 -1315283 -710594 29340 561345 648896 351223
39308C51223k63522K06575O58273O24430J20798m29430o57324n23326k48341j02258
39298b62902j78710k85941j62209J41419K75064Q5215j50114j62480q5209j08224
39288h94091l0375L81979P80606N68430j62251o20512l78635J13508K89966J89630
39278B38255R0564l6296k28762j36443M66678J054480Q93206J09100m08060j79734
39268A862988L46924N41605L17236m9566l41970l99590r2087L99837N72514J80039
39258C337930l78349n33765k46605M7243O1142p8618j63737k08371l27096m80146
39248A029628m82094k39036J06178L12117L07143K41938K35512J86690j9156k10021
39238A468899q5985K97675M78900J75631k86646l79049r0180O0036k37611o21885
$$ plain form
39308 351223 87701 294276 952549 1576979 1697777 1268347 611023 87697 -160644 -262902
39298 -262902 -441612 -727553 -889762 -748343 -473279 -388064 -538178 -700658 -785867 -894091
39288 -894091 -924466 -542487 238119 806549 644298 23786 -354849 -241341 48625 238255
39278 238255 328819 292523 63761 -72682 393996 1448476 2341682 2450782 2042722 1862988
39268 1862988 2209912 2751517 3068753 3019187 2677217 2277627 2185540 2585377 3157891 3337930
39258 3337930 2959581 2425816 2179211 2226454 2287596 2208978 2045241 1836870 1509774 1029628
39248 1029628 547534 308498 414676 726793 1033936 1275874 1511386 1698076 1678920 1468899
39238 1468899 1382914 1680589 2159489 2335120 2048474 1669425 1579245 1639281 1401670 779785
39228G79785n50630o5597K57055J09043j59677j24803P3536L8858j55191n9074
39218A43305L56772N53783K34735k10707l53296l41085m66232n39902k42336J95666
39208f69297K72485K9398k6108K27245L48841Q9572k23825k29099j7040J13546
39198h4282N8996q2587j49232L291L08223M15156J24690k07714j21198K19788
39188D85131K84756O7420L9048K30620J69481j38521o2183M87222O52219m7923
39178B167270q11826p08954o4053J54135j88597m30367k82547n0920J22009L79977
39168B86127N97805M74729J53236N3729J36727O067l10480l91957k03634j11394
39158F90955j13752J62366O18756O40632Q5639m33346m99422m11406m74240m78263
$$ plain form
39228 779785 229155 163558 420613 529656 369979 245176 318712 357570 202379 143305
39218 143305 500077 1053860 1288595 1077888 724592 383507 -82725 -622627 -864963 -669297
39208 -669297 -396812 -367414 -393522 -166277 182564 272136 48311 -180788 -197828 -84282
39198 -84282 -25286 -107873 -257105 -253814 54409 469565 594255 386541 265343 485131
39188 485131 769887 837307 876355 1106975 1276456 1137935 1075752 1562974 2215193 2167270
39178 2167270 1355444 646490 582437 736572 547975 117608 -164939 -215859 -93850 286127
39168 286127 883932 1358661 1511897 1565626 1702353 1708420 1397940 1005983 802349 690955
39158 690955 577203 739569 1358325 1998957 2084596 1651250 1151828 740422 266182 -212081
39148b12081k36863J0985J09474K74505N03646L61167k00880m81466n1896M84830
39138E61421M05910k3781r8192J56861J99378J9833P4889L34858K78744j55699
39128A754222m11761k10499Q0348J20297K6596l6978j44274k88629k73484j01837
39118E14001k3196n1403P9724L29573K64843j93965m77138j66687L69821N41571
39108A187144L27961Q5542p1421k12971k14029L2604K26436L0227k91642j67532
39098I32319L82130P09047M76478R2812K7040J81774K24913J37155P8813Q972
39088C251453j93452m28684n34667n78047o52566n60092j03160M13727M61116
39079A075628Q5372o3503L35959P75188O33845K9564m25958m59397l02614j81407
$$ plain form
39148 -212081 -448944 -437959 -328485 -53980 449666 810833 609953 128487 76591 561421
39138 561421 967331 943550 845358 1002219 1201597 1221430 1296319 1631177 1909921 1754222
39128 1754222 1342461 1131962 1212310 1332607 1359203 1322225 1177951 889322 615838 514001
39118 514001 490805 439402 519126 848699 1113542 919577 442439 275752 645573 1187144
39108 1187144 1515105 1600647 1529226 1316255 1102226 1134830 1361266 1391493 1099851 932319
39098 932319 1314449 2023496 2499974 2592786 2619826 2801600 3026513 3163668 3242481 3251453
39088 3251453 3058001 2629317 2094650 1516603 864037 303945 200785 614512 1075628
39079 1075628 1161000 1097497 1433456 2208644 2842489 2872053 2446095 1986698 1684084 1502677
39069A502677q9967n7573k21988n32826o86599m85186n7576L35537N18301M05823
39059F30623M9935k75724l04802j51134j60177l22839k15324L04032P39694O19274
39049I13558J83284O277J58451K17992J3647j46324m0623J08471K0849k12160
39039A223422l02071j77087k0145J4116l2119j3815J26891K74661K67973J30959
39029A492785Q7973K63391M73471M55252K08414n7638k27525l28313l42641k05150
39019A820019K9618K14540K90311K73441J37560q8109k00747p2083O9781q1571
39009B392760m15080n33636l35895p8176J09685L07789L95853J08598l78039m91632
38999A082227j15706J83149P9600J1824L26373N34236R6576n44140n44441K9697
$$ plain form
39069 1502677 1412710 1355137 1133149 600323 -86276 -571462 -629038 -293501 224800 630623
39059 630623 680558 404834 100032 -51102 -211279 -534118 -749442 -445410 294284 913558
39049 913558 1096842 1103119 1261570 1479562 1493209 1346885 1306262 1414733 1435582 1223422
39039 1223422 921351 744264 724119 738235 706116 692301 819192 1093853 1361826 1492785
39029 1492785 1580758 1844149 2317620 2772872 2981286 2923648 2696123 2367810 2025169 1820019
39019 1820019 1849637 2064177 2354488 2627929 2765489 2677380 2476633 2404550 2474331 2392760
39009 2392760 1977680 1444044 1108149 1029973 1139658 1447447 1843300 1951898 1573859 1082227
38999 1082227 966521 1149670 1229270 1241094 1567467 2101703 2198279 1654139 1109698 1139395
38989A139395L47994J38760l3886J43117K63095N6947q8741J34731L74566K40343
38979B716321k6416j5820J52411J32402J4151J14072L27383K63215o7542k31326
38969C378851n3469J38727M9489j80602k54832j38294k0394j0345k1983Q1971
38959B969119L08013N05644N29095L99762K37753O8538j55360l56359l68868k06726
38949C930611n7363L9363K22711M49048M54991K31453J39060L18772M09428J77242
38939F315316j9457J49160L24846L2655m12323k92401L85314Q87167Q26337N20561
38929H717175K84753J21684J79780O99820J311339J213368L82247k10168n378
38920A2694620L45864J72813o9146L25689R89494J084072P85675J011611J821767
$$ plain form
38989 1139395 1487389 1626149 1592263 1735380 1998475 2055422 1966681 2101412 2475978 2716321
38979 2716321 2689905 2674085 2826496 2958898 2973049 3087121 3414504 3677719 3610177 3378851
38969 3378851 3325382 3464109 3513598 3332996 3078164 2939870 2919476 2909131 2887148 2969119
38959 2969119 3277132 3782776 4311871 4711633 4949386 5017924 4862564 4506205 4137337 3930611
38949 3930611 3873248 3912611 4135322 4584370 5039361 5270814 5409874 5728646 6138074 6315316
38939 6315316 6295859 6445019 6769865 6802520 6390197 6097796 6483110 7370277 8196614 8717175
38929 8717175 9001928 9123612 9303392 10003212 11314551 12527919 12910166 12699998 12694620
38920 12694620 13040484 13213297 13144151 13469840 14459334 15543406 16329081 17340692 19162459
38911A9162459K256963J899848J529098J854566K502443K790879K819696L153847
38903C7969799L865757M509471M830038N019681N392137O147192P327777Q714274
38895H3776126R896156J0753464J1800898J3789371J6956439K0846391K4933767
38888A92752612K9323672L4503843L9790819M1765548L5240433J7534620p490071
38881C83421476l0643474m3889623m5867723m1070498l4601974k8690232k3436289
38874A35221663j8830682j5109445j2159410r689995p792998o711387o214116
38867E8713630n712603m938845m128383l563240l232720k942787k552350k101717
38859B9540985j794835j752467j737230j365273p04470l26175n20001q16874o76688
$$ plain form
38911 19162459 21419422 23319270 24848368 26702934 29205377 31996256 34815952 37969799
38903 37969799 41835556 46345027 51175065 56194746 61586883 67734075 75061852 83776126
38895 83776126 93672282 104425746 116226644 130016015 146972454 167818845 192752612
38888 192752612 222076284 256580127 296370946 338136494 373376927 390911547 383421476
38881 383421476 352778002 308888379 263020656 221950158 187348184 158657952 135221663
38874 135221663 116390981 101281536 89122126 79432131 71639133 64927746 58713630
38867 58713630 53001027 48062182 43933799 40370559 37137839 34195052 31642702 29540985
38859 29540985 27746150 25993683 24256453 22891180 22186710 21860535 21340534 20523660 19846972
38850A9846972l13124k80901m63475j74738P07660J398460J228788M62872k24263
38841B2188251o28483r82881j369404j586471j455970r80035l36573R6797m1097
38832A4904134o25923j056440r82935p34481p25772p83152m92140O1039M04178
38823I968508L68861J80373n727j71526j68975J00477L42816K44245P7707L30889
38813A1267648Q21895R13103O16335O59940J263754J677664J321498O52016M03897
38804A9597750N86635P80834R12549J152797J442376J653692J905399K270601
38796C0302633K519891K570418K800039L486117M337555N003040N587042O238325
38788F2845060O777214P227855Q114689R673636J1453133J3324285J6071613K0234525
$$ plain form
38850 19846972 19533848 19252947 18789472 18614734 19322394 20720854 21949642 22412514 22188251
38841 22188251 21559768 20576887 19207483 17621012 16165042 15185007 14848434 14945231 14904134
38832 14904134 14278211 13221771 12238836 11504355 10778583 9995431 9503291 9564330 9968508
38823 9968508 10337369 10517742 10512015 10340489 10171514 10271991 10614807 10859052 10936759 11267648
38813 11267648 12089543 13002646 13618981 14278921 15542675 17220339 18541837 19193853 19597750
38804 19597750 20184385 20965219 21877768 23030565 24472941 26126633 28032032 30302633
38796 30302633 32822524 35392942 38192981 41679098 46016653 51019693 56606735 62845060
38788 62845060 69622274 76850129 84964818 94638454 106091587 119415872 135487485 155722010
38780A55722010K5342884L1092152L7512975M1974712L7774652J9712488q125381
38773C41006492l3241784m5287804m4265237l7413005l0551443k4741874j9399958
38766A06105387j4934541j1853444r674965p799257o323673n415035m753092m021379
38758D1330001l279851k598278j905712j329243j109559j114335r85510p58628
38750B8248885p41415q09904m93226K00951P11668P84461P84901R97902J188642
38741C0872865J084928Q45060Q33484J244641K020551K816674L065516K479315
38733D5263034J517764R98000J250120J982067K852101L736073M527450N164810
38725F7291419N847996O832525Q072056R399996J0880609J2629833J4606979J7005163
$$ plain form
38780 155722010 181064894 212157046 249670021 291644733 329419385 349131873 341006492
38773 341006492 307764708 262476904 218211667 180798662 150247219 125505345 106105387
38766 106105387 91170846 79317402 69642437 61843180 55519507 50104472 45351380 41330001
38758 41330001 38050150 35451872 33546160 32216917 31107358 29993023 29007513 28248885
38750 28248885 27507470 26697566 26204340 26405291 27116959 27901420 28686321 29684223 30872865
38741 30872865 31957793 32802853 33636337 34880978 36901529 39718203 42783719 45263034
38733 45263034 46780798 47778798 49028918 51010985 53863086 57599159 62126609 67291419
38725 67291419 73139415 79971940 88043996 97443992 108324601 120954434 135561413 152566576
38717A52566576K0404485K5023499L0377325L6106162M1789423M4518519L8221877
38710C89007866J8769686r521657l5059019m8335910m9036789m3317148l6386323
38703A86120706k9671545k3320331j8114725j4553843j2127943j0231293q724073
38696F9376953p401792n994406m839302m513327m667405m269971l163721k299281
38688C2227748k161484k060950j427091p77864p72261j119978j130957p38553
38680B2038610l30839o3234P1471n7828l74092l57939K52554Q87345Q64191L59629
38670B3289868K4160j01200n46854j387692j995673j939346j531413j265112j172548
38661A3374190j005921p17749m85412m49614o10712q36251q77896n77037j44737
$$ plain form
38717 152566576 172971061 197994560 228371885 264478047 306267470 350785989 389007866
38710 389007866 407777552 398255895 363196876 314860966 265824177 222507029 186120706
38703 186120706 156449161 133128830 115014105 100460262 88332319 78101026 69376953
38696 69376953 61975161 55980755 51141453 46628126 41960721 37690750 34527029 32227748
38688 32227748 30066264 28005314 26578223 25800359 25028098 23908120 22777163 22038610
38680 22038610 21707771 21644537 21716008 21658180 21284088 20926149 21178703 22066048 22930239 23289868
38670 23289868 23314028 23212828 22665974 21278282 19282609 17343263 15811850 14546738 13374190
38661 13374190 12368269 11650520 11165108 10715494 10104782 9268531 8390635 7813598 7668861
38652G668861p150k48358m55956l02030k3028m1125l04283l73460r2478K25882
38642F046875L28373L43930M04002K97127j59238o07394m34739M07198J202938
38633G829072J231074N20316k87939o69992o30720m71724l80058l29529k58806
38624F551694j77736q1129Q8896K82850K77252k1745k89628j14507L56908M86378
38614G359233K2604m79757m22908J1935K28737R9468n2875j37469l31407n23729
38604E773832l91299m8626M7145r1564M396K97352J50268m57352n37647M30613
38594E177118J431894J220874J43453l73995J48656P96277P80392L65964P8067
38585I768700r1959k75206k31740K16764P23095Q47895O45846M52031L67656L20008
$$ plain form
38652 7668861 7661711 7413353 6957397 6655367 6632339 6591214 6286931 5913471 5820993 6046875
38642 6046875 6375248 6719178 7123180 7420307 7261069 6653675 6218936 6626134 7829072
38633 7829072 9060146 9580462 9292523 8622531 7991811 7520087 7140029 6810500 6551694
38624 6551694 6373958 6292829 6381725 6664575 6941827 6920082 6630454 6515947 6872855 7359233
38614 7359233 7381837 6902080 6479172 6491107 6719844 6819312 6766437 6628968 6297561 5773832
38604 5773832 5382533 5333907 5381052 5289488 5293884 5591236 5741504 5284152 4746505 5177118
38594 5177118 6609012 7829886 7973339 7599344 7748000 8544277 9324669 9690633 9768700
38585 9768700 9676741 9401535 9169795 9386559 10109654 10957549 11603395 12055426 12423082 12743090
38575A2743090L96846P21890J100108J137544P39740K81861K39698P44962J497716
38566A9603455K046616K157611J945992J685836J569688J682398K071729K710055
38558C5473380L461561M193788M835748N272665N396402N404590N798878O847038
38550G6684050Q267756R701030J1223946J3077480J5190100J7444905K0214357
38543A71803624K4134454K9415929L5520866M0795528M1724972L3662096J4612849
38536C91670318j0911893l3356202m5002589m5419507l9901272l3596989k8160852
38529A55321014k3128818j8408053j4634799j2124340j0464022r037144p556514
38522E9967324o150941n108907m495173m022175l419186k827320k568611k585498
$$ plain form
38575 12743090 13139936 13861826 14961934 16099478 16839218 17121079 17360777 18105739 19603455
38566 19603455 21650071 23807682 25753674 27439510 29009198 30691596 32763325 35473380
38558 35473380 38934941 43128729 47964477 53237142 58633544 64038134 69837012 76684050
38550 76684050 84951806 94652836 105876782 118954262 134144362 151589267 171803624
38543 171803624 195938078 225354007 260874873 301670401 343395373 377057469 391670318
38536 391670318 380758425 347402223 302399634 256980127 217078855 183481866 155321014
38529 155321014 132192196 113784143 99149344 87025004 76560982 67523838 59967324
38522 59967324 53816383 48707476 44212303 40190128 36770942 33943622 31375011 28789513
38514B8789513k456810k015380j592543j482372j460556j113705m85559o6756
38506A8115832j19696k92652q9003M31977P10072M63460J01611J38257M20057
38497A9879915L09018m25706j285582j685277j578836j302947j090097r40571
38489A1879917p76676n42376k86138k26328n29329r56736j025149o46275k82002
38480F608908k66166l27384j00255K06652R7338m18354p68870n50031L9910N30776
38470E052524O68255N06920K25173n2104l16692n87000p70785p39862n65492m78023
38460B942914n04349l77660M6093N12911O92042N56754K71954m8249k76432k54697
38450C561281q1274r8944l17385k29214L94133R19708O41490j48031n62008m15582
$$ plain form
38514 28789513 26332703 24317323 22724780 21242408 19781852 18668147 18182588 18115832
38506 18115832 17996136 17703484 17614481 18046458 18756530 19219990 19321601 19459858 19879915
38497 19879915 20188933 19763227 18477645 16792368 15213532 13910585 12820488 11879917
38489 11879917 11103241 10560865 10274727 10048399 9519070 8562334 7537185 6890910 6608908
38480 6608908 6342742 6015358 5915103 6121755 6219093 5800739 5031869 4481838 4521748 5052524
38470 5052524 5720779 6227699 6452872 6400768 6084076 5497076 4726291 3986429 3420937 2942914
38460 2942914 2438565 2060905 2106998 2619909 3311951 3868705 4140659 4092410 3815978 3561281
38450 3561281 3480007 3381063 3063678 2834464 3228597 4148305 4789795 4641764 4079756 3664174
38440C664174l35577n84305o18071p0573N61124O43374K66646r3664l38946o33654
38430B460528q21563n37242J62751P40958Q00647M59223O4767j96593l32538l78382
38420B422556l25331j67032L1932J32072M0676j48137k28936j43989n9192j12973
38410A441646k06253j54247M1248K05096K24396J33185k1365k43432m64293m86341
38400D69640j94391K18190M02465K70638Q2117J0510j44329n42903q00126l70969
38390e99158N41967J008479N47704j87930l07518J23921L23467j6680l96849l33457
38380G03946O1486M16639N27898L11789k18139p37308p70934k96621J58779K48430
38370D05965K63747N56496Q53909O13493j11929o54523n90341k06222J3723K3693
$$ plain form
38440 3664174 3328597 2744292 2126221 2055648 2616772 3260146 3526792 3433128 3094182 2460528
38430 2460528 1638965 1101723 1264474 2005432 2806079 3265302 3330069 3133476 2800938 2422556
38420 2422556 2097225 1930193 1962125 2094197 2134873 1986736 1757800 1613811 1554619 1441646
38410 1441646 1235393 1081146 1122394 1327490 1551886 1685071 1663706 1420274 955981 469640
38400 469640 275249 493439 895904 1166542 1248659 1259169 1114840 571937 -228189 -599158
38390 -599158 -57191 951288 1498992 1311062 1003544 1127465 1450932 1434252 1037403 703946
38380 703946 765432 1182071 1709969 2021758 1803619 1066311 295377 -1244 157535 405965
38370 405965 669712 1226208 2080117 2693610 2581681 1927158 1336817 1130595 1144318 1168011
38360A168011R1689K57435K61794J1749k03081j20938R5764J40536Q6708K56287
38350B045954N99534O65628L17221j7256q7218l02965r71303j485720j026928
38341b63053J19098P72443M42589j08028j28462Q0824j08455n22837m94382L1829
38331a78434M28009L57622J82786K72525M09279J75079l53096o31861l35478K29968
38321E56399M97705L05657J4790k8239R0378J11247M8361Q2579J50790K3196k36241
38310A616622k90428p8013N3404r5046k56375j45540J10624K42931K44055K16842
38300A619076Q0360k31731m63738k98705J40444L64326R8345m24818p50773o18723
38290d85937j19194M05692O20678M62575J54327n9227j11204m6581Q0849J76330
$$ plain form
38360 1168011 1259700 1517135 1778929 1790678 1587597 1466659 1562423 1702959 1789667 2045954
38350 2045954 2645488 3311116 3628337 3611081 3523863 3220898 2249595 763875 -263053
38341 -263053 -143955 628488 1071077 963049 834587 915411 806956 284119 -210263 -178434
38331 -178434 249575 607197 789983 1062508 1471787 1646866 1293770 661909 326431 556399
38321 556399 1054104 1359761 1374551 1346312 1436690 1547937 1596298 1678877 1829667 1852863 1616622
38310 1616622 1326194 1248181 1301585 1206539 950164 804624 915248 1158179 1402234 1619076
38300 1619076 1699436 1467705 1003967 705262 845706 1210032 1308377 883559 132786 -485937
38290 -485937 -605131 -199439 421239 883814 1038141 978914 867710 821129 901978 1078308
38280A078308J22647o9345k33205k25234l4547K63561N04875M50624O3597k78731
38270A642550j92768J03189L1796m24652n83764p6310N26731M99064n2183m63181
38260A010472m62412l14233k08911n0911J81807L07071K06160n9444l65673n33647
38250b89721l52174J28239M70753L40745j7854j34458L938K6349j52820j91886
38240a68889J14858N21467O78224N10757J76894j16496j98934m3404J70843K47055
38230A892375J89460R3418o4839l14987m91596m18005k14986j61205l05498m62608
38220b58471n16323m72843k99086J7912L15376M12519L54164K79496J82037M2886
38210E7667J4450J61357K17891k3073k75593j59949J28326O6457l60519o07946
$$ plain form
38280 1078308 1200955 1131610 898405 673171 638624 902185 1407060 1857684 1921281 1642550
38270 1642550 1449782 1552971 1584767 1160115 576351 500041 1026772 1525836 1473653 1010472
38260 1010472 548060 233827 24916 -25995 155812 462883 669043 609599 243926 -289721
38250 -289721 -641895 -513656 -42903 297842 279988 145530 149468 175817 22997 -168889
38240 -168889 -54031 467436 1145660 1656417 1833311 1716815 1517881 1474477 1645320 1892375
38230 1892375 2081835 2175253 2110414 1795427 1303831 885826 670840 509635 204137 -258471
38220 -258471 -774794 -1247637 -1546723 -1528811 -1213435 -800916 -446752 -167256 14781 57667
38210 57667 72117 233474 451365 428292 152699 -7250 121076 187533 -172986 -780932
38200g80932l53642J64694O05236Q20672O84681J55563m00323m64850p5934J93471
38190E48636O7621j29336j28081j07780k14576k39286q8020p5897l74553n93895
38180a335167l34174J84662M68925M54761M36650M84902L68526N335l45033l69816
38170A9571k4248M17209N71105L04589j01120l04933l69817n77210q16722o19927
38160a501503O7388O15718M94960l6327l37654j93772J01480K41579J76767K7172
38150c44192m3713K6734Q1473m8483j87144J2749M65450O40107L19164q6490k34414
38139F01241l75777p83822j086078p16577J87834Q63222Q28165L39750k2593M7503
38129a17132L66623M70980J24470l30869l59761L308J73339r0615l22405j36233
$$ plain form
38200 -780932 -1134574 -969880 -364644 456028 1140709 1296272 895949 431099 355165 548636
38190 548636 616257 486921 358840 251060 36484 -202802 -290822 -366719 -741272 -1335167
38180 -1335167 -1669341 -1484679 -1015754 -560993 -124343 360559 729085 734420 389387 19571
38170 19571 -4677 412532 983637 1288226 1187106 882173 512356 -64854 -881576 -1501503
38160 -1501503 -1434115 -818397 -323437 -359764 -697418 -891190 -789710 -548131 -371364 -344192
38150 -344192 -387905 -361171 -279698 -328181 -515325 -502576 -37126 602981 922145 835655 601241
38139 601241 225464 -558358 -1644436 -2361013 -2173179 -1309957 -481792 -142042 -164635 -117132
38129 -117132 249491 720471 844941 514072 154311 157619 330958 240343 -82062 -218295
38119b18295J65765J67706J0127k405J3996r9532l3498M38665P74284L25677n34073
38108A008417p91591k41319K61137P8301m24367n86033l18605K5134J93877J64735
38098f30314L1369m2334L4395J32032J11145J09260L15252N58464N03367J79151
38088A301787q8455k01730l15654m06359k88473l7560P2909M0650Q0859J51468
38078C09442M2594j02841O2609M07344L95827o9156m79900n18785m17983l75820
38068g46669k40690K012M2326j66274j99239J38171M33469L31617P1162j0779
38058c44894k6598j85194l26399k43588j07578j41864j77073P3032N32764Q79798
38048f7594R03883N31615j78951q47153r63289n27073r1175N0929K00022M91973
$$ plain form
38119 -218295 -52530 115176 125303 122898 136894 37362 3864 442529 1216813 1542490 1008417
38108 1008417 216826 -24493 236644 314945 -109422 -695455 -1014060 -988926 -795049 -630314
38098 -630314 -598945 -641279 -606884 -474852 -363707 -254447 60805 619269 1122636 1301787
38088 1301787 1213332 1011602 695948 289589 1116 -36444 36465 77115 157974 309442
38078 309442 352036 249195 311804 719148 1114975 1045819 565919 47134 -370849 -746669
38068 -746669 -987359 -985347 -943021 -1109295 -1308534 -1170363 -736894 -405277 -334115 -344894
38058 -344894 -371492 -556686 -883085 -1126673 -1234251 -1376115 -1553188 -1480156 -947392 -67594
38048 -67594 836289 1367904 1188953 341800 -621489 -1148562 -1239737 -1188808 -988786 -496813
38038d96813M53255j80512p85778o39880M7240N38450O16475N46567L58803n2720
38028D05087l55590j17414L74775L88390j72151o40912n66356j68281K10641M69524
38018a72287M92704J58832k53306k37969J95335M70342K88253R829R274J45534
38008A106541J24720l4287j61804k34372k85854k87855k67349k95846k99825j68152
37998h04083l9033r8565j16425L07639R69358J112844M62499l45439o47622n49107
37988B52066m67606l74181k778M98033O63874L58330p9962k91693k39788j58565
37978A57730l14512o94524q59909l78159M84329Q72415L84245l64591n42937j23773
37968a379686K98285L89718K66216J2450l89979o77176m06748L86006J022799
$$ plain form
38038 -496813 -43558 -224070 -1009848 -1649728 -1602488 -1064038 -447563 99004 457807 405087
38028 405087 49497 -67917 306858 695248 523097 -117815 -684171 -852452 -641811 -172287
38018 -172287 320417 479249 225943 -12026 183309 653651 941904 951733 961007 1106541
38008 1106541 1231261 1196974 1035170 800798 514944 227089 -40260 -336106 -635931 -804083
37998 -804083 -843116 -941681 -1058106 -750467 218891 1331735 1794234 1448795 801173 252066
37988 252066 -215540 -589721 -592499 -94466 569408 927738 847776 556083 316295 157730
37978 157730 -156782 -851306 -1711215 -2089374 -1605045 -732630 -348385 -712976 -1255913 -1379686
37968 -1379686 -1081401 -691683 -425467 -413017 -802996 -1480172 -1886920 -1500914 -478115
37959d78115Q97780J62928m51633m01116J57223N60990L65437j39442k92597L5682
37949D17137K29489j88061q17458r23752m48275K7816J90694K93331N32407O88713
37939B041N64882L27409J77578L9783j82719l48450l21988k16150j50332j7615
37929a25561K45012L91265J85492j85352l45951k55355j66000j55327o7201J01746
37919c77232J44728M2887N0389K31887K64611m8869l63374k31925K23345M74403
37909D10850L39324J49992J43339J27781p2177k40162j40986K9082n8727l06161
37899C82155l30453p0305J53840J61711J02707R4371N3512l9278p4040r6914k75071
37888F2235m71476l03833J83552L97238O0934k70055r272N52940P01036L51667
$$ plain form
37959 -478115 419665 582593 130960 -270156 -112933 448057 813494 674052 381455 417137
37949 417137 646626 458565 -358893 -1282645 -1730920 -1703104 -1512410 -1219079 -686672 2041
37939 2041 566923 894332 1071910 1111693 928974 580524 258536 42386 -107946 -125561
37929 -125561 119451 510716 696208 510856 164905 -90450 -256450 -411777 -478978 -377232
37919 -377232 -232504 -189617 -139228 92659 357270 308401 -54973 -286898 -63553 410850
37909 410850 750174 900166 1043505 1171286 1099109 858947 717961 747043 688316 382155
37899 382155 51702 -18603 135237 296948 399655 494026 547538 508260 434220 337306 62235
37888 62235 -409241 -713074 -529522 -132284 -71350 -341405 -350677 202263 903299 1254966
37878A254966K3781o9727k13408m90733n61107k72723N1627J23253K8250q8806
37868b14627k26172k53426P4752O01767P34508K38578l25693l03448K38198P12194
37858A276631P30468L11458l22006q04210p65408k77304Q2908l7230k48223l4090
37848h7006M10581M91402J67078j6151J90031L95625K20226j95121m80789m70159
37838F25717j94685K23225N22332M30468J408l77981m23446k28285o5170r7163
37828D16420k87997m07444j79436L35865O10257K38775m19762o24142k49621R4509
37818d72576P549j98901j36868O4711J38935J89726L92251N28190K86811j74637
37808F25191l92019k05887J07064K10727j7585m28880o05659j67823O55721J036850
$$ plain form
37878 1254966 1278747 1209020 995612 504879 -56228 -328951 -277324 -154071 -125821 -214627
37868 -214627 -440799 -694225 -619473 -17706 716802 955380 629687 326239 564437 1276631
37858 1276631 2007099 2318557 1996551 1192341 426933 149629 232537 195307 -52916 -87006
37848 -87006 323575 814977 982055 965904 1155935 1551560 1771786 1576665 1095876 625717
37838 625717 431032 654257 1176589 1607057 1608465 1230484 807038 578753 513583 416420
37828 416420 128423 -279021 -458457 -122592 487665 726440 306678 -317464 -567085 -472576
37818 -472576 -465027 -663928 -800796 -736085 -597150 -407424 -15173 513017 799828 625191
37808 625191 233172 27285 134349 345076 327491 -101389 -707048 -874871 -219150 817700
37798H17700M80456m95390r93436q09261m20128j30162J87327N51282O66247L82356
37788B36991n9828l70184m75755l96440j81920q903j3154q290K76141O70596O92239
37777C61493K60992j30361q6796K30367M49806M24521J78272k07402m85319l80782
37767F14791p897K02777J31182J03654K38146J73566k40779n12821k31053K16231
37757F87797K08636j46259k45769K2125J92315O5394j4003J81243L86088L34023
37747A671590J80974J94659L46112M48972M65829M56811L90648J96502q5796l15447
37737C950854l43816q3387L94039Q28616R95492R60116R56029J037776J065149
37728I760868J020025J084887J371922J837182K515591L494189M431740M396254
$$ plain form
37798 817700 1298156 802766 -190670 -999931 -1420059 -1550221 -1362894 -811612 -145365 236991
37788 236991 177163 -193021 -668776 -1065216 -1247136 -1256039 -1269193 -1277483 -1001342 -330746 361493
37777 361493 622485 492124 405328 635695 1085501 1510022 1688294 1480892 995573 614791
37767 614791 606894 809671 940853 1044507 1282653 1456219 1215440 702619 471566 687797
37757 687797 896433 750174 504405 526530 718845 784239 770236 951479 1337567 1671590
37747 1671590 1852564 2047223 2393335 2842307 3308136 3764947 4155595 4352097 4266301 3950854
37737 3950854 3607038 3523651 3917690 4746306 5741798 6701914 7657943 8695719 9760868
37728 9760868 10780893 11865780 13237702 15074884 17590475 21084664 25516404 29912658
37720B9912658K616385n31092l518213m847145m288391k942436k085243k018499
37712A2298024k117409j849981j376948j043847p39046k03049K92751J90689m37671
37703E013513q21411n16426J5530J33122j40187l75740m50429n08730m77517j69794
37693A701931K26454K87968j957k26957k22168k99982o08211p32400k97853L56132
37683A82957N51033J69792k57846l42817k63895k91402l04618q5404J86046J33762
37673c22392k11541m12199k59374l8849l1477r1908L9692K84716L90777L45892
37663c06663K91986J90114l6483j50504J20777M78839K99296l68087o46479m8913
37653a76117O78904N21362l36266p33278j70760N32321M63993j31781l31166J14418
$$ plain form
37720 29912658 32529043 31997951 28479738 23632593 19344202 16401766 14316523 12298024
37712 12298024 10180615 8330634 6953686 5909839 5170793 4967744 5260495 5451184 5013513
37703 5013513 4192102 3675676 3691206 3824328 3684141 3308401 2857972 2349242 1871725 1701931
37693 1701931 1928385 2216353 2214396 1987439 1765271 1465289 857078 124678 -173175 182957
37683 182957 733990 903782 645936 303119 39224 -252178 -556796 -642200 -456154 -322392
37673 -322392 -533933 -946132 -1205506 -1244355 -1275832 -1367740 -1328048 -1043332 -652555 -306663
37663 -306663 -14677 175437 138954 -11550 109227 588066 887362 519275 -127204 -176117
37653 -176117 502787 1024149 687883 -45395 -216155 316166 780159 648378 317212 431630
37643D31630N18102L01278k64792n64557m81776l71636l88753k90879M2182K99526
37633g69675J94417m7605j2652K30430K13402j60317l87353j13051K89709K55884
37623c06811j26737k75748j2217K11776O8032j47901m6925J89318J00346k66575
37613f13442l51110P3402M84484L13736k21900l91091M2174N14867M70676P2965
37603C94761j51073p3885J4203j6469J1307J62935K58485K44552L04122M52556
37593A601494M11221R3338j59770j08770k8550k34760n19271m95262k41729r9310
37583B18631l0516K27540M89310K77401l05139n52637k05058J49529N8861m9810
37573B78112L51768Q77967P03459j89153r38984r51295n00251j10490J04024K62985
$$ plain form
37643 431630 949732 1251010 986218 421661 -60115 -431751 -820504 -1111383 -1069201 -769675
37633 -769675 -575258 -622863 -635515 -405085 -191683 -352000 -739353 -852404 -562695 -306811
37623 -306811 -433548 -709296 -721513 -509737 -441705 -589606 -636531 -447213 -346867 -613442
37613 -613442 -964552 -891150 -406666 -92930 -314830 -705921 -663747 -148880 321796 394761
37603 394761 243688 169803 184006 167537 178844 341779 600264 844816 1148938 1601494
37593 1601494 2012715 2106053 1946283 1837513 1808963 1574203 1054932 559670 317941 218631
37583 218631 188115 415655 904965 1182366 877227 324590 119532 269061 327922 278112
37573 278112 629880 1507847 2211306 2022153 1083169 131874 -368377 -478867 -374843 -111858
37563a11858L19392J68097o4973j24069N7515K92048L45740J53328j13919j94637
37553G26664m1512P3239r4499l82639m22484j71323M3964K6087o7617n9878K7611
37542c42387J99801N53560R17198Q18647J45778m87186m48436P3332L86058K55898
37532B072263L1576p4829k12861l47357j26512M44900P40397L19095l83451o04937
37522A858284k31011K14681L58997K85823J39406r7706l65672m55370l15681j61407
37512A230344j50118j74484r2615L2855N2610o7358k70422m93917o22606m93407
37502a049118q0225M04755O98105P19448N62535L41016J25810l0937j01912j03139
37492A486338p3848n4893p4316j05995p7314J495l0227k83112n80290o00966k84834
$$ plain form
37563 -111858 207534 375631 310658 186589 244104 536152 881892 1035220 921301 726664
37553 726664 685152 758391 663892 281253 -141231 -312554 -268590 -242503 -310120 -369998 -342387
37542 -342387 -142586 410974 1328172 2146819 2292597 1805411 1356975 1430307 1816365 2072263
37532 2072263 2103839 2029010 1816149 1468792 1342280 1787180 2527577 2846672 2463221 1858284
37522 1858284 1627273 1841954 2200951 2486774 2626180 2528474 2162802 1707432 1391751 1230344
37512 1230344 1080226 905742 813127 845982 898592 831234 560812 66895 -555711 -1049118
37502 -1049118 -1129343 -724588 -26483 692965 1255500 1596516 1722326 1691389 1589477 1486338
37492 1486338 1412490 1357597 1283281 1177286 1099972 1101467 1071240 788128 207838 -393128 -677962
37481f77962P8174K06026J06368n0185j56022j78810j11956j2086N3574J60732
37471e82147M37857P38294O62949J11237m21092l96116M5786K55871n9137m77939
37461C15563m62971m9704K54623J31835j92476k73701o056K55123J49862k08716
37451h6618l59901r5260K55931K53377q2787l04687r7847L39941N03909J10912
37441D36970n67307r02427n38200J59500M35157j928o29882p42689k42257L81492
37431b211571O89163O40982L93461N1766l10613n64712n50455j75529M38528Q81257
37421g17723P32943Q7867m03088k69389J68796K48808j14367l74502j92535J30661
37411g02529J83721P308j02306o5434l0207p5889j26879p7770J24072M16925N63176
$$ plain form
37481 -677962 -599788 -393762 -287394 -337579 -493601 -672411 -784367 -796453 -742879 -582147
37471 -582147 -144290 594004 1256953 1368190 947098 550982 596768 852639 793502 315563
37461 315563 -147408 -197112 57511 189346 -3130 -276831 -282887 -27764 122098 -86618
37451 -86618 -446519 -541779 -285848 -32471 -115258 -419945 -517792 -177851 326058 436970
37441 436970 -130337 -1032764 -1570964 -1411464 -976307 -978235 -1608117 -2350806 -2593063 -2211571
37431 -2211571 -1522408 -881426 -487965 -436199 -746812 -1311524 -1861979 -2037508 -1598980 -717723
37421 -717723 15220 103087 -300001 -569390 -400594 -151786 -266153 -640655 -833190 -702529
37411 -702529 -518808 -511500 -613806 -679240 -709447 -785336 -912215 -989985 -865913 -448988 114188
37400A14188L16146k20405n63360l70432J08916L03423J5682l40758k70101J62848
37390g43853L89531P8496l65622k94799K50747N08318O0242m91900l39507L54480
37380e93867O78020K60758k98053l72447p6562J32196R5907r2363l40363m44363
37370a051137j25465M82961P65942M22482l5639j3378K88911K56550j50908m05950
37360D34369k76457n7069O4499K73394O21697P66378M54093q3648m43333n03099
37350A250824l93396k41719j11984l1308M3918J59795K21723R1117j49265k37312
37340F02393r0342Q4916J00982O637o5585o6532J9959J88345K95048J36356k56639
37329I55538n76296n83771l42590n4709J48076J91533O0209q9157k8754K05626
$$ plain form
37400 114188 430334 209929 -353431 -723863 -614947 -311524 -295842 -636600 -906701 -743853
37390 -743853 -354322 -275826 -641448 -936247 -685500 -177182 -116940 -608840 -948347 -593867
37380 -593867 84153 344911 46858 -325589 -402151 -269955 -174048 -266411 -606774 -1051137
37370 -1051137 -1176602 -693641 72301 494783 459144 445766 734677 991227 840319 434369
37360 434369 157912 100843 165342 438736 1060433 1826811 2280904 2197256 1753923 1250824
37350 1250824 857428 615709 503725 472417 516335 676130 897853 988970 839705 602393
37340 602393 512051 596967 697949 704586 639001 572469 592428 780773 1075821 1212177 955538
37329 955538 379242 -204529 -547119 -601828 -453752 -262219 -202010 -291167 -319921 -114295
37319a14295K86449L8309k92389l75978k18905n2109L2598J07204J87116K25731
37309a76269K67921L85658M82731L71821O5779j88398k23265j55365j85380k91282
37299C53951k60092l2818J19036r3799n16629o15610j33914M94639O30015K21670
37289A66449j91058k49230j58721j90365k03621K3568K87598K15969q6637j06212
37279d92260L07146O36072L74552k70119o41654m57157n3276J63957J85482J90294
37269e6963J64496J8955q0671J07407M01027L02543k36910n81532k62958K80402
37259E5796K84866k35783n25730j70128M17300O61896M61623Q504n18653q59206
37249d19515p31515k64528L8478J6551O8909L70856M46128k290m02448j41699
$$ plain form
37319 -114295 172154 210463 -81926 -457904 -676809 -728918 -696320 -589116 -402000 -176269
37309 -176269 91652 477310 960041 1331862 1397641 1209243 985978 830613 645233 353951
37299 353951 93859 61041 180077 86278 -430351 -1045961 -1179875 -685236 -55221 166449
37289 166449 -24609 -273839 -432560 -622925 -826546 -802978 -515380 -299411 -386048 -492260
37279 -492260 -185114 450958 825510 555391 -86263 -543420 -596696 -432739 -247257 -56963
37269 -56963 107533 126488 45817 153224 554251 856794 619884 38352 -224606 55796
37259 55796 340662 104879 -420851 -590979 -173679 488217 949840 958344 439691 -419515
37249 -419515 -1151030 -1415558 -1377080 -1360529 -1291620 -920764 -474636 -476926 -879374 -1021073
37239a021073L66190K87304k48611l43237J61745M13561r664l89285p0824M79487
37229c74407M99224J60377J65622N14100N29384P16m80672m26921r1658M361k36929
37218B63197m97021m60237n7979M96130P86598M96857k29569q31727q28295k36397
37208a098443M77042P64870L88784l70655q83788p21867q5500M18479M19912Q5082
37198f06084j88216j88307K4731K70967L92213L39800K07674J46230K07159K79226
37188H85393J73250j97463o37191p14207k00333N03824O86222K23598j75584P4720
37178F22229N87212N83935O7010k43211o0633J10359r1151l20103k44884j87051
37168H23712n17377q94242p25399r7658L61143L78797K32635J61281J46805K38283
$$ plain form
37239 -1021073 -654883 -367579 -616190 -959427 -797682 -384121 -393785 -783070 -853894 -374407
37229 -374407 124817 285194 450816 964916 1494300 1495016 1014344 587423 495765 500126 263197
37218 263197 -233824 -694061 -752040 -255910 530688 1027545 797976 -33751 -862046 -1098443
37208 -1098443 -621401 143469 532253 161598 -722190 -1444057 -1529557 -1111078 -691166 -606084
37198 -606084 -794300 -982607 -957876 -686909 -294696 45104 252778 399008 606167 885393
37188 885393 1058643 861180 223989 -490218 -690551 -186727 499495 723093 547509 622229
37178 622229 1209441 1793376 1860386 1617175 1556542 1666901 1575750 1255647 1010763 823712
37168 823712 306335 -587907 -1313306 -1410964 -1049821 -671024 -438389 -277108 -130303 107980
37158A07980N24799P42821M53606k62034p68354o92795l39790j20953k6924R8082
37148b83562J91077J92919K64347M33691L65378j17629n65184m28650J19618L95305
37138E67310J61229j25484p4988J06235M6071j98707k71159m5013K47486L53178
37128G66158K54308Q0528q8145k57870m05861m15049j98436J17812K51608Q9381
37118A94434j35219j18146J09932K17337J5598k96571m07729k81494j35205q4561
37108i21624J8371L08646N78526M22865k20085q37886q40003k26519M36484O93786
37098e87439O19839N15490M56751L20656P1976j94063m00481n05737m55718k78619
37088d37345j43482j55890j66602L8073L94849N78683L63657j21620m70702l03672
$$ plain form
37158 107980 632779 1375600 1829206 1567172 798818 106023 -233767 -354720 -381644 -283562
37148 -283562 -92485 100434 364781 798472 1163850 1046221 481037 52387 172005 567310
37138 567310 728539 603055 528067 634302 680373 481666 210507 165494 412980 766158
37128 766158 1020466 1100994 1012849 754979 349118 -65931 -264367 -146555 105053 194434
37118 194434 59215 -58931 51001 268338 283936 -12635 -420364 -701858 -837063 -921624
37108 -921624 -903253 -594607 -16081 406784 186699 -651187 -1491190 -1717709 -1281225 -587439
37098 -587439 32400 547890 1004641 1325297 1397273 1203210 802729 296992 -158726 -437345
37088 -437345 -580827 -736717 -903319 -865246 -470397 108286 471943 350323 -120379 -424051
37078d24051L64392R82701Q96377Q7591p00800p89833l27812J7758o6048l08186
37068b67911l61071j56190J94801M99309N10159J83021j36087j20297L0051q5763
37058B90022l30297j98264K49469L15521k25439o24052k18906N49875P77096L38952
37048I23977j60791m25577o97442j003918r29423l52605J82806J87960q1681m0233
37038b396927L90573P61258P77165N86062L69761M4594m32980p43950n29082N0164
37028a123362M24264L51377K04874L44337N27118K98197k52921n83827m72511
37019b82454k12751o765L06840P31050Q27928L24736l56612n86792l10613L7700
37009D72267J94685K30587J93696L8914j10525l0954K13230K72362n296l46527
$$ plain form
37078 -424051 -59659 923042 1819419 1907010 1206210 416377 88565 106323 40275 -267911
37068 -267911 -628982 -785172 -590371 -91062 419097 602118 466031 345734 375785 290022
37058 290022 -40275 -238539 10930 326451 101012 -523040 -741946 -192071 585025 923977
37048 923977 763186 337609 -359833 -1363751 -2293174 -2645779 -2462973 -2275013 -2356694 -2396927
37038 -2396927 -2006354 -1245096 -467931 118131 487892 532486 99506 -644444 -1173526 -1123362
37028 -1123362 -699098 -347721 -142847 201490 728608 1026805 773884 190057 -282454
37019 -282454 -495205 -501970 -195130 535920 1363848 1688584 1331972 745180 434567 472267
37009 472267 666952 897539 1091235 1130149 1019624 988670 1201900 1474262 1468966 1122439
36999A122439m13007k02366O594j1443k16092l61868k62124k0335P3253q1639
36989c66588k52884j92183O1797L03317M05984L26591P6472j52384p5171K68463
36979D03414M44132K08282j31658k39156k80378n03554o25668k36805L90589N70056
36969g46K18046o7135K1385J23140m4001k14910j23998L7416K7369n8446j13001
36958a94881k71749n06148m24730J05813N47948L82172j08191k49407N5709L01374
36948c62090J96582p710j3990J31833K32610K12864J04004l7085j28022j05346
36938B23650J4838J76603L03022K35048j45969o13932o70296j52682M41064N15298
36928C26644R3228l17892m14745l10943j74185k8192R1133J03812M8728M0686
$$ plain form
36999 1122439 709432 507066 513660 502217 286125 -75743 -337867 -358202 -284949 -366588
36989 -366588 -619472 -811655 -749858 -446541 -40557 286034 362506 210122 134951 403414
36979 403414 847546 1055828 924170 685014 404636 -98918 -724586 -961391 -570802 -746
36969 -746 217300 150165 171550 294690 250689 35779 -88219 -50803 -23434 -81880 -194881
36958 -194881 -466630 -972778 -1397508 -1291695 -743747 -361575 -469766 -719173 -663464 -362090
36948 -362090 -165508 -173218 -187208 -55375 177235 390099 494103 457018 328996 223650
36938 223650 238488 415091 718113 953161 807192 193260 -477036 -629718 -188654 326644
36928 326644 419872 101980 -312765 -623708 -797893 -826085 -734952 -631140 -582412 -541726
36918e41726O3551K4659j9005O7345K23740K42133P3176j42218l08353l93311
36908g10009k75699J08271M82485M54247P5642j67968l0209J92249J89683J03683
36898D22375J74903K30566n9177n42908o55391j98576L08527K84057j36484k89464
36888d61572R3191M89750K82667l95415q11032n37143J18501O03059O78694L81107
36878D41807j91115p65360q80650l70571K98492N16806K30556j59127l92167m17391
36868a688720o6676P19816J370175J087928r791q08364o08191k8729J0233l24425
36858c46744j69126N42832Q73843K66457o35580q95494m52687N4994K33801J86482
36848c41222O4808p8958o6379K47523N36165K52056m91352q06646j87265O47278
$$ plain form
36918 -541726 -478175 -453516 -472521 -405176 -181436 60697 133873 -8345 -316698 -710009
36908 -710009 -985708 -877437 -394952 59295 134937 -33031 -63240 129009 318692 422375
36898 422375 597278 827844 768667 225759 -429632 -628208 -319681 -35624 -172108 -461572
36888 -461572 -368381 121369 404036 8621 -802411 -1339554 -1221053 -617994 60700 441807
36878 441807 250692 -514668 -1395318 -1765889 -1467397 -950591 -720035 -879162 -1271329 -1688720
36868 -1688720 -1755396 -1035580 334595 1422523 1412732 604368 -3823 -32552 -22319 -346744
36858 -346744 -515870 26962 900805 1167262 531682 -363812 -816499 -761505 -527704 -341222
36848 -341222 -276414 -355372 -421751 -174228 361937 613993 122641 -684005 -871270 -223992
36838b23992O25187k04391p53647m29441J44850J81539j64888k36270O1041K64700
36828g35312K01989J76925L30357L82508J39796j78294k86253j81449r808J29807
36818b9734J34298o1500k77030k18584N2208J09643j91695m06387j23513L79882
36808f32412M93093J22068k19647j47346J39027K39706J16491O5341K41969M18973
36798H37263K69127j96143n75339m82764O8632P14863J049140Q19062L2464q95844
36788A640461j267315p39795J74485O06577L47265j3486k783J66362J25892n4834
36778I82829j57417k65856m84053n48368k32509J28566P7465k03728j85103Q7258
36768h00916O5330k88787l31337J89851O04429K96890l45457n11481j10812K48354
$$ plain form
36838 -223992 401195 196804 -556843 -986284 -841434 -659895 -824783 -1061053 -1000012 -735312
36828 -735312 -533323 -356398 -26041 356467 496263 317969 31716 -149733 -159541 -29734
36818 -29734 104564 43064 -233966 -452550 -400342 -290699 -482394 -888781 -1012294 -632412
36808 -632412 -139319 -17251 -236898 -384244 -245217 -5511 110980 176321 418290 837263
36798 837263 1106390 910247 334908 -147856 -79224 635639 1684779 2503841 2536305 1640461
36788 1640461 373146 -366649 -192164 414413 761678 748192 745409 911771 1037663 982829
36778 982829 825412 559556 75503 -472865 -705374 -576808 -499343 -703071 -888174 -800916
36768 -800916 -735586 -1024373 -1355710 -1165859 -561430 -264540 -609997 -1121478 -1232290 -983936
36758i83936K09606J8583k3010M2478L3559j12803l28860m05179n8004O72211
36748i35355J177779Q73354L3887m36261j81289J67176k5777m86715n56329k34677
36738f04207q5204k51045k38321K11129O16781M43964j06593l86937j56557K40963
36728c16027M48703M51457L40108Q8650k61879m45650k53399J16958K28044n1740
36718C45225l54597k72442J07328L01883O2730k87634k74420R6189L30399P4726
36708A29387m43368o92805m29225J01259M66014M43090J61226n6267O503K63779
36698e0407M50092M32322L16869K31970J40030m6068k68827l66448k56301r181
36688E74051K00841K01675M077j05679J37362N22462M95236p5200n69257l75944
$$ plain form
36758 -983936 -774330 -755747 -778757 -736279 -702720 -815523 -1144383 -1549562 -1607566 -935355
36748 -935355 242424 1115778 1149665 713404 532115 699291 673514 186799 -369530 -604207
36738 -604207 -689411 -940456 -1178777 -967648 -350867 93097 -13496 -400433 -556990 -316027
36728 -316027 132676 584133 924241 1012891 751012 305362 51963 168921 396965 345225
36718 345225 -9372 -281814 -174486 127397 190127 -97507 -371927 -275738 54661 129387
36708 129387 -313981 -1006786 -1436011 -1334752 -868738 -425648 -264422 -320689 -314186 -50407
36698 -50407 399685 832007 1148876 1380846 1520876 1474808 1205981 839533 583232 574051
36688 574051 774892 976567 980644 874965 1012327 1534789 2030025 1954825 1385568 1009624
36678A009624K64566N84054K95357j73518l76216k89887m4785K83927M86971K87685
36668B327778j96088m55956k91560j35363m05096q66944r75311n96378o6080K85212
36658a375786L72298K80478K06906L19862M74552K98557k12976m93383j36707
36649b66199M54563N93207K50439l7895n4912r5783k82914l02042k344K49640
36639E05760J04899k36760l24148l9091L64453O08864N63573K44233j40854k76718
36629A374211p5633J68762J27075j53258l38824k45043k4292N6557r2367l18937
36619D78251l93196k39294j9411M7618n3870j28457k7396J71804K74505J95489
36609C06043M7381K6660J93328L50999K35898j20565l61043k62048n9379r1735
$$ plain form
36678 1009624 1274190 1858244 2153601 1980083 1603867 1313980 1269195 1553122 2040093 2327778
36668 2327778 2131690 1675734 1384174 1248811 843715 -23229 -998540 -1594918 -1660998 -1375786
36658 -1375786 -1003488 -723010 -516104 -196242 278310 576867 363891 -129492 -266199
36649 -266199 188364 781571 1032010 994115 939203 843420 560506 258464 256120 505760
36639 505760 610659 373899 49751 10660 375113 983977 1547550 1791783 1650929 1374211
36629 1374211 1298578 1467340 1594415 1441157 1102333 857290 832998 889555 797188 478251
36619 478251 85055 -154239 -173650 -126032 -179902 -308359 -335755 -163951 110554 306043
36609 306043 353424 380084 573412 924411 1160309 1039744 678701 416653 357274 265539
36599B65539k67194k17028P8499K19947K0878j83342o6568J70314J18106k07088
36589f7937l94757k38414J6960P4089k7930o5441n279r507q7127J7693M27277
36578c60373P74834N48593j92645p68911o90072k15008J31824K77112M34750M88722
36568D28826J23272m75007o56871k16205K64256K42752m8324o4172J99312K73732
36558G1571j5882l00166k14222J19379K89776J27949j16122j38319n832l5263
36548b17131k36847j95429K69432O58546M54599k5030o3909K81444K20507m64631
36538F81551r82970p30039j35109J72336L03904N67303O43194J48637m50616m09489
36528a91298J05797L02987L9416j28085o2575k01395n27674m28380J48311L80281
$$ plain form
36599 265539 -1655 -218683 -140184 79763 100641 -82701 -149269 21045 139151 -67937
36589 -67937 -462694 -701108 -684148 -610059 -637989 -703430 -708709 -718216 -805343 -787650 -360373
36578 -360373 414461 963054 770409 1498 -688574 -903582 -771758 -494646 -59896 428826
36568 428826 552098 77091 -579780 -795985 -531729 -288977 -337301 -401473 -202161 71571
36558 71571 55689 -244477 -458699 -339320 -49544 78405 -37717 -176036 -181868 -217131
36548 -217131 -453978 -649407 -379975 278571 733170 708140 644231 925675 1146182 681551
36538 681551 -301419 -1031458 -1166567 -994231 -690327 -123024 520170 668807 218191 -191298
36528 -191298 -85501 217486 256902 128817 66242 -135153 -662827 -1091207 -942896 -562615
36518e62615j24726n89338k46888M61210O03699J53258j23804J23473M70161M67071
36508F31501J56533j67761k87271j41841J11113J79199O735r7446N4072J67859
36498F12693n8992l62238k56189K11262N29433M60264K28587K5004j83749l22166
36488H83909j94037O3206j4752n17195q48930m47971M28167R61289P07137K009
36478A022832n23422n98288m17754k48193r2801J91988N45542O72799M37269Q9798
36468A079770o7300q1246j72431k93033j99419O8333J54495p0879k71424j27622
36458A9244J99156L20936J71360M2718J33689K78351J70796k37711o19808n75157
36448i6426q5848L94013M25836J11520o6249Q8313K60076J58999l3201J789J71115
$$ plain form
36518 -562615 -687341 -1276679 -1523567 -1062357 -458658 -305400 -429204 -305731 164430 631501
36508 631501 788034 620273 333002 191161 302274 481473 488208 390762 444834 612693
36498 612693 553701 191463 -64726 146536 675969 1136233 1364820 1389824 1206075 883909
36488 883909 689872 753078 738326 221131 -627799 -1075770 -647603 313686 1020823 1022832
36478 1022832 499410 -98878 -516632 -764825 -857626 -665638 -120096 552703 989972 1079770
36468 1079770 1012470 931224 758793 465760 266341 334674 489169 418290 146866 19244
36458 19244 218400 539336 710696 753414 887103 1165454 1336250 1098539 478731 -96426
36448 -96426 -182274 211739 637575 749095 682846 771159 1031235 1190234 1157033 1158822 1329937
36437A329937J10552k14459m11198k15153J57981L45348K85999J55644L0895j35345
36427A440201k75747k10812N8344K64717J97461l6119k05218k82639l85389m76367
36417H8432l84409j29192M4016M1184O7228K40430L21762R1028k07717j39117
36407C3645K95195O44612O08595L22664K9310j97666l21259k63673j06586r2813
36397I52024k72820m02426l39910k60896k86175k05197J40337M65122M04897R7599
36387B92555p4K07360L51234J66663k02093n06989o68813o56473m03801P975L22217
36376a090239M06500L92333L99354L21811M8154k67061l39647j00006K20440L09872
36366C01511M2377l90236n87834l12865K01987M57174K52037j08485k38502j10255
$$ plain form
36437 1329937 1440489 1226030 814832 599679 757660 1103008 1389007 1544651 1575546 1440201
36427 1440201 1164454 953642 1011986 1276703 1474164 1438045 1232827 950188 564799 88432
36417 88432 -295977 -425169 -381153 -339969 -272741 -32311 289451 380479 172762 33645
36407 33645 328840 973452 1582047 1904711 1934021 1736355 1415096 1151423 1044837 952024
36397 952024 679204 276778 -63132 -324028 -610203 -815400 -675063 -209941 194956 292555
36387 292555 292481 499841 851075 1017738 815645 308656 -360157 -1016630 -1420431 -1412456 -1090239
36376 -1090239 -683739 -291406 107948 429759 477913 210852 -128795 -228801 -8361 301511
36366 301511 343888 -46348 -634182 -947047 -745060 -287886 -35849 -144334 -382836 -493091
36356d93091N7750J58668K24345K01276l8242m22537o05829l06656L06092O86092
36346b32132M78931p895r9381L85404Q13934N57250r6079l21582K1909J88554
36336A688913k61040p26146m99339R1101J66058l48616o22859j80196M54286N74328
36326C36490K02148j36255j44629P2442L03375L82373K18870p5838k16168q1137
36316H61671J03677P5315j24120k67788k52966j22641Q1044L06082M34466L88220
36306A482960K16517n406k40826l97454l60654k06510j56130k18789j65812L543
36296d8561n3232m08170n42410q1629M80883L81590k76535o30466k69982L04645
36286a143867N32510M58487L21223P8070k82877m43138k17284M5353k5635k12735
$$ plain form
36356 -493091 -435341 -276673 -52328 148948 110706 -311831 -917660 -1224316 -918224 -232132
36346 -232132 246799 238904 139523 524927 1338861 1896111 1800032 1478450 1500359 1688913
36336 1688913 1427873 701727 202388 293489 459547 110931 -511928 -692124 -237838 336490
36326 336490 538638 402383 257754 330196 633571 1015944 1234814 1158976 942808 861671
36316 861671 965348 1040663 916543 648755 395789 273148 354192 660274 1094740 1482960
36306 1482960 1699477 1694071 1453245 1055791 695137 488627 332497 113708 -52104 -48561
36296 -48561 -101793 -509963 -1052373 -1134002 -653119 -271529 -548064 -1178530 -1448512 -1143867
36286 -1143867 -611357 -152870 168353 246423 -36454 -479592 -696876 -651523 -677158 -889893
36276h89893r7820K01476K37121J4341l2892J71419J90669j60267m44323k58625
36266a068794J67721L53101K22657N7736K7151J01603K55358M21646L83969N1614
36256I73762k57248j73455J35536J48960j96184l25927J36010P36511P33951M0318
36246A952234p36700j068762r63351o83914l81216r4738J53138L94084O61045
36237g68180Q22110O73875K87864K7905P8970J88750P2188j48961j77901l9692
36227A016928j6778j74875k97126k85031k94891m13102m86034l74569j41153J04744
36217a361887L19001M04776K37090r2749l15537l70078m49454n36222k89447L36299
36207b118208P67084N42977N6920M839L08262K66041k41370m55416Q9824P57268
$$ plain form
36276 -889893 -987713 -786237 -549116 -534775 -567667 -396248 -205579 -365846 -810169 -1068794
36266 -1068794 -901073 -547972 -325315 -267579 -240428 -138825 116533 538179 922148 973762
36256 973762 716514 543059 678595 827555 631371 305444 441454 1177965 1911916 1952234
36246 1952234 1215534 146772 -816579 -1500493 -1881709 -1976447 -1823309 -1429225 -768180
36237 -768180 53930 727805 1015669 1043574 1122544 1311294 1383482 1234521 1056620 1016928
36227 1016928 1000150 825275 528149 243118 -51773 -464875 -950909 -1325478 -1466631 -1361887
36217 -1361887 -1042886 -638110 -401020 -493769 -809306 -1179384 -1628838 -2165060 -2454507 -2118208
36207 -2118208 -1351124 -808147 -751227 -746388 -438126 -172085 -413455 -868871 -779047 -21779
36197b1779O69403l6783m08009L1206P20829Q41772K56041m60707o89907l39888
36187E62178J45468K64852m3359m07919n02614l43973o8001L00654O41814N89749
36177A138849j6377o86722p45878k18605K12907J87127Q5011K82139N03976L28877
36167A071304n8361j44782Q6208J61887r5385l18570k16765J7756R7199L9139
36157F39630m5750k18439m76505n46282k57436Q8933J06390p3387m487L37009
36147d50324M85426K09236j43844j89140n063J28530J38339L4170k73844o68172
36137g34686o48287M2192Q14517Q38450J81686k71285r7693J44128o9682l72028
36127a72688j84823K61510K89411j12842k83282M6673L71488K37726j36496l08441
$$ plain form
36197 -21779 647624 610841 202832 234038 954867 1796639 2052680 1591973 902066 562178
36187 562178 707646 972498 929139 521220 18606 -325367 -393368 -92714 549100 1138849
36177 1138849 1122472 435750 -310128 -528733 -315826 -128699 -43688 238451 742427 1071304
36167 1071304 1012943 868161 954369 1116256 1020871 702301 485536 503292 600491 639630
36157 639630 593880 375441 -101064 -647346 -904782 -815849 -709459 -782846 -787333 -450324
36147 -450324 35102 244338 100494 -88646 -93709 34821 173160 207330 -66514 -734686
36137 -734686 -1382973 -1340781 -526264 312186 493872 222587 124894 269022 199340 -172688
36127 -172688 -357511 -96001 193410 80568 -202714 -156041 215447 453173 316677 8236
36117H236j99200M0616L37481N52139L98977j18127m81923k80135J70110K40063
36107F68237j23811l88971k57262l1664q2563l29186m19325j80830K51077N95571
36097b98727O27583L52237K6397j03468o3619j8490L7455K12831L94712K99744
36087A466655r8177m58230m76029j88308J68456L83518L36240R0801n2225J18637
36077A291338L43240J84363k75788m84265k61708o7202j89295k43884J11794M91891
36067I00484L83873K9080J9211K80760K13125k64682n70922m21589k11827k49614
36057A07899k61985L1244L88042M39522K01782j16142m30386o11742l95682J84168
36047d63280O22749N68473K93554J70959N3900l29634o81723m65315K00681O02433
$$ plain form
36117 8236 -190964 -150348 187133 739272 1138249 1020122 538199 258064 428174 668237
36107 668237 544426 155455 -101807 -133471 -216034 -545220 -964545 -1145375 -894298 -298727
36097 -298727 328856 681093 707490 604022 540403 521913 559368 772199 1166911 1466655
36087 1466655 1368478 910248 434219 245911 414367 797885 1134125 1224926 1172701 1291338
36077 1291338 1634578 1818941 1543153 1058888 797180 729978 540683 296799 408593 900484
36067 900484 1284357 1313437 1332648 1613408 1826533 1561851 990929 569340 357513 107899
36057 107899 -154086 -122842 265200 704722 906504 790362 359976 -251766 -647448 -463280
36047 -463280 159469 727942 1021496 1192455 1246355 916721 234998 -230317 -29636 572797
36037E72797M05775J5718j28139r3202j03528j08139M662Q2157p5830l43409l89744
36026a60882j15042K14979K60881l2987l47237k74978K10573O47013O15840L00176
36016A318336K20701M40639M33199j18557p79731r23821n64607k51716k71622
36007d97179l52135j80420J31867K53808J02669p8203m9146J49610K78961K08894
35997c1274P6350Q3254J84905J17554k26540n97834o71077m26091j27513n315
35987a623581p8147k14484k23239M9391N35125Q77843P32594J58592m16625o33254
35977h35785m73860j32434J87639L09578J43808j54291k47690N278L49664M60533
35967c87560L58947L02115L28812J78577k74712p32974p87678m23739l5273N4188
$$ plain form
36037 572797 978572 994290 866151 772949 669421 561282 565944 648101 572271 228862 -160882
36026 -160882 -275924 -60945 199936 166949 -180288 -455266 -244693 402320 1018160 1318336
36016 1318336 1539037 1979676 2412875 2294318 1514587 590766 26159 -225557 -497179
36007 -497179 -849314 -1029734 -897867 -644059 -541390 -619593 -668739 -519129 -240168 -31274
35997 -31274 45076 128330 313235 430789 204249 -393585 -1064662 -1490753 -1618266 -1623581
35987 -1623581 -1701728 -1916212 -2139451 -2090060 -1554935 -677092 55502 214094 -202531 -835785
35977 -835785 -1309645 -1442079 -1254440 -944862 -801054 -955345 -1203035 -1197757 -848093 -387560
35967 -387560 -28613 273502 602314 780891 506179 -226795 -1014473 -1438212 -1473485 -1419297
35957a419297o0794o5340J29080K71534J20537k13180l81339k13059J18272L59012
35947a354574M56627M87958M44317K67834N0665l308J47819L11399L31743K94983
35937A435463L56366M64177L90822J3816n19590q94720q60141m18280J49045M93899
35927F10857M98067L12921R5586j58545m46648o00850m89910k62759j56420j23625
35917g21326Q1083M49801O57360N36686L31535L01495L17514J00713k97512n43810
35907A213539m87965l04641j67643m4667J08028J72902M0552j88001l20391l11990
35897b90277k49887j65761k6334J13140J28660M6000O3769K44841L42281J30214
35887C36646j96464k35995Q354P3491k50548m88928j10407O18405Q76824L89197
$$ plain form
35957 -1419297 -1480091 -1545431 -1416351 -1144817 -1024280 -1237460 -1618799 -1831858 -1713586 -1354574
35947 -1354574 -897947 -409989 34328 302162 352827 349519 497338 808737 1140480 1435463
35937 1435463 1791829 2256006 2646828 2660644 2141054 1246334 386193 -32087 116958 610857
35927 610857 1108924 1421845 1517431 1358886 912238 311388 -178522 -441281 -597701 -721326
35917 -721326 -640243 -190442 466918 1003604 1335139 1636634 1954148 2054861 1757349 1213539
35907 1213539 725574 420933 253290 208623 316651 489553 530105 342104 21713 -290277
35897 -290277 -540164 -705925 -732259 -619119 -490459 -444459 -380690 -135849 206432 336646
35887 336646 140182 -95813 -87459 -13968 -264516 -753444 -863851 -245446 631378 1020575
35877A020575j85854j48495L42110N78375K72268j74665l04180j47644n1946j96911
35867A003633m39579n43788m39548k53780j36084r0462j942J89110L98792M96396
35857A82748M36737K87764J73296J69563J98954Q4730j85149l46443k06007j0227
35847G85966j58347n60073o66066k52841K19397K59142j3420j87978j93511j96575
35837i64306j35585J47462M54754M29551J71523J59447N12886P97643O75684L09350
35827B558409m4417m09950p95677q85804m16800L02560O00707J80263n45472q80828
35817c37009n39463Q6194L37875j209m84192n67214k47449P0300J85150K29774
35807a267243K55793J13936j81650l57825k85685j44535n6129R3670L14787L71738
$$ plain form
35877 1020575 834721 686226 1028336 1606711 1878979 1704314 1400134 1252490 1200544 1003633
35867 1003633 564054 20266 -419282 -673062 -809146 -899608 -901550 -712440 -313648 182748
35857 182748 619485 907249 1080545 1250108 1449062 1533792 1348643 1002200 796193 785966
35847 785966 627619 67546 -598520 -851361 -631964 -372822 -386242 -574220 -767731 -964306
35837 -964306 -1099891 -952429 -497675 -68124 103399 262846 775732 1573375 2249059 2558409
35827 2558409 2513992 2104042 1308365 422561 5761 308321 909028 1089291 543819 -337009
35817 -337009 -876472 -790278 -452403 -453612 -937804 -1505018 -1752467 -1682167 -1497017 -1267243
35807 -1267243 -1011450 -897514 -1079164 -1436989 -1722674 -1867209 -1923338 -1829668 -1514881 -1143143
35797a143143K03386J23866L24257M95225K74337j87444m42636l37036q4866O8102
35787g05952k063k74907m64019j71671N39759J007516P57150J59933j12741j9857
35777G13148k1948k40654l64089l05696l15675l94322k17414K05683L83641R7361
35767d59965k15262j45644O1656m1546l82796n26955l32260k3506K60353N70803
35757a235122Q12457O83412R9145n39340o89864k50833L09757M61565K04450J8235
35747a26138J73328L15388j1016n87411o98789j24950M91637M90475L8953k06037
35737b44560k8933J75298Q1033j32925j23543J25383L23231K56216J3267j43686
35727C00781p1347J01938J23913p6974k90615k78586p8867K7038j46082m42071
$$ plain form
35797 -1143143 -939757 -815891 -491634 3591 277928 90484 -352152 -689188 -774054 -705952
35787 -705952 -708015 -982922 -1446941 -1618612 -1078853 -71337 685813 845746 733005 713148
35777 713148 691200 450546 86457 -219239 -534914 -929236 -1146650 -940967 -557326 -459965
35767 -459965 -675227 -820871 -759215 -800761 -1183557 -1710512 -2042772 -2066278 -1805925 -1235122
35757 -1235122 -422665 260747 359892 -179448 -869312 -1120145 -810388 -348823 -144373 -126138
35747 -126138 47190 362578 351562 -235849 -934638 -1059588 -567951 -77476 -38523 -244560
35737 -244560 -273493 -98195 -17162 -150087 -273630 -148247 174984 431200 444467 300781
35727 300781 229434 331372 455285 378311 87696 -190890 -269757 -242719 -388801 -830872
35717h30872n03936j69885L03908M93955L01519P0322J16049K86880K12705r9726
35707A80919k44223l2419K01393R5967k02347k72506k3371K41495L07592K92575
35697E45075L47473L69257J76653j58280l50322k73671j36486j85174l30314k51489
35687b47278J12757M03084L10805J4229j06742m5084r4344k44923j04361M31668
35677D29811Q45416O39883K7089l79521l65520k32120k33152l03722l41281l70159
35667b83276l41020r9924K93238M84806K58348j42625l13416j72593L4285J03974
35657a78203M6609n4666j46981j55338l58K60523M16843L09635J463l04298m61485
35646b66256m50492l07863p6283J73691L38509L39292J91560K9663M0542K81729
$$ plain form
35717 -830872 -1334808 -1504693 -1200785 -706830 -405311 -334989 -218940 67940 280645 180919
35707 180919 -63304 -95723 105670 201637 -710 -273216 -296587 -55092 252500 545075
35697 545075 892548 1261805 1438458 1280178 929856 656185 519699 334525 4211 -247278
35687 -247278 -134521 268563 579368 593597 486855 441771 347427 102504 -1857 429811
35677 429811 1275227 1915110 1942199 1562678 1197158 965038 731886 428164 86883 -283276
35667 -283276 -624296 -724220 -430982 53824 312172 169547 -143869 -316462 -282177 -178203
35657 -178203 -131594 -186260 -333241 -488579 -488937 -228414 188429 498064 499527 195229 -266256
35646 -266256 -716748 -1024611 -1100894 -927203 -588694 -249402 -57842 -28179 12363 294092
35636B94092N22377L96777j31266n56519l45037L31526O81587K61663m20435n38652
35626D96113Q170N26491M25694j56038o44194o50063k30537K31078L22026k9293
35616B99447m30492m50545j50629N4871K5007Q848R9017L2405k68928m14799j40707
$$ plain form
35636 294092 816469 1213246 1081980 525461 180424 511950 1193537 1455200 1034765 496113
35626 496113 504283 1030774 1456468 1300430 656236 6173 -224364 6714 328740 299447
35616 299447 -131045 -581590 -732219 -677348 -652341 -643493 -544476 -512071 -780999 -1195798 -1336505
$$ [...]
##END NTUPLES=NMR SPECTRUM
##END=
