##TITLE=31Pdec_CBPAd-1
 CDCl3, 24 sc
 14.7.2023
##JCAMPDX= 6.0         $$ Bruker NMR JCAMP-DX V2.0
##DATA TYPE= NMR SPECTRUM
##DATA CLASS= NTUPLES
##ORIGIN= UXNMR, Bruker Analytische Messtechnik GmbH
##OWNER= root
$$ XWIN-NMR		Version 3.5
$$ Fri Jul 14 15:34:06 2023 Russian Standard Time (UT+4h)  she@DPX200
##.OBSERVE FREQUENCY= 81.013821
##.OBSERVE NUCLEUS= ^31P
##.ACQUISITION MODE= SIMULTANEOUS
##.ACQUISITION SCHEME= undefined
##.AVERAGES= 24
##.DIGITISER RES= 16
##SPECTROMETER/DATA SYSTEM= spect
##.PULSE SEQUENCE= zgpg30
##.SOLVENT NAME= CDCl3
##.SHIFT REFERENCE= (INTERNAL, CDCl3, 0, 248.564)
##AUDIT TRAIL= $$ (NUMBER, WHEN, WHO, WHERE, WHAT)
$$ ##TITLE= Audit trail, XWIN-NMR		Version 3.5
$$ ##JCAMPDX= 5.01
$$ ##ORIGIN= Bruker BioSpin GmbH
$$ ##OWNER= she
$$ F:/spectra/data/she/nmr/P31/1/pdata/1/auditp.txt
$$ ##AUDIT TRAIL=  $$ (NUMBER, WHEN, WHO, WHERE, WHAT)
(   1,<2023-07-14 15:32:19.92 +0400>,<she>,<DPX200>,
      <created by zg, POWCHK disabled, PULCHK disabled
       configuration hash MD5:
       00 E9 B6 7A A2 85 ED C7 34 08 36 98 17 FE 4E 26
       data hash MD5: 32K
       79 B4 FC D4 97 90 96 06 9F 2E B4 08 9A 1C E4 0B>)
(   2,<2023-07-14 15:32:24.34 +0400>,<she>,<DPX200>,
      <Start of raw data processing
       efp BC_mod = 2 LB = 5 FT_mod = 6 PKNL = 1 PHC0 = -10674.66 PHC1 = 40.28482 SI = 64K 
       data hash MD5: 64K
       E2 7A EA E2 B1 0C D0 7E F7 7C FF 8C 5F 7A 21 6D>)
(   3,<2023-07-14 15:32:41.50 +0400>,<she>,<DPX200>,
      <pk PHC0 = -6.10758 PHC1 = 0 
       data hash MD5: 64K
       FD 13 62 19 8A BB E2 A6 02 E6 87 E5 FA 33 CE 9D>)
(   4,<2023-07-14 15:32:59.07 +0400>,<she>,<DPX200>,
      <pk PHC0 = -7.399998 PHC1 = 0 
       data hash MD5: 64K
       B8 CE 98 9E E5 9B F7 BC 6A 94 E3 54 AA 4C 90 62>)
(   5,<2023-07-14 15:33:28.28 +0400>,<she>,<DPX200>,
      <pk PHC0 = 2.999999 PHC1 = 0 
       data hash MD5: 64K
       89 D0 D8 58 16 E7 80 15 ED 76 C9 8B 8E AB 52 51>)
$$ ##END=
$$ 
$$ hash MD5
$$ 7F C2 41 03 9B 15 03 77 BE 37 D1 F1 94 81 12 B8
##$RELAX= 
##$RELAX= 
##$RELAX= 
##$RELAX= 
##$RELAX= 
##$RELAX= 
##$RELAX= 
##$RELAX= 
##$RELAX= 
$$ Bruker specific parameters
$$ --------------------------
##$DU= <F:/spectra>
##$EXPNO= 1
##$NAME= <P31>
##$PROCNO= 1
##$TYPE= <nmr>
##$USER= <she>
##$AMP= (0..31)
100 100 100 100 100 100 100 100 100 100 100 100 100 100 100 100 100 100 
100 100 100 100 100 100 100 100 100 100 100 100 100 100 
##$AQSEQ= 0
##$AQ_mod= 1
##$AUNM= <au_zg>
##$AUTOPOS= <>
##$BF1= 81.014009
##$BF2= 200.13
##$BF3= 200.13
##$BF4= 200.13
##$BF5= 200.13
##$BF6= 200.13
##$BF7= 200.13
##$BF8= 200.13
##$BYTORDA= 1
##$CFDGTYP= 0
##$CFRGTYP= 5
##$CHEMSTR= <none>
##$CNST= (0..31)
1 1 145 1 1 1 1 1 1 1 1 1 1 1 1 1 1 1 1 1 1 1 1 1 1 1 1 1 1 1 1 1 
##$CPDPRG= <waltz16>
##$CPDPRG1= <>
##$CPDPRG2= <waltz16>
##$CPDPRG3= <>
##$CPDPRG4= <mlev>
##$CPDPRG5= <mlev>
##$CPDPRG6= <mlev>
##$CPDPRG7= <mlev>
##$CPDPRG8= <mlev>
##$CPDPRGB= <>
##$CPDPRGT= <>
##$D= (0..31)
$$ [...]
##$SUBNAM2= <"">
##$SUBNAM3= <"">
##$SUBNAM4= <"">
##$SUBNAM5= <"">
##$SUBNAM6= <"">
##$SUBNAM7= <"">
##$SUBNAM8= <"">
##$SUBNAM9= <"">
##$SW= 501.771253377433
##$SWIBOX= (0..15)
0 1 3 0 0 0 0 0 0 0 0 0 0 0 0 0 
##$SW_h= 40650.406504065
##$TD= 32768
##$TD0= 1
##$TE= 0
##$TE2= 300
##$TE3= 300
##$TEG= 300
##$TL= (0..7)
0 120 53 12 22 120 120 120 
##$TP= (0..7)
150 150 150 150 150 150 150 150 
##$TP07= 0
##$TPNAME0= <>
##$TPNAME1= <>
##$TPNAME2= <>
##$TPNAME3= <>
##$TPNAME4= <>
##$TPNAME5= <>
##$TPNAME6= <>
##$TPNAME7= <>
##$TPOAL= (0..7)
0.5 0.5 0.5 0.5 0.5 0.5 0.5 0.5 
##$TPOFFS= (0..7)
0 0 0 0 0 0 0 0 
##$TUNHIN= 0
##$TUNHOUT= 0
##$TUNXOUT= 0
##$USERA1= <user>
##$USERA2= <user>
##$USERA3= <user>
##$USERA4= <user>
##$USERA5= <user>
##$V9= 5
##$VALIST= <valist>
##$VCLIST= <CCCCCCCCCCCCCCC>
##$VD= 0
##$VDLIST= <DDDDDDDDDDDDDDD>
##$VPLIST= <PPPPPPPPPPPPPPP>
##$VTLIST= <TTTTTTTTTTTTTTT>
##$WBST= 1024
##$WBSW= 4
##$XGAIN= (0..3)
0 0 0 0 
##$XL= 0
##$YL= 0
##$YMAX_a= 1605
##$YMIN_a= -1575
##$ZGOPTNS= <>
##$ZL1= 120
##$ZL2= 120
##$ZL3= 120
##$ZL4= 120
##$ABSF1= 0
##$ABSF2= 0
##$ABSG= 0
##$ABSL= 0
##$ALPHA= 0
##$AQORDER= 0
##$ASSFAC= 0
##$ASSFACI= 0
##$ASSFACX= 0
##$ASSWID= 0
##$AUNMP= <proc_1d>
##$AZFE= 0.1
##$AZFW= 0.5
##$BCFW= 0
##$BC_mod= 2
##$BYTORDP= 0
##$COROFFS= 0
##$CY= -3
##$DATMOD= 1
##$DC= 0
##$DFILT= <>
##$DTYPP= 0
##$F1P= 0
##$F2P= 0
##$FCOR= 1
##$FTSIZE= 65536
##$FT_mod= 6
##$GAMMA= 0
##$GB= 0
##$INTBC= 1
##$INTSCL= 6.047779e-11
##$ISEN= 30
##$LB= 5
##$LEV0= 0
##$LPBIN= 0
##$MAXI= 10000
##$MC2= 0
##$MEAN= 0
##$ME_mod= 0
##$MI= 50
##$NCOEF= 0
##$NC_proc= -11
##$NLEV= 6
##$NOISF1= 182.463
##$NOISF2= 159.3651
##$NSP= 0
##$NTH_PI= 0
##$NZP= 0
##$OFFSET= 248.5645
##$PC= 4
##$PHC0= -10685.17
##$PHC1= 40.28482
##$PH_mod= 1
##$PKNL= yes
##$PPARMOD= 0
##$PSCAL= 0
##$PSIGN= 0
##$REVERSE= no
##$SF= 81.0140089999694
##$SI= 65536
##$SIGF1= 159.3651
##$SIGF2= -187.1042
##$SINO= 113.3802
##$SIOLD= 16384
##$SREGLST= <1H.CDCl3>
##$SSB= 0
##$STSI= 65536
##$STSR= 0
##$SW_p= 40650.406504065
##$SYMM= 0
##$S_DEV= 0
##$TDeff= 32768
##$TDoff= 0
##$TI= <>
##$TILT= no
##$TM1= 0
##$TM2= 0
##$TOPLEV= 0
##$USERP1= <user>
##$USERP2= <user>
##$USERP3= <user>
##$USERP4= <user>
##$USERP5= <user>
##$WDW= 1
##$XDIM= 65536
##$YMAX_p= 460993625
##$YMIN_p= -426627451
$$ End of Bruker specific parameters
$$ ---------------------------------
##NTUPLES= NMR SPECTRUM
##VAR_NAME=  FREQUENCY,     SPECTRUM/REAL,   SPECTRUM/IMAG
##SYMBOL=    X,             R,               I
##VAR_TYPE=  INDEPENDENT,   DEPENDENT,       DEPENDENT
##VAR_FORM=  AFFN,          ASDF,            ASDF
##VAR_DIM=   65536,         65536,           65536
##UNITS=     HZ,            ARBITRARY UNITS, ARBITRARY UNITS
##FACTOR=    0.620285442955139, 1,           1
##FIRST=     20137.2065510682, 0,            0
##LAST=      -20513.1999529968, 0,           0
##MIN=       -20513.1999529968, -426627451,  0
##MAX=       20137.2065510682, 460993625,    0
$$ Real data points
##PAGE= N=1
##DATA TABLE= (X++(R..R)), XYDATA
$$ [...]
41812A0545396M602447K407264j393621n302556p710647q120738p213741n922072
41804a8108268m637571l291698j965205j123295j095140j442145j140790M49590
41796c2354522K910884N147227O299650O198645N205269L968603L217069L312232
41788C905057L854475M029361L506989K763913K363567K155443J408091l79263
41780B3607633k912454n193281o123202n334261l653251k514880k654371l528993
41772h307060m203022m519370n049860o065399o961190o718502m750569j430518
41764d8005490J974647M066623M358875L552181K668104K170392K105029K559005
41756b4550634L386111L859378L395375K495825K184142K550322K721642K379267
$$ y = [10545396, 15147843, 17555107, 16161486, 10858930, 3148283, -4972455, -12186196, -18108268, -22745839, -26037537, -28002742, -29126037, -30221177, -31663322, -32804112, -32354522, -29443638, -24296411, -17996761, -11798116, -6592847, -2624244, 592825, 3905057, 7759532, 11788893, 15295882, 18059795, 20423362, 22578805, 23986896, 23607633, 20695179, 15501898, 9378696, 4044435, 391184, -2123696, -4778067, -8307060, -12510082, -17029452, -22079312, -28144711, -35105901, -41824403, -46574972, -48005490, -46030843, -41964220, -37605345, -34053164, -31385060, -29214668, -27109639, -24550634, -21164523, -17305145, -13909770, -11413945, -9229803, -6679481, -3957839, -1578572]
41748a578572K348597L302783M721917N676677N930654N647421M669096K903619
41740C3622192R98446k34787q70416j564601k291425k156813o01680J792096L868592
41731C2561604M842432M569888L323824J552948l39437k126913l617944m508725
41723C6257677m624873m224314l760728l369021k847410k110278j379772r35155
41715A3006126r03743j245773j676451j639225o60346J179105L226578M656369
41707A5942640M849707L723867K024976J025089J397903K409132K628480J442672
41699C5444466m90114k203644l327353l933258l966005l165430j465798O11120
41691A7503984J948292J481756p80458l506400n195697n506203n076456m305996
$$ y = [-1578572, 770025, 4072808, 8794725, 14471402, 20402056, 26049477, 30718573, 33622192, 34620638, 34385851, 33515435, 31950834, 29659409, 27502596, 26900916, 28693012, 32561604, 37404036, 41973924, 45297748, 46850696, 46511259, 44384346, 40766402, 36257677, 31632804, 27408490, 23647762, 20278741, 17431331, 15321053, 13941281, 13006126, 12102383, 10856610, 9180159, 7540934, 6880588, 8059693, 11286271, 15942640, 20792347, 24516214, 26541190, 27566279, 28964182, 31373314, 34001794, 35444466, 34954352, 32750708, 29423355, 25490097, 21524092, 18358662, 16892864, 17503984, 19452276, 20934032, 20153574, 16647174, 11451477, 5945274, 868818, -3437178]
41683c437178l046078j480718m07373k11596k26796K82043R02388M95383j276793
41674h406718l341952m161070k994331l06085K711177M904446N721425N336584
41666e36524M416014L733780L706863L976821L553528J768772q68252l113051
41658A6637951m335446n027351n835287o548105o395193n081121l172129j569752
41650b1326433q23113q25734r67766o30840L88788K009765M259448P091539R721185
41641a103161J0696507R121129N672873K144495Q8010m5355J091704K173615J977557
41632C1817374L68572j403934j736062j18291K504697M651398N379291M663187
41624D6126232L111412J393329j94926j633291k749646l242985l269282l552113
$$ y = [-3437178, -6483256, -7963974, -8371347, -8582943, -8809739, -8527696, -7625308, -7129925, -8406718, -11748670, -15909740, -18904071, -19210156, -16498979, -11594533, -5873108, -536524, 3879490, 7613270, 11320133, 15296954, 18850482, 20619254, 19751002, 16637951, 12302505, 7275154, 1439867, -5108238, -11503431, -16584552, -19756681, -21326433, -22149546, -22975280, -23943046, -24573886, -24185098, -22175333, -17915885, -10824346, -1103161, 9593346, 18714475, 24387348, 26531843, 26619853, 26574498, 27666202, 29839817, 31817374, 32185946, 30782012, 29045950, 28927659, 31432356, 36083754, 41463045, 46126232, 49237644, 50630973, 50436047, 48802756, 46053110, 42810125, 39540843, 35988730]
41616C5988730m487348n434040n411369m346683l097926k294414j736978j075926
41608H104046n58400p54887j770954l001780l624193l270540k305648j427421
41600h609777q83307j85746J189382K960179M233744M470312L839651K648032
41592I662470J012748o35901j326396m86735J029947J480644o536k499126m210240
41583D020875m133653k653415r25586k9011m74545j905536l069701k588518k80956
41574a2040046K389879L617522L018984J804650J278902J662965K452218L278201
41566G463275L958010M105122L308350J635133m46704k559396m433667n565290
41558G464833n442878m290821l122281k700993k658546j956548j65671J955896
$$ y = [35988730, 31501382, 26067342, 20655973, 16309290, 13211364, 10916950, 9179972, 8104046, 7545646, 6790759, 5019805, 2018025, -1606168, -4876708, -7182356, -8609777, -9493084, -9678830, -8489448, -5529269, -1295525, 3174787, 7014438, 9662470, 10675218, 10039317, 8712921, 8226186, 9256133, 10736777, 10730241, 8231115, 4020875, -112778, -2766193, -3691779, -3720790, -4195335, -6100871, -9170572, -11759090, -12040046, -9650167, -6032645, -3013661, -1209011, 69891, 1732856, 4185074, 7463275, 11421285, 15526407, 18834757, 20469890, 20023186, 17463790, 13030123, 7464833, 2021955, -2268866, -5391147, -8092140, -10750686, -12707234, -12872905, -10917009]
41550a0917009L194896L041023K023894R89134K56515l79152j018132j424007
41542d232838j487225j510392j723235j754850r56376Q28113L072792N036195
41534b727816O145189O072826M849720K939174R37209p98500k043377k469286
41526A2905139j997991j331244j543293k917344m535454n182892m365967k426508
41518a1395554j97042J229261R89868p07365k496581l114709k620835j968276
41510b0281233j598898j063885o935J136362J673151J417873O17087m81284j539110
41501b0126872j871483q60683J296711L626431N258212N987802N942284N158432
41493D410834L780247K293874J099130L9181j148753k023640j709696j34452J542273
$$ y = [-10917009, -7722113, -4681090, -2657196, -1668062, -1411547, -1790699, -2808831, -4232838, -5720063, -7230455, -8953690, -10708540, -11664916, -10836803, -7764011, -2727816, 3417373, 9490199, 14339919, 17279093, 18216302, 17417802, 15374425, 12905139, 10907148, 9575904, 8032611, 5115267, 579813, -4603079, -8969046, -11395554, -11592596, -10363335, -9373467, -10080832, -12577413, -15692122, -18312957, -20281233, -21880131, -22944016, -22950951, -21814589, -20141438, -18723565, -18106478, -18587762, -20126872, -21998355, -22859038, -21562327, -17935896, -12677684, -6689882, -747598, 4410834, 8191081, 10484955, 11584085, 11623266, 10474513, 8450873, 6741177, 6606725, 8148998]
41484H148998K052859J193612l93330k117146l611952m393384m087371l038448
41476f246162k166196k095425k739874l669689m404483m339848l015271p75873
41468b9452821J243116K166074K209784K235156K700756L318087L548191L149121
41460h882536K320656J530607J161712J206899J351061J337145J064039L65338
41452A454921q92534k302177k898405k015517M1536K428436M525108N888463N880608
41443A2110439M165568J598569j63361l24523K39431K05268n59051j061280o52554
41434A5558506J31136K16682r37264k998839n097752o301435o072237m599526
41426a0100729k625539p43888J070979L071176M992526O032288N671444M295347
$$ y = [8148998, 10201857, 11395469, 11002139, 8884993, 5273041, 879657, -3207714, -6246162, -8412358, -10507783, -13247657, -16917346, -21321829, -25661677, -28676948, -29452821, -28209705, -26043631, -23833847, -21598691, -18897935, -15579848, -12031657, -8882536, -6561880, -5031273, -3869561, -2662662, -1311601, 25544, 1089583, 1454921, 562387, -1739790, -4638195, -6653712, -6612176, -4183740, 341368, 6229831, 12110439, 16276007, 17874576, 17711215, 17386692, 17626123, 17831391, 17272340, 16211060, 15558506, 15689642, 15906324, 14969060, 11970221, 6872469, 571034, -5501203, -10100729, -12726268, -13470156, -12399177, -9328001, -4335475, 1696813, 7368257, 11663604]
41418A1663604K813486J771712J025923K40249n54211j065562j283754j607860
41410A3003587k251001k716328k264899r70453J26904K34929j86539j62190L07009
41401E121019K80890n12084j004648k62478J070408J610300J103908M92769K12629
41392H112713n06373k290953m440152n731223n867774n399108m509451k752958
41384b3385279j24280K297105L230271K458959Q66284o08244j603878j942307
41376a8811369j196428Q09233L230801M559630L992108K099763m9474j961797
41368g327533l504496m135934l217679j096164R06627J872151K129548K484488
41360a1888992L178251L992607M827280N546679N579340M378707K243697J15069
$$ y = [11663604, 14477090, 16248802, 17274725, 17514974, 16960763, 15895201, 14611447, 13003587, 10752586, 8036258, 5771359, 4800906, 4927810, 5162739, 4976200, 4814010, 5121019, 5401909, 4889825, 3885177, 3622699, 4693107, 6303407, 7407315, 7900084, 8112713, 7606340, 5315387, 875235, -4855988, -10723762, -16122870, -20632321, -23385279, -23509559, -21212454, -17982183, -15523224, -14656940, -15265184, -16869062, -18811369, -20007797, -19198564, -15967763, -11408133, -7416025, -5316262, -5365736, -7327533, -10832029, -14967963, -18185642, -19281806, -18375179, -16503028, -14373480, -11888992, -8710741, -4718134, 109146, 5655825, 11235165, 15613872, 17857569, 17972638]
41352A7972638j486620k832761m238013n478227o208585o535582o769966o815110
41344b2392226o211711m799880l047505j605227o65578J52230J367867L173795
41336c4028235N314539P238177Q290068P922396N994957L004292p4503k308382
41328A353309l232220k864225j518817K70459J816475K586613K578870K274583
41320C265047K088060J899357J242547n2858j557032k668762l243756l631375
41312b658772m118625m529562m417350l491856j839225M8985J418536J792546
41304a7795323J611718J983838L360327M670061M282503J781989j676965m702138
41296f483990o726472p656292p233656n322570k485102K78674K307767L509495
$$ y = [17972638, 16486018, 13653257, 9415244, 3937017, -2271568, -8807150, -15577116, -22392226, -28603937, -33403817, -36451322, -38056549, -38722127, -38569897, -37202030, -34028235, -28713696, -21475519, -13185451, -5263055, 731902, 3736194, 3661691, 1353309, -1878911, -4743136, -6261953, -5991494, -4175019, -1588406, 990464, 3265047, 5353107, 7252464, 8495011, 8442153, 6885121, 4216359, 972603, -2658772, -6777397, -11306959, -15724309, -19216165, -21055390, -21006405, -19587869, -17795323, -16183605, -14199767, -10839440, -6169379, -1886876, -104887, -1781852, -6483990, -13210462, -20866754, -28100410, -33422980, -35908082, -35629408, -33321641, -29812146]
41288b9812146L967997L680767K694788J319761J85002P073R55936K119453K035965
41279a2845404J69993k377974m030437m415309m474065n051751n907600o166538
41271d5099085n310392l581034j689858k03080J035002K838905N659970Q587413
41263c7762159R864764Q684306O127927M021948L168155L091081L216137L596314
41255D008473M364820N080905N061236M106479K537221P35817q73932j527937
41247B3493082n08790J854898M033319M555219L171710N09500k903187o578986
41239B7626765r371111r852667p701391m117051o39232J913203L238177L188122
41231D284815K188726J342349J327026J563437J197659N79021Q96094K441704
$$ y = [-29812146, -25844149, -22163382, -19468594, -18148833, -17963831, -17956758, -17000822, -14881369, -12845404, -12675411, -15053385, -19083822, -23499131, -27973196, -33024947, -38932547, -45099085, -50409477, -53990511, -55680369, -55883449, -54848447, -52009542, -46349572, -37762159, -27897395, -19213089, -13085162, -9063214, -5895059, -2803978, 412159, 4008473, 8373293, 13454198, 18515434, 22621913, 25159134, 25894951, 25021019, 23493082, 22984292, 24839190, 28872509, 33427728, 36599438, 37108938, 34205751, 27626765, 18255654, 8402987, 701596, -3415455, -4054687, -2141484, 1096693, 4284815, 6473541, 7815890, 9142916, 10706353, 11904012, 12483033, 13379127, 15820831]
41223A5820831M102470M709855M181028L107265J890291O79220l31334j028511
41215C3131115j602685k324712l226647m165291n010111n596152n654567m958373
41207E92577l485860j466044N78973J962632K381218K327582K525316K884766
41199H301160K553583J248482n535M9287J417524K938167L615742L302538K195097
41190B5616045L72477j922246m047499n415832n971715n935877n280528l829712
41182f414887j823331k756R94832J124579P68628L74518M11392J340951L211590
41173a4484N376704P007812P888910Q348057Q423727P608625N609784K907023
41165E3156158K66882j889559l313288l651686l007270k496644l453773n951671
$$ y = [15820831, 19923301, 24633156, 28814184, 31921449, 33811740, 34490960, 34159626, 33131115, 31528430, 29203718, 25977071, 21811780, 16801669, 11205517, 5550950, 592577, -2893283, -4359327, -3780354, -1817722, 563496, 2891078, 5416394, 8301160, 10854743, 12103225, 12097690, 12146977, 13564501, 16502668, 20118410, 23420948, 25616045, 25988522, 24066276, 20018777, 14602945, 8631230, 2695353, -2585175, -6414887, -8238218, -8240974, -7246142, -6121563, -5352935, -4978417, -4567025, -3226074, -14484, 5362220, 12370032, 20258942, 28606999, 37030726, 44639351, 50249135, 53156158, 53423040, 51533481, 48220193, 44568507, 41561237, 39064593, 35610820, 29659149]
41157B9659149q630393j0087757r995739q816290p022607m904681k737179p78538
41149b3314035P50743J590746J627833J283205J398045K515970M426513O388291
41141c332689P447547O611475L462290r53766m375926n144994l696281j902144
41133a884488j156954j497721k263254k850885k752495j562775N68223K743424
41125a0656925L958703L929249L163439K334595J747507J352777J060722R14210
41117G804277R83628J177957J214299P83636k32417j625213k868878l346071k740274
41108A150944j278241M61450J979298L060282L669377L860346L805946L706771
41100B0416173L552451L083776K092375P18781n59747j183388q30038L19376J603235
$$ y = [29659149, 21028756, 10940999, 945260, -7871030, -14893637, -19798318, -22535497, -23314035, -22563292, -20972546, -19344713, -18061508, -16663463, -14147493, -9720980, -3332689, 4114858, 10726333, 14188623, 13234857, 8858931, 3713937, 17656, -1884488, -3041442, -4539163, -6802417, -9653302, -12405797, -13968572, -13400349, -10656925, -6698222, -2768973, 394466, 2729061, 4476568, 5829345, 6890067, 7804277, 8787905, 9965862, 11180161, 11963797, 11731380, 10106167, 7237289, 3891218, 1150944, -127297, 334153, 2313451, 5373733, 9043110, 12903456, 16709402, 20416173, 23968624, 27052400, 29144775, 29863556, 29303809, 28120421, 27290383, 27609759, 29212994]
41091B9212994K336713K329455J887010J355706Q45434L80861Q3262R7463M44815
41082C8973713R58532J257420Q72980l60572k045657l529027m401684m513295
41074B7212410l744481k258977q97231o70179j611918k559679k317063p30008
41066A2422874J470715L380191M214433L423783J045865k159266n118484o836116
41058A1843995o529715m138065j023743N80362m37464k919558m745778m866786
41050a2236752l549829j274223J578365M134838N205307M342742K194647k25626
41042A69469k064461k561823j348034R19845K850842L544001L091301J829099
41034F430239j79360k616971m556247n168971m446254k888822r11428J071475
$$ y = [29212994, 31549707, 33879162, 35766172, 37121878, 37967312, 38348173, 38431435, 38528898, 38973713, 39932245, 41189665, 42062645, 41702073, 39656416, 36127389, 31725705, 27212410, 23467929, 21208952, 20311721, 19641542, 18029624, 15469945, 13152882, 12422874, 13893589, 17273780, 21488213, 24911996, 25957861, 23798595, 18680111, 11843995, 5314280, 1176215, 152472, 732834, 295370, -2624188, -7369966, -12236752, -15786581, -17060804, -15482439, -11347601, -6142294, -1799552, 395095, 169469, -1894992, -4456815, -5804849, -4885004, -2034162, 1509839, 4601140, 6430239, 6250879, 3633908, -922339, -6091310, -10537564, -13426386, -14337814, -13266339]
41026a3266339K415998K653268J950923Q24613l96613j536072k331216k646631
41018a2332069k684713k551104j800431R5576K851524N312252O334141N580076
41010H05252L680238J965836J815215L625592O222043P631802O727263M114310
41002C6587551J485445K53358O39554J667505J931239O84577j573979l619739
40994C8055511m604079m538430l812830k644721j213974p1143q745j405892l787530
40985A5968167o071069p252583o975246n633557m023715k793895k029078j243749
40977b0054725J58419K261157M419885N761307N951255N397241M681234L953907
40969A2529680L002744J769039N57174k99778q42252j492018k696761m520867
$$ y = [-13266339, -10850341, -8197073, -6246150, -5421537, -5818150, -7354222, -9685438, -12332069, -15016782, -17567886, -19368317, -19272741, -16421217, -11108965, -4774824, 805252, 4485490, 6451326, 8266541, 11892133, 18114176, 25745978, 32473241, 36587551, 38072996, 38326354, 38965908, 40633413, 42564652, 43249229, 41675250, 38055511, 33451432, 28913002, 25100172, 22455451, 21241477, 21170334, 21161589, 19755697, 15968167, 9897098, 2644515, -4330731, -9964288, -13988003, -16781898, -18810976, -20054725, -19896306, -17635149, -13215264, -7453957, -1502702, 3894539, 8575773, 12529680, 15532424, 17301463, 17858637, 17558859, 16716607, 15224589, 12527828, 8006961]
40961H006961o450851p558842o976176m399335l27999M050999P273797Q218356
40953A836910O671237L388640m77468m019261o627155p657533o530474l414639
40945a6829743M30291L403728M747859M815597M196554K931292P99299j898768
40937B596109m254886n420155n047344l143520j9007L370179N521956N450960
40929i45708L651942J631952M68145J01848p7179m97024j363517k736775m156329
40920c922645m510866k903812K66625L442252N224724N364770M496567L326537
40912A0784152K309038J737269J589626J231102k49516l015390n935993p448624
40904A001664p041200n634012m431899l707987k891694j503647M07515K575796
$$ y = [8006961, 1556110, -6002732, -12978908, -17378243, -17706242, -13655243, -6381446, 1836910, 8508147, 11896787, 11419319, 7400058, 772903, -6884630, -13415104, -16829743, -16399452, -12995724, -8247865, -3432268, 764286, 3695578, 4494877, 2596109, -1658777, -7078932, -12126276, -15269796, -15288803, -11918624, -6396668, -945708, 2706234, 4338186, 4806331, 4908179, 4831000, 4333976, 2970459, 233684, -3922645, -8433511, -11337323, -11070698, -7628446, -2403722, 2961048, 7457615, 10784152, 13093190, 14830459, 16420085, 17651187, 17401671, 14386281, 8450288, 1001664, -6039536, -11673548, -16105447, -19813434, -22705128, -24208775, -23801260, -21225464]
40896b1225464M751353O566795P594861P716982P157963O046609M279337K009069
40888B4897505p2590j277009j584246j532169j627555k112206l070586m349847
40880I271297n427121n735069n186420m151053k951836j681957n06686K58508
40872a6110337N64069Q56514J650641K975340M367520N266322N281138M287932
40864I139139K584020R18531K2224j02674k75252j275434k895193m074260m078816
40855c7715l329455k819075k839816k653075j482110N22458K514961L872912M584284
40846a666631M898028M932649M567450L433734J118285k209804n357608o790404
40838B925699o060087m295279k982023k436205j773943k35692J886234L702831
$$ y = [-21225464, -16474111, -9907316, -2312455, 5404527, 12562490, 18609099, 22888436, 24897505, 24824915, 23547906, 21963660, 20431491, 18803936, 16691730, 13621144, 9271297, 3844176, -1890893, -7077313, -11228366, -14180202, -15862159, -16368845, -16110337, -15546268, -14689754, -13039113, -10063773, -5696253, -429931, 4851207, 9139139, 11723159, 12641690, 12663914, 12561240, 12285988, 11010554, 8115361, 4041101, -37715, -3367170, -6186245, -9026061, -11679136, -13161246, -12638788, -10123827, -6250915, -1666631, 3231397, 8164046, 12731496, 16165230, 17283515, 15073711, 9716103, 2925699, -3134388, -7429667, -10411690, -12847895, -14621838, -14857530, -12971296, -9268465]
40830i268465M723377N098021N025827M308028K659625K86388k096674l823779
40822F912348m668068m659912l802022k194053k93685J230121J922415J709279
40814c843577Q00263l00746q41810l84375N61407R14556L12793l38254J4187J160344
40804a945212J811293J098721n65941k145975l035332l286262l130515k558047
40796a3757270j271113J022996M084048O852760Q036838P264842N489313M017156
40788B1739570L305930K918535K353740J453268J66284j410295k589996k331504
40780B5605532m26089J855612K843851K140222Q18566M5278q119J72492K84366
40771C3331711L27050K24971j67561p27802j094640j082504q26122n21485l06906
$$ y = [-9268465, -4545088, 552933, 5578760, 9886788, 12546413, 12832801, 10736127, 6912348, 2244280, -2415632, -6217654, -8411707, -8705392, -7475271, -5552856, -3843577, -3043314, -3344060, -4185870, -4570245, -4008838, -3094282, -2781489, -3119743, -3105556, -1945212, -133919, 964802, 398861, -1747114, -4782446, -8068708, -11199223, -13757270, -15028383, -14005387, -9921339, -3068579, 4968259, 12233101, 17722414, 21739570, 25045500, 27964035, 30317775, 31771043, 31937327, 30527032, 27937036, 25605532, 25179443, 27035055, 29878906, 32019128, 32837694, 32882972, 32874853, 33047345, 33331711, 33658761, 33883732, 33716171, 32988369, 31893729, 30811225, 29985103, 29463618, 29156712]
40762B9156712m24143j115804k136486k670041k137560j023173n18463j244163
40754A7886879k592407l475441l473028k990309k470493j872437j027627j91922
40746b06785O0141n33733j548928k139185j642140m0033K017170L662194M419546
40737D048247M418230M016710L366298K469232J467182N19561n83836k268894
40729A7452730m426242o118349o378036n219900l627746k589364k292164k123533
40721a5322604j210999R29455L924388O636894P957116P626731O259636M691855
40713B1492472L494765K879926K565922J717749m10689l462020n962077o657155
40705A5658893n649980m014606k680370k058010k300528l184543l828405l285123
$$ y = [29156712, 28732569, 27616765, 25480279, 22810238, 20672678, 19649505, 19131042, 17886879, 15294472, 11819031, 8346003, 5355694, 2885201, 1012764, -14863, -206785, -146644, -680377, -2229305, -4368490, -6010630, -6050663, -4033493, -371299, 4048247, 8466477, 12483187, 15849485, 18318717, 19785899, 20305460, 19721624, 17452730, 13026488, 6908139, 530103, -4689797, -8317543, -10906907, -13199071, -15322604, -16533603, -15604148, -11679760, -5042866, 2914250, 10540981, 16800617, 21492472, 24987237, 27867163, 30433085, 32150834, 31740145, 28278125, 22316048, 15658893, 10008913, 5994307, 3313937, 1255927, -1044601, -4229144, -8057549, -11342672]
40697a1342672j633554M2538R71714J486722K223713L058286L342324K871037
40689A020108K034438J117808k666j385327k643597l212900k819027j650869k44740
40680g786772Q43563J480685K020864K673479K927523K073834L61007q97682o94325
40671C002176N30658J457218J343567N45628k11373n90564o62107n85997m55445
40662D373761k50361J65372Q53562J556845J818906J447551P55734K86182L69908
40653A1377460R15606J430237J197590l03966k879374n498087o884028o402915
40645g047477m447886j947995N11418K985064N475686P138338O701411L958441
40637A3327000M36323j955584k783322l045669l389758l189264j723475M50227
$$ y = [-11342672, -12976226, -12933688, -11961974, -10475252, -8251539, -5193253, -1850929, 1020108, 3054546, 4172354, 4169688, 2784361, 140764, -3072136, -5891163, -7542032, -7786772, -6943209, -5462524, -3441660, -768181, 2159342, 4233176, 4594183, 3696501, 3002176, 3532834, 4990052, 6333619, 6879247, 6667874, 6077310, 5415203, 4829206, 4373761, 4123400, 4288772, 5142334, 6699179, 8518085, 9965636, 10721370, 11007552, 11377460, 12293066, 13723303, 14920893, 14616927, 11737553, 6239466, -644562, -7047477, -11495363, -13443358, -12931940, -9946876, -4471190, 2667148, 9368559, 13327000, 13763323, 11807739, 9024417, 5978748, 2588990, -600274, -2323749, -1873522]
40629a873522K002617K384296K169937J953001J604149Q17483j49451o71466m76396
40620G760648J14680N83021O67746M60990J60067k36644r21634j897574k719811
40611C971489k821295k081085r29034K9023L16856k47431j226042j489073j54594
40602d631186K113975L344256K334651J45445j072913m98291P78285J424162J227130
40593E165514N84653m24277j716323k492682j816046R8715J915374K675934K648225
40584F639087K401946J707610L0530k187470l553296l198945j705777l16172L35816
40575A53329L72757j6143p74013j556604j776341j370620j125785j824655l247609
40566a1165684m401824m660430m266923l674005k837860j464689K97297J769978
$$ y = [-1873522, 129095, 2513391, 4683328, 6636329, 8240478, 9057961, 8908510, 8237044, 7760648, 7875328, 8458349, 9126095, 9587085, 9747152, 9510508, 8588874, 6691300, 3971489, 1150194, -930891, -1859925, -1830902, -1514046, -1761477, -2987519, -4476592, -4631186, -2517211, 827045, 3161696, 3307141, 2234228, 1735937, 2514222, 3938384, 5165514, 5750167, 5325890, 3609567, 1116885, -699161, -600446, 1314928, 3990862, 6639087, 9041033, 10748643, 10779173, 8591703, 5038407, 1839462, 133685, -182487, 153329, 526086, 509943, -264070, -1820674, -3597015, -4967635, -6093420, -7918075, -11165684, -15567508, -20227938, -24494861, -28168866, -31006726, -32471415, -32174118, -30404140]
40558c0404140K291297J616417j01770k355986m270537m953664m172774k561617
40550d4912774r66619L14123J494936K675932L547250L728795L207447K429741
40542b8481169K134555L036965N309443Q138300R983940R644745P241100M134643
40534B1142522J838891R50364R95803J139948R53002N48233J57036k32278q05013
40525B6688508j696407k953959m524272o061092o930953o773896n996962n278433
40517a3527466m521169k802445L42828L987511O581486P413212O894017N651883
40509A0019857L992347K284837J200332J134040J683363K086375K087638K102077
40501B6590866K554217L270135L580395K950083J488534j49509j378160k149853
$$ y = [-30404140, -28112843, -26496426, -26598196, -28954182, -33224719, -38178383, -42351157, -44912774, -45879393, -45565270, -44070334, -41394402, -37847152, -34118357, -30910910, -28481169, -26346614, -23309649, -18000206, -9861906, 122034, 9766779, 17007879, 21142522, 22981413, 23931777, 24927580, 26067528, 27020530, 27568763, 27725799, 27493521, 26688508, 24992101, 22038142, 17513870, 11452778, 4521825, -2252071, -8249033, -13527466, -18048635, -20851080, -20508252, -16520741, -9939255, -2526043, 4367974, 10019857, 14012204, 16297041, 17497373, 18631413, 20314776, 22401151, 24488789, 26590866, 29145083, 32415218, 35995613, 38945696, 40434230, 40284721, 38906561, 36756708]
40493C6756708k736745l133257k906480j716375J55524J857353K458362J485106
40485C2220196o82759k815328l574338k643229j100248m54733j309310l036898
40477A6603353m552094n085460m310359k224215P51318L695663N565269N841022
40469A6284497M799940L085070J028741j442586m121921n977518n797135l576662
40461D282426q83094N71581N28883m3834n62502j515713l388492n542323o662789
40452a3215857o017572l848527q14702K353500M721153N353093M009006J411606
40444f048300j328829l367607m234455l791703k418026r37226M3446O35498J251328
40435b0195874J851726J959063J311305R3980j461594l254515m945609n812338
$$ y = [36756708, 34019963, 30886706, 27980226, 26263851, 26419375, 28276728, 30735090, 32220196, 31537437, 28722109, 25147771, 22504542, 21404294, 20949561, 19640251, 16603353, 12051259, 6965799, 2655440, 431225, 1182543, 4878206, 10443475, 16284497, 21084437, 24169507, 25198248, 23755662, 19633741, 13656223, 7859088, 4282426, 3399332, 3970913, 4499796, 4455962, 3893460, 2377747, -1010745, -6553068, -13215857, -19233429, -23081956, -23896658, -21543158, -16822005, -11468912, -7459906, -6048300, -7377129, -10744736, -14979191, -18770894, -21188920, -22126146, -22082700, -21447202, -20195874, -18344148, -16385085, -15073780, -14979800, -16441394, -19695909, -24641518, -30453856]
40427c0453856n274001l410351q31442J733976L591130M185563L453442J967223
40419b5038316M51860p73514j677098k045577j543076k49053J198572K117542
40411b7558660K287777J973314J669566J805298K386306K840463K474329J246739
40403a0874868m7073m63416K98155J749046L021706L372173K523370O96863j708108
40394a432152m374727o811785q014782o974842l831977j76170K214825K874679
40386b6526931K704660K742452L210649L723960M069453M546173N517865O715800
40378F704081P215763O368569M649215L164256K277717J250333n23963k475704
40370B8630267l512615l282321k232706q05299O92446J636797J405382K74332
$$ y = [-30453856, -35727857, -39138208, -39969650, -38235674, -34644544, -30458981, -27005539, -25038316, -24586456, -25359970, -27037068, -29082645, -30625721, -30874774, -29676202, -27558660, -25270883, -23297569, -21628003, -19822705, -17436399, -14595936, -12121607, -10874868, -10921941, -11385357, -11087202, -9338156, -6316450, -2944277, -420907, 275956, -1432152, -5806879, -12618664, -20633446, -27608288, -31440265, -31616435, -29401610, -26526931, -23822271, -21079819, -17869170, -14145210, -10075757, -5529584, -11719, 6704081, 13919844, 20288413, 24937628, 28101884, 30379601, 31629934, 31105971, 28630267, 25117652, 21835331, 19602625, 18797326, 19489772, 21126569, 22531951, 22806283]
40362B2806283o95552q31661k90985P48249K470247M583536N897372N467704L720859
40353D3876052J765020m6629k114069m386660o033372o438885n872346m943251
40345A5805860l890332k649757j215369L51992J978804L382736M054030L692669
40337B1510633K529993J047716m37490j688567k228894j505554M79060K873937
40329B2580834M552425N061954M899447M702068M266180K731596r7225k963765
40321D5733514m093783k802467J14280L299601N554089N817059L449327q78286
40313E6193334n103259p278562p109195n720016m260686l253471k978749l602857
40305A6886539m673891n086785l993786j579848J213813L468335M646225M555240
$$ y = [22806283, 22110731, 21279070, 20988085, 21736334, 24206581, 28790117, 34687489, 40155193, 43876052, 45641072, 45594443, 43480374, 39093714, 33060342, 26621457, 20749111, 15805860, 11915528, 9265771, 8050402, 8402394, 10381198, 13763934, 17817964, 21510633, 24040626, 25088342, 24650852, 22962285, 20733391, 19227837, 19706897, 22580834, 27133259, 32195213, 37094660, 41796728, 46062908, 48794504, 48697279, 45733514, 41639731, 38837264, 38951544, 42251145, 47805234, 53622293, 57071620, 56193334, 51090075, 43811513, 36702318, 30982302, 26721616, 23468145, 20489396, 16886539, 12212648, 7125863, 3132077, 1552229, 2766042, 6234377, 10880602, 15435842]
40297A5435842L368615J611207j58650j687943k947266l792410l887575k999426
40289D942394j307607N95374K071864K940024L610992M556503N602257N959162
40281B8970963N057423L150458R72437r53729k441861l318017l378559k694624
40273B5364491j686661q14022l14070k10850l86217o34048q19753j006626j280080
40264A8212164j461385j179564k63648J053811K283376K867531K327234N73169
40256B4412688j810827l845076m897096n047997m680358l925604k665294r01608
40248c361172J068554K768821L715758L615136K608026J334393O08373Q98701
40240A3256590K002920L143963L499143K866509J833067J117067P80466L25385
$$ y = [15435842, 18804457, 20415664, 20257014, 18569071, 15621805, 11829395, 7941820, 4942394, 3634787, 4230161, 6302025, 9242049, 12853041, 17409544, 23011801, 28970963, 34028386, 37178844, 38151281, 37197552, 34755691, 31437674, 28059115, 25364491, 23677830, 22863808, 22549738, 22338888, 21952671, 21318623, 20498870, 19492244, 18212164, 16750779, 15571215, 15307567, 16361378, 18644754, 21512285, 23839519, 24412688, 22601861, 18756785, 13859689, 8811692, 4131334, 205730, -2459564, -3361172, -2292618, 476203, 4191961, 7807097, 10415123, 11749516, 12357889, 13256590, 15259510, 18403473, 21902616, 24769125, 26602192, 27719259, 28499725, 28825110]
40232B8825110n06888j431128k118814k461825k143531n99539K006460M158714
40224B5728559M091285J539329k029669m805452n789912m830545k401507L77211
40216A1879299K185309K499711J918482J257879O51280k09464j301436k101496
40208A6779564j968433m55593K380815N531905P179649N989249K467650j285757
40200C6619049l364016l495838k797176k425449k629017k905356k789242k343191
40192A3869764j917238j622017j241173o12993J61169R22945J571909J860161
40184A2992527J424936L16690p49641j020898m72888L05424Q23365R55856O34986
40175A5210357l22092k038684m435068p130541r227107r467696p216031l344695
$$ y = [28825110, 28318222, 26887094, 24768280, 22306455, 20162924, 19563385, 21569845, 25728559, 29819844, 31359173, 29329504, 24524052, 18734140, 13903595, 11502088, 11879299, 14064608, 16564319, 18482801, 19740680, 20391960, 20182496, 18881060, 16779564, 14811131, 14355538, 16736353, 22268258, 29447907, 35437156, 37904806, 36619049, 33255033, 29759195, 26962019, 24536570, 21907553, 19002197, 16212955, 13869764, 11952526, 10330509, 9089336, 8476343, 8637512, 9560457, 11132366, 12992527, 14417463, 14734153, 13984512, 12963614, 12490726, 12796150, 13619515, 14575371, 15210357, 14888265, 12849581, 8414513, 1283972, -7943135, -17410831, -24626862, -27971557]
40167b7971557L20757K566715L467972L584825L160753K387248J845984K078841
40159h558462K890130L490370L285229K341556J269099Q41294J461966K697628
40151I718810L525681L319309K395993J377731L70853q14402j994095k795759
40143A5104121l339636m023692m613388m273716k728582p46494Q55187K078230
40135a687970L132288L515268K480132K46766j953473l079595k978641j872732
40127b197957J29565K614906M463228M532673K800046N03468r48409j123885p02478
40118A0071157o31094j145053j552341j039974K85713J358611J295824L76518
40110I019361l62665l10573L11000J075263J821189K389645K472507K121468K015045
$$ y = [-27971557, -27650800, -25084085, -21616113, -18031288, -14870535, -12483287, -10637303, -8558462, -5668332, -2177962, 1107267, 3448823, 4717922, 5559216, 7021182, 9718810, 13244491, 16563800, 18959793, 20337524, 20708377, 19893975, 17899880, 15104121, 11764485, 7740793, 3127405, -1146311, -3874893, -4621387, -3766200, -1687970, 1444318, 4959586, 7439718, 7686484, 5733011, 2653416, -325225, -2197957, -2068392, 546514, 5009742, 9542415, 12342461, 12845929, 11897520, 10773635, 10071157, 9440063, 8295010, 6742669, 5702695, 5988408, 7347019, 8642843, 9019361, 8656696, 8346123, 8657123, 9732386, 11553575, 13943220, 16415727, 18537195, 20552240]
40101B0552240K688954L648835L741872K432146L58266j379378k161223k098369
40093B7783343j728262j546892j537920j122339Q9134J477244J820730O93896
40085B5928934j000689k149290k581423k696476k449445j480354j38788M05385
40077A3837854o13116k592965m084477m105704k874984j446593o84456m30351
40069b994792K93543K056738M091094M930023L956902J930976m1285j546688k684709
40060I991802l382949l380724k672694j559962l72477N60535Q55987M23239j87364
40051B75393k11890M62946J181307J346511J036490O38143K23103l42697q30165
40042C779141o64791L18697J430946J733619J010045j12743r32259j168978o09921
$$ y = [20552240, 23241194, 26890029, 30631901, 33064047, 33422313, 32042935, 29881712, 27783343, 26055081, 24508189, 22970269, 21847930, 21937064, 23414308, 25235038, 25928934, 24928245, 22778955, 20197532, 17501056, 15051611, 13571257, 13432469, 13837854, 13224738, 10631773, 6547296, 2441592, -433392, -1879985, -2564441, -2994792, -2701249, -644511, 3446583, 8376606, 12333508, 14264484, 14223199, 12676511, 9991802, 6608853, 3228129, 555435, -1004527, -1377004, -816469, 39518, 462757, 275393, 63503, 526449, 1707756, 3054267, 4090757, 4728900, 4952003, 4609306, 3779141, 3114350, 3433047, 4863993, 6597612, 7607657, 7494914, 6562655, 5393677, 4783756]
40033D783756J193416M284335P524905R144592Q316271N823127L011718N28253
40025D4610373j653744l481756m699009n262269n316256m794879l550995j914700
40017A3936765o28400n8120J59621N07867R48017J090968P48402R8227n20496
40008A6282851q30300q25193q71207j346110k036451k203623j487543m25869K78614
39999F535169P10365J428080K328686K482159J302275o18105k184996k964925
39991I018708l244572l173938k457858j010995O11914J857823K973604M569297
39983I143983O280969O452100L737428j065858n348148p080078o543202n435234
39975A41960m653219l552869j339253J505218L606861M201993L783542L308048
$$ y = [4783756, 5977172, 10261507, 17786412, 26931004, 35247275, 41070402, 44082120, 44610373, 42956629, 39474873, 34775864, 29513595, 24197339, 19402460, 15851465, 13936765, 13308365, 13250245, 13409866, 13917733, 14865750, 15956718, 16705120, 16803347, 16282851, 15452551, 14627358, 13756151, 12410041, 10373590, 8169967, 6682424, 6256555, 6535169, 7245534, 8673614, 11002300, 13484459, 14786734, 14168629, 11983633, 9018708, 5774136, 2600198, 142340, -868655, -256741, 1601082, 4574686, 9143983, 15424952, 21877052, 25614480, 24548622, 19200474, 12120396, 5577194, 141960, -4511259, -8064128, -9403381, -7898163, -4291302, -89309, 3694233, 7002281]
39967G002281L165225L037158K455458J261049l11032j718682k325120j831192
39959A0735145o59485K40252J87029n95756j234058j113955m65408j9270j86391
39950F888103o84325r56216q29624o60926q61331j411171j920686k090166j972042
39941d498384j791003j663415j536001j226017m30775J068290K960378M337976
39933b778951M473125L672622K970537K866110K803870K189655J501805J827557
39925A9526330L398866N111436N568041M200570J338387k242846n482234p204193
39917B4214357o807350m892046k892122j948194k178171k876841l152689k459088
39909b992144r10059P32810J551735J105026m03094k394118m060807m361928k479383
$$ y = [7002281, 10167506, 13204664, 15660122, 16921171, 16610139, 14891457, 12566337, 10735145, 10075660, 10315912, 10502941, 9907185, 8673127, 7559172, 7093764, 7074494, 6888103, 6203778, 5247562, 4417938, 3757012, 2895681, 1484510, -436176, -2526342, -4498384, -6289387, -7952802, -9488803, -10714820, -11145595, -10077305, -7116927, -2778951, 1694174, 5366796, 8337333, 11203443, 14007313, 16196968, 17698773, 19526330, 22925196, 28036632, 33604673, 37805243, 39143630, 36900784, 31418550, 24214357, 17407007, 12514961, 9622839, 7674645, 5496474, 2619633, -533056, -2992144, -3902203, -3169393, -1617658, -512632, -915726, -3309844, -7370651, -11732579, -14211962]
39900a4211962J320386N521178Q420297R311049Q511049O616101M207375K043115
39892C1738588P83511L27553m0610o02941q41100m96110m25000j648956l754828
39883B5040107n059150m511480k800794j317814n95447j83687M23163J348111
39875A2343009K564137L883276M693679M314930K851498J270396L45332j47958
39867C2118299q46705j689515j901193j096919M7319M45838l44042j967549l930915
39858B0834618n949650p568828p894634o177548k685342J260575M196214N372359
39850A387764M876176L360539J816430J167720J581621K230577K094117J015924
39842A9530868k77667j120586j497276j725936k054231k737208m012656n585975
$$ y = [-14211962, -12891576, -7370398, 1049899, 10360948, 18871997, 25488098, 29695473, 31738588, 32522099, 32849652, 32809042, 32206101, 31365001, 30868891, 30443891, 28794935, 25040107, 19980957, 15469477, 12668683, 11350869, 10755422, 10571735, 10994898, 12343009, 14907146, 18790422, 23484101, 27799031, 30650529, 31920925, 32266257, 32118299, 31271594, 29582079, 27680886, 26583967, 26631286, 27077124, 26733082, 24765533, 20834618, 14884968, 7316140, -578494, -6756042, -9441384, -8180809, -3984595, 1387764, 6263940, 9624479, 11440909, 12608629, 14190250, 16420827, 18514944, 19530868, 19253201, 18132615, 16635339, 14909403, 12855172, 10117964, 6105308, 519333]
39834E19333o449422n718596l594028j138879Q40377K339306L610078M473449
39826e118382M343444K774172l3892l080750m997205n017768l666071k217464
39818a7013916j381486p90992J27042J223780J935101K213648K606429L357854
39810g722540L845822L143591R96888j901850m497825o044840o219941m880805
39802b3281500k114207J357449M199466N394099N160649M563711M158059L489409
39794B927135K119244N70401k83183m37022p14732j581387k610823l231644l445998
39785f688009l529103l408104k715925j331478L65953J723072K204757J688671
39777a1690166M96834q63462j929800k231926j346878N64031K438476L139048
$$ y = [519333, -5930089, -11648685, -15242713, -16381592, -15541215, -13201909, -9591831, -5118382, -774938, 1999234, 1965342, -1115408, -6112613, -11130381, -14796452, -17013916, -18395402, -19186394, -19059352, -17835572, -15900471, -13686823, -11080394, -7722540, -3876718, -733127, 263761, -1638089, -6135914, -12180754, -18400695, -23281500, -25395707, -24038258, -19838792, -14444693, -9284044, -4720333, -562274, 2927135, 5046379, 5616780, 5333597, 4896575, 4181843, 2600456, -10367, -3242011, -6688009, -10217112, -13625216, -16341141, -17672619, -17306666, -15583594, -13378837, -11690166, -11193332, -12056794, -13986594, -16218520, -17565398, -17001367, -14562891, -11423843]
39769a1423843K681806K083143J850873J328036o5854j633781k181083j604205
39761h964908q74196n64140k25609O20815J589491J922139J494066R79059J171656
39752b851627K287536L730962M452106L771240K001671J47263r88860j185594
39744A1364697m52017J150276L142338M559675M672524L632206K184747R42614
39736C1197060J35840k17153k84382m42314r44588j566905j879134j914815k302705
39727B1780904l573959n426806o782375o598541m690292j827174R55644L116668
39719c045931M652024N527831N392357M017485J855933n2431p45603M5648J714236
39710A9361549L110382L335808K488354J529022J228444J361324J110674Q3674
$$ y = [-11423843, -8742037, -6658894, -4808021, -3479985, -3545839, -5179620, -7360703, -8964908, -9839104, -10403244, -10628853, -10008038, -8418547, -6496408, -5002342, -4023283, -2851627, -564091, 3166871, 7618977, 11390217, 13391888, 13539151, 12550291, 11364697, 10912680, 12062956, 15205294, 19764969, 24437493, 28069699, 30254446, 31197060, 31332900, 31115747, 30831365, 30389051, 29444463, 27877558, 25998424, 24083609, 21780904, 18206945, 12780139, 5997764, -600777, -5291069, -7118243, -6162599, -3045931, 1606093, 7133924, 12526281, 16543766, 18399699, 18347268, 17601665, 17647313, 19361549, 22471931, 25807739, 28296093, 29825115, 31053559, 32414883, 33525557, 33609231]
39702C3609231j337096k487908k920860k519236j582457q85171j221397k590828
39694A8064278m018225m410187l519212j988810o72703j07525m05973j211427
39686A730216j697330j038016P53011K560106L071374K015862K96707j111211
39678F580719k042284k741090l021512k404899j003022L82404J263058K048466
39670i38160L237836M411374M565462L314308J255344q61712k856083m846738
39662G281631o619924p555481p093323n153135k221995Q02745K915110L415248
39654a4229124K338725O27545l14748L65937K249799M107791N129906N404035
39646E679866N152782M081984J922575q15057l252057n067549o347762o679718
$$ y = [33609231, 32272135, 29784227, 26863367, 24344131, 22761674, 21876503, 20655106, 18064278, 14046053, 9635866, 6116654, 4127844, 3455141, 3347616, 2941643, 1730216, 32886, -1005130, -252119, 2307987, 5379361, 7395223, 7691930, 6580719, 4538435, 1797345, -1224167, -3629066, -4632088, -4249684, -2986626, -938160, 2299676, 6711050, 11276512, 14590820, 15846164, 14984452, 12128369, 7281631, 661707, -6893774, -13987097, -19140232, -21362227, -20559482, -17644372, -14229124, -11890399, -11262854, -11577602, -11211665, -8961866, -4854075, 275831, 5679866, 10832648, 14914632, 16837207, 16022150, 12770093, 7702544, 1354782, -5324936]
39638e324936n296061k370587N82725K120074K281856K206810K694719L570119
39630D64719M176389M013636L026278J715034R51127J281880K280887K782380
39622B0692330J894146k18375k482893l775717l716794k765539j607646n31603
39614G487909N46333J658519K696832L658128M588977N267810N351120M901246
39606C6156874M303890L535784K083434j13496k229587l568948m510066n761643
39598B9896242p034941p290191o206938m561410k996705j222954J122473L408673
39590E114249M467140L968759K838200K212334K282346K325428J722702O84918
39582B5616076j03461l10952j10426L88845J341359K598149L420619L188217K088583
$$ y = [-5324936, -10620997, -12991584, -12408859, -10288785, -8006929, -5800119, -3105400, 464719, 4641108, 8654744, 11681022, 13396056, 14347183, 15629063, 17909950, 20692330, 22586476, 22368101, 19885208, 16109491, 12392697, 9627158, 8019512, 7487909, 8034242, 9692761, 12389593, 16047721, 20636698, 25904508, 31255628, 36156874, 40460764, 43996548, 46079982, 45966486, 43736899, 40167951, 35657885, 29896242, 22861301, 15571110, 9364172, 4802762, 1806057, 583103, 1705576, 5114249, 9581389, 13550148, 16388348, 18600682, 20883028, 23208456, 24931158, 25616076, 25512615, 25201663, 25091237, 25480082, 26821441, 29419590, 32840209, 36028426, 38117009]
39573C8117009O71306r73032l002478m990567o017670n674317m433644k966746
39565A0729861j628046o69805k87920j67424M46539J798943L090803L237746J930611
39556A8481308k01310k075123k613175j296402J221914L363599L978836L333204
39548B4192851K506316K149272K216378K548848L098174L648412L812135L332275
39540D7504661K122985J90824k109575l950812m675132m480232m003479l376374
39532B7222866k343424j309351j429336l197173n451815o364395n269811l154741
39524a297180j455379p34561n43255k61970J41598J82544m29906j311213j734921
39515g444243j349159m05370O31287J450355J892658J873516J454405Q75507M51985
$$ y = [38117009, 38788315, 37815283, 34812805, 29822238, 23804568, 18130251, 13696607, 10729861, 9101815, 8432010, 8144090, 7976666, 8423205, 10222148, 13312951, 16550697, 18481308, 18279998, 16204875, 13591700, 12295298, 13517212, 16880811, 20859647, 24192851, 26699167, 28848439, 31064817, 33613665, 36711839, 40360251, 44172386, 47504661, 49627646, 49818470, 47708895, 43758083, 39082951, 34602719, 30599240, 27222866, 24879442, 23570091, 22140755, 18943582, 13491767, 7127372, 1857561, -1297180, -2752559, -3487120, -4030375, -4292345, -4150747, -3968203, -4398109, -5709322, -7444243, -8793402, -9198772, -8567485, -7117130, -5224472, -3350956, -1896551, -1021044, -569059]
39506e69059M65632J001091J663331J617192L31469j677803l220478l622782l179455
39497g190862k385612j291395Q4865J267817J856056K272597L340018N106104
39489C059588O582344O717636N261598K691141j73713k298643k759008j516724
39481A7564219K48759J071765O17265k1553M89930K396837M747529O380691O796516
39472D0291958O158201M807794L038483J228765j18393o37273l43484M31988J291194
39463E6149233J950637K308274K406604K259816J707342N88576q74953k045535
39455F4449994k353684j711491l82322J315068K962950L968577L980712L394218
39447G5624022L070256L429925M074765M386540M204917L747840L160889K462507
$$ y = [-569059, -103427, 897664, 2560995, 4178187, 4509656, 2831853, -388625, -4011407, -7190862, -9576474, -10867869, -10783004, -9515187, -7659131, -5386534, -2046516, 3059588, 9641932, 16359568, 21621166, 24312307, 24138594, 21839951, 19080943, 17564219, 17812978, 18884743, 19502008, 19480455, 19970385, 22367222, 27114751, 33495442, 40291958, 46450159, 51257953, 54296436, 55525201, 55406808, 54769535, 54426051, 54858039, 56149233, 58099870, 60408144, 62814748, 65074564, 66781906, 67370482, 66495529, 64449994, 62096310, 60384819, 60002497, 61317565, 64280515, 68249092, 72229804, 75624022, 78694278, 82124203, 86198968, 90585508, 94790425, 98538265, 101699154, 104161661]
39439A04161661J806481J494850J726390K493825L640146M776949N216833M376490
39431A29693625K477640O94332L48009J846790M369656O517384P304381O714436
39423A59966253N462653M230963L134994K005277J110906J260640K922732N420184
39415A85514602P370360P950021P445694O572806N735235N227278N696450P712921
39407B39225367J0825736J3575232J4744592J4387097J3444909J2594647J1711429
39400C30509009J0298175Q165678N779234M194772M557131P238565J1247628J4665767
39392C96655959J5933068J4816251J2192650R054615N843633K645805k59617k310263
39384D54572101l148623l011970k488853k020394j863400k390905l926034o107960
$$ y = [104161661, 105968142, 107462992, 109189382, 111683207, 115323353, 120100302, 125317135, 129693625, 132171265, 132865597, 133213606, 135060396, 139430052, 145947436, 153251817, 159966253, 165428906, 169659869, 172794863, 174800140, 175911046, 177171686, 180094418, 185514602, 192884962, 200834983, 208280677, 214853483, 220588718, 225815996, 231512446, 239225367, 250051103, 263626335, 278370927, 292758024, 306202933, 318797580, 330509009, 340807184, 348972862, 354752096, 358946868, 363503999, 370742564, 381990192, 396655959, 412589027, 427405278, 439597928, 448652543, 454496176, 457141981, 456882364, 454572101, 451423478, 448411508, 445922655, 443902261, 442038861, 439647956, 435721922, 429613962]
39376D29613962p903610q693256r069779j0053870j1695720j3089972j3778719
39369C55329036j4391292j5535286j6632514j6429331j4389100j1084771p437225
39362B59429517m139106j735412n75810m03923m20828j09247K12249p3224r58943
39353B51225273j740859j819482j269688n03071M00727J719977L400882M626264
39345B56040023M443445K902506J289585R91813K269171M367853O635588R042867
39337B87982851J1562833J3617783J4626643J4889726J5384788J6564082J7730044
39330C92358750J7841046J6644554J4596087J1746317P280350N26521p825936
39323D53167689j5905775k1957932k5154715k5402765k3156316j9653366j6535691
$$ y = [429613962, 421710352, 413017096, 403947317, 393893447, 382197727, 369107755, 355329036, 340937744, 325402458, 308769944, 292340613, 277951513, 266866742, 259429517, 255290411, 253554999, 252979189, 252575266, 252154438, 252045191, 252257440, 252184216, 251225273, 249484414, 247664932, 246395244, 245892173, 246292900, 248012877, 251413759, 256040023, 260483468, 263385974, 264675559, 265667372, 267936543, 272304396, 278939984, 287982851, 299545684, 313163467, 327790110, 342679836, 358064624, 374628706, 392358750, 410199796, 426844350, 441440437, 453186754, 460467104, 460993625, 453167689, 437261914, 415303982, 390149267, 364746502, 341590186, 321936820, 305401129]
39316C05401129j4489794j2583023r618228n933969l131304k107309k183007k273010
39308B53081485k015804j376728m5434J960685L622133L777090K564245J327393
39300B62895065J107213J787738K665313L196689L092792K340210J466757J352565
39292B79904342K405060M102883N502467N935813N129098L104393L53226k144708
39284C04292574l517292l645419l064980k352546j806421j583331j811178k487683
39276B84023724l430564m394775n159192n474877n017977l516140j052958J673473
39268B57650714L504283L489644J584601j282778l811401n049074m821367l779730
39260B47484892k963373k950906l319703l129776j969436l23569J034719J681327
$$ y = [305401129, 290911335, 278328312, 268710084, 262776115, 259644811, 257537502, 255354495, 253081485, 251065681, 249688953, 249643519, 251604204, 255226337, 259003427, 261567672, 262895065, 264002278, 265790016, 268455329, 271652018, 274744810, 277085020, 278551777, 279904342, 282309402, 286412285, 291914752, 297850565, 302979663, 306084056, 306437282, 304292574, 300775282, 297129863, 294064883, 291712337, 289905916, 288322585, 286511407, 284023724, 280593160, 276198385, 271039193, 265564316, 260546339, 257030199, 255977241, 257650714, 261154997, 264644641, 266229242, 264946464, 261135063, 256085989, 251264622, 247484892, 244521519, 241570613, 238250910, 235121134, 233151698, 232828129, 233862848, 235544175]
39252B35544175J586423R78313K97491j57213p65937k350796n087590q012584
39244B22032282r944344j0543796j0126196q918993p140596n491437m750342m838448
39236A60278130m896017m371574l496745k610671j640632n48874J70440j55675
39228A42728382j684882l869168n767066o525254n900461m441710k910355j534297
39220A10095189k22031N67309q3853k256397m611189n624864m995289l357291
39212H9511584j156368J366936L355276L556495J687726j059911l236730m429200
39204H9595808n069367n436418n347619m609126l261560j392342Q80264L131965
39196F8491605M676326N113757M668862L767355K418477L46681k248445m460471
$$ y = [235544175, 237130598, 238108911, 238406402, 238249189, 237483252, 235132456, 230044866, 222032282, 212087938, 201544142, 191417946, 182498953, 175358357, 169866920, 165116578, 160278130, 155382113, 151010539, 147513794, 144903123, 143262491, 142713617, 142884057, 142728382, 141043500, 137174332, 131407266, 124882012, 118981551, 114539841, 111629486, 110095189, 109873158, 110440467, 110356614, 108100217, 103489028, 97864164, 92868875, 89511584, 88355216, 89722152, 93077428, 96633923, 98321649, 97261738, 94025008, 89595808, 84526441, 79090023, 73742404, 69133278, 65871718, 64479376, 65359640, 68491605, 73167931, 78281688, 82950550, 86717905, 89136382, 89483063, 87234618, 82774147]
39188H2774147n505506n593788n618245o025569o359186n964590m760944l138175
39180C9808144j439738J44783J393850K098866K213751J748136O77590p70411
39172D5874971j943433k312541k150524k203359k580328k407018q75547J615645
39164C3017866L706711M397469L891533L140747K757280K462251J522073l66584
39156E4529346k649865m361442m982922m857701m748151m975071n015221m035932
39148A8903041j886969N41351K088675K359913J781474P67943o65386k294532
39140B1595510l224964k600836o58117J383502K512144K713686K596722K562069
39132B6879716K429642J695365J32868j741655k943012k994848k478598k282066
$$ y = [82774147, 77268641, 71674853, 66056608, 60031039, 53671853, 47707263, 42946319, 39808144, 38368406, 38513189, 39907039, 42005905, 44219656, 45967792, 46645382, 45874971, 43931538, 41618997, 39468473, 37265114, 34684786, 32277768, 31402221, 33017866, 36724577, 41122046, 45013579, 48154326, 50911606, 53373857, 54895930, 54529346, 51879481, 47518039, 42535117, 37677416, 32929265, 27954194, 22938973, 18903041, 17016072, 17557423, 19646098, 22006011, 23787485, 24555428, 23890042, 21595510, 18370546, 15769710, 15111593, 16495095, 19007239, 21720925, 24317647, 26879716, 29309358, 31004723, 31137591, 29395936, 26452924, 23458076, 20979478, 18697412]
39124A8697412k472844k380907j684821p96498q9206O03532J427984K016658K016689
39115A7337999J745198J823066K305221K520757J679688n15377l552564o125315
39107A7218673o814804n252082k537458k40231Q69053R49146M42445j76859l61137
39098D096746O6758M65290k049j237760k249517k369639j862575j224290n42212
39089d859248J66473O08134O66897P14482R11118N74205j050534l474340n066660
39080a0809473m634702k534844j58879J252138J147023m26782k853043m936298
39072b3954860n415582l911629j339182Q79339K122591K960721M137104N363688
39064a9157810N456513L676484O27402k280415l966750m137769l021518j145555
$$ y = [18697412, 16224568, 13843661, 12158840, 11362342, 11273136, 11876668, 13304652, 15321310, 17337999, 19083197, 20906263, 23211484, 25732241, 27411929, 26896552, 23343988, 17218673, 10403869, 5151787, 2614329, 2374098, 3243151, 4192297, 4634742, 4457883, 4096746, 4163504, 4628794, 4626745, 3388985, 1139468, -1230171, -3092746, -4317036, -4859248, -4692775, -4084641, -3417744, -2703262, -1792144, -1217939, -2268473, -5742813, -10809473, -15444175, -17979019, -18137898, -16885760, -15738737, -16165519, -19018562, -23954860, -29370442, -33282071, -34621253, -33741914, -31619323, -28658602, -24521498, -19157810, -13701297, -10024813, -9397411, -11677826, -15644576, -19782345, -22803863, -23949418]
39056b3949418P15949J889357K324051K571603L126720L941942M631466M897231
39048A48901M603362L662242K111401K18676j695193l462760m897256n546022
39040d856649n018468l665062k553656k439810k911253k863411j755525q9352
39032b6153186J328259K221005K834161L445419M107606M603737M418464L066201
39024a28334Q30902j081026j676322j393321j610808k874866m212497m416887
39016a6563159l386798j771205J13717K271871M222325N034037M250839K224856
39008c603517m82261l375755n576113n883422l888425o73840K082887L519777
39000a7880669L824775L507203L058476L094998M002286N204836N366726L718658
$$ y = [-23949418, -23233469, -21344112, -19020061, -16448458, -13321738, -9379796, -4748330, 148901, 4752263, 8414505, 10525906, 10744582, 9049389, 5586629, 689373, -4856649, -9875117, -13540179, -16093835, -18533645, -21444898, -24308309, -26063834, -26153186, -24824927, -22603922, -19769761, -16324342, -12216736, -7612999, -3194535, -128334, 702568, -378458, -2054780, -3448101, -5058909, -7933775, -12146272, -16563159, -19949957, -21721162, -21607445, -19335574, -15113249, -10079212, -5828373, -3603517, -4085778, -7461533, -13037646, -18921068, -22809493, -23483333, -21400446, -17880669, -14055894, -10548691, -7490215, -4395217, -392931, 4811905, 10178631, 13897289]
38992A3897289R33632j555707k852629k978272k278434r25636R51075K917762
38984H109080M162251L825174J645224j490748l811375l917640j982589M38306
38976F977683J891353K226165K330292K946560L987471M889414N294750N214618
38968C5758306M672628L459659J382719j285483l729005n066877m986536l969356
38960B6236055k912459k459957k594368k835193k845852k805197l121483l863684
38952B797862m671162n237078n616837n894562n792885m960296l569722k235076
38944c5179756j216631l7132J852547M188136N925474O113037M596294K027517
38936a1730514m99340j880564j578225j47124R94587P82186l57203q41372L87491
$$ y = [13897289, 14830921, 13275214, 10422585, 7444313, 5165879, 4240243, 5191318, 8109080, 12271331, 16096505, 17741729, 16250981, 12439606, 8521966, 6539377, 6977683, 8869036, 11095201, 13425493, 16372053, 20359524, 25248938, 30543688, 35758306, 40430934, 43890593, 45273312, 43987829, 40258824, 35191947, 30205411, 26236055, 23323596, 20863639, 18269271, 15434078, 12588226, 9783029, 6661546, 2797862, -1873300, -7110378, -12727215, -18621777, -24414662, -29374958, -32944680, -35179756, -36396387, -36433519, -34580972, -30392836, -24467362, -18354325, -13758031, -11730514, -12229854, -14110418, -15688643, -15835767, -14841180, -14058994, -14416197, -15257569, -14870078]
38927a4870078K688636M464067M909142M599301M298019L743775K123480m61275
38919A1495067k622119k994230j614879J97557J120664Q14823j17245q39312r94960
38910D445366r32574j226470j879630k129343j259758M62280J923414K265876
38902A669161J657471R60821Q92599J567374K540699L055327K487654R38100o56054
38893A5113152j331291j073641p09618q13534j173092j574249k598582m952794
38885H86351q088019j0193472r872199p444040m364550j780506j005J044584J459744
38876c8353112J414674J054139L94720l28799l79083Q66553L025842M997580O181789
38867b1125697O797599O887556N848506L487649R08095m44478l84882m895k39488
$$ y = [-14870078, -12181442, -7717375, -2808233, 1791068, 6089087, 9832862, 11956342, 11495067, 8872948, 5878718, 4263839, 4461396, 5582060, 6396883, 6279638, 5440326, 4445366, 3512792, 2286322, 406692, -1722651, -2982409, -2520129, -596715, 1669161, 3326632, 4287453, 5180052, 6747426, 9288125, 12343452, 14831106, 15769206, 15113152, 13781861, 12708220, 11998602, 11185068, 10011976, 8437727, 5839145, 886351, -7201668, -17395140, -27267339, -34711379, -39075929, -40856435, -40857440, -39812856, -38353112, -36938438, -35884299, -35489579, -35818378, -36197461, -35330908, -32305066, -27307486, -21125697, -14328098, -7440542, -1592036, 1895613, 2803708, 2359230, 1974348, 1969453, 1729965]
38858A729965j022032j799680k256571k377747k242829j949686j498533p08255
38850a2125368N03366J787139K608433K782892K447311J605230J98366j321585
38842a514216k023371j369652K26886J869957K905926L089252K449844J298547
38834F933173J24035p70565j383595j681177j474782q74877n85101j358910l165689
38825d237488n046801n761176m597356j862376J193582L098132L085705J447181
38817a2680597q62334k745611l309717k321189n62066P05006R58196Q25649J070708
38808a8921955J590369J777447J478239J093273R78070J211090J728349K206654
38800f858464K054293J103264J43774R5351O74095N86927q15415k721107l899682
$$ y = [1729965, 707933, -1091747, -3348318, -5726065, -7968894, -9918580, -11417113, -12125368, -11622002, -9834863, -7226430, -4443538, -1996227, -390997, -192631, -1514216, -3537587, -4907239, -4680353, -2810396, 95530, 3184782, 5634626, 6933173, 7057208, 6286643, 4903048, 3221871, 1747089, 872212, 287111, -1071799, -4237488, -9284289, -15045465, -19642821, -21505197, -20311615, -17213483, -14127778, -12680597, -13542931, -16288542, -19598259, -21919448, -22481514, -21776508, -20818312, -19992663, -18921955, -17331586, -15554139, -14075900, -12982627, -12004557, -10793467, -9065118, -6858464, -4804171, -3700907, -3557133, -3461782, -2787687, -2200760, -3016175, -5737282, -9636964]
38791i636964l931182l078617j592170K36672J700205K087421J519293R31611
38783a1763731J130478K126399L412137M569072N419906N773571N326721L973505
38775A9968058K143347O10037j60017l17871j55237L81916J267370J695392O07489
38766B6040484j781714l657380l445206j663926l12180n83072j860543k945293
38758I791170l468109l745637l881069l655434l098509k620065k548774k845939
38750a6072366l231446l308812k667743j275611K11523R70181J002151J197954
38742b3174169K138136L214206L383062K543292J607047J274829J334845J294854
38734f383898J107630R09724N05846l46933j352691j903252j862681j697349j800384
$$ y = [-9636964, -13568146, -16646763, -18238933, -18002261, -16302056, -14214635, -12695342, -11763731, -10633253, -8506854, -5094717, -525645, 4894261, 10667832, 15994553, 19968058, 22111405, 22721442, 22561425, 22243554, 22088317, 22470233, 23737603, 25432995, 26040484, 24258770, 20601390, 17156184, 15492258, 15180078, 14597006, 12736463, 9791170, 6323061, 2577424, -1303645, -4959079, -8057588, -10677653, -13226427, -16072366, -19303812, -22612624, -25280367, -26555978, -26344455, -25374274, -24372123, -23174169, -21036033, -17821827, -14438765, -11895473, -10288426, -9013597, -7678752, -6383898, -5276268, -4366544, -3860698, -4207631, -5560322, -7463574, -9326255, -11023604, -12823988]
38725a2823988k082523k311180k464181k559657k435151j930271j104666j00659
38717b7812276J022551K139682K948523L266621L326206L516398L861882L958288
38709c772125L428604K323812J115824L77898L17520M53561l5574j313533k404411
38700D91576k241381j248319j247419l365201o407436p837844o230831k376555
38692c0463410J750791M454644M898937L254022P85458q45454j082487j018535
38684a8266034j909092l453937m225335l571750k234742j052365J0832J186350
38676c3516073K097680K295159K068330K038119K282612K533282K950158L898230
38668a3352503M994495N156118L809654J512177p99329k646234l882601m303473
$$ y = [-12823988, -14906511, -17217691, -19681872, -22241529, -24676680, -26606951, -27711617, -27812276, -26789725, -24650043, -21701520, -18434899, -15108693, -11592295, -7730413, -3772125, -343521, 1980291, 3096115, 3474013, 3791533, 4245094, 4209520, 2895987, 491576, -1749805, -2998124, -4245543, -7610744, -14018180, -21856024, -28086855, -30463410, -28712619, -24257975, -19359038, -16105016, -15319558, -16165012, -17247499, -18266034, -20175126, -23629063, -27854398, -31426148, -33660890, -34713255, -34702423, -33516073, -31418393, -29123234, -27054904, -25016785, -22734173, -20200891, -17250733, -13352503, -8358008, -3201890, 607764, 2119941, 1320612, -1325622, -5208223, -9511696]
38660i511696l842167k869473j883124j010932n2103J156761K611697M134207
38652a1266830N221488N143522L604810J279033o29306j389448j134992l59858
38644D68419O33605J729657K753668L436665L524360K842911J407573m09842j957414
38635A4429602k745716k799874k454674j889029j117226m50676n79477j853740
38627E39190l648006m851223n004846m579633m061587l251078j775433J03834
38619b6528782J674660K544888K733633K149270O11018j499334l155173l539522
38611b5009342k662013r60677J282391L791354N912268O906669O629559N584059
38603A474268M242339K546639K16595k538170m780243n495094m583254l090863
$$ y = [-9511696, -13353863, -16223336, -18106460, -19117392, -19169495, -18012734, -15401037, -11266830, -6045342, -901820, 2702990, 3982023, 3352717, 1963269, 828277, 468419, 1102024, 2831681, 5585349, 9022014, 12546374, 15389285, 16796858, 16387016, 14429602, 11683886, 8884012, 6429338, 4540309, 3423083, 2972407, 2392930, 539190, -3108816, -7960039, -12964885, -17544518, -21606105, -24857183, -26632616, -26528782, -24854122, -22309234, -19575601, -17426331, -16815313, -18314647, -21469820, -25009342, -27671355, -28632032, -27349641, -23558287, -17646019, -10739350, -4109791, 1474268, 5716607, 8263246, 8479841, 5941671, 1161428, -4333666, -8916920, -12007783]
38595a2007783k249770k323187k594720k403402j830463j315567r77812n28690
38587b6231394L69055J810318L512980M882082N458623N390705N171740M856871
38579E220980L959566K277174L27293j320888k639184l640380l805417k708210
38571b329066r86492k0547o54195k630469n028050o643103o217657l305277P90382
38562b7024474L658085L843538J996327j27800j258398j019662M77289K714855
38554a6740240M687190N386940M507035K504578J41132j815260k716414k351575
38546f396614j175154O8293J003121J771563K588126L332916L588264L006221
38538G786736J735317N31291J99287P18652J124529N42476p79196j740948j610482
$$ y = [-12007783, -14257553, -16580740, -19175460, -21578862, -23409325, -24724892, -25702704, -26231394, -25862339, -24052021, -20539041, -15656959, -10198336, -4807631, 364109, 5220980, 9180546, 11457720, 11785013, 10464125, 7824941, 4184561, 379144, -2329066, -3315558, -3336105, -3990300, -6620769, -11648819, -18291922, -24509579, -27814856, -27024474, -23366389, -19522851, -17526524, -17654324, -18912722, -19932384, -19455095, -16740240, -12053050, -6666110, -2159075, 345503, 486635, -1328625, -4045039, -6396614, -7571768, -7503475, -6500354, -4728791, -2140665, 1192251, 4780515, 7786736, 9522053, 10053344, 10252631, 10971283, 12095812, 12638288, 11859092, 10118144, 8507662]
38529H507662p36521j75755q80273l062174n879771p737759p392564n017914j966914
38520b4341983N91274K500806M052982N115564N229946M304284K758993J041108
38512A252974o69874k289436l651217m529543m640567l685684j699124O26110
38504a9286361K297826K887621K836805K753498K603323J832533K21893j592990
38496e445852k493167j710848O21081L553977N866696O655161N684571L457845
38488A6189464R67841r21748k110408l137825m198743m523417l228790p19085
38480a682711J380314J889270J154505K00852o14701j577735k676536l374391
38472e301133l191946k000212J00645K636098M631749N276161M710908L612355
$$ y = [8507662, 7771141, 7595386, 6715113, 3652939, -2226832, -9964591, -17357155, -22375069, -24341983, -23750709, -21249903, -17196921, -12081357, -6851411, -2547127, 211866, 1252974, 583100, -1706336, -5357553, -9887096, -14527663, -18213347, -19912471, -19286361, -16988535, -14100914, -11264109, -8510611, -5907288, -4074755, -3852862, -5445852, -7939019, -9649867, -9028786, -5474809, 391887, 7047048, 12731619, 16189464, 17157305, 16235557, 14125149, 10987324, 6788581, 2265164, -963626, -1682711, -302397, 1586873, 2741378, 2942230, 2327529, 749794, -1926742, -5301133, -8493079, -10493291, -10392646, -7756548, -3124799, 2151362, 6862270, 10474625]
38464A0474625K085524k96300l328479n908306p211355p389251o768872n179240
38456b3521654k661119j54127J309457J718467J755793J762690J726647J911313
38448a6152533K595853L290380L065225J780051L23128n17885q61053j256261
38440g733095j904997k527603k611887j681040K93824K627421M392611N213748
38432c931018N301900M838949L874321K818227K346417K537228K606739J809521
38424B2202284K32731j511466k943630l794931l870372l248375k386616j732008
38416B947617j394886j328737j494096j677323j577301j350782j618545k511919
38408a0005972l119177k468513q78910K41755l3079j166610j755210q01699J565992
$$ y = [10474625, 12560149, 12263849, 8935370, 3027064, -4184291, -11573542, -18342414, -23521654, -26182773, -26336900, -25027443, -23308976, -21553183, -19790493, -18063846, -16152533, -13556680, -10266300, -7201075, -5421024, -5097896, -5615781, -6476834, -7733095, -9638092, -12165695, -14777582, -16458622, -16164798, -13537377, -9144766, -3931018, 1370882, 6209831, 10084152, 12902379, 15248796, 17786024, 20392763, 22202284, 22435015, 20923549, 17979919, 14184988, 10314616, 7066241, 4679625, 2947617, 1552731, 223994, -1270102, -2947425, -4524726, -5875508, -7494053, -10005972, -13125149, -15593662, -16472572, -16230817, -16263896, -17430506, -19185716, -19987415, -18421423]
38399a8421423M288292O184829O777815O424213N672585M699110L513822K426315
38391B1565558J890604J893843J792402Q54743j098264l519703n499026o403378
38383A1476779o278554n560066m451423k882193j063754M57674J574063K902323
38375c825151M783707O403906O578521N201126L219097J284134p75533l016576
38367A9853231m708014n048831m111088k679696j482877r07070j104241j857606
38359b046192k427238j981706l51096J767044L387303L971302L643086K800958
38351H763461J626028R3934j533789k546819k446357j614955q86588m56465L04116
38342A302566J840128L735856N311944O409349P132717P195524O152265M192041
$$ y = [-18421423, -14133131, -7948302, -1170487, 5253726, 10926311, 15625421, 19139243, 21565558, 23456162, 25350005, 27142407, 27997150, 26898886, 23379183, 17880157, 11476779, 5198225, -361841, -4813264, -7695457, -8759211, -8301537, -6727474, -3825151, 958556, 7362462, 13940983, 19142109, 22361206, 23645340, 22869807, 19853231, 15145217, 10096386, 5985298, 3305602, 1822725, 915655, -188586, -2046192, -4473430, -6455136, -6806232, -5039188, -1651885, 2319417, 5962503, 8763461, 10389489, 10483423, 8949634, 6402815, 3956458, 2341503, 1454915, 998450, 1302566, 3142694, 6878550, 12190494, 18599843, 25732560, 32928084, 39080349, 43272390]
38334D3272390K134976N54005o76896j864751k946259l649977l866783l600751
38326B9355954k834482j795450j180492j640172k913525l788890l192318j269257
38318A0741368P17661J480662O20485j330941l436835m903310n448033n375325
38310f934268n171850m877894m016060k340016m60507O48125P63660P11359J474289
38301b0203162L270532N530133P389096Q033281O978140M448901J377213j249095
38293A5575039k930614l451016k596692o39944J165601J415406J21738j148842
38285G510676j091140k00759p0551j428188l316353m075552k772575J67466L271392
38276b005584N000627M905054L910301L143289K492048Q17649k260209n321976
$$ y = [43272390, 45407366, 45961371, 45284475, 43419724, 40473465, 36823488, 32956705, 29355954, 26521472, 24726022, 23545530, 21905358, 18991833, 15202943, 12010625, 10741368, 11459029, 12939691, 13560176, 12229235, 8792400, 3889090, -1558943, -6934268, -12106118, -16984012, -21000072, -23340088, -23800595, -23152470, -22388810, -21677451, -20203162, -16932630, -11402497, -4013401, 4019880, 10998020, 15446921, 16824134, 15575039, 12644425, 9193409, 6596717, 5956773, 7122374, 8537780, 8659518, 7510676, 6419536, 6218777, 6148226, 4720038, 1403685, -2671867, -5444442, -5276976, -2005584, 2995043, 7900097, 11810398, 14953687, 17445735, 18263384, 16003175, 10681199]
38268A0681199o338616m710158j803581L80810P88331k66488j797146l082954
38260f148603m024708m708888m852416m039531k547403j430413j393741j909158
38252c1054861j933119j274548o54132m77289k24304P41553K288361L730797M533110
38243b4324432M490465L559707J930645J45263j154083j579772j052003K45211
38235a7738999J779110K813652K951726K410063J555933L92881j186362k815361
38227i837357l731076l453622k141007l15868J473963K742135L168591K824407
38219i269834K200544J896577K206949K859751L101396K296589P19290m04928
38211E606334l172J691343L346875L858881L173259J849295L13268j184268k241212
$$ y = [10681199, 4342583, -367575, -2171156, -1790346, -1002015, -1268503, -3065649, -6148603, -10173311, -14882199, -19734615, -23774146, -26321549, -27751962, -29145703, -31054861, -32987980, -34262528, -34916660, -35393949, -35618253, -34876700, -32588339, -28857542, -24324432, -19833967, -16274260, -14343615, -14198352, -15352435, -16932207, -17984210, -17738999, -15959889, -13146237, -10194511, -7784448, -6228515, -5835634, -7021996, -9837357, -13568433, -17022055, -19163062, -19478930, -18004967, -15262832, -12094241, -9269834, -7069290, -5172713, -2965764, -106013, 2995383, 5291972, 6011262, 5606334, 5603162, 7294505, 10641380, 14500261, 17673520, 19522815, 19836083, 18651815, 16410603]
38202A6410603k453375j949117j458742j629749k330166k785422k421290j402311
38194a9569k15567J056739K632148M175304M619389L320810J133198k63952j50227
38185A6288273N99740P89422L10896p5994k5886r2735q65632k024800k543606
38176A2359678j726725J54522K208983L657108M164373L787456K947773K311711
38168B9864879K205176K058905R25686j180432k916542l051844j979793j247771
38160B4678264j759591l055890m295007n167104n580250n154061l661476j714192
38152e709307m44101m58837j371847k315173k647175k150467q17112J309524L977928
38143a0626567O442666P562117O517706L567394l2024k886111m154824l580973
$$ y = [16410603, 13957228, 12008111, 10549369, 8919620, 6589454, 3804032, 1382742, -19569, -235136, 821603, 3453751, 7629055, 12248444, 15569254, 16702452, 16438500, 16288273, 16888013, 17677435, 17988331, 17912337, 17886451, 17793716, 16928084, 14903284, 12359678, 10632953, 10787475, 12996458, 16653566, 20817939, 24605395, 27553168, 29864879, 32070055, 34128960, 35054646, 33874214, 30957672, 27905828, 25926035, 24678264, 22918673, 19862783, 15567776, 10400672, 4820422, -333639, -3995115, -5709307, -6153408, -6612245, -7984092, -10299265, -12946440, -15096907, -15914019, -14604495, -10626567, -4183901, 3378216, 9895922, 13463316, 13431292, 10545181, 6390357, 2809384]
38135B809384j371839J663212M203128N141583M316506K385013N6665k353730
38127A6849922m689454o577464p465330o990583n260803k796492k35815J911968
38119a5254051L310068L769663L312602K210394Q65268l00160q03227j91692J535429
38110a545706L676612N292674N923109N626465M451215K329934m05464k812735
38102B2536104l896905l246905j165230J452987L349080L604501K518338J469430
38094B6621400J521485K321513K608671J586559m24232k395905l368541l133263
38086B5337687k524997k793438m267734n787799n808582l946989j206792J025321
38078B6677J875193J320698K94259K22772J727618L759184M606973L771935K264815
$$ y = [2809384, 1437545, 3100757, 7303885, 12445468, 16761974, 19146987, 19203652, 16849922, 12160468, 5583004, -1882326, -8872909, -14133712, -16930204, -17166019, -15254051, -11943983, -8174320, -4861718, -2651324, -1786056, -2086216, -2889443, -3081135, -1545706, 2130906, 7423580, 13346689, 18973154, 23424369, 25754303, 25348839, 22536104, 18639199, 15392294, 14227064, 15680051, 19029131, 22633632, 25151970, 26621400, 28142885, 30464398, 33073069, 34659628, 34235396, 31839491, 28470950, 25337687, 22812690, 20019252, 15751518, 9963719, 4155137, 208148, -998644, 26677, 1901870, 3222568, 3516827, 3739599, 5467217, 9226401, 13833374, 17605309, 19870124]
38069A9870124J123861M45954M5880J85016J092127K347089L358234M101206M842117
38060C7411608N412608N345130M618709L754998L136916K568904J539917k92659
38052F3496131k811701n400311p266386q026261p913713p307317o280877m828822
38044A3660743l234670j841845o83293K47643O04061J40157n87053p05928l14723
38035G285092n28608j908640l501985l968614l141806j813839l77884J425341
38027f530943L452289M748861M565204L218721J565013N7591j226381k017294
38019G833061j971851j331068r18918j291573k148860k691875k360787j201157
38011f083028K12014J122692J166161P95041R39302K048184L604591M711338M941576
$$ y = [19870124, 20993985, 21439939, 21485819, 21670835, 22762962, 25110051, 28468285, 32569491, 37411608, 42824216, 48169346, 52788055, 56543053, 59679969, 62248873, 63788790, 63496131, 60684430, 55284119, 48017733, 39991472, 32077759, 24770442, 18489565, 13660743, 10426073, 8584228, 7900935, 8148578, 8752639, 8892796, 8305743, 7599815, 7285092, 6756484, 4847844, 1345859, -2622755, -5764561, -7578400, -7956284, -6530943, -3078654, 1670207, 6235411, 9454132, 11019145, 11076736, 9850355, 7833061, 5861210, 4530142, 3611224, 2319651, 170791, -2521084, -4881871, -6083028, -5871014, -4748322, -3582161, -2787120, -1847818, 200366, 3804957, 8516295, 13457871]
38002A3457871M435145L456508K251273J181351N09031n755q62089k010197k652383
37993A9760755k099235n51046J235066K785036M043657M862716M860806L871118
37985C8768873K168936J42315j947886l746834m706220m537482l629900k781983
37977A9729819k614975l361377m888672o510035o997670n469144k485030J73190
37969a2423894J124328N50284m06162r89601j221931j328710j409327j639027
37961a7744040k214901k889584k935337j847258Q6575K079109L572035M571819
37953a7321582N416118O312650O999231O834456N409395L116106Q94343o46811
37945A7013906j594870k150625k101982j257880j65187J49587o93714j823010
$$ y = [13457871, 17893016, 21349524, 23600797, 24782148, 25291179, 25285424, 24423335, 22413138, 19760755, 17661520, 17110474, 18345540, 21130576, 25174233, 30036949, 34897755, 38768873, 40937809, 41080124, 39132238, 35385404, 30679184, 26141702, 22511802, 19729819, 17114844, 13753467, 8864795, 2354760, -4642910, -10112054, -12597084, -12423894, -11299566, -10749282, -11155444, -12145045, -13366976, -14695686, -16105013, -17744040, -19958941, -22848525, -25783862, -27631120, -27544545, -25465436, -21893401, -17321582, -11905464, -5592814, 1406417, 8240873, 13650268, 16766374, 17660717, 17013906, 15419036, 13268411, 11166429, 9908549, 9743362, 9892949, 9199235, 7376225]
37937G376225j818472K630K962316N515460O341443N176323K866268P54226j07576
37928B9068843M69052J646950K025829O83818j979152m546718n838641n744937
37920A5785044m851761l637238k291494j021070r8862L49520L48372o5171p57958
37911C759382j432851j966147k696441l964552n363783n872828m870335k688235
37903b5095790k8244K786898N687031Q270755R802686R817661Q458822O171466
37895B5871285L300336J20598k902279n127261o075800n696944m336540k595460
37887B557935j206596p18344r71716j010338Q1014K147560M064163M955267M983633
37878A4882578M772484M468224L773818K626924J301642j42024k033718m539051
$$ y = [7376225, 5557753, 5560383, 8522699, 14038159, 20379602, 25555925, 28422193, 29176419, 29068843, 29537895, 31184845, 33210674, 33894492, 31915340, 27368622, 21529981, 15785044, 10933283, 7296045, 5004551, 3983481, 3884619, 4234139, 4582511, 4517340, 3759382, 2326531, 360384, -2336057, -6300609, -11664392, -17537220, -22407555, -25095790, -25124034, -22337136, -16650105, -8379350, 1423336, 11240997, 19699819, 25871285, 29171621, 29292219, 26389940, 21262679, 15186879, 9489935, 5153395, 2557935, 1351339, 632995, -338721, -1349059, -1268045, 879515, 4943678, 9898945, 14882578, 19655062, 24123286, 27897104, 30524028, 31825670, 31683646, 29649928, 25110877]
37870B5110877p172559r023944r418951q399750o678702n056206l745849k344864
37862b6729948n53631J290807K587437L117572L011064K322764J105496k08747
37854a4057186r87677r86767m10831N31079J685020K613966K750823K033024R85787
37845e842762Q5082n81946j019013j194534j295453j568026j786585j495579r86846
37836a5685662j303664k773099m111043l658817j253674J616327L258891K966887
37828b0943854J169163r35484k031287j578515j23618J550689L353637N533887
37820a4005382P681160Q780532Q299968O658390M510656K092826n07951k860667
37812B0649532m325279m596411m018247l425505l546944m289840m668787l765098
$$ y = [25110877, 17938318, 8914374, -504577, -8904327, -15583029, -20639235, -24385084, -26729948, -27283579, -25992772, -23405335, -20287763, -17276699, -14953935, -13848439, -14057186, -15044863, -16031630, -16442461, -15911382, -14226362, -11612396, -8861573, -6828549, -5842762, -5757680, -6339626, -7358639, -8553173, -9848626, -11416652, -13203237, -14698816, -15685662, -16989326, -19762425, -23873468, -27532285, -28785959, -27169632, -23910741, -20943854, -19774691, -20710175, -22741462, -24319977, -24443595, -22892906, -19539269, -14005382, -6324222, 2456310, 10756278, 17414668, 21925324, 24018150, 23510199, 20649532, 16324253, 11727842, 7709595, 4284090, 737146, -3552694, -8221481, -11986579]
37804a1986579j777530J43890J080830J062492O57270K83888M7750r9356k61997
37795a0849342m93355o75284o42961m29624j86959J07677N98405J223463J756457
37786i591523K189680K718990L267885L397320K864124J982613J262078R25741
37778I016908R07116J025604R82048M43785o46033k009548l382283m662143n623487
37769c948033n897046n532674n241815n656222o528161p081264p048724o908718
37761e3842657p025662o938022n743820l116456J49062K605631L278873K477034
37753f8156017J452832J168002J484085J679231J559868J745146K891568M952488
37745e1222797P265051R079104R865037R401990P921162O121177M703442L708301
$$ y = [-11986579, -13764109, -13620219, -12539389, -11476897, -10819627, -10535739, -10487989, -10587345, -10849342, -11342697, -12017981, -12660942, -13090566, -13277525, -13169848, -12571443, -11347980, -9591523, -7401843, -4682853, -1414968, 1982352, 4846476, 6829089, 8091167, 9016908, 9924024, 10949628, 11931676, 12375461, 11729428, 9719880, 6337597, 1675454, -3948033, -9845079, -15377753, -20619568, -26275790, -32803951, -39885215, -46933939, -53842657, -60868319, -67806341, -73550161, -76666617, -76517555, -73911924, -70633051, -68156017, -66703185, -65535183, -64051098, -62371867, -60811999, -59066853, -56175285, -51222797, -43957746, -34878642, -25013605, -15611615, -7690453, -1569276, 3134166, 6842467]
37737F842467K462954M09146k047032l749357l970794l223618k718445l085189
37729i079868l792203l791151k582450o83646P85247J007953J48366q64082j302666
37720b0154500j228134r29320j72226J325938K773411K595340L43889k310003
37712a7755605l171636j794521M08446J967994K518333K370339J909860J668526
37704a1878264K192161L307233L956497L260545J541205n420m17659M63298K120563
37695D540159L599609L883833K612055M79366j382746k394205k654456k307948
37687F375667j334343l3996Q09142N95719m43629j456048j676550q81641N47173
37678B501494J777351J966948Q79484r33049k652031l774405m114660l566560
$$ y = [6842467, 9305421, 9714567, 7667535, 3918178, -52616, -3276234, -5994679, -9079868, -12872071, -16663222, -19245672, -19929318, -19144071, -18136118, -17987752, -18851834, -20154500, -21382634, -22311954, -22484180, -21158242, -18384831, -15789491, -15445602, -17755605, -20927241, -22721762, -22313316, -20345322, -17826989, -15456650, -13546790, -11878264, -9686103, -6378870, -2422373, 838172, 2379377, 2373957, 1956298, 2419596, 4540159, 8139768, 12023601, 14635656, 15115022, 13732276, 11338071, 8683615, 6375667, 5041324, 5007328, 5816470, 6412189, 5968560, 4512512, 2835962, 1954321, 2501494, 4278845, 6245793, 7125277, 6192228, 3540197, -234208, -4348868, -7915428]
37670g915428k242380p20229K65889M41478K1417q62923k375199m465503o490330
37661b4343208p602424p329969n608772k590678J145482M374916N839407N338091
37653c0777155L912264K713524J907117R42587l19550j227278j179020m63133
37645b4490644Q1692J29257K45583J129540K732217M303243N126635M977234L998593
37636a766650K521454J084496K76715K55434N17272L56487m94348j814224l357199
37627b420563n076939o811477p960568p753622n995286l516991j644990r33199
37619d2113635m48292J345398M834998Q660608J1053350J1468910J0604346R174778
37611A4580461P308340N084988K965571J367903K40291n90950r23451m03753Q32459
$$ y = [-7915428, -10157808, -10878037, -10612148, -10170670, -10149253, -11012176, -13387375, -17852878, -24343208, -31945632, -39275601, -44884373, -47475051, -46329569, -41954653, -36115246, -30777155, -26864891, -24151367, -22244250, -21301663, -21621213, -22848491, -24027511, -24490644, -24408952, -24279695, -24034112, -22904572, -20172355, -15869112, -10742477, -5765243, -1766650, 754804, 1839300, 2116015, 2371449, 2888721, 3245208, 2750860, 936636, -2420563, -7497502, -14308979, -22269547, -30023169, -36018455, -39535446, -41180436, -42113635, -42561927, -41216529, -36381531, -27720923, -16667573, -5198663, 5405683, 14580461, 21888801, 26973789, 29939360, 31307263, 31547554, 30956604, 30033153, 29629400, 30461859]
37602C0461859J988172K059562M49401k574092n785180p619846p341201n674626
37594E964049m059549l194062k448907p44546K133492N169502P011015P172483
37586A7003477O335006N477385M852739L988489K588590J066098K5814m96144
37578D0841454r85503j751578k519328k696415j910934l60194J230514K082530
37570C3930546J966817J304689O04245m2560p64644j442206j737588j496433q15221
37561C1507645K37138J632010L089980M106139M387285M015709L071246J403747
37553E3450899r19765l097422l939432k958441j033890J96218k78660k023229
37545C9396278l655376m026744k884639o71611J892405M008377N065584N069731
$$ y = [30461859, 32450031, 34509593, 34958994, 32384902, 26599722, 18979876, 11638675, 5964049, 1904500, -1289562, -3738469, -4483015, -2349523, 2819979, 9830994, 17003477, 23338483, 28815868, 33668607, 37657096, 40245686, 41311784, 41337598, 40841454, 39855951, 38104373, 35585045, 32888630, 30977696, 30617502, 31848016, 33930546, 35897363, 37202052, 37806297, 37763737, 36999093, 35556887, 33819299, 32322866, 31507645, 31744783, 33376793, 36466773, 40572912, 44960197, 48975906, 52047152, 53450899, 52531134, 49433712, 45494280, 42535839, 41501949, 41698167, 41419507, 39396278, 35740902, 31714158, 28829519, 28157908, 30050313, 34058690, 39124274, 44194005]
37537D4194005M631787M290272M016337L587181L146623K998523L045292K922598
37529G2832618K640901K612871K985937L376966L397527L094478K747078K543794
37521I6232170K575444K835186L088591L009653K531894J786065O86674r68196
37513A11777481k855618m094988m186305l636369l350566l714669m544383n546737
37505G9847846o424052o834053o711645o447279o372684o283056n825814n067684
37497B9881579m210586l034537j225153R08297K656331L749838M357295M360738
37489C7443802L446591K040085J326761J933517L145990L819874L618870L043038
37481E9818528K731765L097722M125959N061479M765275K947437O98326p26858
$$ y = [44194005, 48825792, 53116064, 57132401, 60719582, 63866205, 66864728, 69910020, 72832618, 75473519, 78086390, 81072327, 84449293, 87846820, 90941298, 93688376, 96232170, 98807614, 101642800, 104731391, 107741044, 110272938, 112059003, 112745677, 111777481, 108921863, 104826875, 100640570, 97004201, 93653635, 89938966, 85394583, 79847846, 73423794, 66589741, 59878096, 53430817, 47058133, 40775077, 34949263, 29881579, 25670993, 22636456, 21411303, 22319600, 24975931, 28725769, 33083064, 37443802, 40890393, 42930478, 44257239, 46190756, 49336746, 53156620, 56775490, 59818528, 62550293, 65648015, 69773974, 74835453, 79600728, 82548165, 83246491, 82519633]
37473H2519633j238694j392088j012396O00187L099568M767934M225287J895665
37465I3465096n85619j963749k072889j467870q27375m72750j24796O82514J745095
37456H8377657K071708R46523j161056l108111m292329n012438n835160p011267
37448F4975527q351527r208489q667441o323932l042798n42120M5793r42729k282356
37439B5659928l013352k903828k145997j008230K43978J382961K326922L147977
37431B3690359L866618M209436L678091K055753j09364j763324k314880k241410
37423C1071279k516468l502056m588715m817650l653974j357516J014990K107396
37415A3757286J312927n59018k073570k702238l105638l817996m336399l950868
$$ y = [82519633, 81280939, 79888851, 78876455, 79476642, 82576210, 87344144, 91569431, 93465096, 92879477, 90915728, 88842839, 87374969, 86547594, 86074844, 85950048, 86632562, 88377657, 90449365, 91395888, 90234832, 87126721, 82834392, 77821954, 71986794, 64975527, 56624000, 47415511, 38748070, 32424138, 29381340, 28839220, 28885013, 27942284, 25659928, 22646576, 19742748, 17596751, 16588521, 16832499, 18215460, 20542382, 23690359, 27556977, 31766413, 35444504, 37500257, 37390893, 35627569, 33312689, 31071279, 28554811, 25052755, 20464040, 15646390, 11992416, 10634900, 11649890, 13757286, 15070213, 14511195, 12437625, 9735387, 6629749, 2811753, -1524646, -5475514]
37407e475514k939669k272204k305651k310539j244157J332226M904662Q146885
37399b163961R602421Q785729O627108M437791K510897K02349k685439n220419
37391B2096476o210436n309064l103757n39387J542795K706656L096035L151756
37383A7431074L066384K772966K433283K373827K318411J301524j094098l758215
37375B6845156m944899m082038k220721p48509k04040m63000j459787l131880
37367I590282m793156n210032l723911j132470R71971J817995K052396K583371
37359B156446L314811L490520K909813K057174J115511l25764k363153m283146
37351H072212n344637n528010n183002m502324l745472l388004l499244l484432
$$ y = [-5475514, -8415183, -10687387, -12993038, -15303577, -16547734, -15215508, -10310846, -2163961, 7438460, 16224189, 22851297, 27289088, 29799985, 30002334, 27316895, 22096476, 15886040, 10576976, 7473219, 6933832, 8476627, 11183283, 14279318, 17431074, 20497458, 23270424, 25703707, 28077534, 30395945, 31697469, 30603371, 26845156, 21900257, 17818219, 15597498, 14848989, 14644949, 14181949, 12722162, 9590282, 4797126, -412906, -4136817, -5269287, -4297316, -2479321, -426925, 2156446, 5471257, 8961777, 11871590, 13928764, 15044275, 14718511, 12355358, 8072212, 2727575, -2800435, -7983437, -12485761, -16231233, -19619237, -23118481, -26602913]
37343b6602913l025052k716666l024990l164684k077803k54641O20714n3679r68651
37334d1268365p07377N22433J433240J205949j5265j537254k416002j802607L38021
37325d4247227K987736M916075N583406N065981L608463J696963J48877m73446
37317b0713172l91418j82859r7959j89386p23909j818878k872805l042198k268097
37308c2300681j263158n21749K4663L36175O62j019472j927755j836127o75747
37299c9183189R49578K497305L685825M228783L912450K995796K187064K047195
37291a6679193K481919K817907K329678Q39013r90257k009087j511593O0130J447578
37282a1213905J725284J114653O40855J025228J946249K376042J612498o6068
$$ y = [-26602913, -29627965, -32344631, -35369621, -38534305, -40612108, -40866749, -40246035, -40299714, -41268365, -41975742, -41453309, -40020069, -38814120, -38829385, -40366639, -42782641, -44585248, -44247227, -41259491, -36343416, -30760010, -25694029, -22085566, -20388603, -20239726, -20713172, -21104590, -21287449, -21385408, -21574794, -22298703, -24117581, -26990386, -30032584, -32300681, -33563839, -34085588, -34060925, -33724750, -33724088, -34743560, -36671315, -38507442, -39183189, -38233611, -35736306, -32050481, -27821698, -23909248, -20913452, -18726388, -16679193, -14197274, -11379367, -9049689, -8210676, -9200933, -11210020, -12721613, -12661483, -11213905, -9488621, -8373968, -7733113, -6707885, -4761636, -2385594, -773096, -839164]
37274h39164j787226l001818l806574m358259m332376l300840j495243K23641
37266b2697859J200453J451266J279255R24105Q00285J479268K846160L686580
37258i030487K960472J412886J005286K476559M274485M412843K756253Q63712
37250A1132009J27820Q31125K583976M648966N868490N272038L122122P97582
37242C4384128n68889q59700l88502O57183J883107K521247K148332J190593L41512
37233D1309011j64934m72449q25340j677050l440348n661494p080953p132707
37225A4853736o768787p017171p301546o224605l655582q68869J277401L060327
37217a2645096M651561N464382N308965N103606N551599N839558M638629K033864
$$ y = [-839164, -2626390, -5628208, -9434782, -13793041, -18125417, -21426257, -22921500, -22697859, -21497406, -20046140, -18766885, -17842780, -17042495, -15563227, -12717067, -9030487, -6070015, -4657129, -3651843, -1175284, 3099201, 7512044, 10268297, 11132009, 11259829, 12090954, 14674930, 19323896, 25192386, 30464424, 33586546, 34384128, 33815239, 32955539, 32567037, 33224220, 35107327, 37628574, 39776906, 40967499, 41309011, 41144077, 40671628, 39846288, 38169238, 34728890, 29067396, 21986443, 14853736, 8084949, 1067778, -6233768, -12458373, -16113955, -16982824, -15705423, -12645096, -7993535, -2529153, 2779812, 7883418, 13435017, 19274575, 23913204, 25947068]
37209B5947068m62855j715542j986623k093345k240151k028924j294002n88368
37201A3537258q03417k276346m222888n217018m453720k503584p03915Q1609j3722
37192f575743l32465l92223k30560l62438j370277l282217n359784o706774p042358
37183c1654839o632462n538625l364800N7655M033070P372729R315990R810644
37175a6600638Q931265O485025K606878j399819l465232k513410K85493K470705
37167c199733K619375J465076O81995J005365J827551K255130K018560J411753
37159A0085072Q57479P10985J131058J818152J987806R25322j237904l313498
37151A2964472l809647k172686N97624K719488L172110K398378J442827P28200
$$ y = [25947068, 25484213, 23768671, 21782048, 19688703, 17448552, 15419628, 14125626, 13537258, 12733841, 10457495, 6234607, 1017589, -3436131, -5939715, -6643630, -6562021, -6575743, -6908208, -7300431, -7530991, -7893429, -9263706, -12545923, -17905707, -24612481, -31654839, -38287301, -43825926, -47190726, -47133071, -43100001, -35727272, -26411282, -16600638, -7669373, -1184348, 1422530, 22711, -3442521, -5955931, -5670438, -3199733, -580358, 884718, 1566713, 2572078, 4399629, 6654759, 8673319, 10085072, 10942551, 11653536, 12784594, 14602746, 16590552, 17515874, 16277970, 12964472, 9154825, 6982139, 7579763, 10299251, 13471361, 15869739, 17312566, 18040766]
37143A8040766J1118p71861j315655j685605k525603m040561n217864m729365
37135b234630k516429P0641J713502K171673J816281P83242r41211k953155m503353
37126f593439n095529m686040l388496j353182J067909L357760N060395N745773
37118e884849M910166K422801q53424l420735m459683m499476m524519m707371
37110b1017090m354763k898456n88870J687401K996923K888091J677344K59368
37102a9350052n27737l83475N23432J758893K596981K210556L74831k118239m097939
37093a9012749n022499n166893n038378m894025m579441l504399j113267K136335
37085d6195316M622925N093668M137984L342503L113364K342107M04656j556050
$$ y = [18040766, 18051884, 17280023, 15964368, 14278763, 11753160, 7712599, 2494735, -2234630, -4751059, -4680418, -2966916, -795243, 1021038, 1804280, 863069, -2090086, -6593439, -11688968, -16375008, -19763504, -21116686, -20048777, -16691017, -11630622, -5884849, -974683, 1448118, 594694, -2826041, -7285724, -11785200, -16309719, -21017090, -25371853, -28270309, -28859179, -27171778, -24174855, -21286764, -19609420, -19350052, -19877789, -20261264, -19737832, -17978939, -15381958, -13171402, -12796571, -14914810, -19012749, -24035248, -29202141, -34240519, -39134544, -43713985, -47218384, -48331651, -46195316, -41572391, -36478723, -32340739, -28998236, -25884872, -23542765, -23138109, -24694159]
37077b4694159j918337m35283J793883L625401M505724M280690L149495J700845
37069g991741M75738m48330j158549j473352j214569o79920m01927n54271r13010
37060a4359931j234280j398104j424037j611235k304602l162031l088122j460350
37052c0042692Q87092K513131K976294K967649L053759L067025K769630K386713
37044i421399K230544K260982K189028J669585M06290j438833k903002k878283
37036g885088j345474M64335J324641J041464J23761r83567j913523k032310p60976
37027a1966737J562136L391739K922640k90754m516812o993380o329052l694979
37019b5915199j364679l30371J96747J265426K962931M651940N570313N029322
$$ y = [-24694159, -26612496, -27047779, -25253896, -21628495, -17122771, -12842081, -9692586, -7991741, -7516003, -7964333, -9122882, -10596234, -11810803, -12490723, -12892650, -13446921, -14359931, -15594211, -16992315, -18416352, -20027587, -22332189, -25494220, -28582342, -30042692, -29155600, -26642469, -23666175, -20698526, -17644767, -14577742, -11808112, -9421399, -7190855, -4929873, -2740845, -1071260, -664970, -2103803, -5006805, -7885088, -9230562, -8766227, -7441586, -6400122, -6276361, -7259928, -9173451, -11205761, -11966737, -10404601, -7012862, -4090222, -4380976, -8897788, -15891168, -22220220, -25915199, -27279878, -27610249, -27413502, -26148076, -23185145, -18533205, -12962892, -7933570]
37011g933570K860968O0231j733457j912164j533388j851431k800813l458061
37003a8301685l369811k642409j192360J083786L474439M714112M337340L222806
36995h673782K612342L006413M064618N040686N121303L843187J543591q32441
36987A5725917k577161l660587m255876m247338l524338k454616j622259j181415
36979g797673q37289m45673k47732l94971n83353m35999o3196R4023m5749J7064
36969a0740548P89644K200087L671222M565191M479253L442878K085349J309862
36961A1802938J396549J594673R99296l44672j684276k684798l575756m170698
36953C333256l651062j760918M71659J786641J983184J617717R31943j64797j378827
$$ y = [-7933570, -5072602, -5012371, -6745828, -8657992, -10191380, -12042811, -14843624, -18301685, -21671496, -24313905, -25506265, -24422479, -20948040, -16233928, -11896588, -8673782, -6061440, -3055027, 1009591, 6050277, 11171580, 15014767, 16558358, 15725917, 13148756, 9488169, 5232293, 984955, -2539383, -4993999, -6616258, -7797673, -8634962, -9080635, -9328367, -9723338, -10306691, -10742690, -10805886, -10711863, -10757612, -10740548, -9950904, -7750817, -4079595, 485596, 4964849, 8407727, 10493076, 11802938, 13199487, 14794160, 15793456, 15448784, 13764508, 11079710, 7503954, 3333256, -317806, -2078724, -1607065, 179576, 2162760, 3780477, 4712420, 4547623, 3168796]
$$ [...]
##END NTUPLES=NMR SPECTRUM
##END=
