##TITLE=31Pdec_B4f0606
 CDCl3
 24 sc
 7.6.2024
##JCAMPDX= 6.0         $$ Bruker NMR JCAMP-DX V2.0
##DATA TYPE= NMR SPECTRUM
##DATA CLASS= NTUPLES
##ORIGIN= UXNMR, Bruker Analytische Messtechnik GmbH
##OWNER= root
$$ XWIN-NMR		Version 3.5
$$ Fri Jun  7 16:08:02 2024 Russian Standard Time (UT+4h)  she@DPX200
##.OBSERVE FREQUENCY= 81.013821
##.OBSERVE NUCLEUS= ^31P
##.ACQUISITION MODE= SIMULTANEOUS
##.ACQUISITION SCHEME= undefined
##.AVERAGES= 24
##.DIGITISER RES= 16
##SPECTROMETER/DATA SYSTEM= spect
##.PULSE SEQUENCE= zgpg30
##.SOLVENT NAME= CDCl3
##.SHIFT REFERENCE= (INTERNAL, CDCl3, 0, 248.564)
##AUDIT TRAIL= $$ (NUMBER, WHEN, WHO, WHERE, WHAT)
$$ ##TITLE= Audit trail, XWIN-NMR		Version 3.5
$$ ##JCAMPDX= 5.01
$$ ##ORIGIN= Bruker BioSpin GmbH
$$ ##OWNER= she
$$ F:/spectra/data/she/nmr/P31/1/pdata/1/auditp.txt
$$ ##AUDIT TRAIL=  $$ (NUMBER, WHEN, WHO, WHERE, WHAT)
(   1,<2024-06-07 16:06:54.43 +0400>,<she>,<DPX200>,
      <created by zg, POWCHK disabled, PULCHK disabled
       configuration hash MD5:
       00 E9 B6 7A A2 85 ED C7 34 08 36 98 17 FE 4E 26
       data hash MD5: 32K
       8C 79 DB 89 82 BD A9 BB CA 91 71 B6 DA DA 31 8C>)
(   2,<2024-06-07 16:07:12.26 +0400>,<she>,<DPX200>,
      <Start of raw data processing
       efp BC_mod = 2 LB = 10 FT_mod = 6 PKNL = 1 PHC0 = -204.9725 PHC1 = 59.4 SI = 64K 
       data hash MD5: 64K
       BE 31 16 11 6C 85 E8 0E 4F BA 32 2A 54 3B B1 08>)
(   3,<2024-06-07 16:07:26.95 +0400>,<she>,<DPX200>,
      <pk PHC0 = -2.779301 PHC1 = 0 
       data hash MD5: 64K
       F3 04 86 46 E7 B9 FC 82 12 1A 39 BC F6 3E E3 CD>)
(   4,<2024-06-07 16:07:30.28 +0400>,<she>,<DPX200>,
      <abs ABSG = 5 
       data hash MD5: 64K
       03 B4 94 93 D2 74 25 C6 28 CD E5 DE 3C 6D 35 38>)
$$ ##END=
$$ 
$$ hash MD5
$$ ED E4 31 FB A9 E3 2F 8D 96 6D 22 6D 2E C3 57 F1
##$RELAX= 
##$RELAX= 
##$RELAX= 
##$RELAX= 
##$RELAX= 
##$RELAX= 
##$RELAX= 
##$RELAX= 
##$RELAX= 
$$ Bruker specific parameters
$$ --------------------------
##$DU= <F:/spectra>
##$EXPNO= 1
##$NAME= <P31>
##$PROCNO= 1
##$TYPE= <nmr>
##$USER= <she>
##$AMP= (0..31)
100 100 100 100 100 100 100 100 100 100 100 100 100 100 100 100 100 100 
100 100 100 100 100 100 100 100 100 100 100 100 100 100 
##$AQSEQ= 0
##$AQ_mod= 1
##$AUNM= <au_zg>
##$AUTOPOS= <>
##$BF1= 81.014009
##$BF2= 200.13
##$BF3= 200.13
##$BF4= 200.13
##$BF5= 200.13
##$BF6= 200.13
##$BF7= 200.13
##$BF8= 200.13
##$BYTORDA= 1
##$CFDGTYP= 0
##$CFRGTYP= 5
##$CHEMSTR= <none>
##$CNST= (0..31)
1 1 145 1 1 1 1 1 1 1 1 1 1 1 1 1 1 1 1 1 1 1 1 1 1 1 1 1 1 1 1 1 
##$CPDPRG= <waltz16>
##$CPDPRG1= <>
##$CPDPRG2= <waltz16>
##$CPDPRG3= <>
##$CPDPRG4= <mlev>
##$CPDPRG5= <mlev>
##$CPDPRG6= <mlev>
##$CPDPRG7= <mlev>
##$CPDPRG8= <mlev>
##$CPDPRGB= <>
##$CPDPRGT= <>
##$D= (0..31)
0 1 0 0 0 0 0 0 0 0 0 0.03 2e-05 3e-06 0 0 0 0 0 0 0 0 0 0 0 0 0 0 0 0 
0 0 
##$DATE= 1717762014
##$DBL= (0..7)
120 120 120 11 120 120 24 19 
##$DBP= (0..7)
150 150 150 150 150 150 150 150 
##$DBP07= 0
##$DBPNAM0= <>
##$DBPNAM1= <>
##$DBPNAM2= <>
$$ [...]
##$SUBNAM3= <"">
##$SUBNAM4= <"">
##$SUBNAM5= <"">
##$SUBNAM6= <"">
##$SUBNAM7= <"">
##$SUBNAM8= <"">
##$SUBNAM9= <"">
##$SW= 501.771253377433
##$SWIBOX= (0..15)
0 1 3 0 0 0 0 0 0 0 0 0 0 0 0 0 
##$SW_h= 40650.406504065
##$TD= 32768
##$TD0= 1
##$TE= 0
##$TE2= 300
##$TE3= 300
##$TEG= 300
##$TL= (0..7)
0 120 53 12 22 120 120 120 
##$TP= (0..7)
150 150 150 150 150 150 150 150 
##$TP07= 0
##$TPNAME0= <>
##$TPNAME1= <>
##$TPNAME2= <>
##$TPNAME3= <>
##$TPNAME4= <>
##$TPNAME5= <>
##$TPNAME6= <>
##$TPNAME7= <>
##$TPOAL= (0..7)
0.5 0.5 0.5 0.5 0.5 0.5 0.5 0.5 
##$TPOFFS= (0..7)
0 0 0 0 0 0 0 0 
##$TUNHIN= 0
##$TUNHOUT= 0
##$TUNXOUT= 0
##$USERA1= <user>
##$USERA2= <user>
##$USERA3= <user>
##$USERA4= <user>
##$USERA5= <user>
##$V9= 5
##$VALIST= <valist>
##$VCLIST= <CCCCCCCCCCCCCCC>
##$VD= 0
##$VDLIST= <DDDDDDDDDDDDDDD>
##$VPLIST= <PPPPPPPPPPPPPPP>
##$VTLIST= <TTTTTTTTTTTTTTT>
##$WBST= 1024
##$WBSW= 4
##$XGAIN= (0..3)
0 0 0 0 
##$XL= 0
##$YL= 0
##$YMAX_a= 4929
##$YMIN_a= -1717
##$ZGOPTNS= <>
##$ZL1= 120
##$ZL2= 120
##$ZL3= 120
##$ZL4= 120
##$ABSF1= 248.5645
##$ABSF2= -253.2056
##$ABSG= 5
##$ABSL= 3
##$ALPHA= 0
##$AQORDER= 0
##$ASSFAC= 0
##$ASSFACI= 0
##$ASSFACX= 0
##$ASSWID= 0
##$AUNMP= <proc_1d>
##$AZFE= 0.1
##$AZFW= 0.5
##$BCFW= 0
##$BC_mod= 2
##$BYTORDP= 0
##$COROFFS= 0
##$CY= -3
##$DATMOD= 1
##$DC= 0
##$DFILT= <>
##$DTYPP= 0
##$F1P= 0
##$F2P= 0
##$FCOR= 1
##$FTSIZE= 65536
##$FT_mod= 6
##$GAMMA= 0
##$GB= 0
##$INTBC= 1
##$INTSCL= 6.047779e-11
##$ISEN= 30
##$LB= 10
##$LEV0= 0
##$LPBIN= 0
##$MAXI= 10000
##$MC2= 0
##$MEAN= 0
##$ME_mod= 0
##$MI= 50
##$NCOEF= 0
##$NC_proc= -9
##$NLEV= 6
##$NOISF1= 182.463
##$NOISF2= 159.3651
##$NSP= 0
##$NTH_PI= 0
##$NZP= 0
##$OFFSET= 248.5645
##$PC= 4
##$PHC0= -207.7518
##$PHC1= 59.4
##$PH_mod= 1
##$PKNL= yes
##$PPARMOD= 0
##$PSCAL= 0
##$PSIGN= 0
##$REVERSE= no
##$SF= 81.0140089999694
##$SI= 65536
##$SIGF1= 159.3651
##$SIGF2= -187.1042
##$SINO= 113.3802
##$SIOLD= 16384
##$SREGLST= <1H.CDCl3>
##$SSB= 0
##$STSI= 65536
##$STSR= 0
##$SW_p= 40650.406504065
##$SYMM= 0
##$S_DEV= 0
##$TDeff= 32768
##$TDoff= 0
##$TI= <>
##$TILT= no
##$TM1= 0
##$TM2= 0
##$TOPLEV= 0
##$USERP1= <user>
##$USERP2= <user>
##$USERP3= <user>
##$USERP4= <user>
##$USERP5= <user>
##$WDW= 1
##$XDIM= 65536
##$YMAX_p= 427201717
##$YMIN_p= -28669356
$$ End of Bruker specific parameters
$$ ---------------------------------
##NTUPLES= NMR SPECTRUM
##VAR_NAME=  FREQUENCY,     SPECTRUM/REAL,   SPECTRUM/IMAG
##SYMBOL=    X,             R,               I
##VAR_TYPE=  INDEPENDENT,   DEPENDENT,       DEPENDENT
##VAR_FORM=  AFFN,          ASDF,            ASDF
##VAR_DIM=   65536,         65536,           65536
##UNITS=     HZ,            ARBITRARY UNITS, ARBITRARY UNITS
##FACTOR=    0.620285442955139, 1,           1
##FIRST=     20137.2065510682, 0,            0
##LAST=      -20513.1999529968, 0,           0
##MIN=       -20513.1999529968, -28669356,   0
##MAX=       20137.2065510682, 427201717,    0
$$ Real data points
##PAGE= N=1
##DATA TABLE= (X++(R..R)), XYDATA
$$ [...]
39521a326160m37073l20737j90665o1104N6666J55991K33826K88895L20937L30791
39511i48633L19972K89121K36873J60881O1318n5167j74099k76528l45766l73545
39501a105573l61588l18220k52798j71354p5684L3682J52154K67467L62028M21091
39491a048795M40934M30334M04378L75926L50770L28138L03874K73007K30941
39482B089507J74412J03400K3330n4637j16850j52959j60577j45574j17928q6336
39472A555788n5365k6481j077J7661K5646K0486L620j9256l9231m6686l5591q515
39460A390999K1120L2686P031o5054j79401l20558m66551n94010o83578p25386
39450a582702p22343o88184o40215n90829n43190m93581m37722l75951l13923
$$ plain form
39521 -1326160 -1763233 -2083970 -2274635 -2335739 -2279073 -2123082 -1889256 -1600361 -1279424 -948633
39511 -948633 -628661 -339540 -102667 58214 119532 64365 -109734 -386262 -732028 -1105573
39501 -1105573 -1467161 -1785381 -2038179 -2209533 -2285217 -2251535 -2099381 -1831914 -1469886 -1048795
39491 -1048795 -607861 -177527 226851 602777 953547 1281685 1585559 1858566 2089507
39482 2089507 2263919 2367319 2390649 2336012 2219162 2066203 1905626 1760052 1642124 1555788
39472 1555788 1500423 1473942 1472865 1490526 1516172 1536658 1540278 1521022 1481791 1435105 1399514 1390999
39460 1390999 1412119 1444805 1451836 1386782 1207381 886823 420272 -173738 -857316 -1582702
39450 -1582702 -2305045 -2993229 -3633444 -4224273 -4767463 -5261044 -5698766 -6074717 -6388640
39441f388640k59680k20108j98651j94565k03509k19656k38227k56326k71045
39432h450407k77010k66236k30901j66644p4091M1520J71559L05183M30352N34756
39422g981919O07248O40205O32044N88146N19110M37758L56965K88497K41270
39413c670676K18288K14328K16972K11484J87070J41340Q1045J8848l2289o4339
39403b477929p6225p1972n6875l4445n646K9910P1982J18297J64670K06610K40700
39392a890923K64529K75709K72144K53773K23516J85644J43158R7611N1914J3051
39382a09874q687m041L0261Q9398J62785K39564L13474L83486M49916N09769N55249
39371B611300N76104N63623N14478M33435L33622K32507J44561P5153K0110k9512
$$ plain form
39441 -6388640 -6648320 -6868428 -7067079 -7261644 -7465153 -7684809 -7923036 -8179362 -8450407
39432 -8450407 -8727417 -8993653 -9224554 -9391198 -9465289 -9423769 -9252210 -8947027 -8516675 -7981919
39422 -7981919 -7374671 -6734466 -6102422 -5514276 -4995166 -4557408 -4200443 -3911946 -3670676
39413 -3670676 -3452388 -3238060 -3021088 -2809604 -2622534 -2481194 -2400149 -2381301 -2413590 -2477929
39403 -2477929 -2554154 -2626126 -2683001 -2717446 -2723092 -2693182 -2621200 -2502903 -2338233 -2131623 -1890923
39392 -1890923 -1626394 -1350685 -1078541 -824768 -601252 -415608 -272450 -174839 -122925 -109874
39382 -109874 -118561 -122602 -92341 -2943 159842 399406 712880 1096366 1546282 2056051 2611300
39371 2611300 3187404 3751027 4265505 4698940 5032562 5265069 5409630 5484783 5504893 5475381
39361E475381q1956j42210k11886k89400l69605m43796n00747n28960n20032m72429
39351A914360l93215k95378j91710q9917P129R7024J74410K32456K68012K85517
39341B008688K95310L06768L20995L28652L14698K66869J82810P2195m6707j54152
39331C896126k36182k88242l13610l18486l07656k83059k45418j97657j47918
39322A557898j09357r5087j10859j50858j99950k40319k57805k45263k02913j36534
39312a91047n4271L6325J29332K19489L00770L65605M04988M09923L74983L03007
39302B299104K07266J08291K6689k3338l6324j4359L4800R8909J62830K11867
39292C075735K35831K31156J99599J44899P0315k1227j24968k31762l26982l92536
$$ plain form
39361 5475381 5393425 5251215 5039329 4749929 4380324 3936528 3435781 2906821 2386789 1914360
39351 1914360 1521145 1225767 1034057 944140 951269 1048293 1222703 1455159 1723171 2008688
39341 2008688 2303998 2610766 2931761 3260413 3575111 3841980 4024790 4096985 4050278 3896126
39331 3896126 3659944 3371702 3058092 2739606 2431950 2148891 1903473 1705816 1557898
39322 1557898 1448541 1353454 1242595 1091737 891787 651468 393663 148400 -54513 -191047
39312 -191047 -245318 -208993 -79661 139828 440598 806203 1211191 1621114 1996097 2299104
39302 2299104 2506370 2614661 2641350 2618012 2581688 2567329 2602129 2701038 2863868 3075735
39292 3075735 3311566 3542722 3742321 3887220 3957535 3936308 3811340 3579578 3252596 2860060
39282B860060m12384l79797l02312k00820j02422l0473L271P09k6624o4613j02288
39271A242307j33495j55026j64026j57129j31589q6983k5984M6010J21622J92142
39261G47849K48573K83686K94461K83290K56654K21602J81860J35924P8812P041
39251B739752p6072j58796k24830k60361k59876k27688j75238j16459o3450k4056
39241A152926j746K956q739l3557o5061r4108j12387j17220j13788j12491j23447
39230C73338j52357j99989k63747l38787m18048m92479n51942n86305n86520n46914
39220c763750m68641l62049k44912j36428n0238R559M7715P3418R4460J12851
39210d688015J24045J20369R6622N4246J418n0686r2692j19967j32749j34655
$$ plain form
39282 2860060 2447676 2067879 1765567 1564747 1462325 1431852 1435123 1435832 1409208 1344595 1242307
39271 1242307 1108812 953786 789760 632631 501042 414059 388075 434085 555707 747849
39261 747849 996422 1280108 1574569 1857859 2114513 2336115 2517975 2653899 2732711 2739752
39251 2739752 2663680 2504884 2280054 2019693 1759817 1532129 1356891 1240432 1176982 1152926
39241 1152926 1151180 1154136 1145397 1111840 1046779 952671 840284 723064 609276 496785 373338
39230 373338 220981 20992 -242755 -581542 -999590 -1492069 -2044011 -2630316 -3216836 -3763750
39220 -3763750 -4232391 -4594440 -4839352 -4975780 -5026018 -5016459 -4968744 -4895326 -4800866 -4688015
39210 -4688015 -4563970 -4443601 -4346979 -4292733 -4291315 -4342001 -4434693 -4554660 -4687409 -4822064
39200d822064j30972j26909j25652j26961j27631j23595j11767q9981n5812o339
39190e847683O0272J42462K33923L24234M01553M56201M83367M83673M62114M26353
39180b373531L84474L42040K99941K55315K05203J49522R0869L2816k0237o1424
39170f95012q0952o8427j6701P4992J99555L42399M83993O04202O86647P21426
39160B252122P06011O45094N49660M34840L16665K08752J20515N7637K3873K1703
39150E336872N0478J03801J69573K33574K83410L09537L04186K61825J82566P5401
39140G311223m2407j50233k30416k73140k78782k57610k26626k03963k02927k28679
39130E216440k78773l45880m20142m90772n48389n88180o11333o22477o24721
$$ plain form
39200 -4822064 -4953036 -5079945 -5205597 -5332558 -5460189 -5583784 -5695551 -5785532 -5841344 -5847683
39190 -5847683 -5787411 -5644949 -5411026 -5086792 -4685239 -4229038 -3745671 -3261998 -2799884 -2373531
39180 -2373531 -1989057 -1647017 -1347076 -1091761 -886558 -737036 -646167 -613351 -633588 -695012
39170 -695012 -775964 -844391 -861092 -786100 -586545 -244146 239847 844049 1530696 2252122
39160 2252122 2958133 3603227 4152887 4587727 4904392 5113144 5233659 5291296 5315169 5336872
39150 5336872 5387350 5491151 5660724 5894298 6177708 6487245 6791431 7053256 7235822 7311223
39140 7311223 7268816 7118583 6888167 6615027 6336245 6078635 5852009 5648046 5445119 5216440
39130 5216440 4937667 4591787 4171645 3680873 3132484 2544304 1932971 1310494 685773
39121F85773o16409n92167n47033m80758m00078l17893k49344k06531j94916k13382
39111c132738k56852l18623l90794m63682n26348n69067n86796n81067n58256
39102g384223n24623m81453m24109l45950k44270j24164K158J20017K18218K92828
39092h895571L46766L85906M14849M35339M47719M53327M55368M57585M61722
39083e036990M65707M64150M51616M27167L97122L73565L68928L89809M33619
39074a265307M89388N41520N74379N76513N43953M81733M02375L21267K51008
39065B916829J97817J61551J38361J23596J13486J05503R7835Q8597P5507N6708
39055D075790L2299N291j9011l4795l7661k6190k821K6734N5927Q0237R7910J07946
$$ plain form
39121 685773 69364 -522803 -1069836 -1550594 -1950672 -2268565 -2517909 -2724440 -2919356 -3132738
39111 -3132738 -3389590 -3708213 -4099007 -4562689 -5089037 -5658104 -6244900 -6825967 -7384223
39102 -7384223 -7908846 -8390299 -8814408 -9160358 -9404628 -9528792 -9526634 -9406617 -9188399 -8895571
39092 -8895571 -8548805 -8162899 -7748050 -7312711 -6864992 -6411665 -5956297 -5498712 -5036990
39083 -5036990 -4571283 -4107133 -3655517 -3228350 -2831228 -2457663 -2088735 -1698926 -1265307
39074 -1265307 -775919 -234399 339980 916493 1460446 1942179 2344554 2665821 2916829
39065 2916829 3114646 3276197 3414558 3538154 3651640 3757143 3854978 3943575 4019082 4075790
39055 4075790 4108089 4113380 4094369 4059574 4021913 3995723 3992902 4019636 4075563 4155800 4253710 4361656
39043D361656J07807R3821O4119K1021k9444q0020j24379j57866j77916j85122
39033C893677j84389j84460j95041k22895k69312l30267l98258m63868n16468
39024A128719n45366n42471n05293m37647l46905k39841j20759O294J33251K46107
39014a223911L28418L68935L68260L39504L01811K70560K50139K33193K06145
39005A443054J56896Q0149k1419j38656k57855l62789m37862m72230m63216m17579
38995h91507l50517k82352k32789k14004k26122k58022k92927l15048l14318k88375
38985c665981k42024j84261j23829o5453r092M7595J05544J62371K13846K57284
38975c504000K93153L22876L45393L57075L55829L44917L31846L23207L20226
$$ plain form
39043 4361656 4469463 4563284 4627403 4648424 4618980 4538960 4414581 4256715 4078799 3893677
39033 3893677 3709288 3524828 3329787 3106892 2837580 2507313 2109055 1645187 1128719
39024 1128719 583353 40882 -464411 -902058 -1248963 -1488804 -1609563 -1603269 -1470018 -1223911
39014 -1223911 -895493 -526558 -158298 181206 483017 753577 1003716 1236909 1443054
39005 1443054 1599950 1680099 1658680 1520024 1262169 899380 461518 -10712 -473928 -891507
38995 -891507 -1242024 -1524376 -1757165 -1971169 -2197291 -2455313 -2748240 -3063288 -3377606 -3665981
38985 -3665981 -3908005 -4092266 -4216095 -4281548 -4290640 -4243045 -4137501 -3975130 -3761284 -3504000
38975 -3504000 -3210847 -2887971 -2542578 -2185503 -1829674 -1484757 -1152911 -829704 -509478
38966e09478L18693L12689K99017K79232K58034K39267K22824K04754J79587J41755
38956A946374Q5305M315j03942k34752l74677n05383o10544o81627p19102p28647
38946a922680p15255o79427o18133n29549m17621k92967j69296n7937L6003J13663
38936e253199J79534K38496K94986L53649M18764M90922N63044O19835O42688
38927a451281O17380N39764M17311K67731J16345q242q0925q7598k9784P5692
38917C76393K01263L15513L90712M09190L66549K71042J40289k914j34927k35817
38907B097293k93669l07301k85655k43363j94235j46426j02177o1490k6137q71
38897D35969Q595p83k6153n8102q3731r2170p9256m8924j1494J9870L3781K5287
$$ plain form
38966 -509478 -190785 121904 420921 700153 958187 1197454 1420278 1625032 1804619 1946374
38956 1946374 2031679 2035994 1932052 1697300 1322623 817240 206696 -474931 -1194033 -1922680
38946 -1922680 -2637935 -3317362 -3935495 -4465044 -4882665 -5175632 -5344928 -5402865 -5366862 -5253199
38936 -5253199 -5073665 -4835169 -4540183 -4186534 -3767770 -3276848 -2713804 -2093969 -1451281
38927 -1451281 -833901 -294137 123174 390905 507250 499008 418083 330485 300701 376393
38917 376393 577656 893169 1283881 1693071 2059620 2330662 2470951 2468037 2333110 2097293
38907 2097293 1803624 1496323 1210668 967305 773070 626644 524467 462977 436840 435969
38897 435969 444564 443781 417628 359526 275795 183625 104369 55445 43951 63821 97602 122889
38885A22889k178l9466p7341j10901j40117j67234j93143k14255k21542k03003
38875a246291j49123n8438O0161J89868L11970M12310M84618N29150N48626N45682
38865A628533N23641M88675M50276M19328M05211M12923M40740M79291N13478
38856E762096N26954N06885M46689L46361K11596N2581j17368k83666m32645n53677
38846F465806o40416o90560p04455o83912o32586n57336m68730l79484l02124
38837A406203k47458k23575k33761k73823l31929l92969m44649m80663m99497
38828a722121n01991m90751m70776m48683m29593m13622l94731l63029l09399
38819e544696k29659j25784m092J27121K58315L78198M74407N36349N58578N41860
$$ plain form
38885 122889 120711 81245 3904 -106997 -247114 -414348 -607491 -821746 -1043288 -1246291
38875 -1246291 -1395414 -1453852 -1393691 -1203823 -891853 -479543 5075 534225 1082851 1628533
38865 1628533 2152174 2640849 3091125 3510453 3915664 4328587 4769327 5248618 5762096
38856 5762096 6289050 6795935 7242624 7588985 7800581 7853162 7735794 7452128 7019483 6465806
38846 6465806 5825390 5134830 4430375 3746463 3113877 2556541 2087811 1708327 1406203
38837 1406203 1158745 935170 701409 427586 95657 -297312 -741961 -1222624 -1722121
38828 -1722121 -2224112 -2714863 -3185639 -3634322 -4063915 -4477537 -4872268 -5235297 -5544696
38819 -5544696 -5774355 -5900139 -5904231 -5777110 -5518795 -5140597 -4666190 -4129841 -3571263 -3029403
38809c029403M91023M11375L07171J83948N2625o9211j61475k08251k01774j41662
38799b365634l2761J15016K85587M57908O10419P25677P92415Q05393P65246O78963
38789B838229N59838M25900K96632J88019J06770M7121n950o7245j41423k19294
38779D028597k81949l09223k87953k17458j10821Q616J14347J84310K06138J78749
38769C513353J10300J3410r9760k19507l37158m43600n31147n97733o48776o93574
38759F5808p37944p78365q02095p93799p44533o57135n44784m24839l12722k18799
38749e949207j47993j00823p5432o9796q2674j12725j57152k11511k70201l26222
38739g503736l70152l90543l77212l26069k42169j38557l1278O6728J49743K19702
$$ plain form
38809 -3029403 -2538380 -2127005 -1819834 -1635886 -1583261 -1652472 -1813947 -2022198 -2223972 -2365634
38799 -2365634 -2398395 -2283379 -1997792 -1539884 -929465 -203788 588627 1394020 2159266 2838229
38789 2838229 3398067 3823967 4120599 4308618 4415388 4462509 4456559 4389314 4247891 4028597
38779 4028597 3746648 3437425 3149472 2932014 2821193 2829809 2944156 3128466 3334604 3513353
38769 3513353 3623653 3637063 3537303 3317796 2980638 2537038 2005891 1408158 759382 65808
38759 65808 -672136 -1450501 -2252596 -3046395 -3790928 -4448063 -4992847 -5417686 -5730408 -5949207
38749 -5949207 -6097200 -6198023 -6273455 -6343251 -6425925 -6538650 -6695802 -6907313 -7177514 -7503736
38739 -7503736 -7873888 -8264431 -8641643 -8967712 -9209881 -9348438 -9379716 -9312988 -9163245 -8943543
38729h943543K83214L46856M13004M77774N31701N62574N59515N16959M36963
38720d814983L28616K04672P7472m3338j50640k38549l01635l35048l35176l00747
38710e909356k34438j44483m4731M7987J18715J59094J69462J57529J34913J13452
38700e431856J02696J09197J37448J91213K73104L81573N07472O33638P38950
38691b356565Q04680Q19681P82609P01159N89146M62419L34838K15555J08293
38682B461815J2504p4232j54025k27938k96609l60423m17869m63103m85460m72755
38672d78095m17103l20029j93641n7042P0186J74178K49995L00776L33326L52147
38662A4698L55255L34876K83007J97737Q5681m0417j66148k78765l68689m29608
$$ plain form
38729 -8943543 -8660329 -8313473 -7900469 -7422695 -6890994 -6328420 -5768905 -5251946 -4814983
38720 -4814983 -4486367 -4281695 -4204223 -4247561 -4398201 -4636750 -4938385 -5273433 -5608609 -5909356
38710 -5909356 -6143794 -6288277 -6333008 -6285021 -6166306 -6007212 -5837750 -5680221 -5545308 -5431856
38700 -5431856 -5329160 -5219963 -5082515 -4891302 -4618198 -4236625 -3729153 -3095515 -2356565
38691 -2356565 -1551885 -732204 50405 751564 1340710 1803129 2137967 2353522 2461815
38682 2461815 2474319 2400087 2246062 2018124 1721515 1361092 943223 480120 -5340 -478095
38672 -478095 -895198 -1215227 -1408868 -1465910 -1395724 -1221546 -971551 -670775 -337449 14698
38662 14698 369953 704829 987836 1185573 1271254 1230837 1064689 785924 417235 -12373
38652a2373m57518m49372m02965l18810k02415o4338Q2297K24503L50539M50162
38642h00290N15630N43383N34731M94932M31496L52319K63405J66885O1353n4153
38632B509691j75030k89354l81423m38002m52794m27127l67892k84881j88588
38623d95400q8703O831R2122J63063K16633K50065K60349K44521K01287J33498
38613I84266N0085l4671j05186j49875j64350j50934j16171o9070k0907J4899
38603B38086K4883Kn9409j41479k25792k90545l19661l06006k50097j56966l3985
38592a520969J09280K59826M00728N13660N84864O11231O01613N71614N35408
38583B667255N00072M64942M24387L71454L01106K12974J12771J1025q0945j55885
$$ plain form
38652 -12373 -469891 -919263 -1322228 -1641038 -1843453 -1907791 -1825494 -1600991 -1250452 -800290
38642 -800290 -284660 258723 793454 1288386 1719882 2072201 2335606 2502491 2563844 2509691
38632 2509691 2334661 2045307 1663884 1225882 773088 345961 -21931 -306812 -495400
38623 -495400 -584103 -577272 -485150 -322087 -105454 144611 404960 649481 850768 984266
38613 984266 1034351 999680 894494 744619 580269 429335 313164 244094 223187 238086
38603 238086 262969 262971 203562 62083 -163709 -454254 -773915 -1079921 -1330018 -1486984 -1520969
38592 -1520969 -1411689 -1151863 -751135 -237475 347389 958620 1560233 2131847 2667255
38583 2667255 3167327 3632269 4056656 4428110 4729216 4942190 5054961 5065986 4985041 4829156
38573D829156k13281k58588k99995l44960l97710m57795n19637n73281o06568
38564A157341o08508n73200n02869m07995l03435k02101j10366k8429M5058J08312
38554a426192J55638J81035J83148J67670J45532J27866J20437J20421J17584
38545a06861J00175O2818J1409l8422o8424o6040k9801K9949R5114J47356J75843
38534C13116J81017J72582J63641J64614J79136K02573K23569K28439K06641J54631
38524B189959P6470j8655j20439k20710l13745l93768m52587m80686m71921m28613
38514f34695l63336k95644k44360k19059k16048k22287k24532k16737k00549j80187
38504c017434j56745j26107q1459j8729N8800J40503K13734K70480L10165L37122
$$ plain form
38573 4829156 4615875 4357287 4057292 3712332 3314622 2856827 2337190 1763909 1157341
38564 1157341 548833 -24367 -527236 -935231 -1238666 -1440767 -1551133 -1579562 -1534504 -1426192
38554 -1426192 -1270554 -1089519 -906371 -738701 -593169 -465303 -344866 -224445 -106861
38545 -106861 -6686 56132 67541 29119 -39305 -105345 -135146 -105197 -10083 137273 313116
38534 313116 494133 666715 830356 994970 1174106 1376679 1600248 1828687 2035328 2189959
38524 2189959 2266429 2247774 2127335 1906625 1592880 1199112 746525 265839 -206082 -634695
38514 -634695 -998031 -1293675 -1538035 -1757094 -1973142 -2195429 -2419961 -2636698 -2837247 -3017434
38504 -3017434 -3174179 -3300286 -3381745 -3400474 -3341674 -3201171 -2987437 -2716957 -2406792 -2069670
38494b069670L55652L66646L67599L55651L31360L00372K71372K51824K44879
38485G75685K49553K63025K82627L05934L29141L45245L44233L16557K58505J75621
38475C646126Q1054j0360q8459j50861k02096k50404l04153l68603m42993n18783
38465A390468n81015o13631o06142n57224m72973l62361k34055r6545L9978J62385
38455a931115K55609L06101L06793K60823J81105Q5599q413q7493j42582j69722
38445i43295j72277j62271j57118j71700k10354k64365l16651l50105l54523l29179
38435c431838k81674k24625j71159j29846j00810p5504m1039J2782Q7312J72657
38425d183744K50044K98288L02141K58785J79017Q2530r578q1025j23643j38419
$$ plain form
38494 -2069670 -1714018 -1347372 -979773 -624122 -292762 7610 278982 530806 775685
38485 775685 1025238 1288263 1570890 1876824 2205965 2551210 2895443 3212000 3470505 3646126
38475 3646126 3727180 3716820 3628361 3477500 3275404 3025000 2720847 2352244 1909251 1390468
38465 1390468 809453 195822 -410320 -967544 -1440517 -1802878 -2036933 -2133478 -2093500 -1931115
38455 -1931115 -1675506 -1369405 -1062612 -801789 -620684 -535085 -543498 -630991 -773573 -943295
38445 -943295 -1115572 -1277843 -1434961 -1606661 -1817015 -2081380 -2398031 -2748136 -3102659 -3431838
38435 -3431838 -3713512 -3938137 -4109296 -4239142 -4339952 -4415456 -4456495 -4443713 -4356401 -4183744
38425 -4183744 -3933700 -3635412 -3333271 -3074486 -2895469 -2812939 -2822517 -2903542 -3027185 -3165604
38415c165604j34557j25705j23836j33805j52238j71199j83630j87021j83725
38406d561320j78787j77049j81060j90052j99877k04340j98624j83490j66471
38397f241070j57302j60123j69158j71960j57719j23927p6901k6832J8646N7930
38387g208416R4027J29528J62001J83478J84509J60096J13861N7871P959k3172
38377f138258l0873j8674N561L4090O1909Q7662J13624J44576J85251K37290K97518
38366e020324L58272M09366M40981M46781M26140L84125L28976K68650K08706
38357a748327J52301J01087N5003J0978l7159r5597j65491k39749l04325l42833
38347b614112l41447k92326j95943o2577Q8542K33673L51505M28998M63175M58784
$$ plain form
38415 -3165604 -3300161 -3425866 -3549702 -3683507 -3835745 -4006944 -4190574 -4377595 -4561320
38406 -4561320 -4740107 -4917156 -5098216 -5288268 -5488145 -5692485 -5891109 -6074599 -6241070
38397 -6241070 -6398372 -6558495 -6727653 -6899613 -7057332 -7181259 -7258160 -7284992 -7266346 -7208416
38387 -7208416 -7114389 -6984861 -6822860 -6639382 -6454873 -6294777 -6180916 -6123045 -6115086 -6138258
38377 -6138258 -6169131 -6187805 -6182244 -6148154 -6086245 -5998583 -5884959 -5740383 -5555132 -5317842 -5020324
38366 -5020324 -4662052 -4252686 -3811705 -3364924 -2938784 -2554659 -2225683 -1957033 -1748327
38357 -1748327 -1596026 -1494939 -1439936 -1428958 -1466117 -1561714 -1727205 -1966954 -2271279 -2614112
38347 -2614112 -2955559 -3247885 -3443828 -3506405 -3417863 -3184190 -2832685 -2403687 -1940512 -1481728
38337a481728M24372L69302L02277K30392J58137Q6917J6150n4295j21778j80407
38327b50661k22985k44479k45061k30742k10628j91950j75924j57791j31461r5271
38317b156953n4061j6321J0179K0112R577k4189q0455j52030k25328k84661l18691
38306c272821l25552l13449k95856k83748k80138k80351k76685k63052k36901
38297e828553j99277j54308j08134o6619l2870o115J7865M5645Q4750J41223K16197
38286e890196L03338L89601M59980N03727N18285N08337M80903M40122L85739
38277a900164L16399K34929J50884P7876K8045Q343K0919O5517J40211K39742
38267f17299L53582M66237N60388O21882O43976O28110N80343N06425M09944K94635
$$ plain form
38337 -1481728 -1057356 -688054 -385777 -155385 2752 89669 105819 51524 -70254 -250661
38327 -250661 -473646 -718125 -963186 -1193928 -1404556 -1596506 -1772430 -1930221 -2061682 -2156953
38317 -2156953 -2211014 -2227335 -2217156 -2197044 -2187467 -2211656 -2292111 -2444141 -2669469 -2954130 -3272821
38306 -3272821 -3598373 -3911822 -4207678 -4491426 -4771564 -5051915 -5328600 -5591652 -5828553
38297 -5828553 -6027830 -6182138 -6290272 -6356891 -6389761 -6395876 -6378011 -6332366 -6247616 -6106393 -5890196
38286 -5890196 -5586858 -5197257 -4737277 -4233550 -3715265 -3206928 -2726025 -2285903 -1900164
38277 -1900164 -1583765 -1348836 -1197952 -1120076 -1092031 -1083688 -1062769 -997252 -857041 -617299
38267 -617299 -263717 202520 762908 1384790 2028766 2656876 3237219 3743644 4153588 4448223
38257D448223J67659M0547p2301j56117j99031j96443j54332q8177j6961M4009
38247C817076Q7093J11804J21345J18417J02475O9975J7929n1776j30648k06216
38237D057474k67195l07501l26831l28318l15923k93723k66843k41900k25178
38228A484062k19297k20913k21698k12414j87919j50414j09328p7726o6585p9295
38218f1527j08848j39438j52600j35644q8262k2975M1531R0000J16384J22655
38208c38724J13805R4911P2127N4339N1888P2575J17963J82230K53813L19279
38198I94206L68131L96095M04803L98262L79196L48008L04600K51068J92682J35879
38188D172930Q4289L6230j3495o8497j26909j81957k25781k52596k59332k44977
$$ plain form
38257 4448223 4615882 4656429 4584128 4428011 4228980 4032537 3878205 3790028 3773067 3817076
38247 3817076 3904169 4015973 4137318 4255735 4358210 4428185 4446114 4394338 4263690 4057474
38237 4057474 3790279 3482778 3155947 2827629 2511706 2217983 1951140 1709240 1484062
38228 1484062 1264765 1043852 822154 609740 421821 271407 162079 84353 17768 -61527
38218 -61527 -170375 -309813 -462413 -598057 -686319 -709294 -667763 -577763 -461379 -338724
38208 -338724 -224919 -130008 -57881 -3542 48346 120921 238884 421114 674927 994206
38198 994206 1362337 1758432 2163235 2561497 2940693 3288701 3593301 3844369 4037051 4172930
38188 4172930 4257219 4293449 4279954 4211457 4084548 3902591 3676810 3424214 3164882 2919905
38178B919905k10650j60490j02320m7025o225J1384L558k4092n9930r0332j03695
38167B130088r2993n6884L4O7762J32684J80822K02055J93727J61793J18233P5652
38156C112973M1888J7802r18k0000m3856p4965j13980j58799k03080k36597k48893
38145B071575k34572j96372j43844q9019m2619j2984o630k7805p5730j41534k08471
38134H91995k57021k72370k49292j91752j09197j3438Q2325J64385K21299K47771
38124E14705K46828K28342K04438J84181J70104J58233J41315J13137P1475J8395
38114B051153m1638j03879j63719k15248k50442k61753k47185k12943j70027j27188
38104B57131q6757m6727o193L1620O1310P9915Q9818R7209J06983J17827J21151
$$ plain form
38178 2919905 2709255 2548765 2446445 2399420 2393195 2404579 2408137 2384045 2324115 2233783 2130088
38167 2130088 2037095 1980211 1980245 2048007 2180691 2361513 2563568 2757295 2919088 3037321 3112973
38156 3112973 3154861 3172663 3171745 3151745 3107889 3032924 2918944 2760145 2557065 2320468 2071575
38145 2071575 1837003 1640631 1496787 1407768 1365149 1352165 1345535 1317730 1242000 1100466 891995
38134 891995 634974 362604 113312 -78440 -187637 -201075 -118750 45635 266934 514705
38124 514705 761533 989875 1194313 1378494 1548598 1706831 1848146 1961283 2032758 2051153
38114 2051153 2009515 1905636 1741917 1526669 1276227 1014474 767289 554346 384319 257131
38104 257131 170374 123647 117454 149074 210384 290299 380117 477326 584309 702136 823287
38093H23287J04668N8297k0896j26884k46184l61090m52425n01452m93006m21308
38083a636993k95256j37764K1739J56220K45716K78522K53043J80469Q3841r118
38073h59581p5677j04330r5484n8687q793L8486P1298Q5061Q2670P1731O1136
38062g92170N9198P3010J07085J60570K25110K86127L27648L37942L13230K58339
38052A356089J84579J05521L2186k9928q0436j21035j52659j74841j87133j90634
38042G41709j88108j82794j77339j73619j73088j76695j84552j95866k09027k21266
38032a140645k28429k26068k11756j86548j54011j17768q0034m2093n574K6922
38022b366004N1945O5213O1247L3745k1835j03452j98572k85526l41226l51117
$$ plain form
38093 823287 927955 986252 965356 838472 592288 231198 -221227 -722679 -1215685 -1636993
38083 -1636993 -1932249 -2070013 -2048274 -1892054 -1646338 -1367816 -1114773 -934304 -850463 -859581
38073 -859581 -935258 -1039588 -1135072 -1193759 -1202552 -1164066 -1092768 -1007707 -925037 -853306 -792170
38062 -792170 -732972 -659962 -552877 -392307 -167197 118930 446578 784520 1097750 1356089
38052 1356089 1540668 1646189 1678375 1648447 1568011 1446976 1294317 1119476 932343 741709
38042 741709 553601 370807 193468 19849 -153239 -329934 -514486 -710352 -919379 -1140645
38032 -1140645 -1369074 -1595142 -1806898 -1993446 -2147457 -2265225 -2345259 -2387352 -2392926 -2366004
38022 -2366004 -2314059 -2248846 -2187599 -2153854 -2175689 -2279141 -2477713 -2763239 -3104465 -3455582
38012c455582l14637k43169j52852n7626L3830J16941J88353K44560K83745L09371
38002c047066L31568L63606M14707M83819N58392O18879O46072O27753N62258
37993A559988M58618L33703K07151R5336O602n9952j11349j55053j94053k25497
37983A915494k43302k42522k22296j85716j37648q2889k5819K9295P8572J19070
37973A002239J48543J64558J64500J47298J15237P3418K6606k3564p7857j35079
37963A605899j87743k21818k21766j78177r3444J8062J35661K41160L25901L91784
37953A815519M45309M88310N12155N00200M37124L18707J55675k9766k11262l65458
37943D066513m77058n41706n66419n66642n59679n56545n56481n47992n16316
$$ plain form
38012 -3455582 -3770219 -4013388 -4166240 -4223866 -4190036 -4073095 -3884742 -3640182 -3356437 -3047066
38002 -3047066 -2715498 -2351892 -1937185 -1453366 -894974 -276095 369977 997730 1559988
37993 1559988 2018606 2352309 2559460 2654796 2661398 2601446 2490097 2335044 2140991 1915494
37983 1915494 1672192 1429670 1207374 1021658 884010 801121 775302 804597 883169 1002239
37973 1002239 1150782 1315340 1479840 1627138 1742375 1815793 1842399 1818835 1740978 1605899
37963 1605899 1418156 1196338 974572 796395 702951 721013 856674 1097834 1423735 1815519
37953 1815519 2260828 2749138 3261293 3761493 4198617 4517324 4672999 4643233 4431971 4066513
37943 4066513 3589455 3047749 2481330 1914688 1355009 798464 241983 -306009 -822325
37934h22325m52385l57602k42624j23010j4920O8469J19995J39844J33812J09571
37924a441175P3857L1933j1731n3026q8010j12748j23581j18134r6490o1809k0636
37913b021550J7255M0534M0448J5639k5607o7735r3647r0643n4123J1880R6751
37902b130798J86577K67222L26459L55408L49626L09498K39579J47256M1991o4505
37892B8313j58335k25384k55046k43889j97053j26865m9485J9417O8990R6061
37882a043276J04977J04041J00534R7202R1995Q0563N9784L0663l67k2470k3850
37871d20204L299N9117J36179K23618L12487L98683M82147N63505O40455P05653
37861C104939P47144P51556P09257O19508M93256L51981K21975J25785P4497O4859
$$ plain form
37934 -822325 -1274710 -1632312 -1874936 -1997946 -2012866 -1944397 -1824402 -1684558 -1550746 -1441175
37924 -1441175 -1367318 -1335385 -1347116 -1400142 -1488152 -1600900 -1724481 -1842615 -1939105 -2000914 -2021550
37913 -2021550 -2004295 -1963761 -1923313 -1907674 -1933281 -2001016 -2094663 -2185306 -2239429 -2227549 -2130798
37902 -2130798 -1944221 -1676999 -1350540 -995132 -645506 -336008 -96429 50827 92818 28313
37892 28313 -130022 -355406 -610452 -854341 -1051394 -1178259 -1227744 -1208327 -1139337 -1043276
37882 -1043276 -938299 -834258 -733724 -636522 -544527 -463964 -404180 -373517 -373884 -396354 -420204
37871 -420204 -416905 -357788 -221609 2009 314496 713179 1195326 1758831 2399286 3104939
37861 3104939 3852083 4603639 5312896 5932404 6425660 6777641 6999616 7125401 7199898 7264757
37851G264757Q2499J08809J27880J31073J18429R6953P6493O5199O6722Q0096
37841H218910J01518J26479J50721J69353J75204J59149J13741L8094o0032j66775
37831I026362k67126l48984m04760m31113m27968l97853l46278k82320k17289
37822E902671j60466j14369p3387k7072L4435J16191K16800L29125M43050N49491
37812G216469O43154P21306P79111Q06111P88481P16916N94477M38353K73945
37803A2978323J24927M686q7137j61811k33795l11835l93955m69143n23866n48356
37793A0378038n39289m99558m37305l64585k94534k37222j96413j69341j49424
37784G490367j30374j09769r0305p7956p8205r3274j22069j61515k06934k51302
$$ plain form
37851 7264757 7347256 7456065 7583945 7715018 7833447 7930400 8006893 8072092 8138814 8218910
37841 8218910 8320428 8446907 8597628 8766981 8942185 9101334 9215075 9253169 9193137 9026362
37831 9026362 8759236 8410252 8005492 7574379 7146411 6748558 6402280 6119960 5902671
37822 5902671 5742205 5627836 5554449 5527377 5561812 5678003 5894803 6223928 6666978 7216469
37812 7216469 7859623 8580929 9360040 10166151 10954632 11671548 12266025 12704378 12978323
37803 12978323 13103250 13107936 13020799 12858988 12625193 12313358 11919403 11450260 10926394 10378038
37793 10378038 9838749 9339191 8901886 8537301 8242767 8005545 7809132 7639791 7490367
37784 7490367 7359993 7250224 7159919 7081963 7003758 6910484 6788415 6626900 6419966 6168664
37774F168664k85584l01186k92788k59401k03720j31657n2837J9105O8286Q1129
37764D810011N2473r639q3921j41840j57597j17562k5076J01182K34682L51348
37754E014061M37996M94664N30371N56229N80956O10690O50860P06606P80394
37745A0362827Q68815R62205J048667J120122J175683J219677J256708J288947
37737A9303651J318307J350856J398366J474919J591583J753829J963028K219332
37729C2373871K522756K871984L262287L683680M119993M549782M949152N294056
37721F3627561N558772N710390N703177N477873M970000M129731K951076J497985
37713I9626565r2523j641827k984333m015687m709776n102934n262709n260086
$$ plain form
37774 6168664 5883080 5581894 5289106 5029705 4825985 4694328 4641491 4660596 4728882 4810011
37764 4810011 4862484 4852845 4768924 4627084 4469487 4351925 4326849 4428031 4662713 5014061
37754 5014061 5452057 5946721 6477092 7033321 7614277 8224967 8875827 9582433 10362827
37745 10362827 11231642 12193847 13242514 14362636 15538319 16757996 18014704 19303651
37737 19303651 20621958 21972814 23371180 24846099 26437682 28191511 30154539 32373871
37729 32373871 34896627 37768611 41030898 44714578 48834571 53384353 58333505 63627561
37721 63627561 69186333 74896723 80599900 86077773 91047773 95177504 98128580 99626565
37713 99626565 99534042 97892215 94907882 90892195 86182419 81079485 75816776 70556690
37705G0556690n153445m983243m773509m536514m277845m000239l706023l398526
37697C5727346l082268k762006k441553k123823j812437j513641j236752r92587
37689A9762279p90748o37191n32889m73554m50126m49871m58117m60950m48576
37680A5060257m17985l72698l19198k62791k06615j54080j11309q6524q7119j16998
37670A2924940j75054k53845l38842m10572m50694m49607m11079l51156k91835
37661I792256k52757k44782k68015l14215l71341m27479m72857n00383n06054
37652F434373m89884m56249m11930l62035l06656k41185j60085o1173N2131J70971
37642D168278K83149L76685M43656M82137M94984M86528M59474M13584L46792
$$ plain form
37705 70556690 65403245 60420002 55646493 51109979 46832134 42831895 39125872 35727346
37697 35727346 32645078 29883072 27441519 25317696 23505259 21991618 20754866 19762279
37689 19762279 18971531 18334340 17801451 17327897 16877771 16427900 15969783 15508833 15060257
37680 15060257 14642272 14269574 13950376 13687585 13480970 13326890 13215581 13129057 13041938 12924940
37670 12924940 12749886 12496041 12157199 11746627 11295933 10846326 10435247 10084091 9792256
37661 9792256 9539499 9294717 9026702 8712487 8341146 7913667 7440810 6940427 6434373
37652 6434373 5944489 5488240 5076310 4714275 4407619 4166434 4006349 3945176 3997307 4168278
37642 4168278 4451427 4828112 5271768 5753905 6248889 6735417 7194891 7608475 7955267
37633G955267K58515J53477M2915n8356j37030j84789j98746j80455j35345p2660
37623G442793n177N2015Q4314Q2466M7713o853o1247r7412j05906q6804m6198
37612G299704P767O7153J25209J76887K18851K48615K63372K59568K33729J84094
37602I084949J12190K3396p3839j69659k54372l19388l58196l67960l51131l15303
37592G010687k70581k25749j85509j50348j18803r0809p0214o5042q5067j37640
37582E610925k23231l32561m47031n43227o00021o05202n59036m73996l70721
37573A455899k70808j88701j27027p8335l1720K0589Q0065J42139J98657K42001
37563A442759K69552K85728K99651L20085L51366L92291M37288M78448N07763
$$ plain form
37633 7955267 8213782 8367259 8410174 8351818 8214788 8029999 7831253 7650798 7515453 7442793
37623 7442793 7437616 7489631 7573945 7656411 7704124 7697271 7636024 7538612 7432706 7345902 7299704
37612 7299704 7307471 7374624 7499833 7676720 7895571 8144186 8407558 8667126 8900855 9084949
37602 9084949 9197139 9220535 9146696 8977037 8722665 8403277 8045081 7677121 7325990 7010687
37592 7010687 6740106 6514357 6328848 6178500 6059697 5968888 5898674 5833632 5748565 5610925
37582 5610925 5387694 5055133 4608102 4064875 3464854 2859652 2300616 1826620 1455899
37573 1455899 1185091 996390 869363 791028 759308 779897 859962 1002101 1200758 1442759
37563 1442759 1712311 1998039 2297690 2617775 2969141 3361432 3798720 4277168 4784931
37554D784931N19319N10578M82432M38478L84023L24470K63102J99790J32341
37545H039464O0077j3222p9673j30803j61474j71652j65318j47603j21938q8904
37535G018954m7319L352O0999J20185J72427K07349K15669J93998J48683R4603
37525H188900M7962J7277j038j9090m8257r0673j37294j73601j88355j79045j51118
37514G265668j12967p0867k6490K2713Q1086J51477K32343L16480L91821M44052
37504H695316M60235M31922L56615K37679Q4441q6690k51938l83755m58730m65903
37494H619192m10405l10096j87653o2518N3754J58082K53596L46411M42622N45831
37484I448816O55021P62877Q55837R17576R35770R08620Q46515P67080O86780
$$ plain form
37554 4784931 5304250 5814828 6297260 6735738 7119761 7444231 7707333 7907123 8039464
37545 8039464 8099541 8086319 8006646 7875843 7714369 7542717 7377399 7229796 7107858 7018954
37535 7018954 6971635 6974987 7035986 7156171 7328598 7535947 7751616 7945614 8094297 8188900
37525 8188900 8236862 8254139 8253101 8234011 8185754 8095081 7957787 7784186 7595831 7416786 7265668
37514 7265668 7152701 7081834 7055344 7078057 7159143 7310620 7542963 7859443 8251264 8695316
37504 8695316 9155551 9587473 9944088 10181767 10266208 10179518 9927580 9543825 9085095 8619192
37494 8619192 8208787 7898691 7711038 7648520 7702274 7860356 8113952 8460363 8902985 9448816
37484 9448816 10103837 10866714 11722551 12640127 13575897 14484517 15331032 16098112 16784892
37475A6784892O14265N48661M82238M04829L07387J83851L2107j44568l35855
37466A8877807n24393o89076q10814q78060q89814q55052p89021p08193o26674
37457A2106710n55619n04328m79789m83609n08872n40541n60254n52825n10699
37448G410174m34665l31719k11872q4602M4891J78422L23712M88707O74725Q73865
37438H931638J072733J258911J424970J567487J682389J759755J781341J723196
37430B1202420J563429J292054R18413M72414j361m54579q46587j151466j358745
37421B1635992j470098j495627j451108j355114j225809j079085r28936p88179
37413A1842036o67343n72495n04791m62500m42800m40831m47369m48697m30279
$$ plain form
37475 16784892 17399157 17947818 18430056 18834885 19142272 19326123 19358230 19213662 18877807
37466 18877807 18353414 17664338 16853524 15975464 15085650 14230598 13441577 12733384 12106710
37457 12106710 11551091 11046763 10566974 10083365 9574493 9033952 8473698 7920873 7410174
37448 7410174 6975509 6643790 6431918 6347316 6392207 6570629 6894341 7383048 8057773 8931638
37438 8931638 10004371 11263282 12688252 14255739 15938128 17697883 19479224 21202420
37430 21202420 22765849 24057903 24976316 25448730 25447369 24992790 24146203 22994737 21635992
37421 21635992 20165894 18670267 17219159 15864045 14638236 13559151 12630215 11842036
37413 11842036 11174693 10602198 10097407 9634907 9192107 8751276 8303907 7855210 7424931
37404G424931l82078l02419j98951q7076J3748Q5699J19031J16580R3446P0942
37394F953853O6997Q7786J25252J61957J80013J68823J27918O5163p084p5553
37384G855125j28863j59955j68191j60019j47110j42035j53446j83118k25999
37375F386389k72673l12758l37838l42950l26200k87154k25557j41939m0239O9487
37365D168568J71185K47150K84764K81534K45769J93582J44418J16067J19032
37356E972069J51734J99596K39649K48551K10315J21189r014j59393l04153m20534
37346F250009m94906n24290n13357m69573l99645l08915k03124r0455J8564J13724
37336C378032J88643K42297K77455K97767L06427L07485L07642L15815L39960
$$ plain form
37404 7424931 7042853 6740434 6541483 6454407 6468155 6553854 6672885 6789465 6882911 6953853
37394 6953853 7020850 7108636 7233888 7395845 7575858 7744681 7872599 7937762 7930678 7855125
37384 7855125 7726262 7566307 7398116 7238097 7090987 6948952 6795506 6612388 6386389
37375 6386389 6113716 5800958 5463120 5120170 4793970 4506816 4281259 4139320 4099081 4168568
37365 4168568 4339753 4586903 4871667 5153201 5398970 5592552 5736970 5853037 5972069
37356 5972069 6123803 6323399 6563048 6811599 7021914 7143103 7134089 6974696 6670543 6250009
37346 6250009 5755103 5230813 4717456 4247883 3848238 3539323 3336199 3245744 3264308 3378032
37336 3378032 3566675 3808972 4086427 4384194 4690621 4998106 5305748 5621563 5961523
37327E961523L83004M39962M97456N36390N37853M90288L94130K61167J09381
37318I611154m3427j83973l04199l98837m62338m88484m73716m21142l40568k43437
37308F251033j36787k1521J03837K37666L72802M98346O03331O79403P22001P30904
37298A0041015P10483O69116O17937N69803N38377N35836N68768O34480P20858
37289A5606673Q10246Q85076R32133R43874R17049Q50525P44734O03288M34323
37280B2727921K49039N7982j31592l15651m92177o60886q23384r82005j137186
37271A8492061j284991j416207j517299j573128j571113j505488j379586j205266
37263G038983j000435p86195n83862m11152k77629j81354j09412m3213L3345J26887
$$ plain form
37327 5961523 6344527 6784489 7281945 7818335 8356188 8846476 9240606 9501773 9611154
37318 9611154 9567727 9383754 9079555 8680718 8218380 7729896 7256180 6835038 6494470 6251033
37308 6251033 6114246 6092725 6196562 6434228 6807030 7305376 7908707 8588110 9310111 10041015
37298 10041015 10751498 11420614 12038551 12608354 13146731 13682567 14251335 14885815 15606673
37289 15606673 16416919 17301995 18234128 19178002 20095051 20945576 21690310 22293598 22727921
37280 22727921 22976960 23034942 22903350 22587699 22095522 21434636 20611252 19629247 18492061
37271 18492061 17207070 15790863 14273564 12700436 11129323 9623835 8244249 7038983
37263 7038983 6038548 5252353 4668491 4257339 3979710 3798356 3688944 3645731 3679076 3805963
37253C805963K32257L35693M21239M76853M97799M87232M54853M14121L77968
37244G503978L54031L41898L34144L20288K90862K39765J65077O9252m1092j56255
37234I421948k65344l58551m29221m75324m99888n10286n16234n26453n44724
37225E295923n67280n83934n83105n57771n08392m41344l64763k84807k03892
37216A200635j20689l1538O6843J73726K81609L76579M42382M66295M43717L79561
37206C679120K86340J80080P5726j5750q7288j33633j50123j34375q9881k8139
37196C582077L3148P5686Q7124O4916J5380n0854j23627j95495k61433l17749
37186B909173l61127l87616l92111l69921l20788k52255j78397j13316o3932k7710
$$ plain form
37253 3805963 4038220 4373913 4795152 5272005 5769804 6257036 6711889 7126010 7503978
37244 7503978 7858009 8199907 8534051 8854339 9145201 9384966 9550043 9619295 9578203 9421948
37234 9421948 9156604 8798053 8368832 7893508 7393620 6883334 6367100 5840647 5295923
37225 5295923 4728643 4144709 3561604 3003833 2495441 2054097 1689334 1404527 1200635
37216 1200635 1079946 1048408 1115251 1288977 1570586 1947165 2389547 2855842 3299559 3679120
37206 3679120 3965460 4145540 4221266 4205516 4118228 3984595 3834472 3700097 3610216 3582077
37196 3582077 3615225 3690911 3778035 3842951 3858331 3807477 3683850 3488355 3226922 2909173
37186 2909173 2548046 2160430 1768319 1398398 1077610 825355 646958 533642 469710 442000
37176D42000L055L3913O3198Q2061P9121M6852j3576r1587j70973k36104k77326
37165c9366k93319k89859k75532k55962k29592j88165j22602l0985P6498J78969
37155a469915K52074K77473K50034J79414Q5658q271q3050j26254j32767j03915
37145h79519m6109L1029J16935K02209K79950L46066L98725M37129M60126M65523
37135A812064M50759M14661L59239K90279K16371J46698Q8613M6190K0231R276
37125C854381J0183J7623K3227J6112j4038p1943j52241k39081l11945l55391
37115B776887l66493l54428l32773l10980k91340k72404k54415k41954k41929
37106A10171k59069k92253l34268l74759m04251m17092m12371l92898l62898l25760
$$ plain form
37176 442000 445055 478968 542166 624227 703348 750200 736624 645037 474064 237960 -39366
37165 -39366 -332685 -622544 -898076 -1154038 -1383630 -1571795 -1694397 -1725382 -1648884 -1469915
37155 -1469915 -1217841 -940368 -690334 -510920 -425262 -433533 -516583 -642837 -775604 -879519
37145 -879519 -925628 -894599 -777664 -575455 -295505 50561 449286 886415 1346541 1812064
37135 1812064 2262823 2677484 3036723 3327002 3543373 3690071 3778684 3824874 3845105 3854381
37125 3854381 3864564 3882187 3905414 3921526 3907488 3835545 3683304 3444223 3132278 2776887
37115 2776887 2410394 2055966 1723193 1412213 1120873 848469 594054 352100 110171
37106 110171 -148898 -441151 -775419 -1150178 -1554429 -1971521 -2383892 -2776790 -3139688 -3465448
37096c465448k83170k35961j85037j30860p1791l652P7788J72313K72167L63537
37086c490114M32555M71800M82835M73838M55318M36834M25079M22601M27669
37077E38415M35903M42113M40505M24276L87546L29430K55974J76931J00048K8303
37067C559444l7888r6606j42604j69025j71153j49665j11411o7232k8046j148
37057B584666J2188J7303K4289M3280P8780J26731J76378K15080K32743K24577
37047C736015J93167J49564J10971R3787J05280J39747J82101K16081K31513K26871
37037E385097K07595J82602J60795J48005J44607J44891J39198J18404P8197K0644
37027F730035m7261j16331j77499k23641k51069k59965k52818k32187k00483j62389
$$ plain form
37096 -3465448 -3748618 -3984579 -4169616 -4300476 -4372267 -4375919 -4298131 -4125818 -3853651 -3490114
37086 -3490114 -3057559 -2585759 -2102924 -1629086 -1173768 -736934 -311855 110746 538415
37077 538415 974318 1416431 1856936 2281212 2668758 2998188 3254162 3431093 3531141 3559444
37067 3559444 3521556 3424950 3282346 3113321 2942168 2792503 2681092 2613860 2585814 2584666
37057 2584666 2596854 2614157 2638446 2681726 2760506 2887237 3063615 3278695 3511438 3736015
37047 3736015 3929182 4078746 4189717 4283504 4388784 4528531 4710632 4926713 5158226 5385097
37037 5385097 5592692 5775294 5936089 6084094 6228701 6373592 6512790 6631194 6709391 6730035
37027 6730035 6682774 6566443 6388944 6165303 5914234 5654269 5401451 5169264 4968781 4806392
37017D806392j26971j06033j08898j37474j84915k38137k82463l06659l06665
37008C008177k86140k53271k15817j77712j38783r6625m9012M102N9571J11725
36998A966215J54498J83507J96821J94967J81358J62692J47654J43249J50932
36989C481893J65557J78346J81886J73557J55111J29434R7965O1310K1853j5238
36979D631674m4550o4527p8940r3666j10846j24958j24182r6448l6164N2534J57443
36968D067370K63254L57123M32491M89433N31354N60232N74117N68766N41604
36959H385744M94268M31804L59446K79668J91662R4030j0673j12826j97006k47679
36949I668438k56130k24747j66827j02335n1655l0020m4801r5782j76471k74736
$$ plain form
37017 4806392 4679421 4573388 4464490 4327016 4142101 3903964 3621501 3314842 3008177
37008 3008177 2722037 2468766 2252949 2075237 1936454 1839829 1790817 1794919 1854490 1966215
36998 1966215 2120713 2304220 2501041 2696008 2877366 3040058 3187712 3330961 3481893
36989 3481893 3647450 3825796 4007682 4181239 4336350 4465784 4563749 4625059 4646912 4631674
36979 4631674 4587124 4522597 4443657 4349991 4239145 4114187 3990005 3893557 3857393 3909927 4067370
36968 4067370 4330624 4687747 5120238 5609671 6141025 6701257 7275374 7844140 8385744
36959 8385744 8880012 9311816 9671262 9950930 10142592 10236622 10225949 10113123 9916117 9668438
36949 9668438 9412308 9187561 9020734 8918399 8866744 8836724 8791923 8696141 8519670 8244934
36939H244934l73502m53491m98171m98516m55442l79811k90362k08848j52293
36930D934498j25683j20198j18530j03104o2045Q250J01984K03884K92508L47849
36920E359413L59914L32816K81757K24795J74412J33386R6828N8311J5809k6477
36910G010964o1215q3730r6388j08205j29286j63885k07563k50547k84264l05752
36900E320129l17589l24788l31425l38602l44173l44150l34882l14648k83884
36891B385988k44711k00580j56017j15761q3333o0119m5728l9136l9178m3960
36881A357465n0194n3471m9225l3302k247M5568J07626J75394K35130K71902K75316
36870B279962K44445J89405J28084P9080N4904N9478R0514J43714K15524L03519
$$ plain form
36939 8244934 7871432 7417941 6919770 6421254 5965812 5586001 5295639 5086791 4934498
36930 4934498 4808815 4688617 4570087 4466983 4404938 4413188 4515172 4719056 5011564 5359413
36920 5359413 5719327 6052143 6333900 6558695 6733107 6866493 6963321 7021632 7037441 7010964
36910 7010964 6949749 6866019 6769631 6661426 6532140 6368255 6160692 5910145 5625881 5320129
36900 5320129 5002540 4677752 4346327 4007725 3663552 3319402 2984520 2669872 2385988
36891 2385988 2141277 1940697 1784680 1668919 1585586 1525467 1479739 1440603 1401425 1357465
36881 1357465 1307271 1253800 1204575 1171273 1169026 1214594 1322220 1497614 1732744 2004646 2279962
36870 2279962 2524407 2713812 2841896 2920976 2975880 3035358 3125872 3269586 3485110 3788629
36860C788629M04918N13931O19349P04970P54106P55650P07205O13728M84531
36851I347017L32030J71948K2401r9355j81151k19203k19580j96816j68827j49293
36841H639171j41665j38958j29530j04993o5343j8589K4233N5108P2267P9397
36831H271098Q2708Q8191R9393J15364J29769J32747J15192P3014R425o5228j36237
36820H915436j89564k17032k18495j99696j67759j27536q0701k7833K7998P9245
36810G794063J16263J33310J33961J31822J45769J91792K74678L83407M93344
36801I798409N74816O03626N68549M73763L36743J82711L7409p9020j54880j86328
36791A2155798j74646j23150l5617Q2675K23136L74447N26180O72109Q10783R44535
$$ plain form
36860 3788629 4193547 4707478 5326827 6031797 6785903 7541553 8248758 8862486 9347017
36851 9347017 9679047 9850995 9873396 9774041 9592890 9373687 9154107 8957291 8788464 8639171
36841 8639171 8497506 8358548 8229018 8124025 8058682 8040093 8064326 8119434 8191701 8271098
36831 8271098 8353806 8441997 8541390 8656754 8786523 8919270 9034462 9107476 9116901 9051673 8915436
36820 8915436 8725872 8508840 8290345 8090649 7922890 7795354 7714653 7686820 7714818 7794063
36810 7794063 7910326 8043636 8177597 8309419 8455188 8646980 8921658 9305065 9798409
36801 9798409 10373225 10976851 11545400 12019163 12355906 12538617 12576026 12497006 12342126 12155798
36791 12155798 11981152 11858002 11822385 11905060 12128196 12502643 13028823 13700932 14511715 15456250
36781A5456250J078825J220842J375922J543864J718717J892294K058268K214135
36773B8559117K360928K501818K641238K785996K947408L141508L386271L698533
36765E2022817M092616M578880N160819N833944O589794P422488Q332233R324403
36757A03357994J0406943J1587163J2867948J4245827J5713639J7264968J8894070
36750B04338552K0588264K2312234K3983053K5438239K6409145K6516681K5305207
36743C74891375K2333529J7337061J0426956K212796o281605j3925378j9855639
36736C87139095k3705577k5587022k5903033k5138857k3725789k1987431k0138520
36729B20952866j8308104j6567496j4951783j3473868j2135222j0933172r861913
$$ plain form
36781 15456250 16535075 17755917 19131839 20675703 22394420 24286714 26344982 28559117
36773 28559117 30920045 33421863 36063101 38849097 41796505 44938013 48324284 52022817
36765 52022817 56115433 60694313 65855132 71689076 78278870 85701358 94033591 103357994
36757 103357994 113764937 125352100 138220048 152465875 168179514 185444482 204338552
36750 204338552 224926816 247239050 271222103 296660342 323069487 349586168 374891375
36743 374891375 397224904 414561965 424988921 427201717 420920112 406994734 387139095
36736 387139095 363433518 337846496 311943463 286804606 263078817 241091386 220952866
36729 220952866 202644762 186077266 171125483 157651615 145516393 134583221 124721308
36722A24721308q909672q059199p293999o605592n996103n474238n046286m706815
36714G2629404m435716m204608l987684l768497l539510l298436l046093k786395
36706D3562465k526553k275763k042509j832148j646808j487338j354290j246398
36698B9150658j159049j085837j022046r66297r19331q81862q52941q28564q01068
36689B0633663p60866p00300o17221n16633m10242l14111k44461k13459k27310
36680A6629060k86448l85527n12768o51033p81787q89130r60988r88533r67108
36671A0205738q99292p96840o78210n62127m60908l77394l07022k43236j82689
36662E698020j27295q2576n4218m5446n6380q4233j22999j63127j93278k04473
$$ plain form
36722 124721308 115811636 107752437 100458438 93852846 87856743 82382505 77336219 72629404
36714 72629404 68193688 63989080 60001396 56232899 52693389 49394953 46348860 43562465
36706 43562465 41035912 38760149 36717640 34885492 33238684 31751346 30397056 29150658
36698 29150658 27991609 26905772 25883726 24917429 23998098 23116236 22263295 21434731 20633663
36689 20633663 19872797 19172497 18555276 18038643 17628401 17314290 17069829 16856370 16629060
36680 16629060 16342612 15957085 15444317 14793284 14011497 13122367 12161379 11172846 10205738
36671 10205738 9306446 8509606 7831396 7269269 6808361 6430967 6123945 5880709 5698020
36662 5698020 5570725 5488149 5433931 5388485 5332105 5247872 5124873 4961746 4768468 4563995
36652D563995j93933j65714j28182r0555n9998l9847k9733k8042l4752n1355p7712
36641C664172j09236j37520j53431j49804j22443p0387L460R1314J79702K50203
36631C446030K83388K66147J98734R6283j7379j19843j97754k48345k76120k88387
36621C142754k91938k91139k86708k75131k49644k03590j35958n6296J5161N4540
36611A422051M5751j0731r7244j86137k49862k69107k37028j59439n1457O8155
36601B74952J82385K78749L49107L88444L94743L70203L22201K62139K02078J50947
36591C175948J12371Q5093O5541N1093M2242M2271N5034Q2449J22877J70298K14658
36580D219875K44821K53706K41862K15516J80401J37217Q2708J4352o6117j52582
$$ plain form
36652 4563995 4370062 4204348 4076166 3985611 3925613 3885766 3856033 3827991 3793239 3741884 3664172
36641 3664172 3554936 3417416 3263985 3114181 2991738 2921351 2924811 3016125 3195827 3446030
36631 3446030 3729418 3995565 4194299 4290582 4273203 4153360 3955606 3707261 3431141 3142754
36621 3142754 2850816 2559677 2272969 1997838 1748194 1544604 1408646 1352350 1367511 1422051
36611 1422051 1467802 1457071 1359827 1173690 923828 654721 417693 258254 206797 274952
36601 274952 457337 736086 1085193 1473637 1868380 2238583 2560784 2822923 3025001 3175948
36591 3175948 3288319 3373412 3438953 3490046 3532288 3574559 3629593 3712042 3834919 4005217 4219875
36580 4219875 4464696 4718402 4960264 5175780 5356181 5493398 5576106 5590458 5524341 5371759
36570E371759k36548l09622l65797m02966m22938m29969m28722m22041m08671
36561A944485l82010l32206k52003j43115j8076J04327K06902K79863L21788L36795
36551B066750L30766L08479K71945K20144J50533O2303l9952j44385k33815k91369
36541B701399l07099k81451k23110j42961m8944N4470J62625K66884L54524M12961
36531B949298M35279M22884L83456L26256K58631J85630J11396M0143k3616p4594
36521E014763j06246j11960q8579m0060K2380Q4894J37897J80422K18828K60720
36511E573059L08404L56341L94095M12348M07915L84877L51651L16349K83237
36502H788276K52207K20768J86412J47531J03300N4288M202l9564o8822p9829
$$ plain form
36570 5371759 5135211 4825589 4459792 4056826 3633888 3203919 2775197 2353156 1944485
36561 1944485 1562475 1230269 978266 835151 817075 921402 1128304 1408167 1729955 2066750
36551 2066750 2397516 2705995 2977940 3198084 3348617 3410920 3370968 3226583 2992768 2701399
36541 2701399 2394300 2112849 1889739 1746778 1697834 1752304 1914929 2181813 2536337 2949298
36531 2949298 3384577 3807461 4190917 4517173 4775804 4961434 5072830 5112973 5089357 5014763
36521 5014763 4908517 4796557 4707978 4667918 4690298 4775192 4913089 5093511 5312339 5573059
36511 5573059 5881463 6237804 6631899 7044247 7452162 7837039 8188690 8505039 8788276
36502 8788276 9040483 9261251 9447663 9595194 9698494 9752782 9756984 9717420 9648598 9568769
36492I568769p6463o8323o5296p3105r2349j20065j51504j81541k06534k26492
36482H307097k46011k72539l12485l67143m30516m90188n31216n41635n17045
36473D598319m62114l88732l12694k50623k17288k22755k69771l52636m57747
36464A663959n65212o51827o96754o89070o32718n43941m41748l37949k33901
36455c129161j25330j0231J07041K18535L19373M12020N03923O00499O99518P91200
36445C87387Q62649R02049R00426Q52391P57783O23344M61981K88968J17433m3774
36435F110637j88941l12828m09191m71824m97146m86312m45656l85581l18840
36426B594318k58448k15211j95473k00397k27193k71086l26365l86308m43261
$$ plain form
36492 9568769 9492306 9423983 9358687 9285582 9193233 9073168 8921664 8740123 8533589 8307097
36482 8307097 8061086 7788547 7476062 7108919 6678403 6188215 5656999 5115364 4598319
36473 4598319 4136205 3747473 3434779 3184156 2966868 2744113 2474342 2121706 1663959
36464 1663959 1098747 446920 -249834 -938904 -1571622 -2115563 -2557311 -2895260 -3129161
36455 -3129161 -3254491 -3264722 -3157681 -2939146 -2619773 -2207753 -1703830 -1103331 -403813 387387
36445 387387 1250036 2152085 3052511 3904902 4662685 5286029 5748010 6036978 6154411 6110637
36435 6110637 5921696 5608868 5199677 4727853 4230707 3744395 3298739 2913158 2594318
36426 2594318 2335870 2120659 1925186 1724789 1497596 1226510 900145 513837 70576
36417G0576m89545n18423n24288n02774m52193l75764k81857j80360p7023K9344
36407c302307J44084K70067M02069N25438O19057O61122O36056N40656L86701
36398H82943J98210M486j67507k98461l79157m10628m02553l69846l28169k89563
36388a560245k59658k37197k15914j87746j46112q8421j7611N7937J26858J79329
36378b348780K10977K23362K20963K07710J86087J58771J30166J05726Q9620Q3231
36368g32167Q5636R4983J08709J22911J32793J35573J33873J36420J54715J97439
36358E70885K65831L52399M43694N25819N89659O32440O54498O53929O23729N54365
36348E867248M40441K86932J10920o2452k07804l07671l57562l65649l47271l17334
$$ plain form
36417 70576 -418969 -937392 -1461680 -1964454 -2416647 -2792411 -3074268 -3254628 -3331651 -3302307
36407 -3302307 -3158223 -2888156 -2486087 -1960649 -1341592 -680470 -44414 496242 882943
36398 882943 1081153 1085639 918132 619671 240514 -170114 -572667 -942513 -1270682 -1560245
36388 -1560245 -1819903 -2057100 -2273014 -2460760 -2606872 -2695293 -2712904 -2654967 -2528109 -2348780
36378 -2348780 -2137803 -1914441 -1693478 -1485768 -1299681 -1140910 -1010744 -905018 -815398 -732167
36368 -732167 -646531 -551548 -442839 -319928 -187135 -51562 82311 218731 373446 570885
36358 570885 836716 1189115 1632809 2158628 2748287 3380727 4035225 4689154 5312883 5867248
36348 5867248 6307689 6594621 6705541 6643089 6435285 6127614 5770052 5404403 5057132 4739798
36338D739798k85106k54082k25699k03182j92284j98389k22077k56407k88199
36329B614373l03073k91513k52613j93757j26640o1955n903L9445P2898R1613
36319A582875R1904P2491L6972o169m5476o9398o9682m4060L781O6936J38048
36308A758222K09492K71975L14695L28353L08953K59790J90811J16091N0045L085
36298C811512k1762k9400k9951l4353n0682q2577j29357j86466k45561k94844
36288B706559l21070l13515k68459j91559r6625j563P6316J23886J34523J09538
36278A958031N8476k609n5166q2969p5695l0134N0242J56085K73153L84339M73269
36267C107022N28487N46235N30663M91525M40684L88771L42840L04969K71548
$$ plain form
36338 4739798 4454692 4200610 3974911 3771729 3579445 3381056 3158979 2902572 2614373
36329 2614373 2311300 2019787 1767174 1573417 1446777 1384822 1378919 1418364 1491262 1582875
36319 1582875 1674779 1747270 1784242 1778073 1732597 1663199 1593517 1549457 1553238 1620174 1758222
36308 1758222 1967714 2239689 2554384 2882737 3191690 3451480 3642291 3758382 3808427 3811512
36298 3811512 3789750 3760350 3730399 3696046 3645364 3562787 3433430 3246964 3001403 2706559
36288 2706559 2385489 2071974 1803515 1611956 1515331 1513768 1590084 1713970 1848493 1958031
36278 1958031 2016507 2013898 1958732 1875763 1800068 1769934 1820176 1976261 2249414 2633753 3107022
36267 3107022 3635509 4181744 4712407 5203932 5644616 6033387 6376227 6681196 6952744
36258F952744K33893J81260J05790O048j13759k47784l91125n38238o79515q00632
36248D708682q86257r25729r17030q67000p87966o92741n90835m87511l85039
36239a831426k84104j84448q5297J3692J11212K03354K83530L43760L77404L81914
36229f70409L59620L15716K54931J79225Q7872k0268j43789k76795m08779n25807
36219h48483o12201o53116o38634n68516m55007l21328j95892j04279o1940p0334
36209d529730j17777j83990k45935k82891k80050k30741j37463j1757J27690K59655
36199e632989L67163M43249M91813N22957N45766N62462N66232N43865M82801
36190a106681L79435K43373R4747m2936j49647k12815k28680k01586j41309n9538
$$ plain form
36258 6952744 7186637 7367897 7473687 7479735 7365976 7118192 6727067 6188829 5509314 4708682
36248 4708682 3822425 2896696 1979666 1112666 324700 -368041 -958876 -1446387 -1831426
36239 -1831426 -2115530 -2299978 -2385275 -2371583 -2260371 -2057017 -1773487 -1429727 -1052323 -670409
36229 -670409 -310789 4927 259858 439083 526955 506687 362898 86103 -322676 -848483
36219 -848483 -1460684 -2113800 -2752434 -3320950 -3775957 -4097285 -4293177 -4397456 -4459396 -4529730
36209 -4529730 -4647507 -4831497 -5077432 -5360323 -5640373 -5871114 -6008577 -6020334 -5892644 -5632989
36199 -5632989 -5265826 -4822577 -4330764 -3807807 -3262041 -2699579 -2133347 -1589482 -1106681
36190 -1106681 -727246 -483873 -389126 -432062 -581709 -794524 -1023204 -1224790 -1366099 -1425637
36180a425637L2670J25786K12121K86343L45587L88335M12519M14524L90233L38048
36170A520529K62031J72864Q5365J3403l5500o3542q2205j07386j51717k17883
36160A395959k96696l70628m20386m31182l96757l20683k15415r9393P698R1063
36150a056420J46168J80095K07197K41297K89023L47569M07030M55376M83586
36141A700921M88610M73114M42862M03616L58643L07283K45598J69927Q1677j0457
36131D661794r3075j53452j83851j83042j56223j14549p3634m9913n5379r3291
36121C505385j57491k35614l14133l82542m35508m72823m97264n10544n09399
36112i933m85310m29521l40654k29282j15745k2420L4846N1387L2641j0829o8229
$$ plain form
36180 -1425637 -1392967 -1267181 -1055060 -768717 -423130 -34795 377724 792248 1182481 1520529
36170 1520529 1782560 1955424 2040789 2054192 2018692 1955150 1872945 1765559 1613842 1395959
36160 1395959 1099263 728635 308249 -122933 -519690 -840373 -1055788 -1155181 -1147483 -1056420
36150 -1056420 -910252 -730157 -522960 -281663 7360 354929 761959 1217335 1700921
36141 1700921 2189531 2662645 3105507 3509123 3867766 4175049 4420647 4590574 4672251 4661794
36131 4661794 4568719 4415267 4231416 4048374 3892151 3777602 3703968 3654055 3598676 3505385
36121 3505385 3347894 3112280 2798147 2415605 1980097 1507274 1010010 499466 -9933
36112 -9933 -495243 -924764 -1265418 -1494700 -1610445 -1632865 -1598019 -1546632 -1513991 -1524820 -1593049
36101a593049j30199j87156k27535k39165k14010j53139o8214K1880R7437J44308
36091b548842J57562J41376J06006O4084K7809O882N895K1774M4047N9837O1224
36080a852346M9648L4222K5688L0369M7223O8336Q2063P7771N0667M347n0378
36069a432390r9811j32547j43432j35165j16932j00024r2087r3351r7394r5352
36059b538485q0174m8564j214N7213J18187J70216K00910K00008J63044R4420
36049a664439P631p8503j45898j82290j83762j55151j09145o3607l6724m0807
36039b652695p7045j34099j92237k31682k40604k18604j74877j23324p6799m1893
36029d163859j6360Q799M3666R4260J60540K36488L10463L67119L92686L81322
$$ plain form
36101 -1593049 -1723248 -1910404 -2137939 -2377104 -2591114 -2744253 -2812467 -2790587 -2693150 -2548842
36091 -2548842 -2391280 -2249904 -2143898 -2079814 -2052005 -2045123 -2039228 -2017454 -1973407 -1913570 -1852346
36080 -1852346 -1802698 -1768476 -1742788 -1712419 -1665196 -1596860 -1514797 -1437026 -1386359 -1382012 -1432390
36069 -1432390 -1532201 -1664748 -1808180 -1943345 -2060277 -2160301 -2252388 -2345739 -2443133 -2538485
36059 -2538485 -2618659 -2667223 -2668437 -2611224 -2493037 -2322821 -2121911 -1921903 -1758859 -1664439
36049 -1664439 -1656808 -1735311 -1881209 -2063499 -2247261 -2402412 -2511557 -2575164 -2611888 -2652695
36039 -2652695 -2729740 -2863839 -3056076 -3287758 -3528362 -3746966 -3921843 -4045167 -4121966 -4163859
36029 -4163859 -4180219 -4171420 -4127754 -4033494 -3872954 -3636466 -3326003 -2958884 -2566198 -2184876
36019b184876L37315K71071J92886J09631K5191n8209j39658k19197k96002l66210
36009b328058m22463m55751m58083m24727l56325k60966j54660n8099R815L8261
35999d871056K6892j6392q0054j52703k24173k84514l23136l30150k99512k31772
35989f786570j34482k0164R7040K04978K96097L67903M20988M56071M72355M68500
35979d157284M45590M09728L71618L42548L29363L32018L44993L60377L70515
35970h50534L70069L57847L36978L12214K86111K57936K25968J90052J51607J12266
35960A750514P4011M0632J7762R858J6337L0272M0692L6819J1880l4450r5114
35949A899213j56762k03258k20834k02594j50340p3514J3656R5846J60339J99593
$$ plain form
36019 -2184876 -1847561 -1576490 -1383604 -1273973 -1248782 -1306991 -1446649 -1665846 -1961848 -2328058
36009 -2328058 -2750521 -3206272 -3664355 -4089082 -4445407 -4706373 -4861033 -4919132 -4909317 -4871056
35999 -4871056 -4844164 -4860556 -4940610 -5093313 -5317486 -5602000 -5925136 -6255286 -6554798 -6786570
35989 -6786570 -6921052 -6941216 -6844176 -6639198 -6343101 -5975198 -5554210 -5098139 -4625784 -4157284
35979 -4157284 -3711694 -3301966 -2930348 -2587800 -2258437 -1926419 -1581426 -1221049 -850534
35970 -850534 -480465 -122618 214360 526574 812685 1070621 1296589 1486641 1638248 1750514
35960 1750514 1824525 1865157 1882919 1892777 1909114 1939386 1980078 2016897 2028777 1994327 1899213
35949 1899213 1742451 1539193 1318359 1115765 965425 891911 905567 1001413 1161752 1361345
35939A361345K11639J98733J66182J22325P8356M5995L3068L9471N6319O9282
35929B382715O5062L8406l909m5072o6194n5830j4812M6607J16685J89005K64025
35918B916688L45602M35937N32161O26081P06946P65873P99726Q12265Q12192
35909H753471Q09501Q12423Q26064Q52479Q91199R39639R93504J047603J097289
35900A7023172J139942J175685J206433J233539J254999J263246J243919J175921
35892B6716856J034246P97318M58083L3677m33266q84712j264958j537519j693393
35883B3226332j747824j728621j662966j569389j457067j329465j187953j033981
35875A1509066q71101p07315n55553m30111l40343k85935k57216k40158k22656
$$ plain form
35939 1361345 1572984 1771717 1937899 2060224 2138580 2184575 2217643 2257114 2313433 2382715
35929 2382715 2447777 2486183 2482274 2437202 2371008 2315178 2300366 2346973 2463658 2652663 2916688
35918 2916688 3262290 3698227 4230388 4856469 5563415 6329288 7129014 7941279 8753471
35909 8753471 9562972 10375395 11201459 12053938 12945137 13884776 14878280 15925883 17023172
35900 17023172 18163114 19338799 20545232 21778771 23033770 24297016 25540935 26716856
35892 26716856 27751102 28548420 29006503 29040180 28606914 27722202 26457244 24919725 23226332
35883 23226332 21478508 19749887 18086921 16517532 15060465 13731000 12543047 11509066
35875 11509066 10637965 9930650 9375097 8944986 8604643 8318708 8061492 7821334 7598678
35866G598678j98486j67623j33959j02921q0610p3932q9458j30142j92003k64280
35856F165264l33716l89934m28143m48368m52902m43817m21434l84495l32263
35847B530192k67083j94875j22857n6429K155N2581R3726J21236J27489J04904
35837B391039N0921k9360j25026k23382l12289l80300m17331m17456l81760l18400
35827a63344k40072j61080r5418n5072m7375p1870j18584j69672k04816k08327
35817a535630j74400j07812k0422P3597J60709K28716K67204K69584K35782J72996
35807d29676R3232R678o5656j22921j56056j65443j58765j47193j38091j29464
35797a410355j10940p1147o212P6497J61176K29900K68565K70991K41366J93997
$$ plain form
35866 7598678 7400192 7232569 7098610 6995689 6915079 6841147 6751689 6621547 6429544 6165264
35856 6165264 5831548 5441614 5013471 4565103 4112201 3668384 3246950 2862455 2530192
35847 2530192 2263109 2068234 1945377 1888948 1891103 1943684 2037410 2158646 2286135 2391039
35837 2391039 2441960 2412600 2287574 2064192 1751903 1371603 954272 536816 155056 -163344
35827 -163344 -403416 -564496 -659914 -714986 -762361 -834231 -952815 -1122487 -1327303 -1535630
35817 -1535630 -1710030 -1817842 -1838264 -1764667 -1603958 -1375242 -1108038 -838454 -602672 -429676
35807 -429676 -336444 -326766 -392422 -515343 -671399 -836842 -995607 -1142800 -1280891 -1410355
35797 -1410355 -1521295 -1592442 -1598654 -1522157 -1360981 -1131081 -862516 -591525 -350159 -156162
35787a56162J48596J22037J21106J40886J69173J93125K04108J98930J78293J44630
35777A464722J00992N1220rm8200r0012j22580j41479j39728j09775m7556M4061
35766I61656J54659K68705L69401M41970M75275M62391M01447K96627J57536m051
35756C985616j78181l57774n35759p01306q39609r36128r82230r78097r31522
35747b454990q54043p56765o47611n30802m08414k82816j58489m2239N7698J32883
35737e945588J76033J83304J57282J08785N4879J3099m714N112L9898R3885J60081
35726d957944K30832K98566L57002M01709M29586M37893M23646L83725L16253
35717a678732K23566J15318Q963p4031j14874j04237m6213M2137J35976K10576
$$ plain form
35787 -156162 -7566 114471 235577 376463 545636 738761 942869 1141799 1320092 1464722
35777 1464722 1565714 1616934 1616925 1568725 1478713 1356133 1214654 1074926 965151 917595 961656
35766 961656 1116315 1385020 1754421 2196391 2671666 3134057 3535504 3832131 3989667 3985616
35756 3985616 3807435 3449661 2913902 2212596 1372987 436859 -545371 -1523468 -2454990
35747 -2454990 -3309033 -4065798 -4713409 -5244211 -5652625 -5935441 -6093930 -6136169 -6078471 -5945588
35737 -5945588 -5769555 -5586251 -5428969 -5320184 -5265305 -5252206 -5256920 -5251808 -5211910 -5118025 -4957944
35726 -4957944 -4727112 -4428546 -4071544 -3669835 -3240249 -2802356 -2378710 -1994985 -1678732
35717 -1678732 -1455166 -1339848 -1330885 -1404916 -1519790 -1624027 -1670240 -1628103 -1492127 -1281551
35707a281551K48333K42401J96862J24708M4078k7084p6241r8745r6277p2938
35697g96454l2176K3523R0824J64219K37101L04177L62502M10117M44500M63311
35687A671644M66667M57881M41442M20246L94414L62032L20526K68071K05084
35678E008007J35555O7052Q434l4354o2019q1998j03826j32840j67072j99196
35668D437743k20890k25817k10306j73277j16516m4895L3995J10764J75695K20810
35658C987306K41734K37862K10807J62962R7872K1449n8533j35503k07396k76699
35648D281861l46658m16643m80462n28673n52760n48462n17331m67009m10334
35639A3529l62379l35339l33047l48650l67552l74469l60446l25949k79180k31732
$$ plain form
35707 -1281551 -1033218 -790817 -593955 -469247 -425169 -452253 -528494 -627239 -723516 -796454
35697 -796454 -828630 -805107 -714283 -550064 -312963 -8786 353716 763833 1208333 1671644
35687 1671644 2138311 2596192 3037634 3457880 3852294 4214326 4534852 4802923 5008007
35678 5008007 5143562 5210614 5219048 5184694 5122675 5040677 4936851 4804011 4636939 4437743
35668 4437743 4216853 3991036 3780730 3607453 3490937 3446042 3480037 3590801 3766496 3987306
35658 3987306 4229040 4466902 4677709 4840671 4938543 4959992 4901459 4765956 4558560 4281861
35648 4281861 3935203 3518560 3038098 2509425 1956665 1408203 890872 423863 13529
35639 13529 -348850 -684189 -1017236 -1365886 -1733438 -2107907 -2468353 -2794302 -3073482 -3305214
35629c305214j94269j73641j71863j86846k13980k47387k80664l08008l25855
35620e407727l33506l31605l19952k96984k61137k12162j51421q1935q488O3272
35610g341645J29138J88357K43683K99574L59697M24219M87752N40031N70255
35601d098939N72335N46858M98691M33584L57153K76327K00860J43092J15277
35592i54762J24912J70090K38201L10211L68669M04416M17865M15164M02895L85110
35582B282771L63601L39476L13663K85735K52569K08738J48990P1414k0699j19309
35572D126949k13761k93027l47137l68294l52706l02657k26932j38228m8834L2199
35562A867572R8386J42993J57906J36645P9833j465q7929j58774j99008k03441
$$ plain form
35629 -3305214 -3499483 -3673124 -3844987 -4031833 -4245813 -4493200 -4773864 -5081872 -5407727
35620 -5407727 -5741233 -6072838 -6392790 -6689774 -6950911 -7163073 -7314494 -7396429 -7404917 -7341645
35610 -7341645 -7212507 -7024150 -6780467 -6480893 -6121196 -5696977 -5209225 -4669194 -4098939
35601 -4098939 -3526604 -2979746 -2481055 -2047471 -1690318 -1413991 -1213131 -1070039 -954762
35592 -954762 -829850 -659760 -421559 -111348 257321 661737 1079602 1494766 1897661 2282771
35582 2282771 2646372 2985848 3299511 3585246 3837815 4046553 4195543 4266957 4246258 4126949
35572 4126949 3913188 3620161 3273024 2904730 2552024 2249367 2022435 1884207 1835373 1867572
35562 1867572 1965958 2108951 2266857 2403502 2483335 2481870 2393941 2235167 2036159 1832718
35552A832718j76257j27428o8295q703M3576Q2682J05843J15355J18318J22466
35542B040275J30879J40196J43927J37968J24155J09533J01832J03831J10468
35533C143064J11229R6459O3167J6589l2428p1907r3237r4872q3799p3021p5492
35522B905752r7929j38416j88776k39293k82518l14044l30412l26323k94606k30586
35512D62849j38435l3950N9822J21989J42402J25005Q5619M5716K4218L0138O0035
35501I85408J02130J43772J76559J96665K03054J96969J82501J65874J53074J47888
35491B653894J51776J64054J80605J91963J83755J40941N4084p5966k37415m10764
35481B996927n73800p05857p90515q17680p85980p04466n90978m66525l48441
$$ plain form
35552 1832718 1656461 1529033 1460738 1452035 1495611 1578293 1684136 1799491 1917809 2040275
35542 2040275 2171154 2311350 2455277 2593245 2717400 2826933 2928765 3032596 3143064
35533 3143064 3254293 3350752 3413919 3430508 3398080 3326173 3232936 3138064 3054265 2981244 2905752
35522 2905752 2807823 2669407 2480631 2241338 1958820 1644776 1314364 988041 693435 462849
35512 462849 324414 290464 350286 472275 614677 739682 825301 871017 895235 925373 985408
35501 985408 1087538 1231310 1407869 1604534 1807588 2004557 2187058 2352932 2506006 2653894
35491 2653894 2805670 2969724 3150329 3342292 3526047 3666988 3721072 3645106 3407691 2996927
35481 2996927 2423127 1717270 926755 109075 -676905 -1381371 -1972349 -2438874 -2787315
35472b787315k46286j62001r2702l3923J7778O3489J02414J33618J57432J75185
35462b672311J88009J96373K00784K02883K05855K13927K31283K60757L02589
35453f69851L53188M04120M42628M55044M32537L75635K94019K01636J10838K9530
35443B429324l7594q5746j08401r9461n8173P447Q1957J47882J91335K05248J90275
35432B864093J53957J07830O2786K5092m509k9123n3911q5390j30402j93332k72661
35421B444430l59694m40951n03109n37668n43369n25750m94263m58057m22480
35412a840911l88325l53862l17367k77754k33878j84668j30622p4472j9155L5571
35402c785443R4490J64436K49042L43864M35079N03368N31501N11320M45905L46053
$$ plain form
35472 -2787315 -3033601 -3195602 -3288304 -3322227 -3304449 -3240960 -3138546 -3004928 -2847496 -2672311
35462 -2672311 -2484302 -2287929 -2087145 -1884262 -1678407 -1464480 -1233197 -972440 -669851
35453 -669851 -316663 87457 530085 985129 1417666 1793301 2087320 2288956 2399794 2429324
35443 2429324 2391730 2305984 2197583 2098122 2039949 2047396 2129353 2277235 2468570 2673818 2864093
35432 2864093 3018050 3125880 3188666 3213758 3209249 3180126 3126215 3040825 2910423 2717091 2444430
35421 2444430 2084736 1643785 1140676 603008 59639 -466111 -960374 -1418431 -1840911
35412 -1840911 -2229236 -2583098 -2900465 -3178219 -3412097 -3596765 -3727387 -3801859 -3821014 -3785443
35402 -3785443 -3690953 -3526517 -3277475 -2933611 -2498532 -1995164 -1463663 -952343 -506438 -160385
35392a60385K24375R1511m3569j70889k77992l52030l84407l74803l32100k72013
35382b052302k12447j67838j44199j37497j36888j30790j11792p8094l2817J6816
35372c187848O0771Q9631R9579R5058Q5757P9125P4168O2179L4853o095m5783
35361b558605o3053m2970J4387R5162J80975K58428L22573L74491M16897M50951
35351e50764M74613M82416M66967M21915L45023K40239J18865k50r3120j37103
35341A768801j19858m5599O5957J87630K94570L70032M05527L98362L49879K65085
35331C940386J52262K1966j13554k40184l42329m05220m18846l81817l03372k02398
35321A706894j03244k9460K194j4347p3479j60052k54258l37368l95254m18673
$$ plain form
35392 -160385 63990 155501 111932 -58957 -336949 -688979 -1073386 -1448189 -1780289 -2052302
35382 -2052302 -2264749 -2432587 -2576786 -2714283 -2851171 -2981961 -3093753 -3171847 -3204664 -3187848
35372 -3187848 -3127077 -3037446 -2937867 -2842809 -2757052 -2677927 -2603759 -2541580 -2506727 -2512822 -2558605
35361 -2558605 -2621658 -2664628 -2650241 -2555079 -2374104 -2115676 -1793103 -1418612 -1001715 -550764
35351 -550764 -76151 406265 873232 1295147 1640170 1880409 1999274 1999024 1905904 1768801
35341 1768801 1648943 1603344 1669301 1856931 2151501 2521533 2927060 3325422 3675301 3940386
35331 3940386 4092648 4114614 4001060 3760876 3418547 3013327 2594481 2212664 1909292 1706894
35321 1706894 1603650 1574190 1576384 1562037 1488558 1328506 1074248 736880 341626 -77047
35311g7047m02659l47743k61635j57657m8953N7405J61976K69642L84566N06464
35301H4359O29385P43085Q36169Q99072R25152R09956Q50550P46294O00444M21080
35291G645546K20703J4555j82353l58954n10599o37866p41969q20515q67331q76220
35281B884997q44538p73531o66110n25396l55791j65629L1260K16852L72875M85440
35271F60429N48254N63494N40289M90870M25124L46124K50130J31613j0338j68759
35261C777230l29809m76146n91238o64380o95093o93612o75621o53741o31272
35252a633682o02171n56929m90148m04991l11925k23111j46377q2653k7822K3041
35242d456768P2677J21987J72228K25554K82306L37883L83350M10128M14806M00289
$$ plain form
35311 -77047 -479706 -827449 -1089084 -1246741 -1295694 -1238289 -1076313 -806671 -422105 84359
35301 84359 713744 1456829 2292998 3192070 4117222 5027178 5877728 6624022 7224466 7645546
35291 7645546 7866249 7880804 7698451 7339497 6828898 6191032 5449063 4628548 3761217 2884997
35281 2884997 2040459 1266928 600818 75422 -280369 -445998 -414738 -197886 174989 660429
35271 660429 1208683 1772177 2312466 2803336 3228460 3574584 3824714 3956327 3945989 3777230
35261 3777230 3447421 2971275 2380037 1715657 1020564 326952 -348669 -1002410 -1633682
35252 -1633682 -2235853 -2792782 -3282930 -3687921 -3999846 -4222957 -4369334 -4451987 -4479809 -4456768
35242 -4456768 -4384091 -4262104 -4089876 -3864322 -3582016 -3244133 -2860783 -2450655 -2035849 -1635560
35232a635560L73259L40813L08198K77947K49805K21155J87887J45801R2635L0098
35222E92038l5166r2604j30649j40847j21839q1180l3037P859L2692M1930M3961
35211H3158N0134O8608J00153J38247J73407J98506K11669K15890K16856K20347
35201A676975K29641K43785K57685K63882K54655K23623J67151Q5537j6814j32487
35191C253633k52382l66386m63957n35384n73125n72014n28813m42745l17497
35182g98670j63031M719J66690L04706M05041M60365M69607M36509L68194K74288
35172A928418J65837N3327n5336j55145k42625l14467l67571l99994m11269m01930
35162b00755l73133l27242k69387k08977j59486j34900j43547j83018k40129k96031
$$ plain form
35232 -1635560 -1262301 -921488 -613290 -335343 -85538 135617 323504 469305 561940 592038
35222 592038 556872 464268 333619 192772 70933 -10247 -43284 -35425 -2733 39197 83158
35211 83158 133292 201900 302053 440300 613707 812213 1023882 1239772 1456628 1676975
35201 1676975 1906616 2150401 2408086 2671968 2926623 3150246 3317397 3402934 3386120 3253633
35191 3253633 3001251 2634865 2170908 1635524 1062399 490385 -38428 -481173 -798670
35182 -798670 -961701 -956982 -790292 -485586 -80545 379820 849427 1285936 1654130 1928418
35172 1928418 2094255 2147582 2092246 1937101 1694476 1380009 1012438 612444 201175 -200755
35162 -200755 -573888 -901130 -1170517 -1379494 -1538980 -1673880 -1817427 -2000445 -2240574 -2536605
35152b536605l32438l35596k97951k19426j08205K1033J52175K73240L78425M65110
35142b540238N28891N61557N54234N03494M15521L05780J95042J04213M9210L6862
35132G14566O3316J16180J79349K37713K80043L00223K97689K76688K44073K06390
35122B916230J68121J31870R9875P4986N9856N4645N4915N1734L4335n763p0947
35111C569857j55384k45492l23518l73112l84270l55256k91323k02110r9304M911
35101A144999R8865J72120K16410K27648K08426J68836J23896Q8788P4753Q7108
35091B611849J24250J76920K29123K61931K58793K09534J12055k6971j91731l58741
35081C407012n01813n99491o41430o30248n78005m99736m08197l12072k16446
$$ plain form
35152 -2536605 -2869043 -3204639 -3502590 -3722016 -3830221 -3809188 -3657013 -3383773 -3005348 -2540238
35142 -2540238 -2011347 -1449790 -895556 -392062 23459 329239 524281 628494 677704 714566
35132 714566 777882 894062 1073411 1311124 1591167 1891390 2189079 2465767 2709840 2916230
35122 2916230 3084351 3216221 3316096 3391082 3450938 3505583 3560498 3612232 3646567 3640804 3569857
35111 3569857 3414473 3168981 2845463 2472351 2088081 1732825 1441502 1239392 1140088 1144999
35101 1144999 1243864 1415984 1632394 1860042 2068468 2237304 2361200 2449988 2524741 2611849
35091 2611849 2736099 2913019 3142142 3404073 3662866 3872400 3984455 3957484 3765753 3407012
35081 3407012 2905199 2305708 1664278 1034030 456025 -43711 -451908 -763980 -980426
35072i80426j22954k9557O7766J71008K76666L75870M57140N08929N21036M86542
35062A732020M04916K84314J40920m684j32358k26776k80396k94455k77722k43190
35052A102589k03813j69095j44300j32305j35861j57594j97181k48101k97191
35043e82852l28637l30792l01571k48677j84752j21725o8070k8600m048J0165
35033b189559K3610M7474Q9878J52469K29602L10233L81945M35447M66833M76723
35023D24655M68047M44417M08990L63157L05895K35085J49913N2399n2576j57544
35013B642438k52759l27655l73799l87682l71599l32473k79743k23351j72131
35004g8754j32602j07800r6175r1380q4194o6445l4974O690M9898Q4868J05168
$$ plain form
35072 -980426 -1103380 -1132937 -1065171 -894163 -617497 -241627 215513 724442 1245478 1732020
35062 1732020 2136936 2421250 2562170 2557486 2425128 2198352 1917956 1623501 1345779 1102589
35052 1102589 898776 729681 585381 453076 317215 159621 -37560 -285661 -582852
35043 -582852 -911489 -1242281 -1543852 -1792529 -1977281 -2099006 -2167076 -2195676 -2199724 -2189559
35033 -2189559 -2165949 -2118475 -2028597 -1876128 -1646526 -1336293 -954348 -518901 -52068 424655
35023 424655 892702 1337119 1746109 2109266 2415161 2650246 2800159 2852558 2799982 2642438
35013 2642438 2389679 2062024 1688225 1300543 928944 596471 316728 93377 -78754
35004 -78754 -211356 -319156 -415331 -506711 -590905 -657350 -692324 -685634 -635736 -550868 -445700
34993d45700J10284J04774R4388Q1749O4563L7524l696n9336j25280j94775k59764
34982e95269l11058l39306l38464l10032k64085k15523j78270j61234j67198j93456
34972c073895k32989k75911l10995l27002l14020k65268j79217o1083P7377K20264
34962d742739L51645M59578N38159N87056O09960O13280O04592N89822N70282
34953A81635N42269N00383M42302L71416K95949K26020J70720J36186J24639J34183
34943C125702J59388J92381K23870K44076K44402K20330J74340J16160N9018J3595
34933D773262j6814l7638o0575r8407j58921k40582l32530m18834m84398n19134
34923B405429n19209m86064m25080l45127k58613j79875j20328q2558n8416l3833
$$ plain form
34993 -445700 -335416 -230642 -136254 -54505 10058 47582 43886 -15450 -140730 -335505 -595269
34982 -595269 -906327 -1245633 -1584097 -1894129 -2158214 -2373737 -2552007 -2713241 -2880439 -3073895
34972 -3073895 -3306884 -3582795 -3893790 -4220792 -4534812 -4800080 -4979297 -5040380 -4963003 -4742739
34962 -4742739 -4391094 -3931516 -3393357 -2806301 -2196341 -1583061 -978469 -388647 181635
34953 181635 723904 1224287 1666589 2038005 2333954 2559974 2730694 2866880 2991519 3125702
34943 3125702 3285090 3477471 3701341 3945417 4189819 4410149 4584489 4700649 4759667 4773262
34933 4773262 4756448 4718810 4658235 4559828 4400907 4160325 3827795 3408961 2924563 2405429
34923 2405429 1886220 1400156 975076 629949 371336 191461 71133 -11425 -69841 -103674
34913a03674K712N4134J14259J71247K12019K26138K08722J61518R1906J1008
34903A149989o7653j29145j59190j47802r3000k149J10040K25522L26704L98859
34893A612175M31884M22213L74209K99346K12751J28636N6749R78m0003p0786
34883C428152r6993j23478j52732j83522k10900k28954k35071k31992k25577k20608
34873A518325k18502k17618k13955k01413j73255j25620o0493J4704R0438J58050
34863E70661K10677K43083K52016K36834J99115J41251O5388k5918j27978k32706
34853A532423l29004m04111m45429m43392l95924l12272k12095j18127m6465j173
34843a175569K3930L9107N3241P1280R3669J16372J31667J30783J08331O6266
$$ plain form
34913 -103674 -100962 -46828 67431 238678 450697 676835 885557 1047075 1138981 1149989
34903 1149989 1082336 953191 794001 646199 553199 551050 661090 886612 1213316 1612175
34893 1612175 2044059 2466272 2840481 3139827 3352578 3481214 3537963 3538941 3498938 3428152
34883 3428152 3331159 3207681 3054949 2871427 2660527 2431573 2196502 1964510 1738933 1518325
34873 1518325 1299823 1082205 868250 666837 493582 367962 307469 322173 412611 570661
34863 570661 781338 1024421 1276437 1513271 1712386 1853637 1919025 1893107 1765129 1532423
34853 1532423 1203419 799308 353879 -89513 -485437 -797709 -1009804 -1127931 -1174396 -1175569
34843 -1175569 -1151639 -1112532 -1059291 -988011 -894342 -777970 -646303 -515520 -407189 -340923
34833c40923J4047l5970p4996j01138j17559j28249j35721j41652j47974j55959
34823a366094j64029j66797j57006j29413q4302k8154K9344Q0073J20832J53281
34813a712265J81522K09834K41499K77829L16723L52015L75061L78188L57580
34804I77986L13925K51307J75947R5680J9464m4014q8746j13800j24100j28764
34794A334885j37492j57039j90098k36683k95781l64728m36647m99287n37820
34785a520690n40390n02585m28009l25289k03888p1022O8797K11275L48354M65881
34775b497566N45663N71638N36501M44882L11458J55748l396j51351k78566l79426
34765g44415m50675m90741m99971m80315m33697l60319k59511j33447R110J52466
$$ plain form
34833 -340923 -326876 -362846 -437842 -538980 -656539 -784788 -920509 -1062161 -1210135 -1366094
34823 -1366094 -1530123 -1696920 -1853926 -1983339 -2067641 -2095795 -2066451 -1986378 -1865546 -1712265
34813 -1712265 -1530743 -1320909 -1079410 -801581 -484858 -132843 242218 620406 977986
34804 977986 1291911 1543218 1719165 1814845 1834309 1790295 1701549 1587749 1463649 1334885
34794 1334885 1197393 1040354 850256 613573 317792 -46936 -483583 -982870 -1520690
34785 -1520690 -2061080 -2563665 -2991674 -3316963 -3520851 -3591873 -3523076 -3311801 -2963447 -2497566
34775 -2497566 -1951903 -1380265 -843764 -398882 -87424 68324 64928 -86423 -364989 -744415
34765 -744415 -1195090 -1685831 -2185802 -2666117 -3099814 -3460133 -3719644 -3853091 -3843981 -3691515
34755c691515K77258L64939M01341L79325L00763J77203K8260j21871k49062l34265
34745b467624l67904l51535k95259k12084j12908n110J05427K11488L03817L73148
34735b818544M13342M22982M04554L62672L03516K35379J68459J12445P3079N0413
34725b71703M0303L8118M1902N3140P5216J10949J59953K16140K66976K97090
34715A028084K96078K65309K17141J65996J18233O8985P425p4703j77495k92121
34705A622932m03125m91814n40378n36828m79449l78276k52557j25574j9552M8165
34695a556456O8006M0152k5512j11992j99244k68148l03705k97306k47538j59500
34685c061243m3549Q5863K12401L22319M09559M77344N33750N83562O22089O35493
$$ plain form
34755 -3691515 -3414257 -3049318 -2647977 -2268652 -1967889 -1790686 -1762426 -1884297 -2133359 -2467624
34745 -2467624 -2835528 -3187063 -3482322 -3694406 -3807314 -3812424 -3706997 -3495509 -3191692 -2818544
34735 -2818544 -2405202 -1982220 -1577666 -1214994 -911478 -676099 -507640 -395195 -322116 -271703
34725 -271703 -231400 -193282 -151380 -98240 -23024 87925 247878 464018 730994 1028084
34715 1028084 1324162 1589471 1806612 1972608 2090841 2159826 2167251 2092548 1915053 1622932
34705 1622932 1219807 727993 187615 -349213 -828662 -1206938 -1459495 -1585069 -1604621 -1556456
34695 -1556456 -1488450 -1448298 -1473810 -1585802 -1785046 -2053194 -2356899 -2654205 -2901743 -3061243
34685 -3061243 -3104792 -3018929 -2806528 -2484209 -2074650 -1597306 -1063556 -479994 142095 777588
34675G77588O07910N31022M09874K61442J07533l3104j49534k39665l08537l64427
34665A600102m13607m56117m85214m90987m65858m08902l27236k33821j42624
34656a824264o3502N5M8904Q4157J04906J09971J01703Q7844P9091Q4144J06094
34645a080897J42400J86871K31036K64563K77041K62357K23015J70279J19077
34636G95742Q1054O0369N3952N4694N5218N0656L9715K4290Q222m241j0466j1582
34624A197623j3136k2505m4227p7170j16417j58069k02435k52822l11355l75141
34614c75654m35086m77768m89639m61828l93521k92485j72902n1901N3989J31395
34604b965400J71070J67695J19972L2284q3391k08270l21784m08465m62164m85194
$$ plain form
34675 777588 1385498 1916520 2326394 2587836 2695369 2662265 2512731 2273066 1964529 1600102
34665 1600102 1186495 730378 245164 -245823 -711681 -1120583 -1447819 -1681640 -1824264
34656 -1824264 -1887766 -1887711 -1838807 -1754650 -1649744 -1539773 -1438070 -1350226 -1271135 -1186991 -1080897
34645 -1080897 -938497 -751626 -520590 -256027 21014 283371 506386 676665 795742
34636 795742 876796 937165 991117 1045811 1101029 1151685 1191400 1215690 1223912 1219671 1209205 1197623
34624 1197623 1184487 1161982 1117755 1040585 924168 766099 563664 310842 -513 -375654
34614 -375654 -810740 -1288508 -1778147 -2239975 -2633496 -2925981 -3098883 -3150784 -3096795 -2965400
34604 -2965400 -2794330 -2626635 -2506663 -2474379 -2557770 -2766040 -3087824 -3496289 -3958453 -4443647
34594d443647m83821m63702m27634l75475l05068k13501r9263L4510J77178L11024
34584f289399M16322M78698M93926M67315M09483L32571K48750J69514J03915
34575c168905N6381K6204R475K229L081J4216M0217Q4799J46961K19049K88665
34564b277628L43872L78721L95603M02785M08846M17800M28067M34908M33555
34555A366529M20895L95609L57931L09303K51957J88849J24088O2899J0209l1095
34545C457174n9962p4940p2603m9135l991N7869J27037J92773K45836K79887K91724
34534D391669K80989K49848K02940J46995Q9037L3094k2214q2578j53070k32440
34524D904270l10554l70686l95476l73554l04113j97837p4286M3223J33851J84760
$$ plain form
34594 -4443647 -4927468 -5391170 -5818804 -6194279 -6499347 -6712848 -6812111 -6777601 -6600423 -6289399
34584 -6289399 -5873077 -5394379 -4900453 -4433138 -4023655 -3691084 -3442334 -3272820 -3168905
34575 -3168905 -3112524 -3086320 -3076845 -3074616 -3071535 -3057319 -3017102 -2932303 -2785342 -2566293 -2277628
34564 -2277628 -1933756 -1555035 -1159432 -756647 -347801 69999 498066 932974 1366529
34555 1366529 1787424 2183033 2540964 2850267 3102224 3291073 3415161 3478060 3488269 3457174
34545 3457174 3397212 3322272 3249669 3200534 3196543 3254412 3381449 3574222 3820058 4099945 4391669
34534 4391669 4672658 4922506 5125446 5272441 5361478 5394572 5372358 5289780 5136710 4904270
34524 4904270 4593716 4223030 3827554 3454000 3149887 2952050 2877764 2920987 3054838 3239598
34514C239598J93737J67416J16288N0080k3517r7340j63554k14781k46627k59421
34504B761879k57830k48447k36373k22562k03871j76364j39760r9638o5686m7180
34494A064168m8401o6333r1805j13736j24186j21263j08282r0623p2808n6944
34484A69787m1999k3815K973M0790Q5257J25222J47737J44828J17335P3292K2362
34473H63769k9374q0380j29829j72510j97559j93103j53764q5412l823P1323J23076
34462A2414J41569J25733Q3144K8015k3242n8039p2578p2832p1206q1366j14131
34451a02519j75167k63561l71078m83165n82018o50337o74140o44825n61199m30779
34441d938788k68603r3550P5965K25162L44730M31089M84255N04036M88068M34476
$$ plain form
34514 3239598 3433335 3600751 3717039 3767119 3743602 3646262 3482708 3267927 3021300 2761879
34504 2761879 2504049 2255602 2019229 1796667 1592796 1416432 1276672 1177034 1111348 1064168
34494 1064168 1015767 949434 857629 743893 619707 498444 390162 299539 226731 169787
34484 169787 127788 103973 106946 147736 232993 358215 505952 650780 768115 841407 863769
34473 863769 834395 754015 624186 451676 254117 61014 -92750 -178162 -181985 -110662 12414
34462 12414 153983 279716 362860 390875 367633 309594 237016 164184 92978 11612 -102519
34451 -102519 -277686 -541247 -912325 -1395490 -1977508 -2627845 -3301985 -3946810 -4508009 -4938788
34441 -4938788 -5207391 -5300941 -5224976 -4999814 -4655084 -4223995 -3739740 -3235704 -2747636 -2313160
34431b313160L46974K37109J21108J4401p1975j31844j63073j66886j47301j10067
34421b384714o0917l404O2501J39133K26555L17348L95148M39275M33243L72313
34411f3519K66163J36166R594q6519j30839j12566l4866Q5372K22560L50210M47887
34400A089643N05178N22567N09490M79921M47234M20584M03189L91076L72378
34391E141260L29962K48892J25316k9308j91667l35113m38251m89905m89706m45459
34381C426021l69329k74750j74843q1985p880L6844M4202J1557n6294j47564k46578
34370B159401l37308m05701m41412m40284m06757l53126k93988k38592j86477
34361i44244j29645n9510K6268J21202K12348K85502L30399L43842L30240K99928
$$ plain form
34431 -2313160 -1966186 -1729077 -1607969 -1593568 -1665543 -1797387 -1960460 -2127346 -2274647 -2384714
34421 -2384714 -2445631 -2449035 -2386534 -2247401 -2020846 -1703498 -1308350 -869075 -435832 -63519
34411 -63519 202644 338810 348404 261885 131046 18480 -16386 68986 291546 641756 1089643
34400 1089643 1594821 2117388 2626878 3106799 3554033 3974617 4377806 4768882 5141260
34391 5141260 5471222 5720114 5845430 5816122 5624455 5289342 4851091 4361186 3871480 3426021
34381 3426021 3056692 2781942 2607099 2525114 2517234 2554078 2598280 2609837 2553543 2405979 2159401
34370 2159401 1822093 1416392 974980 534696 127939 -225187 -519175 -757767 -944244
34361 -944244 -1073889 -1133399 -1107131 -985929 -773581 -488079 -157680 186162 516402 816330
34351H16330K65779K38320K20786K07097J85220J44617Q2872P220o9140j32978
34341A966123j76054j97530k02961k00101j93994j84672j68891j44021j10761
34332C87138p3365l8582j5058j2675l9552r6125j69794k35923k67206k46911j77995
34321i86048q2970N094N5801N2917r11q7741j83093k64624l17335l35521l22492
34310b466923k88043k43675j97485j51595j03501m9875J0040P3460J35562J91500
34300c090535K37158K68658K82340K76278K52370K16797J78028J43352J16086
34291a119468R5192P7209N9187M0812K5009J7038K2206M2842P6209J14974J49842
34280c98948J72105J75234J56503J18925P1177K3767j6344m8119p4501r9021j23974
$$ plain form
34351 816330 1082109 1320429 1541215 1748312 1933532 2078149 2161021 2168241 2099101 1966123
34341 1966123 1790069 1592539 1389578 1189477 995483 810811 641920 497899 387138
34332 387138 313773 275191 260133 247458 207906 111781 -58013 -293936 -561142 -808053 -986048
34321 -986048 -1069018 -1063924 -1008123 -955206 -956117 -1043858 -1226951 -1491575 -1808910 -2144431 -2466923
34310 -2466923 -2754966 -2998641 -3196126 -3347721 -3451222 -3501097 -3491057 -3417597 -3282035 -3090535
34300 -3090535 -2853377 -2584719 -2302379 -2026101 -1773731 -1556934 -1378906 -1235554 -1119468
34291 -1119468 -1024276 -947067 -887880 -847068 -822059 -805021 -782815 -739973 -663764 -548790 -398948
34280 -398948 -226843 -51609 104894 223819 294996 318763 302419 254300 179799 80778 -43196
34269d3196j49654j72965j86343j79702j45825q5757r933O5782J26234J61526
34259f19833J68126J47180J01999L6806m2512j27116k05640k67060l03689l11758
34249a423497k89674k36640j53308m3367Q6116K25929L66371M98412O14374P08394
34239C53110P76640Q16940Q27890Q07907P55512O71503N61613M36931L10903J94913
34229F513862R5419J3721n2341j05754j47932j78288j96769k07109k17376k36883
34219E280550k72073l23941l87258m51103n01366n25747n19309m87047m41559
34210A371147l97173l63888l44221l34071l26330l14744k96394k72336k46570
34201a524580k23362k04109j86179j65167j38807j09037q0392n6288l6469j7647
$$ plain form
34269 -43196 -192850 -365815 -552158 -731860 -877685 -963442 -973375 -907593 -781359 -619833
34259 -619833 -451707 -304527 -202528 -165722 -208234 -335350 -540990 -808050 -1111739 -1423497
34249 -1423497 -1713171 -1949811 -2103119 -2146486 -2060370 -1834441 -1468070 -969658 -355284 353110
34239 353110 1129750 1946690 2774580 3582487 4337999 5009502 5571115 6008046 6318949 6513862
34229 6513862 6609281 6623002 6570661 6464907 6316975 6138687 5941918 5734809 5517433 5280550
34219 5280550 5008477 4684536 4297278 3846175 3344809 2819062 2299753 1812706 1371147
34210 1371147 973974 610086 265865 -68206 -394536 -709280 -1005674 -1278010 -1524580
34201 -1524580 -1747942 -1952051 -2138230 -2303397 -2442204 -2551241 -2631633 -2687921 -2724390 -2742037
34191b742037L202K5442M4069N2486M6839K8886N612j3927k2497j7195M83K6183
34179b562454N3928P6228Q4466P0998L2179l0008j08474j92383k68222l21481
34169c165223l40022l18184k59510j76532q7769j2643L4242M7376L1209k486l9132
34158d288674o5797p4303o2011k9836K1324R2616J85376K96279M13617N18409
34148b993000N90717O17830N99829N49528M87204M32949M00432L94184M10262
34139A489935M38685M66155M78668M64233M15824L33876K27066J10548K200q1813
34129D345377j30905j42872j24945r1989o1566m7581n5531q1271j13171j36558
34119C358988j39229j16221p1318j4266M4463R7746J42689J78837K05367K18877
$$ plain form
34191 -2742037 -2738835 -2713393 -2669324 -2616838 -2569999 -2541113 -2535501 -2549428 -2571925 -2589120 -2588637 -2562454
34179 -2562454 -2508526 -2432298 -2347832 -2276834 -2244655 -2274663 -2383137 -2575520 -2843742 -3165223
34169 -3165223 -3505245 -3823429 -4082939 -4259471 -4347240 -4359883 -4325641 -4278265 -4247056 -4249542 -4288674
34158 -4288674 -4354471 -4428774 -4490785 -4520621 -4499297 -4406681 -4221305 -3925026 -3511409 -2993000
34148 -2993000 -2402283 -1784453 -1184624 -635096 -147892 285057 685489 1079673 1489935
34139 1489935 1928620 2394775 2873443 3337676 3753500 4087376 4314442 4424990 4427190 4345377
34129 4345377 4214472 4071600 3946655 3854666 3793100 3745519 3689988 3608717 3495546 3358988
34119 3358988 3219759 3103538 3032220 3017954 3062417 3160163 3302852 3481689 3687056 3905933
34109C905933K13354J83427J29516O0771p303n9352q6312q7818p0768m5959k4436
34098D111053j4651k0875m2504p3859j05204j26411j32476j26899j19316j18804
34088C230054j28202j43739j59345j71795j83069j98470k21569k49407k72070
34079A502388k78056k61867k27985j88316j55220j35343j27919j27673j29421
34070a29412j30762j31500j31664j30907j29993j32051j41320j59949j85844k13498
34060a616900k36973k52274k57328k50169k27824j87730j30965o4234J826N7499
34050c165072R8875J29753J59805K00243K58807L35813M22716N04060N62238N83487
34040I0725N62808N05897M26967L43111K67813K07159J60313J22995R1373O4516
$$ plain form
34109 3905933 4119287 4302714 4432230 4493001 4485698 4426346 4340034 4252216 4181448 4135489 4111053
34098 4111053 4096402 4075527 4033023 3959164 3853960 3727549 3595073 3468174 3348858 3230054
34088 3230054 3101852 2958113 2798768 2626973 2443904 2245434 2023865 1774458 1502388
34079 1502388 1224332 962465 734480 546164 390944 255601 127682 9 -129412
34070 -129412 -260174 -391674 -523338 -654245 -784238 -916289 -1057609 -1217558 -1403402 -1616900
34060 -1616900 -1853873 -2106147 -2363475 -2613644 -2841468 -3029198 -3160163 -3224397 -3222571 -3165072
34050 -3165072 -3066197 -2936444 -2776639 -2576396 -2317589 -1981776 -1559060 -1055000 -492762 90725
34040 90725 653533 1159430 1586397 1929508 2197321 2404480 2564793 2687788 2779161 2843677
34030B843677M5216L9024N1178Q2401J26183J70288K02303K15728K12621K01021
34020D189640J88914J78606J65044J39212R4511L2194l7437r8782j37334j45323
34010D569245j23957q2042l2627J0439L5434L5209Q679l9672j02445j72455k44346
33999C861462l14321l79417m37618m88476n32849n71140o01224o17831o14129
33990f95543n84283n25526m39042l30211k08377q5662K5252J13456J71216J94619
33980b364101J84480J47402R5472M2992J185k6052m2052n2874o1881o7907o8476
33969b211812o5073o5573q1039j18376j73683k31181k69524k72104k34720j65555
33959c888640p8442J4667J06546J92212K64800L13965L28719L03671K45285J73798
$$ plain form
34030 2843677 2888893 2927917 2979095 3061496 3187679 3357967 3560270 3775998 3988619 4189640
34020 4189640 4378554 4557160 4722204 4861416 4955927 4988121 4950684 4851902 4714568 4569245
34010 4569245 4445288 4363246 4330619 4341058 4376492 4411701 4420380 4380708 4278263 4105808 3861462
33999 3861462 3547141 3167724 2730106 2241630 1708781 1137641 536417 -81414 -695543
33990 -695543 -1279826 -1805352 -2244394 -2574605 -2782982 -2868644 -2843392 -2729936 -2558720 -2364101
33980 -2364101 -2179621 -2032219 -1936747 -1893755 -1892570 -1918622 -1960674 -2013548 -2075429 -2143336 -2211812
33969 -2211812 -2276885 -2342458 -2423497 -2541873 -2715556 -2946737 -3216261 -3488365 -3723085 -3888640
33959 -3888640 -3967082 -3952415 -3845869 -3653657 -3388857 -3074892 -2746173 -2442502 -2197217 -2023419
33949b023419J18198J05856J51918K53492L90616N32858O48879P15941P26067
33940A620406O86619O15410N33267M57270L96670L51792L15717K78195K30315
33931E485661J68079R3613J4047o1415j25472j76009k16157k50450k80041l01411
33921D350445l09657l02430k80296k43942j92798j27905n6384P971N0005O0810
33911B955819M1705K248m5433r1889j33091j70431k08082k48223k86544l11595
$$ plain form
33949 -2023419 -1905221 -1799365 -1647447 -1393955 -1003339 -470481 178398 894339 1620406
33940 1620406 2307025 2922435 3455702 3912972 4309642 4661434 4977151 5255346 5485661
33931 5485661 5653740 5747353 5761400 5699985 5574513 5398504 5182347 4931897 4651856 4350445
33921 4350445 4040788 3738358 3458062 3214120 3021322 2893417 2837033 2845004 2895009 2955819
33911 2955819 2997524 2999772 2954339 2862450 2729359 2558928 2350846 2102623 1816079 1504484
$$ [...]
##END NTUPLES=NMR SPECTRUM
##END=
