##TITLE=31Pdec_B4f-4
 CDCl3, 64 sc
 28.6.2024
##JCAMPDX= 6.0         $$ Bruker NMR JCAMP-DX V2.0
##DATA TYPE= NMR SPECTRUM
##DATA CLASS= NTUPLES
##ORIGIN= UXNMR, Bruker Analytische Messtechnik GmbH
##OWNER= root
$$ XWIN-NMR		Version 3.5
$$ Fri Jun 28 13:59:26 2024 Russian Standard Time (UT+4h)  she@DPX200
##.OBSERVE FREQUENCY= 81.013821
##.OBSERVE NUCLEUS= ^31P
##.ACQUISITION MODE= SIMULTANEOUS
##.ACQUISITION SCHEME= undefined
##.AVERAGES= 64
##.DIGITISER RES= 17
##SPECTROMETER/DATA SYSTEM= spect
##.PULSE SEQUENCE= zgpg30
##.SOLVENT NAME= D2O
##.SHIFT REFERENCE= (INTERNAL, D2O, 0, 198.062)
##AUDIT TRAIL= $$ (NUMBER, WHEN, WHO, WHERE, WHAT)
$$ ##TITLE= Audit trail, XWIN-NMR		Version 3.5
$$ ##JCAMPDX= 5.01
$$ ##ORIGIN= Bruker BioSpin GmbH
$$ ##OWNER= she
$$ F:/spectra/data/she/nmr/P31/2/pdata/1/auditp.txt
$$ ##AUDIT TRAIL=  $$ (NUMBER, WHEN, WHO, WHERE, WHAT)
(   1,<2024-06-28 13:58:19.65 +0400>,<she>,<DPX200>,
      <continue with go, POWCHK disabled, PULCHK disabled
       configuration hash MD5:
       00 E9 B6 7A A2 85 ED C7 34 08 36 98 17 FE 4E 26
       data hash MD5: 32K
       9A A2 6A 81 77 A3 A2 2E A5 A7 D0 9B 19 19 CD BB>)
(   2,<2024-06-28 13:58:27.17 +0400>,<she>,<DPX200>,
      <Start of raw data processing
       efp BC_mod = 2 LB = 1.5 FT_mod = 6 PKNL = 1 PHC0 = 2821.33 PHC1 = 86.08627 SI = 64K 
       data hash MD5: 64K
       AA 92 ED 55 CF 24 80 68 DC 2D B6 9E 5C 53 70 5E>)
(   3,<2024-06-28 13:58:59.68 +0400>,<she>,<DPX200>,
      <pk PHC0 = -43.46991 PHC1 = 91.19999 
       data hash MD5: 64K
       72 AA 63 F1 14 F6 23 55 A6 CD 44 75 DA 5C E2 F1>)
$$ ##END=
$$ 
$$ hash MD5
$$ B6 A0 2F B4 F5 3C C1 C9 EB B7 17 36 1D 65 3D 0E
##$RELAX= 
##$RELAX= 
##$RELAX= 
##$RELAX= 
##$RELAX= 
##$RELAX= 
##$RELAX= 
##$RELAX= 
$$ Bruker specific parameters
$$ --------------------------
##$DU= <F:/spectra>
##$EXPNO= 2
##$NAME= <P31>
##$PROCNO= 1
##$TYPE= <nmr>
##$USER= <she>
##$AMP= (0..31)
100 100 100 100 100 100 100 100 100 100 100 100 100 100 100 100 100 100 
100 100 100 100 100 100 100 100 100 100 100 100 100 100 
##$AQSEQ= 0
##$AQ_mod= 1
##$AUNM= <au_zg>
##$AUTOPOS= <>
##$BF1= 81.014009
##$BF2= 200.13
##$BF3= 200.13
##$BF4= 200.13
##$BF5= 200.13
##$BF6= 200.13
##$BF7= 200.13
##$BF8= 200.13
##$BYTORDA= 1
##$CFDGTYP= 0
##$CFRGTYP= 5
##$CHEMSTR= <none>
##$CNST= (0..31)
1 1 145 1 1 1 1 1 1 1 1 1 1 1 1 1 1 1 1 1 1 1 1 1 1 1 1 1 1 1 1 1 
##$CPDPRG= <waltz16>
##$CPDPRG1= <>
##$CPDPRG2= <waltz16>
##$CPDPRG3= <>
##$CPDPRG4= <mlev>
##$CPDPRG5= <mlev>
##$CPDPRG6= <mlev>
##$CPDPRG7= <mlev>
##$CPDPRG8= <mlev>
##$CPDPRGB= <>
##$CPDPRGT= <>
##$D= (0..31)
0 1 0 0 0 0 0 0 0 0.06 0 0.03 2e-05 3e-06 0 0 0.0002 0 0 0 0 0 0 0 0 0 
0 0 0 0 0 0 
##$DATE= 1719568615
##$DBL= (0..7)
120 120 120 11 120 120 24 19 
##$DBP= (0..7)
150 150 150 150 150 150 150 150 
##$DBP07= 0
##$DBPNAM0= <>
##$DBPNAM1= <>
##$DBPNAM2= <>
##$DBPNAM3= <>
##$DBPNAM4= <>
##$DBPNAM5= <>
##$DBPNAM6= <>
##$DBPNAM7= <>
##$DBPOAL= (0..7)
0.5 0.5 0.5 0.5 0.5 0.5 0.5 0.5 
##$DBPOFFS= (0..7)
$$ [...]
##$SUBNAM2= <"">
##$SUBNAM3= <"">
##$SUBNAM4= <"">
##$SUBNAM5= <"">
##$SUBNAM6= <"">
##$SUBNAM7= <"">
##$SUBNAM8= <"">
##$SUBNAM9= <"">
##$SW= 400.765351723535
##$SWIBOX= (0..15)
0 1 3 0 0 0 0 0 0 0 0 0 0 0 0 0 
##$SW_h= 32467.5324675325
##$TD= 32768
##$TD0= 1
##$TE= 0
##$TE2= 300
##$TE3= 300
##$TEG= 300
##$TL= (0..7)
0 120 53 12 22 120 120 120 
##$TP= (0..7)
150 150 150 150 150 150 150 150 
##$TP07= 0
##$TPNAME0= <>
##$TPNAME1= <>
##$TPNAME2= <>
##$TPNAME3= <>
##$TPNAME4= <>
##$TPNAME5= <>
##$TPNAME6= <>
##$TPNAME7= <>
##$TPOAL= (0..7)
0.5 0.5 0.5 0.5 0.5 0.5 0.5 0.5 
##$TPOFFS= (0..7)
0 0 0 0 0 0 0 0 
##$TUNHIN= 0
##$TUNHOUT= 0
##$TUNXOUT= 0
##$USERA1= <user>
##$USERA2= <user>
##$USERA3= <user>
##$USERA4= <user>
##$USERA5= <user>
##$V9= 5
##$VALIST= <valist>
##$VCLIST= <CCCCCCCCCCCCCCC>
##$VD= 0
##$VDLIST= <DDDDDDDDDDDDDDD>
##$VPLIST= <PPPPPPPPPPPPPPP>
##$VTLIST= <TTTTTTTTTTTTTTT>
##$WBST= 1024
##$WBSW= 4
##$XGAIN= (0..3)
0 0 0 0 
##$XL= 0
##$YL= 0
##$YMAX_a= 4734
##$YMIN_a= -4973
##$ZGOPTNS= <>
##$ZL1= 120
##$ZL2= 120
##$ZL3= 120
##$ZL4= 120
##$ABSF1= 0
##$ABSF2= 0
##$ABSG= 0
##$ABSL= 0
##$ALPHA= 0
##$AQORDER= 0
##$ASSFAC= 0
##$ASSFACI= 0
##$ASSFACX= 0
##$ASSWID= 0
##$AUNMP= <proc_1d>
##$AZFE= 0.1
##$AZFW= 0.5
##$BCFW= 0
##$BC_mod= 2
##$BYTORDP= 0
##$COROFFS= 0
##$CY= -3
##$DATMOD= 1
##$DC= 0
##$DFILT= <>
##$DTYPP= 0
##$F1P= 0
##$F2P= 0
##$FCOR= 1
##$FTSIZE= 65536
##$FT_mod= 6
##$GAMMA= 0
##$GB= 0
##$INTBC= 1
##$INTSCL= 9.790993e-09
##$ISEN= 30
##$LB= 1.5
##$LEV0= 0
##$LPBIN= 0
##$MAXI= 10000
##$MC2= 0
##$MEAN= 0
##$ME_mod= 0
##$MI= 50
##$NCOEF= 0
##$NC_proc= -9
##$NLEV= 6
##$NOISF1= 182.463
##$NOISF2= 159.3651
##$NSP= 0
##$NTH_PI= 0
##$NZP= 0
##$OFFSET= 198.0616
##$PC= 4
##$PHC0= 2777.86
##$PHC1= 177.2863
##$PH_mod= 1
##$PKNL= yes
##$PPARMOD= 0
##$PSCAL= 0
##$PSIGN= 0
##$REVERSE= no
##$SF= 81.0140089999434
##$SI= 65536
##$SIGF1= 159.3651
##$SIGF2= -187.1042
##$SINO= 113.3802
##$SIOLD= 16384
##$SREGLST= <1H.CDCl3>
##$SSB= 0
##$STSI= 65536
##$STSR= 0
##$SW_p= 32467.5324675325
##$SYMM= 0
##$S_DEV= 0
##$TDeff= 32768
##$TDoff= 0
##$TI= <>
##$TILT= no
##$TM1= 0
##$TM2= 0
##$TOPLEV= 0
##$USERP1= <user>
##$USERP2= <user>
##$USERP3= <user>
##$USERP4= <user>
##$USERP5= <user>
##$WDW= 1
##$XDIM= 65536
##$YMAX_p= 381625621
##$YMIN_p= -305108706
$$ End of Bruker specific parameters
$$ ---------------------------------
##NTUPLES= NMR SPECTRUM
##VAR_NAME=  FREQUENCY,     SPECTRUM/REAL,   SPECTRUM/IMAG
##SYMBOL=    X,             R,               I
##VAR_TYPE=  INDEPENDENT,   DEPENDENT,       DEPENDENT
##VAR_FORM=  AFFN,          ASDF,            ASDF
##VAR_DIM=   65536,         65536,           65536
##UNITS=     HZ,            ARBITRARY UNITS, ARBITRARY UNITS
##FACTOR=    0.49542278885378, 1,            1
##FIRST=     16045.7642231865, 0,            0
##LAST=      -16421.768244346, 0,            0
##MIN=       -16421.768244346, -305108706,   0
##MAX=       16045.7642231865, 381625621,    0
$$ Real data points
##PAGE= N=1
##DATA TABLE= (X++(R..R)), XYDATA
$$ [...]
43543 -1134397 -1278690 -6150404 -11183131 -12502175 -11370859 -10296627 -9012922 -5787173
43535 -5787173 -326043 5531620 8878254 7833457 3831105 1102878 2568189 6921121
43527 6921121 10554108 10896046 7037661 -381548 -7746073 -9259716 -2557559 7211289
43519 7211289 11725854 7920347 468356 -3385789 125911 9016387 16879950 17438518
43511 17438518 10324354 1866541 -1968469 -2387802 -4895825 -10745838 -14992834 -13110393
43503 -13110393 -5837338 3388896 12131858 18188949 18340129 11257853 822300 -5981226
43495 -5981226 -4922315 2292926 10142468 13924270 12831767 9130982 4605914 -1102565
43487 -1102565 -7613944 -10986707 -7050334 2400671 10198989 11736791 9076869 5557404
43479 5557404 247269 -8580212 -17382362 -19956626 -15560274 -9794708 -6864642 -5183332
43471 -5183332 -2103834 866486 305937 -4001249 -8783512 -10780342 -8717345 -3453353
43463 -3453353 1684241 2160218 -3524708 -11363794 -15753020 -15511666 -14167659 -14763702 -16511093
43454 -16511093 -16612931 -13625783 -8757801 -4879143 -3933056 -4590709 -3777699 -1590873 -2133425
43445 -2133425 -6858887 -10130175 -6338428 450619 557786 -7461392 -14147993 -12444581
43437 -12444581 -6678376 -4344177 -5420407 -5553579 -4454453 -3998089 -1830770 5205914
43429 5205914 13477164 16374472 14661440 14905024 17754410 16511437 8948122 1881766
43421 1881766 508090 901152 -2084186 -6041338 -5935358 -2688662 -716549 -606844 -214082
43412 -214082 -288746 -3237178 -8038046 -11472699 -13056902 -14385534 -15154059 -14085921 -12207749
43403 -12207749 -11110742 -9820212 -7467748 -6492339 -8179606 -7805211 -735602 8502662
43395 8502662 10809292 5756310 2239990 4601771 6055818 -619821 -12391516 -20565880
43387 -20565880 -21457459 -17982599 -13961157 -11004594 -8878996 -5746145 91343 6423246
43379 6423246 7545271 790613 -9709232 -17827246 -21252772 -20531434 -16037812 -9379486
43371 -9379486 -4808827 -5049265 -7492716 -8163368 -7604357 -8866715 -11278794 -10993519 -7453091
43362 -7453091 -4775511 -5890206 -9068998 -11602566 -13545638 -15567514 -15490386 -10129308
43354 -10129308 -309474 8330664 10581999 6717001 1260776 -2537885 -5083626 -7126765
43346 -7126765 -6930771 -2997869 2481195 6351989 9560508 15386905 22777345 26060202
43338 26060202 22478935 15721850 10152539 5716315 1044612 -2554739 -3824603 -5058246
43330 -5058246 -8867565 -13577351 -15414020 -13571977 -9999133 -5974008 -2011444 505262
43322 505262 516966 -1430022 -5188743 -11608875 -18700209 -20983239 -16550428 -11205222 -10867921
43313 -10867921 -13255811 -12577145 -9131129 -7437693 -7351615 -4955252 -1274301 -1864978 -7170742
43304 -7170742 -11001685 -10003373 -7392181 -5430639 -1461507 5658661 11675790 12881672
43296 12881672 10486528 6331138 106115 -6128619 -6944323 -1289100 4061208 2913201
43288 2913201 -3340133 -10515522 -17374851 -22125142 -19749767 -9280212 1287867 3927103
43280 3927103 297135 -3320519 -5615926 -7611001 -5853054 2182732 9372397 6151929
43272 6151929 -4761002 -10899655 -7221741 -876356 2007073 3967113 7884194 10752131
43264 10752131 10428987 10552482 13433657 14845869 11481686 7710118 8910403 12934831
43256 12934831 14444590 13950540 16156721 21681126 26125798 25908342 20479169 10554249
43248 10554249 -1312115 -9932668 -11674759 -8516579 -4740711 -1677969 705952 80681
43240 80681 -4955852 -9818481 -8252907 -1133543 4669439 5868994 5213650 4089431 -478357
43231 -478357 -8982796 -15507294 -14601473 -8133114 -1580967 3134390 6997260 8656175
43223 8656175 4843529 -4121441 -12882662 -15975147 -12463249 -5649690 70147 1788352
43215 1788352 -898979 -6156841 -10785311 -11144150 -4968168 5523826 12887470 10154577
43207 10154577 -1327421 -12282885 -15517637 -13190679 -11874915 -12981422 -11955828 -5798841
43199 -5798841 3060737 10895311 16622487 19854363 18520988 11933663 4821871 4577237
43191 4577237 13454673 25364985 31556604 28570406 19803802 10433340 2812556 -2898596
43183 -2898596 -5792108 -4293439 805914 5336675 5104181 -39016 -5911480 -7462112
43175 -7462112 -2583962 6404306 14381739 17200386 14615809 9489698 4560796 1073619
43167 1073619 -48119 1636589 3820525 2064846 -5081883 -13395115 -17722458 -17682041
43159 -17682041 -15986902 -13248026 -8662042 -4656836 -5398160 -9862706 -11542417 -7121076
43151 -7121076 -826129 2676091 5073218 9731112 14038664 12387522 5130503 -1450762
43143 -1450762 -4055889 -5614037 -8537551 -10065780 -7018483 -1253890 2833429 3642560
43135 3642560 2262158 -724103 -5015828 -8498320 -8672953 -5924869 -2851421 -539757
43127 -539757 2055145 4950246 5969113 3842194 620144 -727815 -480989 -2314307
43119 -2314307 -8725105 -17079676 -21485160 -19200361 -14183712 -12617120 -15162910 -16069912
43111 -16069912 -10967726 -3045752 989340 -573686 -3453081 -4495254 -5726997 -9691615
43103 -9691615 -14121775 -14572202 -10925272 -7829125 -8527382 -11010792 -11190561 -7821153 -3116221
43094 -3116221 -171567 -1105892 -6090096 -12204226 -14368600 -9916334 -2116293 2899305
43086 2899305 2531990 -1202471 -6523273 -13912261 -21782832 -24116733 -16487694 -2885191
43078 -2885191 7458570 9914111 7864825 6224259 5296326 2726111 -1314103 -3759385
43070 -3759385 -2833478 -711261 -1646396 -7770901 -16566635 -22650966 -22721091 -18558235 -14498774
43061 -14498774 -12631821 -11712545 -9984612 -7107282 -3596791 -412341 897768 -500574
43053 -500574 -3345549 -5815461 -7589268 -8113108 -4392762 5336485 16305394 20750398
43045 20750398 17706294 14099027 14262820 13969445 8338878 497465 -2791307 -603834
43037 -603834 2417099 3453192 3426368 3158011 2670668 3475142 7177510 12516599 17356890
43028 17356890 21898091 25889456 25405306 18380827 11357495 13166223 21999961 26556368
43020 26556368 21457012 13737574 11009558 10854769 7416688 2605008 3491963 11043172
43012 11043172 17850663 17052360 9417724 1264794 -2111813 -739008 1059677 239347
43004 239347 -759608 2399794 8458898 10741040 5982834 -1541427 -6973472 -11020122
42996 -11020122 -15341714 -16500029 -10388634 -80440 6926507 8523949 9657319 14089953
42988 14089953 19323728 20803720 17665232 13122729 11286744 13631532 16559806 13435278
42980 13435278 2069573 -10586276 -14839305 -9204115 -1458825 1099195 -1630200 -6030103
42972 -6030103 -10111199 -12910889 -12369742 -7751695 -2770389 -2888246 -9309364 -17729523
42964 -17729523 -23549807 -26765177 -30341552 -34287259 -33687973 -24685757 -11254921 -2353654
42956 -2353654 -1285880 -1525919 4261742 14229857 20332255 19097232 14493988 10782576
42948 10782576 7727043 3893330 223421 -1837442 -2863609 -4161771 -5891828 -7598270
42940 -7598270 -8801035 -8536716 -6404890 -4185294 -3667351 -2723593 2846128 12514878 19752161
42931 19752161 19419932 13339857 6626354 1741997 -1451959 -3019843 -3525486 -4778521
42923 -4778521 -6910182 -7140014 -4713153 -4206227 -9309025 -15423833 -14241479 -5304549
42915 -5304549 2814617 3851972 739478 -1043837 -1423423 -2756493 -3228412 609723
42907 609723 6264987 6555880 -533641 -8201279 -9260987 -4532183 -49923 1150186
42899 1150186 920638 1391201 2230207 2181664 404634 -3559862 -8600006 -11309415 -9526586
42890 -9526586 -6338482 -6968429 -11438060 -14344598 -12783507 -10005766 -9485651 -10250134 -11037335
42881 -11037335 -13961929 -19218262 -20444375 -11945135 1620309 9408414 7640580 2683569
42873 2683569 1000895 2149894 2750005 1682305 -632625 -3567123 -5191435 -4037866
42865 -4037866 -3082268 -6972978 -13633105 -14315720 -5240260 5908078 9288361 4612005
42857 4612005 -983827 -3231743 -3486470 -3141547 -796628 4705781 11705822 16407672
42849 16407672 14676501 4969413 -8047253 -14801273 -9320107 3995569 14370267 14604796
42841 14604796 5565965 -6770284 -15587763 -16361212 -9783098 -1623170 2844398 4020153
42833 4020153 5842242 9766485 13358862 13935333 11160886 6770219 3757897 4742565
42825 4742565 8960887 12042279 10891411 7451464 5542575 5781402 6191704 5982567 5714951
42816 5714951 5305995 4849145 5723170 7786867 7501178 2610316 -3141507 -4240141 -923903
42807 -923903 2022605 2829968 4150551 7372943 10488740 11864848 11710752 9561015 4625087
42798 4625087 -1060469 -4022388 -4075150 -3573066 -2460955 719574 3051797 -1057957 -10835526
42789 -10835526 -17969795 -17298855 -13423189 -13468958 -17966424 -22523539 -24365612 -23021811
42781 -23021811 -17745188 -8796338 260177 5020339 4288384 -20987 -5353735 -9495777
42773 -9495777 -11377869 -12618169 -16227616 -22424421 -27776517 -29332818 -27331207 -23721244
42765 -23721244 -21096052 -22597356 -28244179 -31484175 -25416722 -13309853 -5989671 -6823031
42757 -6823031 -7181654 -483623 7634486 9072293 5538960 3443099 2870658 327540
42749 327540 -2583593 -2473392 -2150059 -5693054 -8877504 -4960569 2223881 2281543 -5216832
42740 -5216832 -9820719 -6815462 -3048370 -3432033 -3341130 436602 1750035 -4812080 -14187021
42731 -14187021 -18717761 -19046122 -19686788 -19682510 -15773725 -10343713 -7974304 -7215694 -3607194
42722 -3607194 1393853 2151468 -1833272 -5571629 -6888014 -8168321 -9852898 -8990530
42714 -8990530 -5391077 -3197127 -4385968 -5528660 -3083306 1934587 6341007 8469555
42706 8469555 7854423 4295826 -946748 -5251777 -7368500 -8587588 -10705114 -14192805
42698 -14192805 -17905327 -18847869 -13732058 -3828154 3320756 1456133 -5976174 -10095761
42690 -10095761 -8815832 -8163104 -10235280 -7929398 3308786 14923065 14366957 2280674
42682 2280674 -7230448 -4042250 6540371 12178332 8743590 3107819 2414817 4929946
42674 4929946 3503397 -3782095 -10137594 -8755750 -1901969 2656160 2756560 3623024
42666 3623024 7753696 9595126 4153606 -4533911 -9368926 -10831159 -14611676 -20592666
42658 -20592666 -22106081 -16801323 -10963580 -10426453 -12997559 -13272213 -10258946 -6328644
42650 -6328644 -2244564 2487991 6649683 8587379 9055007 9722307 10267887 9732374 9239142
42641 9239142 10489321 12898875 14952408 16737887 17977740 15451352 6902600 -3164111
42633 -3164111 -6667553 -2098256 2739672 333444 -7346023 -12045391 -9663822 -4384324
42625 -4384324 -2684917 -5629988 -8086514 -4696299 4484703 14513618 20728675 22065081
42617 22065081 19720519 15149965 10596232 9031064 10813150 11772044 7563938 -709505
42609 -709505 -7981441 -11712695 -13726670 -15648083 -16111860 -13728761 -10101421 -8221055
42601 -8221055 -9328416 -12138568 -13750617 -11148096 -3714581 5396344 12074691 15199900
42593 15199900 15814463 13556187 7792973 2167573 3041063 11391509 20176058 22413462
42585 22413462 18941826 15659570 15867747 18193632 19858909 19011321 15116509 9229335
42577 9229335 2884787 -4098636 -12504072 -19853146 -21423988 -16833544 -11450792 -8698650
42569 -8698650 -5474145 1147226 7448854 8663286 7136990 8479547 12171535 12826752
42561 12826752 9216188 5009384 1328065 -4001398 -9464135 -9867562 -5295030 -2950725
42553 -2950725 -6896060 -12084354 -12490588 -9783530 -9121514 -10409600 -9056854 -3271371
42545 -3271371 3853669 8399144 8605155 5073798 664581 -1083160 374860 1953610
42537 1953610 1734574 2103465 5658301 10283156 11530717 8477062 4087083 749469
42529 749469 -1472228 -2593906 -1703896 1181576 3879038 3195220 -2842045 -12866634
42521 -12866634 -21786119 -24379308 -20665120 -16100885 -15094312 -16190008 -15274465 -11219648
42513 -11219648 -5818904 -146113 5604213 9544756 8812590 3264111 -3738922 -8540469
42505 -8540469 -9787667 -8281985 -5968451 -4707072 -4344737 -2315346 3199634 9984823
42497 9984823 13338636 11014998 5517277 1611848 2448879 7667660 14137599 18453701
42489 18453701 19096612 16187245 10063419 1780363 -5606468 -9183013 -10058871 -12074698
42481 -12074698 -15911448 -18231084 -18077572 -19438358 -24275627 -27484597 -23541493 -14780665
42473 -14780665 -7643579 -3350574 1551324 7158817 9756544 9197411 9721685 12094662
42465 12094662 11392744 5150555 -1735251 -3335987 393379 5757213 10146139 11906281
42457 11906281 9908839 7054922 10163449 21597924 33839214 37254537 31303618 23408737
42449 23408737 18620200 15905501 13805228 13462238 14656079 14215363 11204274 9725501
42441 9725501 13110451 18088891 18680137 14481982 11043416 12072282 15200510 16818285
42433 16818285 17539683 19682094 21363492 17628809 8136379 -155712 -646357 4750996
42425 4750996 8397358 7048168 5452928 8757084 14401514 14635488 6555130 -3067630
42417 -3067630 -4432460 4668599 16447693 21539764 18221277 12033816 7926930 5806448
42409 5806448 3619862 923583 -2393997 -7533968 -13892309 -17298215 -14949310 -10514047
42401 -10514047 -10126526 -13909047 -15656162 -11165941 -3054390 3334999 5243841 2952278
42393 2952278 -1406278 -4087566 -2013593 3489262 7657855 7988460 6238933 4112094
42385 4112094 673277 -4376185 -8611705 -10412431 -11388439 -12931368 -13463337 -11646136
42377 -11646136 -9247508 -8163212 -7799867 -8195664 -11842084 -18487003 -22005701 -17733586
42369 -17733586 -9956920 -6132939 -5870341 -2528243 5137666 10378259 8448889 2351047
42361 2351047 -3497805 -9005566 -14719484 -18142663 -17978241 -17496983 -19014953 -18859881 -13196865
42352 -13196865 -5912542 -4349492 -8296523 -9626645 -3585022 5362377 10955152 13148289
42344 13148289 15015038 15644198 11539081 3869685 -1045798 102759 2658775 -369598
42336 -369598 -9698222 -19148149 -22596681 -19407345 -13467420 -8949142 -7175272 -6064098
42328 -6064098 -2408118 4102604 9306143 8563562 2149302 -5234998 -10116699 -12740214
42320 -12740214 -13521049 -10520836 -2668399 6927472 13531584 15245082 12944448 7707118
42312 7707118 1009539 -4130114 -5646123 -5636509 -8208888 -14217196 -20425375 -23463896 -22298852
42303 -22298852 -17471722 -10640567 -4498765 -530870 2662893 6323764 8144123 5445379
42295 5445379 371663 -2811761 -4704829 -9088529 -14179661 -12970457 -4721775 1392603
42287 1392603 -1010058 -5568908 -2543795 6581332 11412919 6624565 -4004179 -15460784
42279 -15460784 -24968308 -28048707 -20253067 -5290860 5811444 6743944 1213496 -5802245
42271 -5802245 -14419181 -23345325 -25100437 -15378717 -2011763 3729610 1698585 613908
42263 613908 3549032 4988178 2363097 1003713 4758760 9664123 11228190 11541585
42255 11541585 14006710 16109567 13200566 5977821 -1310911 -7480058 -13788733 -18776843
42247 -18776843 -19520150 -17256476 -16328152 -17302830 -15791018 -8730525 2053084 12996932
42239 12996932 21719498 26320945 25754858 22179937 19848146 20508114 22225702 22785580
42231 22785580 21324425 16979763 9858641 3397203 1316554 1765502 -630092 -6036833
42223 -6036833 -8355034 -4724796 -117444 615035 -651013 -859709 -2159574 -6928060
42215 -6928060 -11041839 -8942242 -2467924 1951000 2576888 2125988 270697 -5780215
42207 -5780215 -13337170 -14512426 -6259109 5716381 14776247 19791648 22055727 21130922
42199 21130922 16674077 10596496 4830296 -387075 -4683701 -6927915 -7223099 -6434877
42191 -6434877 -3704048 1488747 4916855 882745 -8861915 -15243771 -13173966 -7246020
42183 -7246020 -3526365 -1647142 903793 2341408 187995 -2695376 -1889788 978111
42175 978111 -45774 -7078146 -16433673 -23797861 -27453147 -27320008 -24357664 -20380794
42167 -20380794 -16202026 -11407559 -7488570 -7696590 -10999972 -10624267 -3356766 3629745
42159 3629745 1344428 -8455960 -15826429 -15649626 -11089549 -5651238 146462 4270277
42151 4270277 3740239 1322269 3797865 10765371 12510528 3058143 -10981418 -19250621
42143 -19250621 -19820072 -17346719 -14002842 -8754224 -2840249 446127 664083 232242
42135 232242 309769 579241 1908688 4899655 6500246 2615407 -5498732 -11234373 -9993820
42126 -9993820 -3920071 1207796 1397061 -3447256 -10205499 -14644536 -14848899 -13018712
42118 -13018712 -12203721 -11613941 -7819098 -753453 4776703 5158890 2961996 3428174 7310516
42109 7310516 9746211 6296086 -1626302 -8062747 -8575692 -4312136 112101 2171079
42101 2171079 3560776 6266238 8413907 6642640 2018901 -48086 2683058 5051436
42093 5051436 1054569 -7106995 -10785070 -5849714 2220947 5937424 4864638 3895220
42085 3895220 5054457 5562676 3439849 293240 -2795315 -8155692 -17493360 -27339274
42077 -27339274 -31597371 -27806244 -18857115 -9420128 -2574227 912878 2113163 2699025
42069 2699025 3149810 2856686 2439908 3793785 6429302 6552327 2415711 -2182755 -3513115
42060 -3513115 -4432626 -9951949 -17636562 -18893806 -10740391 -527019 3118646 -677798
42052 -677798 -7063226 -11676543 -12190542 -8273448 -3433115 -3025923 -7062756 -8812393 -4050314
42043 -4050314 2532243 4503326 2991073 3172740 5052830 4557386 1696252 508994
42035 508994 1658813 1876038 671929 945457 2567399 2262411 896446 3597752 10451376
42026 10451376 14394527 11863065 8568034 9956091 12375695 9869584 4367622 1774258
42018 1774258 1715297 -823561 -5700505 -7534641 -5048787 -2984098 -3906875 -5050161 -4921778
42009 -4921778 -6375599 -10333062 -12405614 -9456344 -4542174 -1319283 1775438 6779475
42001 6779475 9733225 5474890 -3122280 -7561136 -5418681 -3292951 -6365755 -10670338
41993 -10670338 -9379452 -3041537 1002991 -1922287 -8884574 -14018672 -15191775 -14827941
41985 -14827941 -15745832 -17674865 -17670000 -13229775 -4875653 4066978 10041366 11772111 10771834
41976 10771834 9752816 10218651 11099826 9878216 5333464 -1251661 -7854397 -13477118
41968 -13477118 -16991646 -15585480 -7027223 6391021 18672532 25803234 28724846 29952314
41960 29952314 29754070 27289409 23156300 18437770 13131150 8307725 8035374 15174901
41952 15174901 25602613 30593793 25929124 15672731 6157079 -359074 -4410965 -5320458
41944 -5320458 -2140087 2727525 4412525 874948 -4184986 -4448278 2968820 14029579
41936 14029579 20421168 17121017 7819303 1291448 1873331 5572838 6444187 3903330
41928 3903330 1362445 64429 -2019371 -5878830 -9429057 -10200115 -7942018 -4462977
41920 -4462977 -2541018 -4452684 -9552567 -13891138 -14350571 -12225404 -10133153 -6917665
41912 -6917665 18115 7758372 8836502 1082248 -8148407 -10540573 -5906865 422449
41904 422449 5506427 9697816 12553459 13270057 13934761 16973238 19605280 16336400 8062222
41895 8062222 3496005 8912624 20284623 28484932 29190681 24475380 17327220 8836291
41887 8836291 -24126 -7399462 -11617300 -11402515 -6061031 1986757 6091305 818476
41879 818476 -10903324 -19477774 -18766809 -11805026 -5239466 -1333684 2046742 6253172
41871 6253172 10418454 14106763 17660973 19691884 17478980 11150787 5221119 4286275
41863 4286275 8293599 13217851 15469201 14506182 11822302 8743978 5525043 2186755
41855 2186755 -163144 370812 4039803 7874260 8069711 4088625 -1020525 -4480978
41847 -4480978 -6069567 -6147205 -4069405 -280592 2402752 2406122 2619040 6424262 11293077
41838 11293077 10739620 3513972 -3580919 -4674977 -2983258 -5748540 -12995126 -16389091
41830 -16389091 -9665206 4049281 16668257 23206615 23379949 18831406 12504483 8630773
41822 8630773 9064165 10273286 7771994 3053660 1700182 4403536 5395825 2005708
41814 2005708 54119 4805823 10672780 6901604 -7441178 -20733730 -22232243 -13105709
41806 -13105709 -2374276 3372782 3471392 472272 -2080575 -1151455 3122747 7018231
41798 7018231 7405111 5231784 3470998 3360789 4264778 5316324 5521582 4395364 4176510
41789 4176510 8517489 16509523 21261131 18061582 10992785 6756778 4469807 -2266767
41781 -2266767 -14059166 -23216705 -23728241 -17900762 -10937986 -4327354 1970346 5215646
41773 5215646 2619612 -3492887 -7199160 -5245420 385758 5356969 6758134 5104621
41765 5104621 4099008 7362752 14281415 20388973 22575898 21778985 19548381 15100495
41757 15100495 8266915 2575074 1517149 2904614 764120 -6875743 -14842679 -16089715
41749 -16089715 -8427696 4026050 14337819 17457716 13002195 4189400 -5871556 -15927145
41741 -15927145 -24444160 -28140498 -24931414 -17061946 -8884507 -2410581 2530314 4964445
41733 4964445 3331882 -577082 -2104725 482574 3742606 4203733 2747435 1595262
41725 1595262 -1200 -3321344 -5522738 -2495855 3684300 5514223 463717 -3987596
41717 -3987596 171997 10067218 15348676 11761228 5333112 2395262 1701219 -458812
41709 -458812 -2685519 -1120746 3531992 6882335 6828243 3860747 -2500293 -11693823 -17850074
41700 -17850074 -14571679 -4617561 1912281 747501 -1783893 319611 4058783 4241021
41692 4241021 2821986 5118941 10755562 14925624 16149757 16539713 15997808 12360380
41684 12360380 6842169 3758316 4456282 5970973 5873972 4402829 1840825 -2081009
41676 -2081009 -6026124 -8208533 -9802952 -13340719 -17695063 -18807150 -15768057 -12081061
41668 -12081061 -10279290 -9311531 -8039169 -7320082 -7559505 -7869313 -8515096 -10434393 -11729784
41659 -11729784 -9127358 -4024198 -2136279 -5141078 -7621525 -5171929 -800948 475611
41651 475611 -905016 -1750164 -2803346 -6904480 -12046876 -12116114 -4977349 4673517 11536168
41642 11536168 15029287 16817949 16323921 11766601 4476016 -1019004 -2219088 -2038661
41634 -2038661 -4845337 -9842513 -11453681 -7329410 -2789204 -4399894 -11336065 -16933536
41626 -16933536 -17591251 -15814115 -14725439 -14150496 -12955936 -11158493 -8458125 -4351846
41618 -4351846 -900633 -1594411 -5961586 -8973932 -7457070 -3553497 -354349 1887956
41610 1887956 3344831 2749322 533228 -186741 1375002 1421543 -2740904 -8412289 -11671616
41601 -11671616 -11820313 -8758906 -818904 10507544 18142066 16932671 10313942 4920432
41593 4920432 2296372 790882 1216508 4203542 5699321 2432685 -991288 1779878
41585 1779878 7814106 8379058 2259575 -3256019 -4689698 -6465958 -11005242 -13575268
41577 -13575268 -10608879 -6011270 -5066795 -7593566 -10644259 -12836018 -12649221 -7508040
41569 -7508040 1620241 8899428 10363848 8335355 6538049 5186359 3771334 3821739
41561 3821739 5023301 3052070 -4201396 -11862672 -14058601 -11626401 -9501717 -9334470
41553 -9334470 -9331572 -8970392 -8930968 -7876201 -3808847 2328518 8038000 12818866 16752950
41544 16752950 17513447 13373075 7943113 6862285 9858389 10830355 6517043 761922
41536 761922 -1318202 253611 1909362 1940803 1748620 2878345 5002770 6801437 7458911
41527 7458911 6734172 4217463 -302317 -5244181 -7201746 -4140874 1787994 6436302
41519 6436302 8403003 9430856 10193256 8606886 3230620 -4224905 -10972322 -15588066
41511 -15588066 -17532737 -16616948 -13839253 -10439086 -5791169 652461 5213059 2447208
41503 2447208 -6719144 -14110143 -13963303 -8793364 -2941270 4017109 12814305 18796268
41495 18796268 17316945 11569015 8395129 8449113 7069028 3419668 1810643 3970178
41487 3970178 6269606 5429665 1841187 -3363560 -9711504 -15434248 -18891882 -22267494
41479 -22267494 -28759254 -35523450 -35000091 -24973902 -12405094 -5224828 -4686048 -7680859
41471 -7680859 -11739946 -14591033 -12821272 -5245082 4044438 8915511 6782076 -89726
41463 -89726 -7221248 -11069329 -11525592 -12055160 -15527894 -19836512 -20099013 -15133044 -8692335
41454 -8692335 -4196378 -1720853 -570758 -1002145 -2487709 -3774439 -5252431 -7520579
41446 -7520579 -7594891 -1842050 6298184 7750057 -175059 -8963044 -10157804 -6194781
41438 -6194781 -4600145 -5527707 -2017695 8460905 18719142 19282948 8234982 -6679375
41430 -6679375 -14315241 -9760437 523917 4844864 -846363 -8712523 -9530239 -3700015
41422 -3700015 1896086 4462618 6901610 10218761 10623666 5725677 -748076 -3090466
41414 -3090466 -600763 1538551 -1959238 -10552403 -18060732 -19263926 -15687345 -13074765
41406 -13074765 -13651889 -14143543 -11935630 -9027797 -7851061 -7213394 -5520523 -4465176
41398 -4465176 -5743068 -7165096 -6197192 -4633403 -5123848 -5402458 -1186052 6720128 13547436
41389 13547436 17810453 21839882 25240210 23658286 15542379 5501981 -1075360 -3476136
41381 -3476136 -4222796 -5088775 -6089875 -6340208 -4834236 -1906566 -90338 -1708084 -5551604
41372 -5551604 -7595524 -4861763 2438253 11266023 16913580 16110277 11151427 8275886
41364 8275886 9335249 8557775 1181409 -8937516 -15482007 -18793823 -21552876 -19813986
41356 -19813986 -8862454 3839440 3883282 -9887608 -21878933 -20784818 -13631106 -12530831
41348 -12530831 -16873722 -17344919 -10844865 -1974585 6075543 13064647 16639086 14290512
41340 14290512 9675394 9732423 15183148 19585600 18079426 12102313 5137474 -1578580
41332 -1578580 -8036654 -13351988 -15754935 -13597447 -7428720 -2036583 -3418960 -11392501
41324 -11392501 -18543872 -19385486 -16480157 -13805535 -9363227 -606610 7461626 8011706
41316 8011706 3531464 2301314 5076976 4955980 775526 141018 6058247 10325906
41308 10325906 5837103 -2236484 -4345555 -82372 3394217 2852510 1689180 2548621
41300 2548621 3480422 1817488 -2343388 -7137349 -10798176 -12556096 -13465692 -15552293
41292 -15552293 -18628884 -19580604 -16695993 -12643867 -10522592 -8921600 -4414398 2078774
41284 2078774 5198045 1727925 -5560548 -11357316 -13065008 -11887474 -10293293 -9578217
41276 -9578217 -9606930 -10249641 -12204981 -15504861 -17815671 -16229857 -11099326 -6017382 -3198412
41267 -3198412 -1022348 2651118 6950519 9540711 9915652 9224290 8120021 6433500
41259 6433500 3808254 -682511 -8292562 -18859636 -30484881 -41076007 -47909857 -46157506
41251 -46157506 -32888259 -14387461 -3790635 -6877957 -14458665 -14210135 -6451123 -1710859
41243 -1710859 -5349391 -12307701 -16357109 -16720714 -14484938 -9580019 -3564787 491215
41235 491215 3071680 7612534 12980737 12973921 6346701 796534 2451025 7145935 7526755
41226 7526755 3706962 556092 -1395179 -5073965 -9579992 -11245425 -10837355 -12786440
41218 -12786440 -17509980 -20876307 -21347787 -21277506 -20613022 -16129766 -8715660 -4803111 -7240954
41209 -7240954 -10213716 -7395744 -1007194 1737531 -1611676 -6873499 -9508885 -9002247
41201 -9002247 -7676337 -7992231 -10800525 -14452931 -15906821 -13596203 -8538003 -2611834
41193 -2611834 2390341 4057640 894444 -4331310 -6023065 -2437861 1855524 2013144
41185 2013144 -1753560 -7123348 -14117670 -22543589 -27631974 -23428361 -10544542 3029455
41177 3029455 9533446 8036023 3511842 722432 -951339 -6345964 -16772111 -24761131
41169 -24761131 -21071039 -7253284 4844290 8397957 9468400 14966230 20187447 16488414
41161 16488414 6098158 -704185 -555021 956389 1022191 2621851 4871370 1194671
41153 1194671 -9268235 -17465921 -16213211 -8888598 -2379271 1314999 2079771 -2001717
41145 -2001717 -9401156 -12781905 -8496620 -3210973 -4766867 -11354418 -16059949 -17124939
41137 -17124939 -16581497 -13402995 -6234043 474348 1467953 -550189 701133 4114265
41129 4114265 3423702 -849755 -1213419 4430352 9272958 8475305 5481511 4661685 4887125
41120 4887125 3905974 2846790 2590512 1114482 -1673326 -1439576 3896853 9149280 8252186
41111 8252186 2739683 -756961 310981 2006405 226652 -3864137 -5501960 -2218602
41103 -2218602 2543509 2457633 -4195762 -11474611 -12436494 -7422566 -2346227 27944 2340784
41094 2340784 6178591 8642729 7142055 3457929 872139 287994 763271 1140939 177191
41085 177191 -2172641 -3315444 -1119435 1879605 1629291 -579641 -15254 2702124 1743510
41076 1743510 -3386949 -5060213 1135620 9166322 11409487 8651427 5751402 2808557
41068 2808557 -2689733 -8718106 -10515323 -7671245 -4206640 -3283821 -5847179 -11918737
41060 -11918737 -19065802 -22369660 -20106098 -16494697 -14883737 -12265471 -5555830 1073827
41052 1073827 1735914 -1595171 -2055918 1931190 6385923 9623784 13074412 15520282
41044 15520282 13835811 9080925 5238564 2372465 -2412794 -7833225 -9237017 -6326962
41036 -6326962 -3022144 310459 6933739 15440720 19119160 15253215 8115923 1278409
41028 1278409 -5828353 -12011477 -12782495 -7659616 -2121859 462381 1970350 2271191
41020 2271191 -2782635 -12184560 -17273452 -14257809 -11311591 -15882629 -21985956 -19168150
41012 -19168150 -9017505 -2784731 -5237824 -10605905 -13725344 -15642241 -16660796 -12442035
41004 -12442035 -1198916 10741674 15228506 11529954 5848320 3071825 2057499 -838855
40996 -838855 -5861832 -9348457 -8929199 -7020716 -7446572 -10381304 -13600051 -17287266 -23095065
40987 -23095065 -28632941 -28275595 -20998886 -12601572 -8098713 -6558712 -5693837 -6342714
40979 -6342714 -9088728 -11350279 -11750974 -12827079 -15312644 -14578288 -7717411 365540
40971 365540 3475623 2438916 929422 -2375204 -9740416 -15981292 -13237235 -3155553
40963 -3155553 4009255 2678127 -2920324 -7073147 -8631270 -7722331 -3516669 2660604
40955 2660604 7640708 11248615 15374143 17510770 11898693 -934012 -12204116 -15243074
40947 -15243074 -12269221 -8361403 -4848121 -2169485 -3192021 -8549660 -13083000 -12055492
40939 -12055492 -7721615 -5227852 -5147104 -4925729 -5048562 -8156689 -13065048 -14823086 -11215801
40930 -11215801 -5539754 -2148570 -1838563 -2428032 -2094205 -1207096 -1479555 -3740588 -6917015
40921 -6917015 -9759444 -12691387 -16121445 -17571502 -13466273 -4311336 4737282 9478522
40913 9478522 10346738 9671335 8280679 6498456 5922459 7895197 11319157 13214325 10869811
40904 10869811 4114263 -2771514 -3149713 4080538 10070604 5209916 -7367800 -14160386
40896 -14160386 -8368441 2902550 11018583 16530815 21914928 22272310 12805834 254203
40888 254203 -3799422 1153942 5325693 4426404 4133781 7320748 7401998 -590124 -10262434
40879 -10262434 -11779901 -4707264 3184643 6859475 8061097 10088572 13723584 18184653
40871 18184653 22179821 23580666 20926443 15812262 11671192 9721756 7903361 4409111
40863 4409111 691446 -193944 2463216 5883829 6746438 4621006 2073113 1889506 5002684
40854 5002684 10710164 17277899 21801522 21272660 15500859 8286448 4236516 4711940
40846 4711940 7806806 11416788 14775219 17417291 18338486 16595586 12114284 5931073
40838 5931073 -232663 -5320923 -9828058 -13940841 -14996016 -9673653 181713 7278885
40830 7278885 7019407 3155972 2066980 3973453 4247215 1726174 348009 2438749
40822 2438749 5358505 6197211 5961623 7375472 11255329 16289048 20086721 19876400 14719112
40813 14719112 7434131 1760256 -2129450 -5938556 -7796316 -3703579 4871563 10751989
40805 10751989 10772724 10004233 12662547 14547327 10133378 2621405 -268991 1994838
40797 1994838 2926923 185819 -1335445 996649 2463960 -932914 -5396555 -5592237
40789 -5592237 -3623856 -5207108 -9019917 -7309194 1843589 9558824 7301392 -1588415
40781 -1588415 -6794166 -4904965 -2022061 -2629864 -2888801 1754282 8109366 10328353
40773 10328353 10050580 14047402 22117729 24901504 16517838 3483496 -3414430 -2282432
40765 -2282432 -315882 -3281486 -9976749 -16333341 -19993132 -19893100 -15323842 -7669000
40757 -7669000 -1143543 192330 -4057091 -10269948 -13310365 -9996817 -1862009 5279713
40749 5279713 6016364 287229 -6923732 -10669591 -9895810 -6712683 -3576127 -1640202
40741 -1640202 -652873 195798 772811 -627902 -5372965 -11707102 -15064362 -12111671 -4218831
40732 -4218831 3656778 7569609 7882662 7976713 10031108 12898996 14591757 15588359 17683656
40723 17683656 19878189 18233393 11120504 2434099 -2397301 -2207151 -87210 959620
40715 959620 134260 -2184304 -4832994 -5621296 -3201253 804564 3605138 4957519 6858032
40706 6858032 9707442 11352029 10240028 7085356 2957174 -1695010 -5318745 -5307464
40698 -5307464 -1432882 2748129 3675081 1633996 -541477 -1275996 -1320500 -2081882 -4209170
40689 -4209170 -7046922 -8561550 -6798829 -2377740 1352011 1438405 -2115198 -7002394
40681 -7002394 -10300638 -9416311 -3803754 3211360 6618329 5027581 1502460 -1961990
40673 -1961990 -7154173 -14211377 -17393991 -11291784 726056 9596914 11361431 9627640
40665 9627640 7624482 4290773 64029 74115 7046489 15215172 16437567 10135718
40657 10135718 2610265 -1838965 -4232363 -5974837 -5654990 -2072625 3041097 7026648
40649 7026648 8925323 9163944 8600580 8670697 10561634 13411948 15004732 14842759 14785648
40640 14785648 16157802 18188929 19777787 20398751 18532846 12283897 3521505 -1332926
40632 -1332926 2222901 10822593 16597108 15868235 12048910 10323033 11965528 14272090
40624 14272090 14242459 11649211 9238896 9860309 12970932 14936456 13540901 10605073
40616 10605073 8701098 7223178 4246787 824376 257869 3663159 9070055 14234953
40608 14234953 17295421 15613944 8265141 -176780 -2836330 1277779 6268845 7745669
40600 7745669 7655737 8585421 8225090 3730213 -1940987 -3176858 322555 3133841 1056501
40591 1056501 -4988980 -11283487 -14129548 -10918619 -2078609 7519949 11913441 9765671
40583 9765671 5348495 3756564 6199128 9390562 8658312 2977049 -2327142 -584900
40575 -584900 6979880 10988991 6217585 -194411 1547508 9533112 13227540 9332356
40567 9332356 5643727 7987010 12033078 11599369 7687509 4545854 2895305 2460794
40559 2460794 5963544 14272619 21384656 20814696 14715353 10735517 11672721 14037045
40551 14037045 15300601 16319985 17208288 17025330 17666358 21772775 25800160 21661141
40543 21661141 7989630 -5656931 -9569092 -4857123 138612 899532 -630866 -2417278
40535 -2417278 -5576250 -10136575 -11713722 -5629728 6591756 17446877 21068067 19180175
40527 19180175 17751539 18544786 17125550 10360932 2575919 1006235 6919215 14889149
40519 14889149 19972181 21792576 21872141 21111989 20587537 20983090 20144679 14860171 6449019
40510 6449019 963077 2109001 7432763 13158106 18558985 22897514 22701018 16708348
40502 16708348 10244611 9383036 12648672 13610461 10285376 6454266 4273113 1732579
40494 1732579 -1443061 -1154797 4964248 12848788 16476724 14319440 8952027 3025348
40486 3025348 -1685827 -3776733 -4071740 -6365544 -13000783 -20534896 -22805559 -17953556
40478 -17953556 -9721830 -1979351 5116976 12762582 19771913 22983186 20772995 15334049
40470 15334049 11455828 12523203 16813426 18291697 12570763 2018355 -6467423 -8618077
40462 -8618077 -5924378 -1651943 3375831 9192662 13042894 10641087 1379398 -9876797
40454 -9876797 -17153473 -18474731 -16142974 -13283698 -11321908 -10168331 -9325449 -8418487
40446 -8418487 -7525247 -7570986 -9847961 -14293224 -18232845 -17681604 -10665193 690324 11705142
40437 11705142 18810187 21463834 20771869 17383676 11683376 5469603 1791713 2317859
40429 2317859 5664231 9146111 11499782 12835078 12691503 10196088 6417357 4314345
40421 4314345 4890898 5110527 1773621 -3732110 -7367386 -8570901 -10739461 -14711894
40413 -14711894 -15964111 -11445401 -6045009 -7326699 -14879980 -20322393 -18881470 -15789024
40405 -15789024 -18142566 -24424040 -26594740 -20514706 -9604809 1105147 9812076 16091600
40397 16091600 18525366 16542404 12277573 8637012 6929753 7270044 9155626 10514135
40389 10514135 8749803 4627330 2754143 5785329 10183125 10565396 6577648 2197894
40381 2197894 -488983 -2991469 -6311426 -9090168 -10400348 -10887793 -10108369 -5880992
40373 -5880992 2266156 11517072 18737449 22433024 20985144 12742219 186768 -9425018
40365 -9425018 -11160658 -8203883 -7448598 -11170186 -16393331 -20613819 -23740766 -25152770
40357 -25152770 -23605661 -20657035 -19856757 -21086305 -19561508 -12677495 -4579841 -995261
40349 -995261 -1953803 -3125453 -2862317 -3715591 -6721333 -8318891 -5417431 -933036 -380885
40340 -380885 -3220975 -1928704 7712775 18528587 19094598 8493094 -1628856 -1781334
40332 -1781334 3898106 5268735 876298 -1916156 314563 2266303 -611203 -5147501
40324 -5147501 -6887664 -7891289 -12645714 -19520124 -22040988 -17582320 -10198116 -5167957
40316 -5167957 -4407371 -6880604 -9823370 -9318185 -3038805 6670245 14756155 18865251
40308 18865251 20527483 20832291 17800223 9249322 -3722361 -17315021 -27699455 -32385639
40300 -32385639 -30664190 -24298692 -17289588 -13731207 -15306332 -20537223 -26309725 -30370861
40292 -30370861 -32197917 -31002960 -24350711 -11729286 770394 4090752 -3004918 -10990592
40284 -10990592 -11361362 -7518498 -8278864 -13599927 -14662751 -7932194 -935697 -1443586
40276 -1443586 -7618888 -12789698 -14541934 -14279929 -11805056 -5782692 2225607 8470180
40268 8470180 10819340 9217216 4194122 -2229842 -5996103 -4394960 1184073 7870946
40260 7870946 14633960 20942133 24888149 25397835 23657576 19710102 11212888 -796541
40252 -796541 -9084161 -8736663 -5304165 -7811815 -15708627 -20159112 -17522958 -13429812
40244 -13429812 -12260249 -10573125 -4447124 3148981 7146758 8202593 10828716 16080670
40236 16080670 20162420 19324018 13666345 6815277 2855043 2319901 1225306 -3644236
40228 -3644236 -9102381 -9099721 -3802265 -25240 -1471339 -4067332 -3322399 -722981 706108
40219 706108 2056784 5423050 9615221 13527735 19339072 27142816 30755146 25249590
40211 25249590 15208430 8646096 5760081 1429110 -3566789 -3123423 2727154 6456536
40203 6456536 4870314 3399578 5506326 6418634 2382869 -1379018 1336376 7141729
40195 7141729 7566564 624840 -8658790 -16374921 -21570611 -22071423 -16034662 -7619254
40187 -7619254 -4281658 -7290894 -10722719 -10991978 -11053499 -12719941 -11401835 -3513835 5571414
40178 5571414 7337777 1759571 -3046943 -2447286 -784966 -3864451 -10596844 -14698676
40170 -14698676 -11781026 -2555377 8541186 15833484 16028973 11917606 10377620 14126504
40162 14126504 17800251 15420517 9011201 4899426 3512108 -322352 -6826380 -8827169
40154 -8827169 -2993685 3336222 1952021 -4643321 -7880400 -5829760 -3882196 -4367027
40146 -4367027 -3378974 1193313 5481617 6076784 5227779 6298972 8017077 6768771 2139951
40137 2139951 -2694619 -4462885 -1998415 3030659 6363924 4740931 640231 375256
40129 375256 5610802 10091694 7477139 -540083 -6993724 -7822403 -3904591 2484727
40121 2484727 9006172 12667790 12278804 10833261 11751102 13651782 12919843 10609455 11675191
40112 11675191 16773916 19979372 16721600 9786180 4708908 2823100 2429133 4090617
40104 4090617 10008773 18588151 23872447 21917819 15484622 10905310 11612288 16093082
40096 16093082 21116572 24803488 26279899 24603257 20159365 16238054 16342962 19110517
40088 19110517 18407982 10447391 -881103 -8134061 -8626161 -5952515 -3950950 -2488339
40080 -2488339 202272 3987944 7119046 8164771 6571394 2971823 -331557 -1319455
40072 -1319455 -1648729 -5541847 -13647938 -20692159 -21825830 -18966814 -17326117 -17306742 -14313193
40063 -14313193 -6446565 2048447 6137613 5079564 720370 -5468161 -11215823 -12834391
40055 -12834391 -9369173 -4999115 -3578813 -2876129 1370634 7407418 9212954 6006269
40047 6006269 3504743 4053775 2239785 -5553885 -12956425 -11218361 -1598186 6511212
40039 6511212 8077956 6392808 5238873 4258129 3246398 4210484 6229242 3904482
40031 3904482 -5160423 -15433716 -19710504 -16898635 -10302948 -2065783 6292425 11048127
40023 11048127 9345957 3641155 -1259168 -4147980 -6336538 -6558481 -2167824 5357454
40015 5357454 11235850 13623092 14286349 13192841 7884843 -734861 -7253183 -8447485
40007 -8447485 -6889709 -5977966 -5753592 -6065837 -9322471 -16164361 -21640253 -20180794 -12908818
39998 -12908818 -6285697 -4247273 -4848961 -4563586 -3260448 -4068737 -9202491 -16415129
39990 -16415129 -20234546 -17725557 -12118717 -8584205 -7528244 -5805845 -3906415 -6199245
39982 -6199245 -12520640 -15682366 -11113772 -3692315 -75825 957503 4211065 8094653
39974 8094653 6969808 1663972 -849795 1322685 2037781 -2677979 -8584548 -10440512
39966 -10440512 -9067699 -7493362 -5563885 -2987920 -3276686 -9480904 -18945624 -26791325
39958 -26791325 -31867081 -34872312 -33579288 -25444997 -13248095 -2802234 3773847 7481275
39950 7481275 6812060 -728687 -11649304 -18048645 -17703673 -16118147 -16377297 -14133170
39942 -14133170 -6952681 -1745848 -5702136 -14176617 -15872238 -8372103 -349831 1901488
39934 1901488 2046637 5309147 9647106 10075402 6907351 4156820 2571961 -186692
39926 -186692 -3606761 -3843955 312862 5120122 6805362 5766026 4355870 3008714
39918 3008714 771798 -1613277 -1629198 1505653 4482003 2493910 -5093493 -12375154
39910 -12375154 -11977898 -3157246 6602669 9070679 3045356 -6219542 -13197235 -15636963
39902 -15636963 -14023042 -10907408 -10027194 -12722445 -15317009 -13133324 -6961515 -2023405
39894 -2023405 -421050 964852 3770544 4193368 -905766 -7421519 -7837561 -147573
39886 -147573 10491345 17897749 19587181 16584503 12168066 10504452 13054132 15813424
39878 15813424 12969613 4090150 -4695516 -7604147 -5275106 -2884457 -3882896 -7017578
39870 -7017578 -8684680 -6906094 -2903341 726063 2770982 3625689 3134687 294255
39862 294255 -3852661 -5312316 -1679132 3794789 5741482 3658932 1962624 2954902
39854 2954902 3482689 38533 -5957659 -10281728 -11198907 -10199898 -8804128 -7111062 -5119935
39845 -5119935 -3574885 -3386249 -5102471 -8411710 -11241505 -10376549 -4712650 2455122
39837 2455122 6175064 5159812 3005644 3641442 6819888 9072152 8280575 5804376
39829 5804376 3884883 2334260 -831635 -5738413 -9233425 -8055130 -2647803 3226029
39821 3226029 6313370 6416908 5564981 5851160 7964408 10567713 10944506 7520645 2265513
39812 2265513 -491547 1474873 5454477 6102609 560146 -8761982 -16229344 -17901148
39804 -17901148 -14840234 -11491596 -10630646 -10632450 -8386234 -3833980 19616 1071559 -15439
39795 -15439 -2094477 -5391836 -9821639 -13044283 -12166157 -7288676 -2236244 -1290513 -5216534
39786 -5216534 -10554351 -13221787 -13061053 -14011481 -19058924 -26140090 -30485413 -29884353 -25517503
39777 -25517503 -18770892 -10683796 -4405769 -3873037 -8258231 -11338031 -9102670 -5136397
39769 -5136397 -5127847 -8298037 -8428061 -2479903 5952825 11976810 14431468 14660113 13687061
39760 13687061 12535642 12801251 14406051 14233278 9540665 2197221 -2850584 -3529158
39752 -3529158 -2833314 -4041535 -5757453 -4183789 337201 2332557 -1793890 -8279748
39744 -8279748 -10249084 -5971016 453708 5845099 10845865 15028920 13904104 4393234
39736 4393234 -9511773 -20472861 -25686106 -27604351 -28331765 -27565122 -25653086 -24263762
39728 -24263762 -23249532 -20597557 -16479864 -13599300 -11996507 -7431235 2274378 12334129
39720 12334129 15990122 12691094 7928504 5922437 5770452 4628432 1586325 -2401130
39712 -2401130 -6322036 -9844101 -13263787 -16972586 -20146074 -20446319 -16493326 -10327348
39704 -10327348 -5723469 -4096786 -3695868 -2742035 -1459866 -880836 -1674063 -4409996 -8603863
39695 -8603863 -10888053 -6981493 2869131 12805399 17757499 18802065 19840612 21330412
39687 21330412 20843085 18253150 16017491 14575676 11758212 7310561 3781823 1682696
39679 1682696 -1942774 -7965507 -12364434 -12163566 -10443618 -11191573 -12177651 -8355692 -772285
39670 -772285 3857512 2674670 342760 1925320 7054007 13317974 20696986 28882702
39662 28882702 33558814 30168958 20533901 11930922 9296508 10892144 12104908 11296189
39654 11296189 10595480 11969675 14244717 14869424 13945029 14589865 18437916 22760978 24113161
39645 24113161 22971665 21526190 18475513 11018976 1963724 -1193603 3353915 7708698
39637 7708698 4765139 -1463899 -1279463 7409471 16709976 18888796 14112368 7863098
39629 7863098 4602950 4978316 6723838 7407268 7284999 8824875 12533958 15345951 14888404
39620 14888404 12565434 9786125 4649269 -3345710 -8641148 -5728053 2069278 6574914
39612 6574914 6475291 7646731 11677961 12523575 7347677 3060807 7173386 17479359
39604 17479359 25745585 27625624 24382594 18377502 11735929 7107162 5420043 4371846
39596 4371846 1943890 -939131 -3606632 -7680557 -12359337 -11840614 -2748207 8801080
39588 8801080 13300402 9223118 2918545 -1092141 -3612625 -5319092 -4240362 261885
39580 261885 5842283 10391092 12911690 11420740 5063489 -1405257 -1032401 5951409
39572 5951409 11593319 11075814 8594731 9415834 11510777 9734111 4298253 -243612
39564 -243612 -2039891 -2787428 -2880073 -820256 2466481 3135606 -492812 -5269641 -7019620
39555 -7019620 -5227395 -2890969 -2881482 -5313780 -8084948 -9590748 -10546294 -12310161 -13649641
39546 -13649641 -11172869 -3843613 5003930 11623485 15588597 17310428 14285433 3970386
39538 3970386 -10230621 -20264497 -21933782 -18882732 -16614686 -15601902 -12796382 -7603626
39530 -7603626 -2728172 475355 4081483 9684284 14472706 13549155 6256868 -1374427
39522 -1374427 -1853466 6046755 15747311 19689215 17028692 13472457 13899453 16907986
39514 16907986 17314814 12576972 5400328 764628 1711023 7524003 14404494 17833782
39506 17833782 15862872 10895259 7512343 8180337 11786395 16172396 20251005 22865612
39498 22865612 21810003 16484795 10694031 9939615 15302211 22090657 25527556 25850670
39490 25850670 26119475 26585332 24306399 18838036 15468338 19904808 30037505 36069457
39482 36069457 31005854 19458649 12859431 16030218 22223765 22944710 18675071 16193645
39474 16193645 18291518 21591691 23513543 25342741 27412267 26880169 22671283 17793489
39466 17793489 13841559 7925051 -1091425 -7806801 -6932573 -1236138 3076553 6236853
39458 6236853 13177322 22984914 27651429 22765179 13333757 6793590 5239360 6798475
39450 6798475 9970002 13709429 16877796 20139908 25111442 29630370 27823202 17660098
39442 17660098 5034103 -2489396 -2988098 800531 5667418 8336001 6305286 2273504
39434 2273504 3270673 10585034 15236099 9997334 1829004 3668111 15745705 24809544
39426 24809544 22827304 16932204 17161484 22516865 25073662 22238814 18292807 16906212
39418 16906212 18089808 20815495 23411630 22360972 15689690 7620422 5601488 11756177
39410 11756177 20198348 23581022 20119119 13971606 11031377 14469654 21825178 25966093
39402 25966093 21557597 11628517 5405172 8304830 16184485 21050093 20226531 17461947
39394 17461947 16764395 18569659 21452812 23901868 23647709 18815532 11672538 8060636
39386 8060636 10080031 11983080 7700994 914366 1925869 13830833 27632438 33916790
39378 33916790 34150141 35670661 39679874 41153969 39213981 39926692 46838980 54629981
39370 54629981 55803577 49966206 42643985 37194526 31830230 24087272 15108467 8651104
39362 8651104 7066408 8961069 11051698 12355970 15167837 20450148 24284772 22577453
39354 22577453 18211392 18194658 22999686 24936229 20059081 15472233 19214966 27630264
39346 27630264 30287108 25167400 20815670 23088979 27375012 26474619 20139971 13169911
39338 13169911 8578321 6833406 8851587 15290533 23765995 29793247 30381303 25558224
39330 25558224 17656028 10337435 6650106 6421526 6862603 6834218 8674344 14490936 22813930
39321 22813930 30779281 37612405 43749552 48308328 49938234 48845307 45655020 39726077
39313 39726077 31249936 23708282 21022987 22682010 24542155 24315057 23643831 24778757
39305 24778757 27715420 30794431 31918238 29238807 23108424 17468876 16678989 20415000
39297 20415000 24066528 24694783 24081188 25045895 27301659 28379454 26728187 22634085
39289 22634085 17913210 15954336 20076203 29920724 40550381 46551777 46220011 41118319
39281 41118319 33546846 26217653 22793158 25968110 34649487 44161173 49431218 48053036
39273 48053036 41544193 34407000 30650854 30060316 28865022 24944580 20838632 20176832
39265 20176832 22671119 24831459 24845848 24445435 25950613 29389389 33036509 35529402
39257 35529402 36754880 37115073 36433457 34051629 30443016 27956433 28380632 30205677
39249 30205677 30783858 31371457 36583882 47233903 57068710 59361711 54040406 45436575
39241 45436575 36342574 28748183 27327095 35272721 47024044 52009258 47382481 41312754
39233 41312754 41290865 44906470 45994206 44606847 44949696 46515351 44114534 36564776
39225 36564776 29609341 28548165 31957200 34946369 35998006 37966061 43257274 50030511
39217 50030511 53459535 50240144 41871000 33551047 29640136 30286485 32533143 33909768
39209 33909768 34115944 33764230 32834944 30793996 27665053 24595016 23359944 25216305
39201 25216305 30135652 37091829 44635369 50896154 54079061 54398676 54934769 58569699
39193 58569699 64100343 67557863 67545031 66463818 65652390 62894103 57301406 53593581
39185 53593581 57346888 67128733 75289617 76475071 72023648 66048568 61179237 59329719
39177 59329719 62742029 71297948 80748072 86278981 86966926 85066120 82428813 79987085
39169 79987085 79575668 83094677 89693592 96389844 101896640 107153434 111332611 110858061
39161 110858061 105023371 99783314 101898417 110583584 119296510 125199809 131475322 139400615
39153 139400615 144481293 144071549 143354643 148157296 155839759 160120156 162326731 169956634
39145 169956634 184749783 200356946 212770357 224857996 238143065 248351351 253439079
39138 253439079 258625014 267860373 276762040 280323734 281560224 284941764 286647850 280489909
39130 280489909 269757536 263195754 261261364 256720908 248319390 242946848 242651213 240116057
39122 240116057 230683735 219332860 210783243 201410141 187450726 173797333 166717887
39115 166717887 163131245 155454950 143839956 135400818 132728347 130848600 126035295 121198375
39107 121198375 120440876 122352961 121011157 112024320 96870315 82091262 73560398 70646074
39099 70646074 67406548 60311743 52352654 48308239 49233014 53691943 60660844 67877571
39091 67877571 70749290 67108267 60633815 55817600 52297080 48158835 45437482 46907473
39083 46907473 50144069 50987274 51002065 54722760 60396914 60604460 52614305 41783623
39075 41783623 33836713 29779710 29180785 31738038 33773533 29858462 20898509 14818283
39067 14818283 16152677 20618163 23276950 25795020 30686671 34010926 30352320 21554164
39059 21554164 14250478 11183259 10745827 12707681 17748768 22523988 22228401 18667076
39051 18667076 19456483 27390337 35979067 38183594 35047482 32153199 30969018 28328660
39043 28328660 23294853 20003612 22250894 27655210 29453487 23909897 14473819 8001326
39035 8001326 7938748 12354736 17547606 21137561 21719379 18652165 13654036 9977916 8038452
39026 8038452 4398079 -2246426 -6554225 -1940241 10721121 23766642 31529258 34291235
39018 34291235 33666488 29326422 22416222 17871447 19637720 25692090 30819056 32796519
39010 32796519 33103707 32934841 31823970 29924766 28675042 28624755 28682551 28067961 27324912
39001 27324912 26981825 26882491 27305918 28866213 30369417 28621888 22047317 13441662 7586153
38992 7586153 6916364 10891753 18338352 27996728 37323529 43646709 46958146 49035057
38984 49035057 49363350 45228727 37269257 31110492 30209724 30184651 24942515 16518621 13004649
38975 13004649 16909841 21950278 23180688 23993540 29043420 35574714 37846505 36837325
38967 36837325 38350701 42379668 41753002 33055138 22570824 17830672 17929281 16760777
38959 16760777 12727194 9927071 10766704 12507981 12050022 10286493 9968329 11903219
38951 11903219 15196137 19297344 23717549 27078667 28659018 30011864 32676268 34599181
38943 34599181 31390394 21707801 9367008 -560686 -5722377 -5911592 -1468368 5485341
38935 5485341 10499800 10777564 8712144 8433495 9792276 9545787 8062313 9791069 15481103
38926 15481103 18913729 15151508 8532775 7455469 12752613 16459768 12405941 3333014
38918 3333014 -4133255 -7519623 -8413395 -7103743 -1836792 6490884 12738492 12979544
38910 12979544 9917745 10158935 16074266 22674161 23509149 17779747 10081794 4930860
38902 4930860 4029024 7576202 14545015 21325950 23539023 20532820 15615700 11019667
38894 11019667 5725316 -542058 -4984603 -5844782 -5279572 -4867791 -1668196 6816126
38886 6816126 16432529 20575922 19314996 18882657 22505816 27298243 30574964 33263180
38878 33263180 35265675 33139344 25757278 17965742 14757709 14978433 14645077 13821578
38870 13821578 15676229 20028992 22420774 20152869 16179320 15922261 21726760 30851662
38862 30851662 37881518 39155096 35708877 31717950 29733615 28538200 26381968 24575146
38854 24575146 25836854 29844938 32682044 31248941 27205419 26042269 32215100 44518708
38846 44518708 55821710 58322317 50307496 37829711 29306400 28355798 31523008 32285257
38838 32285257 27390858 19977882 16239485 18516218 22747166 23823935 21666365 19694388
38830 19694388 19263149 19510373 21433938 26823561 32897026 33807293 29328061 26499734
38822 26499734 29781253 34954690 36685028 36810740 39695154 43703893 43866518 40159889
38814 40159889 36440730 33094721 27720840 22084871 21081986 24469618 26518556 24956215
38806 24956215 23619638 24493185 23806275 19071101 14050172 12740061 13156597 11318823
38798 11318823 7642913 5232234 4862552 5599612 7805369 11729672 15239310 16426729
38790 16426729 16596548 17623084 18521680 17804039 16863288 17354079 17339659 14157640 9559644
38781 9559644 7719375 8970305 9522835 7032042 3030165 358588 1312228 7177024
38773 7177024 15827788 20969855 18458554 12915993 12947710 19496353 24501407 22473114
38765 22473114 17458302 15330992 14549614 9867918 2076901 -1927789 1729726 9568195
38757 9568195 16270572 20703345 24699968 28480461 29879970 27602644 23344009 19893093
38749 19893093 17701906 14417660 8386767 1851572 -737243 2307907 7930270 11758734
38741 11758734 12281758 10903463 9112995 6959768 3885664 -97857 -4183520 -7254143
38733 -7254143 -8639565 -8514722 -7270617 -4647031 -319877 4544023 7467028 7150772
38725 7150772 5087487 3849096 4100129 4045619 1812663 -2199600 -5723077 -7269897 -7690238
38716 -7690238 -8341625 -8365194 -5724864 -1146143 1833128 2429211 5138123 13187254 21880088
38707 21880088 23623727 18659037 14675817 15015263 14099590 7690248 1033370 961988 4690563
38698 4690563 3884296 -2577018 -7778781 -8306185 -8646417 -12161496 -14823122 -11983382 -6089444
38689 -6089444 -2602927 -1606766 1218090 6850506 11207512 11286753 9112913 8423408 9846087
38680 9846087 10530027 7289563 -370243 -9232785 -14049997 -11287844 -1861086 9745945
38672 9745945 18445610 20476146 14352788 2456315 -8429833 -10923148 -3553450 6771470
38664 6771470 10215424 2777092 -10366334 -20383612 -23226494 -21838232 -20466674 -19142476
38656 -19142476 -15404801 -9464428 -4264193 -916086 1989169 3758257 675788 -7585687
38648 -7585687 -14325582 -12900283 -5414549 409633 2273112 6006738 16128173 28373713
38640 28373713 34662354 32743931 27541894 24131547 22701041 20851761 18276590 17132730
38632 17132730 18255383 19025183 16427283 11376453 7680611 6354978 3854687 -2087324
38624 -2087324 -7569681 -7078824 -1493753 2785633 2541701 1026011 1585677 2705574 1970469
38615 1970469 1004812 2590317 5296853 5181175 1879807 -725952 127483 3194433 6205502
38606 6205502 9127903 13155245 17804505 20333574 18164768 11785921 4805255 242569
38598 242569 -2764981 -6731349 -10755745 -11157952 -8090466 -7121824 -11198276 -15056456 -12435002
38589 -12435002 -5883227 -3315450 -6284310 -8490102 -6128858 -2652198 -1295487 324713
38581 324713 4478991 8044014 7800994 6204316 6129069 3852791 -5508597 -17593248 -21821884
38572 -21821884 -15581502 -8343718 -9050850 -15095276 -17650297 -13717679 -8127341 -5839645
38564 -5839645 -7115838 -10059581 -13831782 -17784115 -19558075 -16140726 -7114878 3521787
38556 3521787 9524206 7610764 846378 -4324275 -4868276 -3496000 -3538969 -3949776 -1895066
38547 -1895066 1364008 1122180 -3790973 -8239197 -6973344 -1195128 3667197 5319766
38539 5319766 6686775 10751677 16144190 18944680 17101065 11932057 6635115 4460687
38531 4460687 6995391 12519628 16712503 16551938 13119716 9234081 5250946 -383136
38523 -383136 -6638732 -9194029 -5817758 -170371 2125424 -51985 -3218779 -4852920
38515 -4852920 -5992528 -7636150 -7426075 -2350225 6206028 12596080 12788257 8673311
38507 8673311 5351012 4967813 5042018 3037896 366832 89500 2193722 4061804 5257340
38498 5257340 8280766 13391875 16153227 12791033 5455280 -1067148 -5683310 -9882161
38490 -9882161 -11902304 -7680490 1773268 9449437 11071359 10122975 11144498 12508041
38482 12508041 10453910 6918216 7430466 12432814 16224089 14603926 8879272 2177783
38474 2177783 -3272193 -4663030 -13479 7148620 10075656 8668531 11391295 22753368
38466 22753368 34129184 33894219 23449573 15150490 15236661 17239685 13940734 7870699
38458 7870699 5601473 7610443 9615227 10446209 12732854 17347980 22316770 26771756
38450 26771756 31578410 35882792 36920367 34007171 29645717 25914859 22486837 18989811
38442 18989811 16651029 16398860 17514748 19333577 22222638 25447871 25841576 20480258
38434 20480258 10073863 -1248405 -8836901 -9976942 -5215780 1530690 5515811 5425062
38426 5425062 4625239 7080142 12521200 16800408 16930826 14796291 15110242 19328160 22155940
38417 22155940 16196484 1546598 -11242649 -11166432 780516 12985219 17459261 18035324
38409 18035324 22087744 28848508 31034812 25830995 18563648 15169203 15472113 15216392
38401 15216392 11402760 4079104 -4376956 -9875989 -8756172 -1713256 5452960 7096773
38393 7096773 3468490 -201162 -121931 2059216 2229408 -290746 -1384080 2703880 9988573
38384 9988573 14445910 13155281 9386589 7255777 5707310 703708 -7881918 -15187928
38376 -15187928 -17347477 -15259371 -11540620 -7017703 -2184231 609695 -558848 -3949964
38368 -3949964 -5931431 -5524104 -4910630 -5681713 -6899425 -7090581 -5827669 -2523471 4001517
38359 4001517 12816353 19239280 18620731 11889652 5231703 3591793 6222459 9417148
38351 9417148 11376900 12337992 11744720 8621783 4337761 1616335 356977 -2166847
38343 -2166847 -5890099 -6520511 -1862056 3929860 6020010 6138424 9561179 16232140
38335 16232140 19922864 16422186 8057392 -890615 -9023208 -16170976 -20596175 -20952503
38327 -20952503 -19186488 -18722153 -20268661 -21034215 -17901486 -10754211 -2997238 1318171
38319 1318171 1515118 719009 1329372 1831159 317792 -1040746 955479 4616136 5796229
38310 5796229 5600494 9122633 15673277 17775253 12899675 8517616 10028380 10784578
38302 10784578 2471363 -9428217 -10919404 784639 12730154 13259263 5094539 -2333332
38294 -2333332 -6411461 -11012738 -16696987 -18391871 -13305148 -6650553 -7020953 -16963483
38286 -16963483 -29651406 -35605703 -32261208 -25473074 -21552477 -20592646 -19384458 -17746513
38278 -17746513 -17955024 -19550284 -19454277 -17236811 -16046860 -17604262 -19792160 -19876664 -16825816
38269 -16825816 -10153827 -411300 8399462 11209403 8421526 6336335 9197940 14388531
38261 14388531 17385797 17463744 15785126 11811447 5425352 -323850 -2636350 -3042329
38253 -3042329 -4346311 -5493926 -3618971 222240 1885208 398919 -726732 1074825
38245 1074825 4142650 5567539 4667587 2587554 724171 326136 1541220 2091035 -967899
38236 -967899 -7058166 -11617742 -11416769 -8871052 -8991412 -12686709 -15498622 -13631671 -9089034
38227 -9089034 -6726742 -7299759 -6615089 -2152337 3144688 6298746 10188907 19004454
38219 19004454 29156080 31025723 21412952 8901796 3614136 5654375 7570505 5066631
38211 5066631 533581 -2425043 -3196045 -2727792 -1301126 1396733 5371601 9243808
38203 9243808 9609471 3872361 -4588567 -7395354 -1017955 6889771 5890954 -3704713
38195 -3704713 -10999682 -8387236 -187696 4141692 1244561 -4202833 -6117825 -2925020
38187 -2925020 2173896 5190835 5449276 5414990 6313550 5974882 2854942 -210420 306430
38178 306430 3064088 4514444 6026747 12676232 24180945 32543594 31147352 22271495
38170 22271495 13349425 9276470 10490302 14853660 18365008 16777150 9583177 734332
38162 734332 -6280044 -11510930 -15150404 -14933008 -10383998 -6631423 -9352134 -16920899
38154 -16920899 -21512279 -18121093 -9808442 -3755291 -3919287 -7845077 -9966127 -8193231
38146 -8193231 -6604139 -9602485 -14082185 -11639246 89533 12809405 17163574 12995654
38138 12995654 6605299 2050691 238665 2943541 10681127 17928701 17624161 11116398
38130 11116398 7489143 11464689 17543865 18480765 14547768 11018501 10317459 10683960
38122 10683960 10411606 9695602 9113517 8936033 9596997 11171373 12801308 13632148 13558992
38113 13558992 12414899 9703478 5955433 2946333 1598637 1027923 578034 1140341
38105 1140341 3106629 4635739 3967823 2611569 4137705 9711532 16218718 19259607
38097 19259607 17448674 13639452 12127293 14425775 17559295 16786793 10316071 1433805
38089 1433805 -3829347 -1406400 7165590 15094927 15716370 9094106 2325753 1657843
38081 1657843 5583289 8145480 7602275 7683029 10213363 11385552 7745843 2128423 -2746
38072 -2746 2015136 4043951 3648656 2928365 4506499 7687521 9900659 10143174 9519147
38063 9519147 9269364 9673037 10768125 12906775 15845031 17956130 17739574 16266665 16440925
38054 16440925 18805552 19849051 16508751 10985576 8278313 9709618 12238639 13985669
38046 13985669 16342716 19528874 20191757 15926293 9050783 3095885 -1831189 -7121454
38038 -7121454 -11473006 -12373284 -10423686 -8496780 -7208117 -4736414 -1143716 437589
38030 437589 -2112103 -6729311 -8950471 -5822925 1858437 10035118 14350466 13499442
38022 13499442 9091937 2316195 -6595959 -14672373 -16335364 -10952463 -6589873 -10607580
38014 -10607580 -18682888 -19766222 -11205672 -1703700 1564348 982842 778934 -990156
38006 -990156 -7006490 -12985005 -12800529 -8510462 -8132149 -14180757 -20557301 -21085761 -15731780
37997 -15731780 -7503708 1529393 8942059 11105842 7245431 2197735 1924815 6876810
37989 6876810 11801687 11731266 6613251 280380 -3556444 -3709110 -1085161 2459904 4436265
37980 4436265 2608073 -2364032 -5855156 -3692540 2009821 4631624 1788894 -1588072
37972 -1588072 -1465836 -1639390 -7376188 -15163235 -15840881 -7750386 188831 490794 -3696226
37963 -3696226 -4570291 -101141 5423100 7762178 5691300 282076 -5033057 -5953645
37955 -5953645 -2460835 -217655 -3048210 -6416534 -3055254 6722793 15635178 19371809
37947 19371809 20197098 20605888 19522371 16466438 13947476 12888120 10214467 4334151
37939 4334151 -693944 -17923 5980111 13924740 22598455 31530464 36849826 33913784
37931 33913784 23828368 13099341 6408113 2976184 156532 -2694189 -4340559 -2716840
37923 -2716840 4373643 16403773 27482976 30179633 23622168 15158417 12426128 16037071
37915 16037071 21249668 23983145 23183481 19860851 16553942 16161661 18774307 20720916
37907 20720916 18791010 14265936 10938046 10571428 12244628 14274255 14245389 9427885
37899 9427885 1122820 -3059689 3415076 16187898 23009821 18348104 10097808 8822386
37891 8822386 14794023 20128622 20429056 18515679 17692667 17020049 14221848 8996878 2087285
37882 2087285 -5393212 -10376567 -9284490 -3176323 1777462 1495191 -1305861 -2415655
37874 -2415655 -2714411 -4970884 -6832847 -3471686 3183286 4882780 -1010219 -6249814
37866 -6249814 -2705703 6112637 10258409 6992576 2372188 92362 -3730522 -12279958
37858 -12279958 -20668613 -21584949 -15158626 -8478730 -6488251 -7440108 -7373446 -5596116 -4497685
37849 -4497685 -5962902 -9365814 -12485153 -13923333 -14872246 -17975603 -23623924 -28144451
37841 -28144451 -27203563 -20766349 -13181652 -8436446 -6860176 -6493856 -5836174 -4627192
37833 -4627192 -3430360 -3140685 -3621128 -2359257 3744658 14083397 23236351 25583289
37825 25583289 20254706 10821434 1761104 -3440509 -2895397 2013480 6526261 7150010
37817 7150010 6063896 7738420 11385400 11048049 4523689 -2319055 -3387415 -918389
37809 -918389 -1444704 -5246970 -5485208 1931649 12707627 20024615 21887175 20258352
37801 20258352 16379768 10273110 2949699 -3779163 -8479549 -9160523 -3383258 7655849
37793 7655849 16896540 17239218 9458303 1132714 -2381856 -2874516 -4770603 -8769612
37785 -8769612 -11438937 -9379877 -2605268 5382123 10665373 12877377 15465571 20838065
37777 20838065 26694565 29328397 28813988 27532362 25043506 19100464 11280692 6176597
37769 6176597 4115181 126907 -7955341 -15599774 -18312405 -17129898 -14278176 -8800925
37761 -8800925 -902568 4556351 4726201 4781319 10688740 19063042 21257487 15440360 7345239
37752 7345239 489974 -6385300 -12300445 -12698712 -6791929 727446 7093290 13848418
37744 13848418 19983597 20160507 13107869 4869034 -397456 -6191509 -15352703 -22602316
37736 -22602316 -22028006 -16777033 -13846960 -13098810 -9384590 -3071600 -69540 -1925676
37728 -1925676 -3480817 -1074424 3298340 6830937 8965487 8704697 4917465 925403
37720 925403 2824314 10621372 16315833 14036597 7521245 3840003 3733831 2745336 -765190
37711 -765190 -3613392 -2888981 767379 4878288 7461482 7757748 6588579 5777627 5953841
37702 5953841 5784450 4579059 4084699 5775790 7889271 7761799 6109184 5943903 7498411
37693 7498411 7575214 4976838 3692305 8265305 17153297 23154557 20922005 12723860
37685 12723860 5837093 4805628 7452907 8651701 6470870 3143816 980053 -26422
37677 -26422 -16625 2497361 7989767 13150220 13711117 9820562 5821487 4021571 1354905
37668 1354905 -5897746 -15928019 -22670173 -22807320 -18886335 -14984282 -11891364 -8298109
37660 -8298109 -4723817 -3306739 -4073497 -4276285 -2261836 140375 296246 -1817044 -4131816
37651 -4131816 -4826753 -2573802 3850034 13517698 21392995 21207342 11438184 -2562067
37643 -2562067 -12842670 -14892104 -10258785 -4701762 -3501712 -7058962 -10936828 -11089860
37635 -11089860 -8366562 -6413892 -6112895 -4649569 -38672 6147492 11287645 14546386
37627 14546386 16090727 15674118 13668015 11940587 11876688 12355799 11191526 8085829 4965030
37618 4965030 3575256 3443906 2150664 -2359871 -9178900 -14436692 -14989497 -11835786
37610 -11835786 -8440976 -6056020 -2827992 2435145 8206372 12512964 14518921 12888220
37602 12888220 5886057 -4599487 -11948970 -11095846 -4568318 757406 2056712 2737209
37594 2737209 6575657 12672739 16955959 16692114 12603929 7648154 4434421 3500532
37586 3500532 3849037 4677233 5555142 5280141 2750583 -575101 -1787247 -1287875 -3352485
37577 -3352485 -9777812 -16207020 -18068641 -17094831 -17350308 -17300319 -12105277 -3240156 1134536
37568 1134536 -2464574 -6823963 -3163296 7354504 15197349 13551422 4566181 -4138591
37560 -4138591 -6237566 -629606 8630001 15576375 16503847 11690229 4125857 -2118692
37552 -2118692 -3307221 1168558 7000960 8825198 6685558 5793217 8956710 12766690
37544 12766690 12994581 9978726 5917697 583903 -6187248 -10683226 -9120294 -3907624
37536 -3907624 -1113584 -2095078 -2529581 -183027 1265659 -2078049 -8697009 -14066467
37528 -14066467 -15861952 -14508315 -10858387 -5831527 -944260 2934834 6397870 9424282
37520 9424282 9640347 4683645 -4151467 -12451650 -16977638 -18124880 -17824683 -16167709
37512 -16167709 -11304867 -2909686 5283063 8106246 4752259 432400 746447 5409533
37504 5409533 9316782 8774405 4289088 -1856939 -7311650 -8917637 -4393292 3584761
37496 3584761 8373895 6783415 2856342 1996330 4255986 6548183 8625943 12213340
37488 12213340 15567184 14083342 6908515 -1212810 -5958438 -7987322 -10165947 -13392394
37480 -13392394 -17066158 -21101512 -25155316 -27587208 -27277385 -25196119 -22525965 -18820712
37472 -18820712 -14041790 -10816721 -11766024 -15095921 -15731422 -11357983 -5197116 -2009831
37464 -2009831 -3102736 -6299154 -9286846 -11318490 -12318487 -12277836 -12096986 -13715261 -18061461
37455 -18061461 -23052916 -24832749 -21517753 -14989770 -8447988 -3107171 1655078 5857235
37447 5857235 8713951 10976925 15140462 21740018 26770958 25106519 16906543 9055954
37439 9055954 8684554 15260993 20585419 17806370 9309558 3176703 2144637 277967
37431 277967 -7147438 -14799131 -13628554 -3876857 4804768 6277260 4220078 3839827
37423 3839827 4331403 3596780 4189486 8501640 12426913 10546508 4777047 1180230 413564
37414 413564 -1394583 -3730740 -1890853 3647824 6370393 4139035 2504092 4382791
37406 4382791 4154301 -2843898 -11438209 -13706918 -10186070 -7002067 -5129974 -149719
37398 -149719 8429600 14901290 15483117 13207002 12897787 15210301 17453846 17424378 14696243
37389 14696243 10147218 5789291 4018938 5912686 10267870 14200216 14903040 12179524
37381 12179524 9461294 10208516 12687874 11349089 4926688 -507139 340427 4087078
37373 4087078 3160514 -4017449 -11824721 -14879079 -12167670 -5110785 3257746 7457554
37365 7457554 3202151 -6973317 -15492884 -17807818 -15426668 -11247646 -6272162 -1387150
37357 -1387150 2043794 4514879 7644486 10531547 10764633 9424544 10505543 14572875
37349 14572875 17807440 18356795 18371235 18429114 16116443 12606611 13915221 21238823 26185750
37340 26185750 21639013 12642364 9584974 13739063 16873195 13720438 7664728 3909643
37332 3909643 3350656 4591171 6956257 9551789 10945963 11338235 12181050 12807431 10636483
37323 10636483 5896185 2944442 4928952 9438942 11573869 9817367 6786625 4949197
37315 4949197 3761217 1521790 -1487276 -3455443 -4626857 -8238453 -15980419 -23985993
37307 -23985993 -26471763 -23008635 -18528533 -15691076 -11636683 -4173227 3224105 5963728
37299 5963728 4557595 2635863 1510888 462747 -190251 -433070 -2541986 -7202626
37291 -7202626 -9892069 -6386185 -252284 996364 -3353585 -6178358 -2579888 4537147
37283 4537147 9960797 12146682 12148515 10997707 9869992 9283730 7130676 1202716 -5925043
37274 -5925043 -9191991 -8933516 -10879225 -16454002 -19059635 -13522698 -3991102 2263437
37266 2263437 4851139 8734414 15309282 20504766 20956185 17621473 13201407 9206780
37258 9206780 5855887 2767352 -216130 -1805890 -102343 4053058 6555893 5011734
37250 5011734 2422650 3281346 7301127 9761991 7306800 927616 -6231339 -11681973
37242 -11681973 -14363484 -14520793 -13062512 -10358841 -6394694 -2599042 -1693969 -4218066
37234 -4218066 -6737260 -5357294 -21464 6081156 10180562 11643644 11348223 10736250
37226 10736250 10385264 8769316 4188764 -1536756 -4091019 -2480091 -422243 -169494
37218 -169494 872725 4184984 5189228 -509672 -8978471 -12365837 -10185773 -9665504
37210 -9665504 -14397362 -18905772 -16936903 -10487999 -7128382 -10673066 -17271750 -19867085
37202 -19867085 -15168035 -6839090 -2200545 -5148720 -12675079 -18843163 -20358987 -16696889
37194 -16696889 -7702857 4928143 15480764 18396883 14552770 9396929 5455874 1576096
37186 1576096 -777170 2853280 11808421 17898926 15201275 8024743 4697284 6563912
37178 6563912 7977854 5514167 2465882 4023217 10944655 18437297 20125829 14028436
37170 14028436 5586072 2745090 6381178 8186410 847213 -12021604 -19930842 -18145732
37162 -18145732 -11943527 -8288164 -7481319 -4713116 2850624 12584448 18855363 17839415
37154 17839415 10731344 2851248 -980846 -410695 1314063 1303620 -1001186 -4821094
37146 -4821094 -8823795 -10893972 -9190807 -4180990 1703130 6875666 11681506 16225780
37138 16225780 18843490 17905688 13875850 8143732 861320 -8012532 -15784632 -17782237
37130 -17782237 -12674648 -5673471 -4108459 -9715712 -17128964 -20361926 -18615177 -14582218
37122 -14582218 -9738951 -4376186 -642564 -1089212 -3706112 -2700084 3667037 9470914
37114 9470914 8418958 2177143 -2346512 -2357419 -1344995 -2215728 -3070981 -1509078 726291
37105 726291 416651 -2035363 -3415359 -2645674 -1803242 -2064106 -1466698 1905229 6232068
37096 6232068 7295502 3094491 -4087412 -10005085 -11818141 -9474089 -5352611 -3052626
37088 -3052626 -5051951 -10266121 -14646391 -15409337 -14090740 -14110302 -16021092 -17185376 -15992399
37079 -15992399 -13813981 -11790268 -8096353 -658957 8528765 14138439 12627150 5370798
37071 5370798 -2979812 -7869158 -6896999 -541103 8104782 14981720 17260696 14258897
37063 14258897 6960338 -2510910 -11325299 -17039583 -18579792 -15885177 -9363481 -902443
37055 -902443 5321671 5411765 -93777 -6332407 -9452554 -10367178 -11901524 -13943500 -13989146
37046 -13989146 -11774077 -10136887 -10471200 -10221668 -6902729 -2481198 -1010856 -3128210
37038 -3128210 -6006693 -8215312 -10845942 -13132372 -11094192 -3259028 5144590 7334873
37030 7334873 3035663 -1812382 -2500453 655361 5554767 11468659 17865256 22972132
37022 22972132 25018922 23190203 16822876 6051886 -5820953 -13149318 -12884650 -7253264
37014 -7253264 -596300 4648103 8105983 10135481 11787210 13940409 15200711 13167658
37006 13167658 9178968 8413200 12566699 15573634 10505941 -1333072 -12246652 -17499675
36998 -17499675 -18466306 -17526957 -15038669 -12030778 -11277542 -13747072 -16988697 -18555438
36990 -18555438 -18546966 -17745856 -15987494 -13735694 -12760916 -13633257 -14424784 -13098736 -9449604
36981 -9449604 -4094332 2065369 6698520 7406573 5607417 5969205 10076362 13804364
36973 13804364 13504506 11574914 12299153 14823513 14822446 11525944 7986741 4798799 -883926
36964 -883926 -8734708 -12915436 -9701916 -3882169 -3248422 -8295837 -11615766 -7565306
36956 -7565306 1023747 6910742 6531491 2274594 -1372410 -1554355 2162731 7952744
36948 7952744 12108952 11396851 6438403 1679974 834502 3232753 5714856 6843297
36940 6843297 7365603 7354865 5517242 1835608 -1082697 -327746 4524924 11092533 15531425
36931 15531425 14595423 8454585 1714961 -610060 1218036 2203205 -621382 -4881105
36923 -4881105 -7478773 -8932926 -10458698 -10073608 -5835359 -956684 -839196 -5476712
36915 -5476712 -9321559 -9035213 -7065178 -6478486 -6367931 -4368475 -411049 4261313 9030102
36906 9030102 12597463 12434218 8278341 4021189 3099048 3570452 772420 -6257179 -13831371
36897 -13831371 -17989006 -16856408 -9827161 1664532 12523686 17095897 15176618 12037193
36889 12037193 11268342 10498748 6037659 -749542 -4279635 -782835 8404591 18599920
36881 18599920 25253712 26802935 25905513 27069432 31209578 33081176 26185640 10587603
36873 10587603 -5483075 -12461159 -7723374 2397724 8172384 4723497 -4053581 -9704944
36865 -9704944 -7661560 -979630 4408394 6557342 8392810 13038393 20098095 26140749
36857 26140749 27577346 23656121 17681980 14148500 13328127 10404326 2183517 -7117426
36849 -7117426 -10102086 -5085008 3094671 10335869 16287912 19609079 16354877 6593114
36841 6593114 -1911384 -1568058 5691227 11312696 10909204 7771994 6286752 6499087 6232094
36832 6232094 5022815 4053746 4133104 5221247 6798002 7783156 6994645 4358778 1175484
36823 1175484 -1017035 -1588685 -1254331 -1716287 -4012857 -6793595 -7626154 -6668141 -7001438
36814 -7001438 -10089260 -13427672 -14671699 -15068648 -15682967 -13578189 -6791654 -538754
36806 -538754 -1653953 -7536825 -8203473 -655907 6545487 6435449 3950316 7342241 15261384
36797 15261384 20079464 20512954 22303263 27025356 28489393 22355091 13058384 7977268
36789 7977268 8960113 12625250 15601989 16182065 13218491 6904898 -236900 -5633442
36781 -5633442 -9445608 -13420479 -17675138 -20261021 -19492349 -15424683 -9529366 -4104254
36773 -4104254 -1397863 -1783291 -2907926 -2064135 298698 601394 -3554465 -9678790 -11994210
36764 -11994210 -7057313 2704500 11575956 16244362 17765786 17771835 14734082 6138916
36756 6138916 -6132943 -15080394 -14401912 -4121478 10032093 21638747 27426195 27886456
36748 27886456 26101263 25662601 27931962 30514982 29110852 21652939 10748194 1838016
36740 1838016 -1272599 676868 3709530 4557880 2981721 379699 -2668310 -6468745
36732 -6468745 -10672834 -14283879 -16920652 -18280639 -16488520 -9582135 484797 8176771
36724 8176771 10844718 12456134 17868581 25440317 29620064 29852245 31327875 35763800
36716 35763800 37217976 30677314 20256477 13626568 11177026 6932878 -777553 -6348650
36708 -6348650 -5910378 -3188026 -3056237 -3845860 -481359 7430354 14993858 18163329 16873369
36699 16873369 13047838 8976050 7142033 8273888 9392622 6557932 -109017 -6207256
36691 -6207256 -7681966 -3730342 3923562 11650256 14418852 9517064 523718 -5474013
36683 -5474013 -5344410 -1822916 2059130 6271659 10224089 10489379 5324127 -1653874
36675 -1653874 -5823603 -7365614 -9167735 -10721389 -8277685 -785615 7897693 13325241
36667 13325241 14533362 13392046 12095716 11923744 12693918 12670546 10314719 6790477 5607278
36658 5607278 8808042 13942196 15749730 11372679 3814572 -463914 2177776 9456333
36650 9456333 16843788 22439278 26005103 25221312 17614245 6485242 -75139 1724630
36642 1724630 7277452 10955927 13142273 16128441 17321096 12419674 3239179 -3543131
36634 -3543131 -4782569 -2927844 -401970 2514733 4178401 1903210 -2966366 -5797325
36626 -5797325 -6157866 -8744841 -13980758 -13768289 -1972768 14975076 24296941 21849172
36618 21849172 14911571 10627360 7925262 2555583 -5216250 -11654581 -15276765 -17516103
36610 -17516103 -18848529 -18020490 -15337002 -13353312 -12820862 -10595149 -4124763 3558331
36602 3558331 6545518 3460628 -1057610 -2865556 -2941583 -3758614 -4171668 -1164989 4858909
36593 4858909 9767959 10302170 6756859 1709180 -1827967 -1853401 658147 2003336 286490
36584 286490 -1398232 808364 5295279 6785327 3922682 692580 -323556 -1531367
36576 -1531367 -5072980 -7793495 -4898659 2956410 9103872 7424736 -1457960 -10285190
36568 -10285190 -11550959 -4611262 4157249 9187172 11635849 14927934 17138390 13338707
36560 13338707 4924634 138087 3464578 10036358 13188120 12305536 9657553 4623485
36552 4623485 -3647693 -11391140 -13884121 -12215087 -11331593 -12561664 -12960519 -11282689
36544 -11282689 -9396103 -7406057 -2329847 6599122 14915135 17425645 13578599 6720056
36536 6720056 -95154 -5692693 -9367057 -10004295 -7026627 -1391701 4954642 10605793
36528 10605793 15230977 18473794 19301530 17372047 14007113 10228769 4940724 -2523363
36520 -2523363 -9045432 -10441279 -7421735 -4962137 -5291824 -5870096 -5365125 -6440173 -9973253
36511 -9973253 -11529168 -7718685 -2198066 -689712 -2886697 -3993176 -2223326 -260610
36503 -260610 -658866 -3579259 -7690418 -10266519 -8681854 -4926947 -5258312 -11223903 -15057949
36494 -15057949 -9848178 -624951 2148110 -2400965 -5740498 -4250686 -3794181 -8354094
36486 -8354094 -13078370 -12548665 -8996773 -7649058 -8864393 -8979458 -5175222 3334823
36478 3334823 14855716 23486248 22556596 12809432 2749794 -1944951 -4445924 -9201623
36470 -9201623 -14322501 -16355627 -17152132 -19604190 -20778177 -16576513 -10545729 -10358565
36462 -10358565 -16399879 -21011518 -19458537 -15205471 -13089214 -13054349 -12699154 -11189784
36454 -11189784 -8283076 -3558156 890814 640901 -5406141 -12665413 -17086970 -20766726
36446 -20766726 -27591549 -35566632 -38401927 -34430843 -29090033 -26930083 -25171689 -18431119
36438 -18431119 -7459937 929466 2308924 -733419 -3312020 -4245945 -5227250 -6576839
36430 -6576839 -6989115 -6404695 -6109115 -6209242 -5620321 -4537747 -4253987 -4102684 -1353057
36421 -1353057 4494408 9327346 8170141 637189 -8296440 -12472461 -9212022 -711366
36413 -711366 8554428 15746068 20459535 21763593 16990252 5930479 -5348237 -8567765
36405 -8567765 -1579900 9686967 17587163 18681529 13756420 5436474 -3176678 -9963156
36397 -9963156 -14923053 -18352422 -18284492 -12407074 -2459855 6286705 10377343 10534537 8985371
36388 8985371 7509997 7778967 10033940 11671615 10823842 10328098 13119375 14902691 8814098
36379 8814098 -2036646 -5403228 3350614 13517096 13424030 5515898 400030 1698627
36371 1698627 4765726 6508700 8087515 9567642 9268890 7964904 8016599 9150066 10059244
36362 10059244 12474682 18101135 23241273 22518622 16604660 10077998 3104886 -7449238
36354 -7449238 -19099101 -23914239 -19055433 -10257779 -3036207 2831519 7567198 7043258
36346 7043258 -1202328 -12134779 -17968415 -16213569 -10162911 -4287056 -1921113 -4585593
36338 -4585593 -10129895 -13046449 -9396996 -1040092 5998358 6506445 -255879 -9579980
36330 -9579980 -14035446 -10106807 -2577193 486967 -2693149 -6249709 -4907959 536927
36322 536927 6709016 11975033 15388218 15683621 14206616 15345162 20796998 25998435
36314 25998435 25382687 19214253 12347377 7899110 5064105 2070348 -1640110 -6144866
36306 -6144866 -11804402 -18390599 -23892521 -24934530 -19662938 -10827565 -4177643 -2131527
36298 -2131527 -1191657 1754835 3455834 -611881 -7266187 -8373063 -2569133 2649407
36290 2649407 2038306 -1110968 -2715766 -5069818 -11204881 -17325397 -17077222 -10493490
36282 -10493490 -3211375 1312460 3830451 4949568 3840373 1442543 1004585 4230652
36274 4230652 8743863 10073450 5912495 -825117 -3462624 1601027 9401628 11154432
36266 11154432 5276308 -501780 267370 4826346 7128875 7237036 10008124 16983845
36258 16983845 24054122 25839736 19540467 6856780 -4881738 -6695682 2731731 14191093
36250 14191093 18501388 17244319 18269509 23308389 26420438 23830233 18903062 16335334
36242 16335334 16357754 16319835 14476751 10716923 5976862 1929149 -264753 -910493 -447629
36233 -447629 1484002 4088677 4724551 2616248 898994 1901902 2855663 19308 -5267674
36224 -5267674 -8940311 -10442714 -11719609 -11772173 -7842860 -1349098 2838111 3257038 3393459
36215 3393459 6153764 10726206 14600693 15062297 10084573 2095075 -1320532 3707370
36207 3707370 9824192 7163303 -1725662 -4473547 3325082 12731933 16171378 17138214
36199 17138214 20013068 19878060 11047751 -773590 -4607482 551765 5372289 3969091
36191 3969091 148610 -709106 824276 1179715 -325099 -1377509 -134372 3103155
36183 3103155 6467109 7828925 6341878 3119712 157682 -881514 1428865 7909327
36175 7909327 16680113 22474964 20398566 11148708 1585942 -1015378 4044128 9919603
36167 9919603 9453033 3393509 -818835 817482 3522160 1201853 -4490717 -7350497
36159 -7350497 -6025034 -4037846 -2143707 1996248 6690746 6698313 2322758 211718 2304527
36150 2304527 1658093 -6589911 -17253557 -23305913 -25610812 -28352740 -30374530 -27991263
36142 -27991263 -22039739 -15180730 -6043815 6605682 17082196 18094926 11053199 3807258
36134 3807258 -240690 -3378191 -5566012 -3845894 -30433 -560287 -6645534 -11516299
36126 -11516299 -9954295 -4726776 -1380154 -2165732 -7106094 -15193362 -21822072 -20797203
36118 -20797203 -12610632 -5958298 -7193746 -12548805 -14873615 -13903350 -14502515 -17407141
36110 -17407141 -17664233 -12109366 -3916391 1329833 1595785 -292952 46143 4028961
36102 4028961 8075481 6754494 -1054666 -9922998 -12891058 -8099146 504277 8243146
36094 8243146 14058205 19683152 25587730 29114303 27614880 22690021 18866973 17319804
36086 17319804 13836965 5314895 -4453092 -9038313 -7394966 -3300190 1654124 8961714
36078 8961714 17175455 20948751 17959848 12040503 7251893 3146322 -1727413 -5945628
36070 -5945628 -8043122 -9598166 -11953041 -12833421 -9955481 -5669915 -4235127 -6054462
36062 -6054462 -8077221 -8719901 -9036391 -9488851 -8360629 -3718418 4113039 11647427 14084855
36053 14084855 10456288 6920978 10830728 20279421 24775545 19337616 12202611 13069383
36045 13069383 18694426 18061766 9037701 651059 -1197298 -1015336 -3934536 -6831744
36037 -6831744 -4553577 654940 2328496 -419147 -1991779 1782542 9314134 16450005
36029 16450005 20223527 19333479 14366720 8576621 5999337 7417740 9465722 8616073
36021 8616073 5103703 2231956 2660461 6207003 10767013 14320240 15833672 15077659
36013 15077659 12588876 9951719 9310064 11900191 17069269 22709525 26239017 25557640
36005 25557640 20622068 14625302 11819838 12717194 12913590 8582791 1845306 -1784560
35997 -1784560 -379060 2908312 4860379 5202368 4157111 791232 -4378981 -8161296
35989 -8161296 -8549049 -7755055 -9035010 -12192307 -14623332 -15277783 -14830674 -12939060 -8282654
35980 -8282654 -1239172 5736846 10444094 12121705 11065581 8966885 8558906 10345746
35972 10345746 10712954 6712825 2121515 4217257 13626284 21965196 21957687 15934487 10940515
35963 10940515 8769598 5427513 -1387155 -9239869 -15177400 -18718047 -20047957 -18880447
35955 -18880447 -16242261 -14509639 -14421770 -14183680 -12232287 -8894560 -5315072 -3305815
35947 -3305815 -5641567 -12345795 -16751066 -11204509 1254695 7431022 749739 -8412116
35939 -8412116 -6094275 6004204 13760333 11333710 8313827 14196348 25033039 30471857
35931 30471857 27281865 20034659 13214128 8718253 7808790 9567415 9558210 5317533 1248027
35922 1248027 2878149 8254999 10819552 9073213 6515447 2853483 -6357447 -19597461
35914 -19597461 -27080759 -22884949 -13120678 -6924493 -4585473 -776212 4524032 5915408
35906 5915408 1842094 -3258713 -6382516 -9141460 -12123067 -12057124 -7697172 -3965021
35898 -3965021 -6118818 -12322140 -15740279 -12629438 -5261228 2038180 6502469 7007745
35890 7007745 3915703 -211196 -2065727 -1224822 -1059598 -4651989 -10416942 -13180210
35882 -13180210 -9933498 -3707602 -804149 -4042324 -9595526 -11303685 -7466884 -1994247
35874 -1994247 855191 798428 90108 161299 1482334 4981154 10980873 17381105 21335264
35865 21335264 22631003 23305046 24072291 23565534 21357493 19081540 17554325 15111088
35857 15111088 10292688 4486717 454606 -511019 946786 2993125 2981574 -660857
35849 -660857 -5515262 -6565991 -2525471 1719931 1667522 -300263 1331817 6975113 12110990
35840 12110990 14568238 16125160 16573240 12160907 2370930 -6641071 -8849596 -5065997
35832 -5065997 427889 6275808 12631864 16290993 13146351 5012982 -1250682 -2291578
35824 -2291578 -1761828 -4132167 -8891005 -12773134 -14491599 -14810840 -14294525 -13409089 -12952293
35815 -12952293 -12018575 -7469054 1685079 11027884 15490010 16328363 18838120 22904714
35807 22904714 21318829 10336407 -2706945 -7283153 -2586600 3045897 4417061 4471761
35799 4471761 5864788 4538907 -3768357 -15322644 -22429125 -23254759 -22176973 -21725275
35791 -21725275 -19743015 -14379811 -6718972 2007288 10887336 16359277 14214522 6402143
35783 6402143 736391 1244525 3521614 2675787 968457 3209690 8598968 12286493
35775 12286493 12335515 10320419 7379463 4487654 4343043 7690647 9723447 5924937
35767 5924937 -12 -434690 4638097 7451757 4366433 869338 2603317 7756954
35759 7756954 11344623 11638955 9271213 5088547 2285142 5513436 13683826 18354819
35751 18354819 14207734 7095372 6213744 11621662 15644470 14395938 11401964 10532109
35743 10532109 11274344 11286523 8793035 2376247 -6918495 -13237116 -10731945 -1499868
35735 -1499868 5966104 7203466 6001021 7080877 9727325 10970840 10297078 7943649
35727 7943649 2517291 -5836881 -12729630 -13640687 -8764738 -1205251 6689871 12020042
35719 12020042 10045494 -439013 -12248434 -15863565 -10109170 -2334117 1415422 1217592
35711 1217592 -1540774 -7271476 -14182185 -16910997 -13244528 -8277448 -7584126 -9323416
35703 -9323416 -7957256 -3685880 -2558122 -7380446 -13716674 -16396492 -16117804 -17427835
35695 -17427835 -22630805 -29638849 -34183167 -32677901 -24422990 -12540002 -1959055 4267390
35687 4267390 5932389 3560740 -1963686 -7145630 -6887705 -446286 5969931 5815118
35679 5815118 159927 -4084511 -2970625 942485 3589711 4047753 3152261 957868
35671 957868 -2304169 -5139582 -6899528 -9113857 -12439766 -14119683 -11610402 -7639285
35663 -7639285 -7657384 -11750449 -13049449 -6445759 4071449 10080769 8951023 5475406
35655 5475406 3987361 3655409 2964008 4057650 8782868 13450749 12500196 6415440 1320287
35646 1320287 560671 1119756 -681132 -4198064 -6864570 -7645638 -5967102 -1038733 5073595
35637 5073595 7566454 5636754 5516129 12359873 22193686 27131064 26007937 23586080
35629 23586080 20942629 14415512 4791516 -291942 3350435 9429566 8866714 898630
35621 898630 -7457481 -10433833 -8299710 -4730311 -2612351 -2089517 -1272456 648423 1368674
35612 1368674 -1166311 -4016325 -2091819 3841095 7244247 5501757 3486079 4240812
35604 4240812 2784496 -4906388 -12458883 -10934296 -2741735 1603648 -328304 164601
35596 164601 7723960 14031468 9585571 -2060429 -8777435 -5420548 1649577 4678719
35588 4678719 3147292 919463 -646121 -3296671 -7241922 -9405950 -7331397 -2993862
35580 -2993862 -890492 -2895377 -6930600 -10699892 -14261283 -17814168 -19321990 -16536016
35572 -16536016 -10053544 -2413454 4637255 10099334 12491836 11293668 8752147 7730951
35564 7730951 8248471 8218711 6776915 4713165 2785033 2136886 4958149 11360186 16678443
35555 16678443 15973740 11129283 9453949 14567287 22180287 25740718 22983079 16024952
35547 16024952 8430476 3742411 4025762 7801977 10887658 10209593 5614732 -1494726
35539 -1494726 -8718703 -12341473 -10066606 -4556656 -914028 -158411 1206620 4591579
35531 4591579 6612991 4643781 1154513 147896 2149431 4715780 5423470 2987117
35523 2987117 -1935512 -6130328 -7020710 -6847253 -9709958 -14216387 -14501079 -9656555 -5591721
35514 -5591721 -4957329 -2451394 5314367 12286542 11745443 6594906 3090755 -642484
35506 -642484 -10206481 -21916071 -24865172 -16431850 -6361093 -3282523 -5221891 -6552791
35498 -6552791 -6991262 -8865336 -10651914 -8669189 -2810916 3261801 6247826 5282410
35490 5282410 1718232 -1201424 -258431 4189895 7781399 6569045 855405 -5821120
35482 -5821120 -9892997 -9520321 -5113414 895180 5896713 9050229 10623850 10317094
35474 10317094 7956067 4816523 1962681 -1757732 -7503754 -13382040 -16671299 -18026549
35466 -18026549 -20024362 -22604748 -23834895 -23990043 -24161245 -21826796 -13635087 -2560704
35458 -2560704 4062810 4667353 5107053 8332742 9376053 4285122 -2230372 -3289383
35450 -3289383 491712 3049785 1402575 -2587034 -6413363 -8684939 -8835654 -8483573
35442 -8483573 -10525970 -13864858 -12641721 -4676035 3155750 3157446 -2591358 -5615117 -2908100
35433 -2908100 444814 -797254 -7192065 -16871812 -26789815 -31665383 -27290321 -16119574
35425 -16119574 -5545357 30952 1985408 2894917 3730225 5645118 9685101 13769841
35417 13769841 14246891 11517348 10186451 12595782 15962776 16885107 14981850 11278038
35409 11278038 6890978 4149189 4884143 6723131 5550413 2557777 3400467 8459531
35401 8459531 10118632 3641504 -4628834 -5355742 1251744 6888102 6956251 5018851 6050677
35392 6050677 10520606 15968502 20508733 23314119 23932422 22300690 18615065 13373076
35384 13373076 8053760 4194326 646109 -5879318 -15297130 -21655992 -19526434 -11115912
35376 -11115912 -3300161 918827 3583462 5525738 4689565 1659652 1311477 5963564
35368 5963564 10864235 10182459 4935029 1162850 1671011 3363822 2522758 -616178 -3225858
35359 -3225858 -3198088 113758 6377017 13513427 17373818 14498865 6032568 -2164312
35351 -2164312 -4437739 -434160 5082567 7238598 5317368 2364368 1701697 4267479
35343 4267479 8439165 11468450 11275048 7617272 1952032 -3528829 -6506754 -5018816
35335 -5018816 1123904 9262470 15778648 19520794 21733114 22174525 18039964 8727707
35327 8727707 -706209 -4106094 -1156485 3285264 5792625 6594497 5794823 2346219
35319 2346219 -1857751 -1686529 4291293 10162734 9827994 5225757 3139958 5694127
35311 5694127 9087630 11102619 14075410 18946471 21612768 18628375 13029725 10340575
35303 10340575 10576883 8353915 632299 -9183556 -15642248 -17247469 -16921582 -17959918
35295 -17959918 -20588309 -22031659 -19744407 -14806697 -11296005 -11298143 -11719866 -8085458 -796485
35286 -796485 4995155 5726683 2838337 -650314 -3847394 -6702317 -7753209 -5623027
35278 -5623027 -1202963 3652996 8113009 11267177 11183024 7879822 5533504 8078919
35270 8078919 13306808 15077859 11489050 7067137 5911914 6275339 3981163 -1442766
35262 -1442766 -6495742 -7925007 -5024545 1092120 8213169 13257287 13518618 8316705
35254 8316705 -588494 -9704079 -15120480 -14705677 -9861167 -4224564 -199203 2252929
35246 2252929 3502938 3059342 1249990 -45981 178402 551347 -255519 -1162524 -443301
35237 -443301 1526534 3084835 3619210 3254828 1426278 -2252076 -6855215 -11926665 -18815127
35228 -18815127 -27273849 -32055481 -27258538 -14694072 -3989763 -2418083 -7415252 -11304996
35220 -11304996 -10777191 -8424579 -6483304 -3466414 1939498 7015467 7841024 4705506
35212 4705506 1850163 1717029 2038359 -248780 -4513710 -8064586 -10692428 -14540662
35204 -14540662 -19831092 -23919088 -25277663 -25557568 -26339576 -26249418 -23145195 -17595815 -12596880
35195 -12596880 -10815404 -12657441 -15455384 -14640614 -8758226 -3699094 -7530465 -19269874
35187 -19269874 -27775962 -25329994 -17391254 -13693392 -14386456 -12597444 -7656427 -6042247
35179 -6042247 -8718278 -7056177 4743264 20055563 27383085 22853242 11178364 -1554033
35171 -1554033 -11505076 -16660065 -17465194 -16614179 -15542244 -13057079 -9281289 -7524876
35163 -7524876 -9339374 -11277601 -10386159 -9638145 -13230347 -19050854 -21106767 -17925741
35155 -17925741 -13270819 -9400174 -5209239 -1249066 -912676 -4762000 -8107208 -6833555
35147 -6833555 -2678437 -362014 -1681553 -4631765 -6725507 -7019588 -5754781 -3944646
35139 -3944646 -3321080 -5474528 -10437979 -16119771 -19457237 -18853827 -15683013 -12505056
35131 -12505056 -9549646 -4454791 3688475 11789887 15804881 14897231 10877549 5084839
35123 5084839 -1736788 -7480965 -9466513 -7386613 -3639501 -586486 1313102 2939518
35115 2939518 5138449 7494214 8118879 6013031 3754987 5016789 8462539 8026739
35107 8026739 1672800 -4403133 -4282497 -904110 -540560 -2170304 251072 6619029
35099 6619029 10166151 8804804 8956685 15300299 23266745 25424510 20368305 11869603
35091 11869603 3614378 -1762508 -2300530 965909 3982339 4398472 3495231 2056562
35083 2056562 -1340251 -5880047 -7309385 -4126212 -106717 2549258 7071598 14825876
35075 14825876 19996048 17594961 11860393 9676025 9805622 6702067 1819459 1817893 6680716
35066 6680716 9137078 6682647 5119740 7815550 9901098 7108667 3093162 2700931
35058 2700931 3601988 666395 -5034308 -7742873 -5894231 -4206995 -6912055 -12500178
35050 -12500178 -15809875 -13513997 -7465570 -3420727 -5713850 -12710720 -18686525 -20034531
35042 -20034531 -17382069 -11958469 -3971946 4165755 7491532 4360748 -783226 -3727544
35034 -3727544 -6138779 -10821967 -14665003 -12156093 -4436921 1453579 2702486 4112473
35026 4112473 9539384 15324028 15733371 11137815 6685557 5240893 5872863 8001673
35018 8001673 12345705 17221321 17945151 12127465 3507298 -1495745 -131224 4912203
35010 4912203 8883378 8687877 4141391 -2735303 -9549447 -15338151 -20231218 -23229573
35002 -23229573 -22039728 -16488657 -10509210 -8494027 -10559148 -13514380 -15310615 -15754939
34994 -15754939 -14134967 -10116314 -6427110 -5903767 -5673565 100983 10317818 16232719
34986 16232719 13910343 10791959 14470475 21020649 22203516 19560578 21314746 27115377
34978 27115377 27004013 17458403 8426914 9612327 17269994 20460883 15246213 7037586
34970 7037586 2539823 4519039 11804324 19733402 22460077 18607467 12891754 9365287
34962 9365287 5976341 -661335 -8305063 -11595793 -9415766 -5126126 -1136644 2119255
34954 2119255 3179697 580049 -3507589 -5215686 -4504265 -4581137 -6001014 -5980408 -4196470
34945 -4196470 -4615135 -9626983 -15650008 -16536901 -9393717 3637213 16858764 23763611
34937 23763611 21522701 14405843 10604733 14267951 22065998 27704043 27297826 20101709
34929 20101709 7850125 -4306876 -9239478 -3995813 5930195 11114008 7514926 70420
34921 70420 -3269420 -187531 3981502 2760860 -3885377 -9839282 -10686802 -9086076 -10707583
34912 -10707583 -16595417 -22258156 -23781267 -22125819 -20865065 -21496527 -21792277 -18289343
34904 -18289343 -10731353 -4152960 -4555996 -11193532 -15642300 -11104945 -423972 8246452
34896 8246452 11257057 10649251 7791086 1857664 -5694809 -11181754 -14203124 -17795519
34888 -17795519 -21916885 -22240490 -17334372 -11853486 -10230454 -11935178 -15043548 -19037845
34880 -19037845 -21421200 -17775879 -9379385 -4871169 -9033903 -15337363 -15901628 -13676934
34872 -13676934 -16654759 -23716638 -25709693 -19479486 -11811200 -8857791 -9856468 -12690617
34864 -12690617 -17483893 -21678371 -18923462 -7535793 5039379 10519940 8617786 4177359
34856 4177359 -185262 -4405873 -7543661 -8648961 -8770531 -8401166 -5433642 602686
34848 602686 5090893 3801519 -283328 -817501 2501399 4043433 1704511 261873
34840 261873 3374219 7338011 6412812 1274804 -1781111 1072557 7049639 10530817
34832 10530817 8749328 3537579 -850935 -1141559 2477622 6358335 6302900 1267383
34824 1267383 -5530285 -9337262 -8070382 -4158573 -2202518 -4523059 -8932395 -11054474
34816 -11054474 -8797106 -4226129 -983231 -349081 -428562 851755 2876218 3430551 2361928
34807 2361928 2507280 5896310 10195461 10910508 6950354 1822446 -1348139 -3715951
34799 -3715951 -7875350 -12837531 -14610618 -11514094 -6318826 -2458547 -330696 1303013
34791 1303013 1959615 -466462 -6755977 -15101972 -22597326 -26727960 -25871182 -20281650
34783 -20281650 -12893985 -7155715 -3085281 2639845 11038235 17113859 14862626 5719679
34775 5719679 -1227205 1200067 10612609 18443337 19140924 13989729 7203179 1088220
34767 1088220 -4634076 -10659812 -16212283 -18931745 -16918321 -11392702 -6293530 -4072789
34759 -4072789 -3230263 -1930439 -2401514 -8126189 -17131044 -22652787 -21865582 -19477621 -19714787
34750 -19714787 -18936708 -11343839 499368 7546426 7010375 6589501 12887371 21052136
34742 21052136 21394975 13262530 5635763 4085872 3790076 -1738003 -10252619 -13989696
34734 -13989696 -10334961 -3706018 2199608 7984066 13161849 13067387 5143814 -5285909
34726 -5285909 -10337649 -9117525 -7641328 -9932243 -13508709 -14024524 -10461351 -4757772
34718 -4757772 252681 1407116 -2676391 -8190041 -8107812 -25968 10551499 17020673
34710 17020673 18872312 19260597 18591911 14986343 9244432 4420309 1044431 -2514949
34702 -2514949 -4969193 -2503713 4459672 9673033 8788460 4952601 3688950 5217714
34694 5217714 5411723 2344010 -1930835 -5233409 -7376183 -8417017 -7759563 -5717250
$$ [...]
##END NTUPLES=NMR SPECTRUM
##END=
