##TITLE=31Pdec_B4f-2
 CDCl3, 24 sc
 25.6.2024
##JCAMPDX= 6.0         $$ Bruker NMR JCAMP-DX V2.0
##DATA TYPE= NMR SPECTRUM
##DATA CLASS= NTUPLES
##ORIGIN= UXNMR, Bruker Analytische Messtechnik GmbH
##OWNER= root
$$ XWIN-NMR		Version 3.5
$$ Tue Jun 25 14:47:06 2024 Russian Standard Time (UT+4h)  she@DPX200
##.OBSERVE FREQUENCY= 81.013821
##.OBSERVE NUCLEUS= ^31P
##.ACQUISITION MODE= SIMULTANEOUS
##.ACQUISITION SCHEME= undefined
##.AVERAGES= 24
##.DIGITISER RES= 17
##SPECTROMETER/DATA SYSTEM= spect
##.PULSE SEQUENCE= zgpg30
##.SOLVENT NAME= DMSO
##.SHIFT REFERENCE= (INTERNAL, DMSO, 0, 182.463)
##AUDIT TRAIL= $$ (NUMBER, WHEN, WHO, WHERE, WHAT)
$$ ##TITLE= Audit trail, XWIN-NMR		Version 3.5
$$ ##JCAMPDX= 5.01
$$ ##ORIGIN= Bruker BioSpin GmbH
$$ ##OWNER= she
$$ F:/spectra/data/she/nmr/P31/2/pdata/1/auditp.txt
$$ ##AUDIT TRAIL=  $$ (NUMBER, WHEN, WHO, WHERE, WHAT)
(   1,<2024-06-25 14:44:40.06 +0400>,<she>,<DPX200>,
      <created by zg, POWCHK disabled, PULCHK disabled
       configuration hash MD5:
       00 E9 B6 7A A2 85 ED C7 34 08 36 98 17 FE 4E 26
       data hash MD5: 32K
       12 96 2A 2C B1 C3 94 E4 5F E3 4B 52 97 96 03 C3>)
(   2,<2024-06-25 14:44:43.46 +0400>,<she>,<DPX200>,
      <Start of raw data processing
       efp BC_mod = 2 LB = 1.5 FT_mod = 6 PKNL = 1 PHC0 = 2855.718 PHC1 = 187.0862 SI = 64K 
       data hash MD5: 64K
       55 59 C3 D1 B9 4B DD F5 B8 B5 B1 A7 45 0E 27 69>)
(   3,<2024-06-25 14:44:58.73 +0400>,<she>,<DPX200>,
      <pk PHC0 = -80.50696 PHC1 = 0 
       data hash MD5: 64K
       DB 1C C5 5B 05 17 35 93 67 F4 2A 19 97 43 CC 0E>)
(   4,<2024-06-25 14:45:16.51 +0400>,<she>,<DPX200>,
      <pk PHC0 = -1.268124 PHC1 = 16.8 
       data hash MD5: 64K
       71 7C 9C 46 B3 D3 46 1E A4 62 AB 77 9E 39 C1 AD>)
$$ ##END=
$$ 
$$ hash MD5
$$ 45 FF D2 BB 88 EC 9F F2 92 54 9C 01 B6 41 4D 3D
##$RELAX= 
##$RELAX= 
##$RELAX= 
##$RELAX= 
##$RELAX= 
##$RELAX= 
##$RELAX= 
##$RELAX= 
$$ Bruker specific parameters
$$ --------------------------
##$DU= <F:/spectra>
##$EXPNO= 2
##$NAME= <P31>
##$PROCNO= 1
##$TYPE= <nmr>
##$USER= <she>
##$AMP= (0..31)
100 100 100 100 100 100 100 100 100 100 100 100 100 100 100 100 100 100 
100 100 100 100 100 100 100 100 100 100 100 100 100 100 
##$AQSEQ= 0
##$AQ_mod= 1
##$AUNM= <au_zg>
##$AUTOPOS= <>
##$BF1= 81.014009
##$BF2= 200.13
##$BF3= 200.13
##$BF4= 200.13
##$BF5= 200.13
##$BF6= 200.13
##$BF7= 200.13
##$BF8= 200.13
##$BYTORDA= 1
##$CFDGTYP= 0
##$CFRGTYP= 5
##$CHEMSTR= <none>
##$CNST= (0..31)
1 1 145 1 1 1 1 1 1 1 1 1 1 1 1 1 1 1 1 1 1 1 1 1 1 1 1 1 1 1 1 1 
##$CPDPRG= <waltz16>
##$CPDPRG1= <>
##$CPDPRG2= <waltz16>
##$CPDPRG3= <>
##$CPDPRG4= <mlev>
##$CPDPRG5= <mlev>
##$CPDPRG6= <mlev>
##$CPDPRG7= <mlev>
##$CPDPRG8= <mlev>
##$CPDPRGB= <>
##$CPDPRGT= <>
##$D= (0..31)
0 1 0 0 0 0 0 0 0 0 0 0.03 2e-05 3e-06 0 0 0 0 0 0 0 0 0 0 0 0 0 0 0 0 
0 0 
##$DATE= 1719312279
##$DBL= (0..7)
120 120 120 11 120 120 24 19 
##$DBP= (0..7)
150 150 150 150 150 150 150 150 
##$DBP07= 0
##$DBPNAM0= <>
##$DBPNAM1= <>
$$ [...]
##$SUBNAM2= <"">
##$SUBNAM3= <"">
##$SUBNAM4= <"">
##$SUBNAM5= <"">
##$SUBNAM6= <"">
##$SUBNAM7= <"">
##$SUBNAM8= <"">
##$SUBNAM9= <"">
##$SW= 369.568048894756
##$SWIBOX= (0..15)
0 1 3 0 0 0 0 0 0 0 0 0 0 0 0 0 
##$SW_h= 29940.119760479
##$TD= 32768
##$TD0= 1
##$TE= 0
##$TE2= 300
##$TE3= 300
##$TEG= 300
##$TL= (0..7)
0 120 53 12 22 120 120 120 
##$TP= (0..7)
150 150 150 150 150 150 150 150 
##$TP07= 0
##$TPNAME0= <>
##$TPNAME1= <>
##$TPNAME2= <>
##$TPNAME3= <>
##$TPNAME4= <>
##$TPNAME5= <>
##$TPNAME6= <>
##$TPNAME7= <>
##$TPOAL= (0..7)
0.5 0.5 0.5 0.5 0.5 0.5 0.5 0.5 
##$TPOFFS= (0..7)
0 0 0 0 0 0 0 0 
##$TUNHIN= 0
##$TUNHOUT= 0
##$TUNXOUT= 0
##$USERA1= <user>
##$USERA2= <user>
##$USERA3= <user>
##$USERA4= <user>
##$USERA5= <user>
##$V9= 5
##$VALIST= <valist>
##$VCLIST= <CCCCCCCCCCCCCCC>
##$VD= 0
##$VDLIST= <DDDDDDDDDDDDDDD>
##$VPLIST= <PPPPPPPPPPPPPPP>
##$VTLIST= <TTTTTTTTTTTTTTT>
##$WBST= 1024
##$WBSW= 4
##$XGAIN= (0..3)
0 0 0 0 
##$XL= 0
##$YL= 0
##$YMAX_a= 14618
##$YMIN_a= -19222
##$ZGOPTNS= <>
##$ZL1= 120
##$ZL2= 120
##$ZL3= 120
##$ZL4= 120
##$ABSF1= 0
##$ABSF2= 0
##$ABSG= 0
##$ABSL= 0
##$ALPHA= 0
##$AQORDER= 0
##$ASSFAC= 0
##$ASSFACI= 0
##$ASSFACX= 0
##$ASSWID= 0
##$AUNMP= <proc_1d>
##$AZFE= 0.1
##$AZFW= 0.5
##$BCFW= 0
##$BC_mod= 2
##$BYTORDP= 0
##$COROFFS= 0
##$CY= -3
##$DATMOD= 1
##$DC= 0
##$DFILT= <>
##$DTYPP= 0
##$F1P= 0
##$F2P= 0
##$FCOR= 1
##$FTSIZE= 65536
##$FT_mod= 6
##$GAMMA= 0
##$GB= 0
##$INTBC= 1
##$INTSCL= 9.790993e-09
##$ISEN= 30
##$LB= 1.5
##$LEV0= 0
##$LPBIN= 0
##$MAXI= 10000
##$MC2= 0
##$MEAN= 0
##$ME_mod= 0
##$MI= 50
##$NCOEF= 0
##$NC_proc= -7
##$NLEV= 6
##$NOISF1= 182.463
##$NOISF2= 159.3651
##$NSP= 0
##$NTH_PI= 0
##$NZP= 0
##$OFFSET= 182.463
##$PC= 4
##$PHC0= 2773.943
##$PHC1= 203.8862
##$PH_mod= 1
##$PKNL= yes
##$PPARMOD= 0
##$PSCAL= 0
##$PSIGN= 0
##$REVERSE= no
##$SF= 81.0140089999434
##$SI= 65536
##$SIGF1= 159.3651
##$SIGF2= -187.1042
##$SINO= 113.3802
##$SIOLD= 16384
##$SREGLST= <1H.CDCl3>
##$SSB= 0
##$STSI= 65536
##$STSR= 0
##$SW_p= 29940.119760479
##$SYMM= 0
##$S_DEV= 0
##$TDeff= 32768
##$TDoff= 0
##$TI= <>
##$TILT= no
##$TM1= 0
##$TM2= 0
##$TOPLEV= 0
##$USERP1= <user>
##$USERP2= <user>
##$USERP3= <user>
##$USERP4= <user>
##$USERP5= <user>
##$WDW= 1
##$XDIM= 65536
##$YMAX_p= 337315032
##$YMIN_p= -25806623
$$ End of Bruker specific parameters
$$ ---------------------------------
##NTUPLES= NMR SPECTRUM
##VAR_NAME=  FREQUENCY,     SPECTRUM/REAL,   SPECTRUM/IMAG
##SYMBOL=    X,             R,               I
##VAR_TYPE=  INDEPENDENT,   DEPENDENT,       DEPENDENT
##VAR_FORM=  AFFN,          ASDF,            ASDF
##VAR_DIM=   65536,         65536,           65536
##UNITS=     HZ,            ARBITRARY UNITS, ARBITRARY UNITS
##FACTOR=    0.456856943014862, 1,           1
##FIRST=     14782.0589164792, 0,            0
##LAST=      -15158.0608439998, 0,           0
##MIN=       -15158.0608439998, -25806623,   0
##MAX=       14782.0589164792, 337315032,    0
$$ Real data points
##PAGE= N=1
##DATA TABLE= (X++(R..R)), XYDATA
$$ [...]
42317a315696M44888R86077J000547O65652L71518J61523n4898j60011p061L13623
42307B406162N84674O52642M50633N2360l09355n28504q12979j230721j277420
42298a2508m87561O38446J067247O36249K11691K86870L43926k7139l46116j95112
42288B115993n3137l73365o38302l01526P6885j80609l87328N15275J829300J679958
42278D283144j43575j614164j283874j59370Q7954n49833j025977j109350j237694
42269b752739j160635k43039J071763J502203P89170J40366M53274J074510Q77775
42260A752648j51670j066878j254862r34357n33719j38600L55743Q74034J136008
42251C8347R62607N43367L22129N15584P73208M82368n16974j633760k047978
$$ y = [-1315696, -870808, 115269, 1115816, 1781468, 2152986, 2314509, 2259611, 2099600, 2092539, 2406162, 2990836, 3643478, 4094111, 4146471, 3837116, 3308612, 2495633, 1264912, -12508, -500069, 138377, 1205624, 1841873, 2053564, 2340434, 2684360, 2657221, 2311105, 2115993, 2062856, 1689491, 1051189, 749663, 826548, 645939, 258611, 773886, 2603186, 4283144, 4139569, 2525405, 1241531, 1082161, 1170115, 620282, -405695, -1515045, -2752739, -3913374, -4156413, -3084650, -1582447, -793277, -652911, -199637, 874873, 1752648, 1600978, 534100, -720762, -1655119, -2188838, -2327438, -1971695, -1097661, 38347, 1000954, 1544321, 1866450, 2382034, 3155242, 3637610, 3120636, 1486876, -561102]
42242e61102j516829o13878j54895l88795p78285o03662K65379J264412J724138
42233a363517J430918O70937o1306l91216l24273k28552l90349o27678n94932
42224a879968l79362l60858m71246j68480O28224J150408P58739j23018n61096
42215a406657k90126J84215M21426M13934K33706j23074m99889o22797m55910
42206b145172k22858p8396r225K1947R8444L72448P55712P67495Q7460q70944
42196a223089j348752j099510m77422J64058O87554R27069P83789N28907M87874
42187e69522M56439j2144p41920r76974m12590L74083O97598M87569R2886j63074
42177g67649q7299K59312M23331L5918m75239k54124P07767J324571Q19042k13107
$$ y = [-561102, -2077931, -2691809, -2846704, -3235499, -4013784, -4617446, -4352067, -3087655, -1363517, 67401, 738338, 677032, 285816, -38457, -267009, -657358, -1285036, -1879968, -2259330, -2620188, -3091434, -3259914, -2631690, -1481282, -722543, -845561, -1406657, -1696783, -1512568, -1091142, -677208, -443502, -566576, -1066465, -1689262, -2145172, -2368030, -2446426, -2455651, -2433704, -2335260, -1962812, -1207100, -439605, -352145, -1223089, -2571841, -3671351, -4148773, -3984715, -3297161, -2370092, -1586303, -1057396, -569522, -113083, -125227, -867147, -1844121, -2256711, -1882628, -1185030, -697461, -604575, -767649, -854948, -595636, -172305, -136387, -611626, -865750, -157983, 1166588, 1985630, 1772523]
42167A772523o47234k94087O6378j12863m64783k55372O91975J707749J893225
42158D357511J074690J3687n27285o63835r01713j089138o57160J74051M09608
42149B190416k53133q89037o93365j6669M65267P74323J133308J195232O12857
42140D519199j73291n54742p11895j124372j537176j310412n23235J38244M04592
42131h73088N28008N47749K69608j46670l62991m99780q15241r15434j97295R68459
42121a496675J454921Q90731P9839k37575j81097q5761N3082J47607j61183p91994
42111c28105r93593l17397O74218J086491O76954j24397p39665p41987j13012
42102i20493N34023M54327k76335p98198o31651j94880O9925L42313P59241Q30281
$$ y = [1772523, 1125289, 831202, 897580, 784717, 319934, 64562, 756537, 2464286, 4357511, 5432201, 5445888, 4918603, 4254768, 3353055, 2263917, 1606757, 1780808, 2190416, 1937283, 1048246, 354881, 338212, 803479, 1577802, 2711110, 3906342, 4519199, 4345908, 3791166, 3079271, 1954899, 417723, -892689, -1415924, -1277680, -873088, -345080, 202669, 472277, 325607, -37384, -537164, -1352405, -2267839, -2465134, -1496675, -41754, 848977, 928816, 691241, 510144, 424383, 477465, 625072, 463889, -328105, -1321698, -1639095, -964877, 121614, 798568, 674171, -65494, -807481, -920493, -386470, 67857, -208478, -1006676, -1638327, -1833207, -1763282, -1420969, -661728, 168553]
42092A68553J78881o46858q10257l13224J37610J50844m1316j33273r3456l5074
42082a437570q6589k74402l26214J15431Q42744J065021M05181n09539q74187
42073a080124o64802k70310L01285J112687J610714J172068J87070k91762M865
42064B081691L00339N1975l48086m16638l38156m21373m18318J9031N76075N82416
42054A668956l6613o15842o12574k67539k33828o96071j082060p56188J15290
42045b516469O72840M26095j08843j08000M89199J013596J000789O04204J38928
42036A612339k47682l89848j38374K25155J16447n11584r04499m74095L38429
42027c73712O52903L50271J10704L22765N50271K64872l49888o63014m22901K3748
$$ y = [168553, 347434, -299424, -1109681, -1422905, -1285295, -1134451, -1175767, -1309040, -1402496, -1437570, -1524159, -1798561, -2124775, -2009344, -1166600, -101579, 303602, -205937, -1080124, -1744926, -2015236, -1713951, -601264, 1009450, 2181518, 2368588, 2076826, 2081691, 2382030, 2434005, 2085919, 1669281, 1331125, 909752, 491434, 510465, 1086540, 1668956, 1632343, 1016501, 403927, 136388, -97440, -793511, -1875571, -2631759, -2516469, -1843629, -1417534, -1526377, -1634377, -1145178, -131582, 869207, 1473411, 1612339, 1364657, 974809, 836435, 1061590, 1178037, 666453, -238046, -712141, -373712, 279191, 629462, 740166, 1062931, 1613202, 1878074, 1528186, 865172, 442271, 466019]
42017D66019K56358K20775J14537O7986M9720l5660k34551m34783l54572J64116
42007B79945P67241P58854q8708j081023j285877n71954L64059Q88554R10576
41998I41667N50937n8025n18241l51467K41305L82434k91005r87728q72336k91716
41988a254175j43173m27271l77869J35400L80948O8103j23249L01172Q24092Q03122
41978A87100M82375M30317M83085M2988q18230j316379j001462k51722L36844
41969a425084N57737M82151J82609k01505l81721j37637M36635R58538J000523
41960A472246M21096l82175o74204j26569O61249P02896k24668j253126j408494
41951h11749o87854R4641L64352L13527L44494L94983J44811l08522m49821r1853
$$ y = [466019, 722377, 943152, 1057689, 1125675, 1175395, 1139735, 905184, 470401, 115829, 279945, 1047186, 1806040, 1717332, 636309, -649568, -1221522, -857463, 31091, 941667, 1492604, 1434579, 916338, 564871, 806176, 1188610, 897605, -90123, -962459, -1254175, -1397348, -1824619, -2202488, -2067088, -1686140, -1618037, -1741286, -1440114, -616022, 187100, 669475, 1099792, 1582877, 1625865, 807635, -508744, -1510206, -1761928, -1425084, -867347, -385196, -202587, -404092, -785813, -923450, -486815, 471723, 1472246, 1893342, 1511167, 836963, 710394, 1371643, 2074539, 1849871, 596745, -811749, -1499603, -1404962, -1040610, -727083, -382589, 12394, 157205, -151317, -601138, -692991]
41941f92991L04570K94222O4776K6154J08005k267j40429J21654N74940M78390
41931A137024k27412o22479j81150L07771r1449r59052j103882l31194L65899
41922a705924L30575p345p9073K701o1076j46445m8964Q2944P0106K4024J0229
41911a528248j33643k98545J7660Q49959J333487P80198k36808o02553j53717
41902B7790L26690M00866L98545N56271N76415K41923j97687m72641n67195m05479
41892H85498J24428O53106N04706l04798q67828n74046N6985J67583l15564q26706
41882d96636r86702p79674k75760L22364O52517O30716N96634O88882N60169J24170
41872A036680n2537K74669L52667l74983j021860m09975R10860J209097J22947
$$ y = [-692991, -388421, -94199, -29423, -3269, 104736, 102469, -37960, 83694, 658634, 1137024, 909612, 287133, 105983, 413754, 322305, -636747, -1740629, -2071823, -1705924, -1375349, -1382694, -1461767, -1459066, -1520142, -1666587, -1715551, -1632607, -1562501, -1538477, -1528248, -1661891, -1960436, -1942776, -1092817, 240670, 1020868, 784060, 181507, 27790, 354480, 755346, 1153891, 1710162, 2286577, 2528500, 2330813, 1858172, 1290977, 885498, 1009926, 1663032, 2167738, 1862940, 995112, 421066, 478051, 645634, 330070, -496636, -1483338, -2263012, -2538772, -2216408, -1563891, -933175, -336541, 352341, 912510, 1036680, 984143, 1258812, 1611479, 1236496, 214636, -195339, 715521, 1924618, 2047565]
41863B047565p87786l90704M84988N52916l6628k64144P2131K58052j29726p53580
41853A053084j070363p87681J6123P79450P66061o8636q38446p80572j83829J94085
41843i20724K21511L13197N65187O11770K26984m11680r46272r97045l65573N68938
41833a133707J008949O93996K80876L22344M06971l8062o31058o05877j25516
41824A78916l5980m75760p07982l19403L17239Q01239J045773Q40714L2820p36920
41814I40656m97541N64798J094140M77232k29424N8310P85549O67364l18639q90214
41804B652231k53875R12620J368238O46872o37127j475094j352732o22523k3769
41795A214841J45237J69740K55188J76669j87465m32960j86352K05618P4951n51184
$$ y = [2047565, 1259779, 869075, 1354063, 1906979, 1870351, 1606207, 1678338, 1936390, 1806664, 1053084, -17279, -804960, -788837, -9387, 756674, 688038, -150408, -930980, -1114809, -920724, -699213, -386016, 179171, 790941, 1017925, 606245, -340027, -1337072, -1702645, -1133707, -124758, 569238, 850114, 1172458, 1579429, 1541367, 910309, 304432, 178916, 142936, -332824, -1040806, -1360209, -1042970, -241731, 804042, 1644756, 1677576, 940656, 443115, 1007913, 2102053, 2579285, 2349861, 2408171, 3193720, 3861084, 3542445, 2652231, 2398356, 3310976, 4679214, 5326086, 4688959, 3213865, 1861133, 1238610, 1214841, 1360078, 1529818, 1785006, 1961675, 1774210, 1341250, 1154898, 1360516, 1435467, 884283]
41785H84283q30955j64357R32898J293026M16648q89611j394441q72299k80727
41776i05535l96082p74494n18655L36200R14724Q02662M68279L56195L39372K60542
41766H83208K89702M29169K94747k35429o73376n76928j10551L13831M76310K12491
41756A303174n65645j408469j511929p53814L8325K45258K38886N44488R19849
41747i49877R04472O66608N68511M07767j22701o46169n86337j07977K11349L30825
41737F76471N39004N96027N5644o63442n41606N45416J454545J214139J79054
41728D055252o09502p18713n56183n71357o52725m11945J13122L59123M1200k85929
41718G62343k0502M11696J85681l32603P3343J290145J641034O10300K8833J053166
$$ y = [884283, 53328, -111029, 821869, 2114895, 2531543, 1641932, 247491, -624808, -905535, -1301617, -2076111, -2594766, -2258566, -1343842, -541180, -72901, 283294, 622666, 883208, 1172910, 1602079, 1896826, 1661397, 988021, 411093, 300542, 614373, 1090683, 1303174, 737529, -670940, -2182869, -2936683, -2898358, -2653100, -2414214, -1869726, -949877, -45405, 621203, 1189714, 1597481, 1474780, 828611, 242274, 134297, 345646, 676471, 1215475, 1811502, 1867146, 1203704, 662098, 1207514, 2662059, 3876198, 4055252, 3445750, 2727037, 2170854, 1599497, 946772, 534827, 647949, 1007072, 1048272, 762343, 741841, 1153537, 1339218, 1006615, 1079958, 2370103, 4011137, 4621437, 4650270, 5703436]
41708E703436J632567o79217m412466n499969k783611N36391J455229N93908N6351
41699c397381K13599K49149J51244L18269L35635j61939l12463O67230J752135
41690a84522J363151j58382j005476n69423m354j45728m58203l52828j48705j86929
41680a851399j04378L74986P68202N80291R8231j19412m6984L1181J43481M95808
41670C70007R27796R54410L27524o43201j279887j031716n764R43323R31532l0175
41660A463849j055757j380712j031086m21880K59349R26760J185137N96962o09254
41651f6632j520504j446503o30380J51496N15398O78805Q18392O85169R8871n25291
41641a241179n84091j04563K73014J37992k55016m60969l72987j29871J66616
$$ y = [5703436, 7336003, 6656786, 2244320, -3255649, -6039260, -5502869, -4047640, -3453732, -3397381, -3183782, -2934633, -2783389, -2465120, -2129485, -2291424, -2603887, -1936657, -184522, 1178629, 1020247, 14771, -554652, -559006, -704734, -1162937, -1515765, -1664470, -1851399, -1955777, -1580791, -812589, -232298, -134067, -253479, -300463, -269282, -125801, 370007, 1297803, 2252213, 2579737, 1936536, 656649, -375067, -380831, 562492, 1494024, 1463849, 408092, -972620, -2003706, -2425586, -2166237, -1239477, -54340, 542622, -66632, -1587136, -3033639, -3664019, -3512523, -2997125, -2318320, -1499928, -814759, -715888, -1241179, -1825270, -1929833, -1656819, -1518827, -1773843, -2234812, -2607799, -2737670, -2571054]
41632b571054M29389N18242L84949J28763j70171m60601n38675j90229L75643
41623b093744N91863K38474k03834j27397M83644J070688J058567L41349n43864
41614H15746p46629Q168Q60375O67616m80852j222955o55150N27085J038264N78686
41604A390354j46516n20202m82977j94464J51040K80276Q0345j93859k51857j17660
41594e520J02975M69314Q80738Q89755K94839l98395n76684k99758m7513o922
41584A302829p7470k56754n11612n66359l08088p4431p3574L3852M20023N11356
41574C99772j07307p20372l75760N98493J009892N27437p0544k77120l85750n83060
41564A5681n75404l05256r5329Q5809N61816J017742O93241k28951n44133K04745
$$ y = [-2571054, -2141665, -1623423, -1238474, -1109711, -1279882, -1740483, -2279158, -2469387, -2093744, -1501881, -1263407, -1467241, -1594638, -1110994, -40306, 1018261, 1359610, 815746, 69117, 77285, 937660, 1605276, 1124424, -98531, -753681, -226596, 811668, 1390354, 1243838, 723636, 240659, 46195, 197235, 477511, 557856, 363997, 112140, -5520, 97455, 566769, 1447507, 2337262, 2632101, 2233706, 1657022, 1357264, 1309751, 1302829, 1225359, 968605, 456993, -109366, -417454, -491885, -565459, -531607, -111584, 399772, 292465, -427907, -803667, -205174, 804718, 1332155, 1261611, 984491, 598741, 15681, -559723, -864979, -960308, -874499, -312683, 705059, 1398300, 1169349, 625216, 829961]
41554H29961R37959O40565j99522n11226k10933j9972k77968p13614r92173q62148
41544a379071j54965Q07527J230185Q00477J84602N4586J31511j92974p73874
41535G08004r70568o33321j38213K86561O15640O53696K61330k07591k74516j4251
41525B86771J18330l7123k95428n24433o45211m95954j54327r0514n02960q37460
41515c178309n21720J64443N64012O39741P99785J028712R56226N82687J99794
41506A235371j93941o47192p15226p6080N56463K22048o73100p35984K99328J096500
41496C68187P24331q7285l02700n5414N8103J66212N60822P00574l9405j060111
41486A033314j159023k74147M88671N37741M11129N24299L62222n50174j633933
$$ y = [829961, 1767920, 2408485, 2208963, 1697737, 1486804, 1466832, 1188864, 475250, -516923, -1379071, -1534036, -726509, 503676, 1304153, 1488755, 1543341, 1674852, 1481878, 708004, -262564, -895885, -1034098, -747537, -131897, 521799, 783129, 575538, 301022, 286771, 405101, 367978, 72550, -451883, -1097094, -1593048, -1747375, -1837889, -2340849, -3178309, -3700029, -3535586, -2971574, -2331833, -1532048, -503336, 452890, 1035577, 1235371, 1041430, 394238, -320988, -397068, 159395, 381443, -291657, -1027641, -728313, 368187, 1092518, 1005233, 702533, 647119, 705222, 871434, 1432256, 2132830, 2093425, 1033314, -125709, -399856, 88815, 626556, 1037685, 1561984, 1924206, 1374032, -259901]
41477b59901j880879j088583O4847Q83229J106974P63106J16323l09078j68469
41468g72431J94850J19938l87910n00636L27044J465713J768028R49111j52473
41459C011234o54347m81363n0804L47039N30053K48514m40005q70986m38893N01357
41449A701799R55028N34083j77814o01955q58057j170388j207416o05735K26048
41440a204407N05641J52226j51198K5220L50795L75189J76237J18218L18036O06745
41430A272702P70542O38103J83381k86620l46120n6764m556m35531p60545m05517
41420E69075K04550K16714k73100k91991M32264Q79184K16433q71961j102771
41411b1603l89062J50926j65579p76436q25645k40139M04220N99408K31056m17472
$$ y = [-259901, -2140780, -3229363, -3164516, -2281287, -1174313, -411207, -294884, -603962, -772431, -577581, -457643, -845553, -1346189, -1019145, 446568, 2214596, 3163707, 3011234, 2356887, 1875524, 1824720, 2171759, 2701812, 2950326, 2510321, 1639335, 1200442, 1701799, 2656827, 3190910, 3013096, 2411141, 1553084, 382696, -824720, -1430455, -1204407, -698766, -546540, -697738, -672518, -321723, 53466, 229703, 347921, 665957, 1272702, 2043244, 2681347, 2864728, 2578108, 2231988, 2175224, 2170668, 1735137, 974592, 569075, 773625, 990339, 717239, 425248, 857512, 1736696, 1953129, 1081168, -21603, -410665, -259739, -425318, -1201754, -2027399, -2267538, -1863318, -1263910, -1032854, -1450326]
41401a450326p54153l24791O02399J214371J106599P13635N89083O75277O13087
41392B985181L81221J75097n4631m13295n88205j55266O26805Q92314K51957o18711
41382C482467q01930k99098K6083l79589j051529j186687p35368l57163l27502
41373a630316r4935P33050J502320J288676K84248m11953l45295j56194l15297
41364H54304l74360N6433M85359M11889K65614N71574P81985M2416j206817j580094
41354C08303o90514L34868M73097j1003l08850j68049J59256M13380L83132J226
41344H94846l24350k7896P17281J057357P01817L71063N70485P16222J70866n49479
41334D298212n31843J7799N3966o57671j182855q53087j88525l2910m04352o55026
$$ y = [-1450326, -2204479, -2529270, -1926871, -712500, 394099, 1107734, 1696817, 2372094, 2985181, 3366402, 3541499, 3486868, 3073573, 2485368, 2330102, 2956907, 3849221, 4101178, 3482467, 2680537, 2381439, 2407522, 2027933, 976404, -210283, -945651, -1302814, -1630316, -1725251, -992201, 510119, 1798795, 2083043, 1671090, 1325795, 1169601, 854304, 479944, 536377, 1021736, 1433625, 1699239, 2270813, 3052798, 3095214, 1888397, 308303, -382211, -47343, 425754, 414751, 105901, -62148, 97108, 510488, 893620, 894846, 570496, 542600, 1259881, 2317238, 3019055, 3390118, 3960603, 4676825, 4847691, 4298212, 3766369, 3784168, 3838134, 3180463, 1997608, 1144521, 955996, 923086, 518734, -136292]
41324a36292l81377K41863Q13546J050957Q93293N13518J94993O6447R554j01933
41314C164569j73661m312M39446R63661J342716J499518J476515J280957Q42329
41305A0831738J68074n34696j017718j248742j371628j434324j357086j179534
41297B856084j066260r72644o16358M759L67950O2824n08471n21887J73805P80610
41287E60412N36665l42644r76814q85126m05674p1286O6410K50696L91255R1277
41277g84829n94837q90887k08705R06293J283915N78944l19521m67918N6465N34822
41267I3742N86308L43833P645k66509k42049J25995M02304J44429l83835m66536
41257C45327O6001N81550N18836P2841k13407j82813j06374k30996n63335r58839
$$ y = [-136292, -517669, -275806, 537740, 1588697, 2481990, 2995508, 3190501, 3256948, 3266502, 3164569, 2990908, 2986596, 3426042, 4389703, 5732419, 7231937, 8708452, 9989409, 10831738, 10999812, 10465116, 9447398, 8198656, 6827028, 5392704, 4035618, 2856084, 1789824, 817180, 200822, 205581, 573531, 636355, 127884, -394003, -220198, 560412, 1097077, 754433, -222381, -1107507, -1513181, -1584467, -1518057, -1267361, -876106, -784829, -1379666, -2270553, -2479258, -1572965, -289050, 289894, -29627, -497545, -441080, 93742, 680050, 1023883, 1031528, 765019, 522970, 648965, 1051269, 1195698, 811863, 345327, 411328, 992878, 1511714, 1584555, 1371148, 1188335, 1081961, 850965, 287630, -671209]
41247f71209j181080r60313k28276O89780J265572J223913P86274M14281K75228
41238A614170L3054o50708j428268j455108n12011M40640L45000n20422q46882
41229b980535n1411R81982J173160O03641J31277J44905L04751K40664p8947n27120
41219e7633q51338o67866M0270N54279J94074n70183n30255N67296J507047J189013
41209A374704N2264o84639o69311n14819n57992m35763L9510M01031K59999o2651
41199g97667o2178J78072J90270j21303l59841k18322J48151L65412K50424n7724
41189d84706k56433j54002J54523M00956M35515L26086J91352R6161J07418K26138
41179A043008K31479j16822o17756p00819j62650M71647N87833K11063j96550
$$ y = [-671209, -1852289, -2812602, -3040878, -2351098, -1085526, 138387, 924661, 1338942, 1614170, 1647224, 996516, -431752, -1886860, -2398871, -1958231, -1613231, -2133653, -2980535, -3031946, -2049964, -876804, -273163, -141886, 3019, 307770, 548434, 469487, -57633, -908971, -1576837, -1536567, -982288, -788214, -1358397, -1888652, -1321356, 185691, 1374704, 1426968, 742329, 73018, -441801, -999793, -1435556, -1396046, -995015, -735016, -797667, -859845, -681773, -491503, -612806, -972647, -1190969, -1042818, -677406, -426982, -484706, -741139, -895141, -740618, -339662, 95853, 421939, 613291, 709452, 816870, 1043008, 1274487, 1157665, 539909, -160910, -323560, 148087, 735920, 946983, 750433]
41170G50433l85405l95923k29701J19209M50707N69359N51599M37927m6267r13463
41160I08475j367692o68331N42021P53929l18046j112053k59822J489702K174106
41151B142289J037288p34008j548358j017262P923M96008J65257m06970m87762
41142c45595K917N21798O93228O59556N28262N0693p40280j111902n11431M68513
41132B15759P44456K05538k35622m3232K74136R5451m06521o63779n14701j94359
41122e22874J25432L82328M40592K34842k2518o3178Q9867K12128K13772J62208
41112A252599M2426k52751o56024q38249n19229J66014P05362O75910J56458l92848
41102C39668o42587o46503n63604l67610j6695K71890K02312j91971n50488n77337
$$ y = [750433, 365028, -30895, -260596, -141387, 309320, 878679, 1430278, 1868205, 1821938, 908475, -459217, -1127548, -585527, 168402, -149644, -1261697, -1521519, -31817, 2142289, 3179577, 2445569, 897211, -120051, -112128, 383880, 549137, 142167, -345595, -342678, 179120, 872348, 1531904, 2060166, 2110859, 1370579, 258677, -252754, 215759, 960215, 1165753, 930131, 886899, 1161035, 1256486, 849965, 186186, -328515, -522874, -397442, -15114, 425478, 660320, 637802, 574624, 664491, 876619, 1090391, 1252599, 1295025, 1042274, 386250, -451999, -971228, -805214, -99852, 576058, 732516, 339668, -302919, -949422, -1513026, -1880636, -1897331, -1625441, -1423129, -1615100, -2165588, -2742925]
41092b742925k59512K27279O15558O30092K40155k02467l19050j49365R816J08797
41082a841622L13098N06157L03898k92448o97948m75664N9902L01785J81329J55397
41072a486116M52619P20485N24580n7416n38817o30973n33147n47819n92948l47109
41062c036661J65736M88746L75679J84261L32596O44200O42737K99980M551r5343
41052F482j59727r7096M07242J137184J269862M37429o26545r62876n54314j39493
41042G18148j24888k11088o961M54417Q43431Q56036M06251k29108m84013k0228
41032B201997P89312J134226N91206m73215j321577j501787j093288m96624p0011
41023b39761R0651P3736n6503k35576k00323L49192J200602J557628Q88903l11134
$$ y = [-2742925, -3002437, -2775158, -2159600, -1529508, -1289353, -1491820, -1810870, -1960235, -1950419, -1841622, -1528524, -1022367, -718469, -1010917, -1708865, -2184529, -2124627, -1822842, -1641513, -1486116, -1033497, -313012, 211568, 154152, -384665, -1015638, -1548785, -2096604, -2689552, -3036661, -2870925, -2382179, -2006500, -1822239, -1489643, -845443, -202706, 97274, 101825, 6482, -153245, -250341, 156901, 1294085, 2563947, 3001376, 2374831, 1411955, 857641, 718148, 593260, 382172, 375211, 829628, 1673059, 2529095, 2935346, 2706238, 2222225, 2201997, 2991309, 4125535, 4716741, 4243526, 2921949, 1420162, 326874, -169750, -239761, -149110, -75374, -131877, -367453, -567776, -218584, 982018, 2539646, 3428549, 3117415]
41013C117415j001829p74429j81422P1326j57727n76452q55146p21374p1305P32714
41003d18229J000853M92388j84679l13036o636L2875l98353o99004l62242K87492
40993e68571N54715K64617j54751l17740k58831k00692k34354k79916j89631J31353
40983a253801N76765Q39897P06504L07841n1988k26477k12752L2076M58500P27867
40973A904432N41453J22561o6601q4308m49457j207917j652315j263808l98523
40964b554483L29571Q14087J128254R77594J80930o63648p78371l09447r3742
40955i69255m06136o84466n10471j04523K83856P32647J136708J032583L42878
40946H53821k35950n5062O21722R69227N70136k73622r76762j153634q39282m18451
$$ y = [3117415, 2115586, 1341157, 1159735, 1231061, 1073334, 496882, -358264, -1079638, -1150943, -418229, 582624, 1075012, 890333, 577297, 570661, 603536, 205183, -493821, -856063, -568571, -13856, 250761, 96010, -221730, -480561, -681253, -915607, -1195523, -1385154, -1253801, -677036, 162861, 869365, 1177206, 1125218, 898741, 685989, 718065, 1176565, 1904432, 2445885, 2568446, 2501845, 2417537, 1968080, 760163, -892152, -2155960, -2554483, -2224912, -1410825, -282571, 695023, 875953, 212305, -566066, -875513, -969255, -1375391, -2059857, -2570328, -2674851, -2390995, -1658348, -521640, 510943, 853821, 617871, 562809, 1184531, 2153758, 2723894, 2450272, 1473510, 319876, -519406, -937857]
40936i37857k02054m7140L46692P95310P34031P1770n39350n33506j34571M9250
40926c97425j84322n16127n36320q8832O01423J040453R42848N98670M36850L24996
40916B222214j53916p85763q41494k48724J68450n4657l28679m1772M71985N97629
40906A005273M06383K86855J97127q395m9883K25954K78306l15295r43871p83160
40896B99294j56954o0453n42678o37971P8704Q54943Q65984J78999n75799q70199
40886e66130n07240K39607O78261M25145o990N8096L63645J76996l45757l23390
40876A92243K80483M39966k27301o86793q7181Q12602P11221l55263j145688r43333
40866a009044l08814j20037n07599r15662q48025l27064K94436Q00872J219150
$$ y = [-937857, -1139911, -1187051, -840359, -45049, 688982, 760752, 221402, -312104, -446675, -397425, -581747, -1097874, -1634194, -1723026, -1121603, -81150, 861698, 1460368, 1897218, 2222214, 2068298, 1282535, 441041, 192317, 360767, 306110, -22569, -64341, 407644, 1005273, 1411656, 1698511, 1895638, 1887243, 1837360, 2063314, 2341620, 2026325, 1082454, 299294, 142340, 81887, -460791, -1098762, -1020058, -165115, 700869, 879868, 304069, -566130, -1073370, -833763, -155502, 269643, 262653, 320749, 684394, 861390, 515633, 192243, 472726, 912692, 685391, -1402, -88583, 724019, 1435240, 1079977, -65711, -1009044, -1317858, -1437895, -1945494, -2861156, -3709181, -4036245, -3741809, -2940937, -1721787]
40857a721787J458009J209609M98775m8634k761J33792l05666r08085o55179L90286
40847D8359R49413L47680n56694p54166m65397m61372p53884p71986l71662N6149
40837b733560J93112R21l37555l11517N53784J783480K059288Q62548o30742j044346
40827C95413n48794k02439j80237J23765O21504N76114Q6558R6027O47494N48150
40817B163555o06628j395749n84128Q48835J024559q7191p32871p5871O87750
40808A242261L35326n95039q99811n97087n22460o31157j22023Q45787J035816
40799I1613J32159n04905R3167Q31162J69679j371807j830621o34680O88348P88975
40789a546910J42635l9087N22374J175471J243265M55368q57011j676529j172253
$$ y = [-1721787, -263778, 945831, 1444606, 1395972, 1393211, 1527003, 1221337, 313252, -341927, 48359, 997772, 1345452, 788758, 34592, -430805, -892177, -1646061, -2418047, -2789709, -2733560, -2540448, -2539527, -2877082, -3188599, -2634815, -851335, 1207953, 2070501, 1439759, 395413, -153381, -355820, -536057, -412292, 209212, 785326, 871884, 967911, 1615405, 2163555, 1556927, 161178, -422950, 425885, 1450444, 1363253, 630382, 554511, 1242261, 1577587, 982548, 82737, -514350, -1036810, -1667967, -1789990, -944203, 91613, 223772, -281133, -187966, 643196, 812875, -558932, -2389553, -3024233, -2335885, -1546910, -1404275, -1443362, -920988, 254483, 1497748, 1953116, 1096105, -580424, -1752677]
40780a752677M0388M08132m13627r83380k55288P97259P29374j60578m51662J49177
40770a892882N47942Q6114n86747n97477O4861P46081Q72956M37086L6139K40656
40760d5271P25650N86447j78309m04407L64354Q11761k06597j616574j567526
40751a530472k55090M86240P9485k46087J50031L62374j40070m63248L8065N93536
40741i25236M62942J94909M32280O80621L64344R894J82932K41590n03660j206652
40731f6036n80317R16114J511759N87474o68994j092632p74218k96668J04773
40722c58745K57669j08049p47235q45320p8945P84817Q14736Q7072m80141k57684
40712i31825M59674Q79009N70012j33327n71262n25631l42684k73477r2112L78416
$$ y = [-1752677, -1712289, -1304157, -1717784, -2701164, -2956452, -2159193, -1429819, -1590397, -2042059, -1892882, -1344940, -1258826, -1845573, -2443050, -2378189, -1632108, -759152, -322066, -285927, -45271, 680379, 1266826, 1088517, 684110, 1048464, 1860225, 1653628, 37054, -1530472, -1785562, -1299322, -1219837, -1465924, -1315893, -953519, -1093589, -1556837, -1518772, -925236, -462294, -267385, 164895, 845516, 1209860, 1219754, 1402686, 1644276, 1140616, -66036, -646353, 269761, 1781520, 2368994, 1700000, 607368, -166850, -463518, -358745, -101076, -209125, -956360, -1801680, -1880625, -1095808, -281072, -194000, -674141, -931825, -472151, 406858, 976870, 843543, 272281, -253350, -596034, -869511, -961623, -583207]
40702e83207P75169O90557L68073L68471P19736R38910P78611M06116o3724o17699
40692C781013r60136p21088j31484J10453k23284o63769q69443r89186r74918
40683a641842l42881Q48697J512328Q35820m04838p89789k73926j81146j090225
40674a527802j859456j309760L9753P91164O22899L78655M82197M35932K2862
40665a923556j29026L23526O98229L96420k8574J82367O03090L05082m28789l68222
40655c69453O68834J361077P86828l21513p81008m89217r6551O3580n913l54042
40645D62622p53211n85403J92920N99960N843o90146l59097M46455K92656o98176
40635a085577q67124L02406J188624M70010q48510j008042q6929L82064j46061
$$ y = [-583207, 191962, 882519, 1250592, 1619063, 2338799, 3277709, 4056320, 4462436, 4398712, 3781013, 2820877, 2099789, 1968305, 2078758, 1855474, 1191705, 322262, -666924, -1641842, -1984723, -1136026, 376302, 1212122, 807284, 17495, -256431, -437577, -1527802, -3387258, -4697018, -4657265, -3866101, -3243202, -2864547, -2382350, -1946418, -1923556, -2052582, -1729056, -1030827, -634407, -662981, -480614, 122476, 427558, -1231, -369453, 299381, 1660458, 2447286, 2125773, 1344765, 855548, 758997, 822577, 816664, 462622, -290589, -875992, -683072, -83112, -77269, -767415, -1126512, -680057, -387401, -1085577, -1952701, -1650295, -461671, 8339, -840171, -1848213, -1935142, -1553078, -1699139]
40626a699139o39642l13648K85865L95671J91755K12586L49865J56538k32781
40617a292930k21733L19205Q36914Q26843L17014l98188j031554j229124p49514
40608b623067M1642L39215q1509m52246q7994N50658N45201l5581k56708J72231
40598a888158M93736K61021J12498N92257J032383N22407n08003p25503J87226
40589G9864J018505O64748m65818j116063p82912j41914n145l18533m12885n8661
40579a538814J60578k47356p93587o29145Q7511K85863l62022q05728j86740P99185
40569c230255R61159L82297Q5244L56128N58179M29680L79395M55818J79006l91164
40559A65487n13622k4917K98842O0837j11537J97136L46489j67355n95259n2330
$$ y = [-1699139, -2338781, -2652429, -2366564, -1970893, -1779138, -1566552, -1216687, -1060149, -1292930, -1514663, -1195458, -358544, 468299, 785313, 387125, -644429, -1873553, -2623067, -2581425, -2242210, -2323719, -2775965, -2863959, -2313301, -1768100, -1803681, -2060389, -1888158, -1394422, -1133401, -1020903, -428646, 603737, 1126144, 618141, -107362, 79864, 1098369, 1763117, 1297299, 181236, -601676, -743590, -748735, -1067268, -1480153, -1538814, -1378236, -1625592, -2419179, -3048324, -2960813, -2674950, -3036972, -3842700, -4029440, -3230255, -2269096, -1886799, -1801555, -1445427, -887248, -457568, -78173, 377645, 556651, 165487, -348135, -373052, -74210, -13373, -124910, 72226, 418715, 251360, -343899, -396229]
40549c96229R00778R55406O451p18354m23041L67479Q20788Q33873P38089O22534
40539C707774L94153J55345J12422K00758N6673n49582j277867j373914n13345
40530I12417N73193P66312l5064p07529l95928L71363N72107J46448j93416k30048
40520A779855l75458o30923l92354M67073J129680Q73211J2452o20992o93162
40511A549382m30872m6129L81706O30078M47347k4559k94852j12550J92403R8335
40501B390289m62232r89563r85563n32976j78364k79607o65961r70949j042906
40492c717832q96965n36831o3239K71599M06380O60449J243564J764493J648132
40483G79750R42021K77719O8935J63886K69966K75508J18234k13260m60798l09529
$$ y = [-396229, 504549, 1459955, 1466406, 748052, 325011, 692490, 1513278, 2347151, 3085240, 3707774, 4101927, 4257272, 4369694, 4570452, 4627125, 4077543, 2799676, 1425762, 912417, 1485610, 2251922, 2216858, 1509329, 1113401, 1484764, 2056871, 2203319, 2009903, 1779855, 1404397, 773474, 381120, 848193, 1977873, 2851084, 2863536, 2242544, 1549382, 1118510, 1072381, 1454087, 2084165, 2531512, 2506953, 2212101, 2099551, 2291954, 2390289, 1928057, 938494, -47069, -580045, -758409, -1038016, -1703977, -2674926, -3717832, -4614797, -5151628, -5214867, -4943268, -4536888, -3876439, -2632875, -868382, 779750, 1721771, 1999490, 2068425, 2232311, 2502277, 2777785, 2896019, 2682759, 2221961, 1912432]
40473A912432P7686J73129j46601m12230l22884j96107l61857n70468m16907j0048
40463b73855K23591J64852J5664j20693k64343l09846j55933J7255j0537o9264
40453g83109J64385N28383M52232j98946p74292n97845J80749P91390P68805L77569
40443I09321J19046J02858R1275R567P9992L44730L60841k68698j148668j323555
40433g23291m25921P46185J101355N14690j17853k8533N43230P27375Q7411q75243
40423A549405j284471q34829l7026M61258N45756M64327K83679o2205l38722j89845
40413E57327K18876L21466N5338J0226M07564O28175K30523k34606r8843L22951
40403B418997L37444Q1155J19457K07268l39466j163176j112590j68291K68066
$$ y = [1912432, 1990118, 2163247, 2016646, 1604416, 1281532, 1085425, 723568, 153100, -263807, -273855, -50264, 114588, 130252, 9559, -254784, -564630, -720563, -703308, -713845, -783109, -618724, -90341, 361891, 162945, -611347, -1209192, -1028443, -237053, 531752, 909321, 1028367, 1131225, 1222500, 1232067, 1312059, 1656789, 2017630, 1748932, 600264, -723291, -1149212, -403027, 698328, 1213018, 1095165, 1066632, 1609862, 2337237, 2424648, 1549405, 264934, -569895, -606921, -145663, 400093, 864420, 1148099, 1085894, 747172, 557327, 776203, 1097669, 1153007, 1163233, 1570797, 2198972, 2429495, 2194889, 2096046, 2418997, 2756441, 2837596, 2957053, 3164321, 2824855, 1661679, 549089, 380798, 648864]
40394F48864m52026j091983m72518N96778N61157m91182j082356n95641J19994
40385b258913L34507L06092L29244Q7991n24232q27489k38450Q28004J486628
40376d76618J415133R25001L60622j32985m80304o76352p81567p41475m44490
40367a033035p5910m2608l34829l64222K38437R95666J123879M72082l99910q71250
40357b91700p01258n6057N82113P14032L21532r0096j39677R590Q1711J29337
40347E59527J86510p3794p79395j302751r51158l5176M52267J62072k93756l55499
40337b431153j23922J67516N61016R72862J015891N94196J70275R1637J32617
40328A150935M9993N8044K92045L22404j88528p66185p65691m20744m36994o96189
$$ y = [648864, 196838, -895145, -1367663, -770885, -209728, -700910, -1783266, -2378907, -2258913, -1924406, -1618314, -1289070, -1201079, -1725311, -2552800, -2791250, -1963246, -476618, 938515, 1863516, 2224138, 2091153, 1610849, 934497, 152930, -588545, -1033035, -1108945, -1151553, -1486382, -1850604, -1612167, -616501, 507378, 979460, 579550, -291700, -992958, -1049015, -466902, 247130, 568662, 478566, 338889, 348479, 430190, 559527, 746037, 672243, -107152, -1409903, -2361061, -2396237, -1943970, -1781898, -2075654, -2431153, -2555075, -2387559, -1826543, -853681, 162210, 756406, 926681, 1018318, 1150935, 1200928, 1258972, 1551017, 1873421, 1684893, 918708, 153017, -267727, -704721, -1400910]
40318a400910l10075Q77113J732426J245120j43412j175210j279046q28064k44293
40309a526351L77721P99307N83842j60709n39591J20394J281394J723050J004387
40300C663444o5849n11754l18954k05505n44802r25277p71513q5685N72540P06821
40290A513466L53671l7638j08653Q1534K39769K37573J56125j7296m18403q92300
40280A107848q91226j44164P63924R27869K18231n64071o89126k68877J13276
40271E73684J88586J59737K70297M68350M74752J25335l19580l29421K22062O92341
40261B526143L74888n12418j060658r04145n80486m90975k56902M33181J029209
40252E57837Q79553K89213J2196L7887k07818o41728n39103J37792M54698o5469
$$ y = [-1400910, -1710985, -833872, 898554, 2143674, 2000262, 825052, -453994, -1282058, -1526351, -1148630, -349323, 234519, 73810, -465781, -345387, 936007, 2659057, 3663444, 3597595, 3085841, 2766887, 2561382, 2016580, 1091303, 319790, 234105, 806645, 1513466, 1867137, 1829499, 1720846, 1802380, 2042149, 2279722, 2435847, 2418551, 2000148, 1107848, 216622, 72458, 836382, 1764251, 1982482, 1418411, 729285, 460408, 573684, 762270, 922007, 1192304, 1660654, 2135406, 2260741, 1941161, 1611740, 1833802, 2526143, 2901031, 2388613, 1327955, 423810, -156676, -647651, -904553, -471372, 557837, 1437390, 1726603, 1738799, 1776686, 1568868, 927140, 388037, 525829, 980527, 915058]
40242I15058o19104l34832L82023M85027j65800p20975o48692l34096k76045l51707
40232a669143j92316J51778L27930K58931K16199L34589L87808J95380J9229K53252
40222B83637P62009Q87103K90937m86239o32146p4283M78718M50628l1205m86165
40212A442994n82858k00755N57727J200206J120953L85075j22873K35136R08789
40203D944394P98565l00889j439737j700280j130047l76861J07866K31695K3620
40194A158326l60869n70070l55059Q7277L13697J62893j11239k11735r2828J37498
40184A57891L89212N58398M90617J48411k50755m28977l75186l23031l63830k62569
40174b59819J80989P06001P93483L39276j35299j30239J63051J33609l66421p64184
$$ y = [915058, 295954, -38878, 343145, 828172, 662372, -58603, -707295, -1041391, -1317436, -1669143, -1861459, -1709681, -1381751, -1122820, -906621, -572032, -184224, 11156, 30385, 283637, 1045646, 1932749, 2223686, 1737447, 1105301, 1031018, 1509736, 1960364, 1929159, 1442994, 860136, 659381, 1217108, 2417314, 3538267, 3923342, 3800469, 4035605, 4944394, 5742959, 5442070, 4002333, 2302053, 1172006, 795145, 903011, 1134706, 1158326, 797457, 227387, -127672, -40395, 273302, 436195, 324956, 113221, 20393, 157891, 547103, 1105501, 1596118, 1744529, 1493774, 1064797, 689611, 366580, 2750, -259819, -78830, 627171, 1420654, 1759930, 1624631, 1494392, 1657443, 1791052, 1424631, 660447]
40164F60447n11808K03403P33189P56947M96242K48385O3108q7196j50472j36575
40154B275670j49047j44122N0719L02105J23703n83119j080649o50306K72077
40145D17031N06929k57352r76066o76593K69464Q17473O85408M30464L87105L12174
40135A916037O3114j07140j16833k98474p51349r23517k66362R44402J812467
40126B272345J741775R26396L3866m14064m28544m31641o73413q31147m69576
40117A725997J54632K74187k37597n18046L1725P15331M95214m01942p84748l26045
40107A128708l3319n77470j149079p05415L47367O95078M2843n13355j42884N77317
40097c30209O06079p3492n07270q8913P01866R38199L20817n44414q70868n51010
$$ y = [660447, 148639, 352042, 1085231, 1842178, 2338420, 2586805, 2649913, 2562717, 2412245, 2275670, 2126623, 1982501, 2033220, 2335325, 2459028, 1875909, 795260, 144954, 417031, 923960, 666608, -309458, -986051, -716587, 100886, 786294, 1216758, 1603863, 1916037, 1979151, 1872011, 1755178, 1456704, 705355, -218162, -484524, 459878, 2272345, 4014120, 4940516, 4974382, 4560318, 4131774, 3700133, 3026720, 2195573, 1725997, 1880629, 2154816, 1917219, 1399173, 1430898, 2146229, 2641443, 2239501, 1454753, 1128708, 1095389, 517919, -631160, -1336575, -989208, -294130, -251287, -764642, -907526, -330209, 275870, 202378, -304892, -393805, 308061, 1246260, 1567077, 1022663, 151795, -399215]
40087c99215j46256l1571J06595O17484J064936P09862k48596p19355k64334K10152
40077H99702j43941p53764n22632M07736Q52096L74116j97551j65320J30989J43565
40067A024996k1649o8515j40260m26033o51119m78010k9597L75889O09218N65780
40057G60700J59296k07658J57390J130057J601904R92557J40633m5151K7906m00082
40047D317552q94520n65162J99451K35704m09354n28221K27239Q90209R01361
40038D374259P88003Q26038N47674L7654J42230P18787L21500j360651k345940
40029D049554j049956J191127J960984J110058M03442N25439N00713r0597l65188
40020H235576P9203L85777L9897k07383K49915P64396N96403K03564M23665J066076
$$ y = [-399215, -545471, -577042, -470447, 147037, 1211973, 1921835, 1673239, 953884, 689550, 899702, 755761, 1997, -520635, -112899, 739197, 1113313, 915762, 750442, 881431, 1024996, 1003347, 934832, 794572, 368539, -282580, -760590, -790187, -414298, 194920, 760700, 919996, 712338, 869728, 1999785, 3601689, 4594246, 4734879, 4689728, 4717634, 4317552, 3423032, 2857870, 3057321, 3293025, 2883671, 2355450, 2582689, 3472898, 4374259, 5162262, 5988300, 6535974, 6573628, 6715858, 7434645, 7756145, 6395494, 4049554, 2999598, 4190725, 6151709, 7261767, 7665209, 8190648, 8691361, 8600764, 8235576, 8314779, 8700556, 8740453, 8533070, 8782985, 9547381, 10143784, 10347348, 10771013, 11837089]
40010A1837089J263343Q03204K62742L9655l8452k30449n69489j009514j455984
40001A0902145j654005j384873q04708l46881k42119k82529j08128L37206O91733
39992G107841N66895K6170m84396p03529p68626p51053m09434K54328O32962K68633
39982E739791l59486m78413k02347k60599o69041o25777J31368P90327O43946
39973D709769L4029l03627j83361J52065M77471N00056l6147p18167o24356L29437
39963D337169R17553K14913r69017j189480l96290K19291J21965l0858K09062
39954C434308L30466q8881n47841m29389N4837L58241N02232P98951J047965P72138
39944F233027J15638k30233n8813O6780k12732m13568J682O43028O27995j81760
$$ y = [11837089, 13100432, 13903636, 14166378, 14206033, 14167581, 13937132, 13367643, 12358129, 10902145, 9248140, 7863267, 7058559, 6711678, 6469559, 6187030, 6078902, 6416108, 7107841, 7674736, 7700906, 7216510, 6512981, 5744355, 4993302, 4583868, 4838196, 5471158, 5739791, 5380305, 4901892, 4699545, 4438946, 3769905, 3144128, 3275496, 4065823, 4709769, 4743798, 4440171, 4256810, 4408875, 4886346, 5386402, 5350255, 4632088, 4007732, 4337169, 5254722, 5469635, 4500618, 3311138, 2914848, 3134139, 3256104, 3225246, 3434308, 3764774, 3675893, 3128052, 2698663, 2753500, 3111741, 3613973, 4412924, 5460889, 6233027, 6348665, 6118432, 6059619, 6126399, 5913667, 5500099, 5501781, 6144809, 6772804, 6591044]
39934F591044j006940j207266q94571l81191K99137R74739J081202M09212l41503
39925E523863m13348o4965r2175n58615q33338p26710o40132n85245r6245O63669
39915B176759P87733R0229l33117K80877J072381P87831l82104j211112j213137
39906B056340r42990p89520n48140j60824R2232K31108N55125Q86133O88080J05447
39896B172991j3008N52749R17355M63568j00304J93663J012796J138280K24442
39887F562532p39650q26816k95037J8093j08464k11101l9047O4209k07795n63556
39877C653368n28562j78085j4808j72634k23010J01627M48311L87345N0009j36763
39867C386798p0325O9746K47489M94878N64698J60488n24296r62451r99600r43648
$$ y = [6591044, 5584104, 4376838, 3482267, 3101076, 3400213, 4374952, 5456154, 5865366, 5523863, 5110515, 5045550, 4953375, 4394760, 3561422, 2834712, 2194580, 1609335, 1513090, 2176759, 2964492, 3054721, 2721604, 3002481, 4074862, 4862693, 4480589, 3269477, 2056340, 1113350, 323830, -224310, -385134, -292902, -61794, 493331, 1379464, 2067544, 2172991, 2159983, 2712732, 3630087, 4093655, 3993351, 4187014, 5199810, 6338090, 6562532, 5822882, 4996066, 4701029, 4719122, 4610658, 4399557, 4360510, 4424719, 4216924, 3653368, 3124806, 2946721, 2931913, 2759279, 2536269, 2637896, 3086207, 3473552, 3523561, 3386798, 3316473, 3386219, 3633708, 4128586, 4693284, 4853772, 4329476, 3367025, 2367425, 1423777]
39857A423777q85844m43637N57513J522601J604756O94236l93146p72564l97973
39848B909719O506j03703m46163m33999j23135j10868m77551n10413J96292J015745
39838A922430J213224J033974J129760J335946R39439l3871p60319q62624q10311
39829E107648r33208r01367m79704l2799J16282K04287N01003P86554P43294M40465
39819E552455J05216j97757m08165l93320k20081q0375J44377O76553J120195
39810F299098P21721l88639j058008o62376Q484j0136n11581p19869n30848l22852
39800B824994j25475J29673M9533n58163r00551j48816J119591J545245R01995
39791D838026K45612J78258J76510j65494m36876l87481m94247r12299q37066
$$ y = [1423777, 537933, 94296, 651809, 2174410, 3779166, 4473402, 4080256, 3307692, 2909719, 2916225, 2812522, 2366359, 1932360, 1809225, 1698357, 1220806, 710393, 906685, 1922430, 3135654, 4169628, 5299388, 6635334, 7574773, 7540902, 6780583, 5917959, 5107648, 4174440, 3273073, 2793369, 2760570, 2876852, 3081139, 3582142, 4368696, 5111990, 5552455, 5657671, 5459914, 5051749, 4658429, 4438348, 4357973, 4502350, 5178903, 6299098, 7020819, 6632180, 5574172, 4911796, 4920280, 4910144, 4398563, 3678694, 3147846, 2824994, 2699519, 2829192, 2878725, 2320562, 1420011, 1271195, 2390786, 3936031, 4838026, 5083638, 5261896, 5438406, 5272912, 4836036, 4448555, 3954308, 3042009, 2204943]
39782B204943K26562J301622J078971j74513r01851m04775K63361j32838j277645
39773B183837j753020r18807L38952Q72638P07759O82555R62523P78189j58219
39764C696407q71173m57614M39859M94602l00935o64399o6548N08708K68933r1691
39754B956149L64434J152454J049918J6537p11229m29175J22863l6783p38349
39745C746819r74439k65346P65193J154286O62771l7670j54614M05649J087597
39736F390246J384924J218295O98954n2164p28196r13212o16084l81151n40359
39727F461253o85507l00742L64676N82701J52054m34156p80632r79494j124199
39718C255954r92856m72212J25223M77875O71213Q73973Q79875M06874k72323
$$ y = [2204943, 2431505, 3733127, 4812098, 4637585, 3735734, 3330959, 3594320, 3461482, 2183837, 430817, -487990, -149038, 723600, 1431359, 2113914, 3076437, 3854626, 3696407, 2825234, 2367620, 2807479, 3302081, 3001146, 2336747, 2270199, 2778907, 3047840, 2956149, 3320583, 4473037, 5522955, 5539492, 4828263, 4399088, 4521951, 4485168, 3746819, 2772380, 2507034, 3272227, 4426513, 5089284, 5051614, 4897000, 5302649, 6390246, 7775170, 8993465, 9692419, 9640255, 8912059, 7998847, 7382763, 7001612, 6461253, 5775746, 5475004, 5839680, 6422381, 6574435, 6140279, 5359647, 4380153, 3255954, 2263098, 1790886, 1916109, 2393984, 3065197, 3939170, 4819045, 5225919, 4953596]
39709D953596m80862j4041N20873M74806R62k02358J36697N57102N87723L69711
39699F904209L07567M15037L90044J55087j08737l69740p12770r27451o79175
39690E374071j73134l2928k88490j55883P18192J426910R43694l19313r41788
39681F551331l30626O96788J163485R57121M54741q2479l90424j38489N50526
39672I431974R98274Q23446M64208M15732M20067J2686n05618m12464K57885O72427
39662A2578617M36350J39089L45963O61080L48175m58285q10201k08877P18411
39653A3750322J018656N51052J9533L9535N14566R27377R22971N00295o7959l02409
39643A7873939J97154J189339J755355J314733N45839O55239J666560K192254
$$ y = [4953596, 4472734, 4458693, 4979566, 5454372, 5455334, 5252976, 5389673, 5946775, 6534498, 6904209, 7211776, 7626813, 8016857, 8171944, 8063207, 7693467, 6980697, 6053246, 5374071, 5200937, 5168009, 4879519, 4723636, 5441828, 6868738, 7812432, 7493119, 6551331, 6220705, 6917493, 8080978, 9038099, 9492840, 9410361, 9019937, 8881448, 9431974, 10430248, 11253694, 11717902, 12133634, 12553701, 12566387, 12060769, 11648305, 11906190, 12578617, 13014967, 13154056, 13500019, 14161099, 14509274, 14050989, 13240788, 13031911, 13750322, 14768978, 15320030, 15339563, 15379098, 15893664, 16821041, 17744012, 18244307, 18176348, 17873939, 18071093, 19260432, 21015787, 22330520, 22876359, 23531598, 25198158, 27390412]
39635B7390412J298323r6164l89573N72101J409840J120324J56345n69648r11582
39626B9980378j231858j513819j395697q70176m00005l46976o25453r11227r53528
39617B1731639p22903m47465m27531o37393o43236j43242N48487Q39477N73964
39608B0671797R5069l19698o88555r84422j007445p61366n76352o00831m90757
39599A5337440M4922O22099N64048j38003p04696n41909M8645L88089L34719K63964
39589A6219318K96339J12500l21193l91131L38440J263681J334726M66814k88154
39580A9031340j53750M23562O38139N52026P73777J268114J353492Q64104M56947
39571B5207751N18810N46425Q1969l85289j23346O61164J106081R57842P78571
$$ y = [27390412, 28688735, 28592571, 28202998, 28775099, 30184939, 31305263, 31461608, 30891960, 29980378, 28748520, 27234701, 25839004, 24968828, 24568823, 24221847, 23596394, 22685167, 21731639, 21008736, 20561271, 20133740, 19496347, 18853111, 18709869, 19258356, 20097833, 20671797, 20766866, 20447168, 19758613, 18774191, 17766746, 17005380, 16429028, 15828197, 15337440, 15382362, 16004461, 16568509, 16430506, 15725810, 15183901, 15232546, 15620635, 15955354, 16219318, 16515657, 16628157, 16306964, 15915833, 16254273, 17517954, 18852680, 19319494, 19031340, 18877590, 19301152, 19939291, 20491317, 21265094, 22533208, 23886700, 24750804, 25207751, 25726561, 26272986, 26354955, 25969666, 25846320, 26507484, 27613565, 28571407, 29349978]
39562B9349978R05849J001212Q68801J000285J801467K754526K974277K409216
39554D3065611J915308K139066K825512L367266L606589L789257L999684M081893
39546F8790186M130247M668734O063530P880988R134107R269789Q756411Q576351
39538A27270343R251548J0503688J1747424J2673381J3370130J4153519J5365655
39531B14335688J7076815J8788245J9624824J9069239J7353794J4820843J1051473
39524C32120921N194111k624555j0669943j6842658k0390600k2000164k2399460
39517B42387652k1563418j9480261j7012815j5337468j4703703j4276462j3187097
39510A26826428j1340569r246658p550124o773260o968008p389042o992346n600099
$$ y = [29349978, 30255827, 31257039, 32125840, 33126125, 34927592, 37682118, 40656395, 43065611, 44980919, 47119985, 49945497, 53312763, 56919352, 60708609, 64708293, 68790186, 72920433, 77589167, 83652697, 91533685, 100667792, 109937581, 118693992, 127270343, 136521891, 147025579, 158773003, 171446384, 184816514, 198970033, 214335688, 231412503, 250200748, 269825572, 288894811, 306248605, 321069448, 332120921, 337315032, 334690477, 324020534, 307177876, 286787276, 264787112, 242387652, 220824234, 201343973, 184331158, 168993690, 154289987, 140013525, 126826428, 115485859, 106239201, 98689077, 91915817, 84947809, 77558767, 70566421, 64966322]
39502F4966322m187435l652914l701688l435632k699731k166552k210283k401781
39494D0510306k230309j758913j371811j300161j545390j874982j805312j057149
39486B7566279j31479J29334k73607m24976O1036L15080l97574j247773q30994
39477B4765326P16502J698153J032955n15935j553092j615056j077892k82882
39469B3168079N43339R68142P06465J43138o8776J46878L23232K67019L44388
39460B6541904Q62229J542531J795391J362940O30283L55635R67769J999682K447612
39451C8505976J949153J326621J525068K261248K402399J654504J064156J524736
39443E2213861K487110K732875J960697R27466K71965q1833l94333o79476r75907
$$ y = [64966322, 60778887, 57125973, 53424285, 49988653, 47288922, 45122370, 42912087, 40510306, 38279997, 36521084, 35149273, 33849112, 32303722, 30428740, 28623428, 27566279, 27434800, 27564134, 27290527, 26865551, 26926587, 27241667, 26844093, 25596320, 24765326, 25481828, 27179981, 28212936, 27697001, 26143909, 24528853, 23450961, 23168079, 23711418, 24679560, 25386025, 25529163, 25460387, 25607265, 25930497, 26197516, 26541904, 27404133, 28946664, 30742055, 32104995, 32735278, 33090913, 34058682, 36058364, 38505976, 40455129, 41781750, 43306818, 45568066, 47970465, 49624969, 50689125, 52213861, 54700971, 57433846, 59394543, 60322009, 60593974, 60512141, 60117808, 59438332, 58462425]
39434E8462425j495234k218907k743198k800364k595141k342349j837971r30101
39426D1499160j55411k95700j257786j952327j591951p52945p07799j821602l080012
39417B9883627l331128k591751j790021j493913j442124j318497j334711j679309
39409A4902173j894622j419857n15228K2928k169m4370J32237P0773l80515m99223
39399A0372127K27630J054787Q61350k44166j078204j017920o05712m60084m46600
39390H663208k25926Q0436J80878O5874j74243n29420p74033m95150K32367P13892
39380G737883N95746M18000O61112P84097J5944j207580j522098l92304J151497
39371H242297J722152R88211k71572j050333q76315q3330N02063L80104j08238
$$ y = [58462425, 56967191, 54748284, 52005086, 49204722, 46609581, 44267232, 42429261, 41499160, 41343749, 41048049, 39790263, 37837936, 36245985, 35493040, 34785241, 32963639, 29883627, 26552499, 23960748, 22170727, 20676814, 19234690, 17916193, 16581482, 14902173, 13007551, 11587694, 11072466, 11095394, 11093225, 11048855, 11181092, 11251865, 10871350, 10372127, 10599757, 11654544, 12515894, 12271728, 11193524, 10175604, 9569892, 9109808, 8663208, 8437282, 8517718, 8698596, 8764470, 8590227, 8060807, 7286774, 6791624, 7023991, 7737883, 8333629, 8751629, 9412741, 10196838, 10212782, 9005202, 7483104, 7090800, 8242297, 9964449, 10952660, 10681088, 9630755, 8754440, 8671110, 9173173, 9553277, 9445039]
39362I445039l36164k71207l16973m42502j79820M69597Q82921P84069O35641
39353A0670601P43375P06609K36890j76758o1901J84118J5374j79672L39265J275689
39343A3753590J541006R19188M84418J039775J968421K153372J447571O17275
39335B3924616J64380j48195o18856r62820o15694M33672J362300J282633K94486
39326B5116522n41161m87354n7232k32495j031468j515578j181741o12191n15591
39317A8941711p72777q32963n58531k09021N9633K16271J27095k66791p22269
39308A5982358r91740j154844j334614j327562r04245k77701J30191K30728K01179
39299A0553750O1533k57687n76475o35448m91199l31219o3192M22355P51234M51563
$$ y = [9445039, 9108875, 8837668, 8520695, 8078193, 7898373, 8367970, 9250891, 10034960, 10670601, 11413976, 12120585, 12357475, 12180717, 12118816, 12302934, 12318308, 12138636, 12477901, 13753590, 15294596, 16213784, 16698202, 17737977, 19706398, 21859770, 23307341, 23924616, 24088996, 23940801, 23321945, 22359125, 21743431, 22177103, 23539403, 24822036, 25116522, 24575361, 24088007, 24030775, 23798280, 22766812, 21251234, 20069493, 19457302, 18941711, 18168934, 17335971, 16777440, 16568419, 16628052, 16844323, 16971418, 16704627, 15982358, 14990618, 13835774, 12501160, 11173598, 10269353, 9991652, 10121843, 10352571, 10553750, 10615283, 10357596, 9781121, 9145673, 8654474, 8323255, 8260063, 8682418, 9433652, 9885215]
39289I885215j98508l63181K05463P95732O72152j16804r94212j412725j058500
39280G414632q7072O78176M14633n82418j090011n60706J82139K81949Q7644L45306
39270G084272Q41530Q27488L89566L29551P87581J011895O34132K49843L91731
39261A2547589O85561N22490M5861q4555L42646Q22540P70096J40066n99344r76827
39251A4216123r55034q30950p40933n03418p5112J72370m5273m41102n92724n61401
39241I642546n38811k06295P61450J726018J594828M08180n56086n58838l01734
39232A1971258n52440q41991l62824N62845R08305M31662j83201m19773l01546
39223A1212295J33941Q43296J330412J074596M61336M49538J178916J746950J614288
$$ y = [9885215, 9686707, 9323526, 9528989, 10324721, 10996873, 10880069, 9885857, 8473132, 7414632, 7327560, 8005736, 8420369, 7837951, 6747940, 6187234, 6369373, 6651322, 6738966, 7084272, 7925802, 8753290, 9142856, 9472407, 10259988, 11271883, 11906015, 12155858, 12547589, 13233150, 13755640, 13801501, 13716946, 14059592, 14882132, 15652228, 15792294, 15192950, 14216123, 13261089, 12430139, 11689206, 11185788, 11110676, 11283046, 11237773, 10796671, 10203947, 9642546, 9103735, 8897440, 9658890, 11384908, 12979736, 13387916, 12831830, 12272992, 11971258, 11418818, 10576827, 10214003, 10776848, 11685153, 12116815, 11933614, 11513841, 11212295, 11346236, 12189532, 13519944, 14594540, 15055876, 15505414, 16684330, 18431280, 20045568]
39214B0045568J372948J660549K073110J836171J058601N88429Q61308J537961
39206C1034645K186357K728541L138066L160589K555126J421343J69562p61266
39198D5632963j179321j237975j219149j170336r12040m94876l60817p49830j176797
39189C7131822r74839l07825q2310o58485j177576o41167O61217J435433J065175
39180C6451445L66833M18527J208810J965392K429081L035984L877196M296925
39172E4050193L887449L283753L402472M212036M824525M635551L800529K634692
39164H4731200J159143n83085k251618l544738m504196n234047n583837n390768
39156E8798054m834382m259333l787611l393387l232103l509463l996426m046551
$$ y = [20045568, 21418516, 23079065, 25152175, 26988346, 28046947, 28635376, 29496684, 31034645, 33221002, 35949543, 39087609, 42248198, 44803324, 46224667, 46394229, 45632963, 44453642, 43215667, 41996518, 40826182, 39914142, 39419266, 39058449, 38308619, 37131822, 36156983, 35849158, 35766848, 35108363, 33930787, 33289620, 33950837, 35386270, 36451445, 36818278, 37236805, 38445615, 40411007, 42840088, 45876072, 49753268, 54050193, 57937642, 61221395, 64623867, 68835903, 73660428, 78295979, 82096508, 84731200, 85890343, 85307258, 83055640, 79510902, 75006706, 69772659, 64188822, 58798054, 53963672, 49704339, 45916728, 42523341, 39291238, 35781775, 31785349, 27738798]
39148B7738798l288671k069434j008725l42325L830p8886p40110j500428j392545
39139A7321504j98733R54784Q76795j40799q23559p59776p43673j189842j368030
39130A3928671p61434j33428l32327q27325n38557M10123R64648Q39871O82896
39121A4233138O81283L60221j41668r725O59450O10915n53017j426994q63563
39112A3550040J45453o4722j273880j746808q05817L86394O31618N6233n71426
39103A0307085q64739p82326l66088M7535o2917o77858j054891o24863K63956
39094F184894P95588O16018N0210m13162n91882o03705n45045l07014J55592M76847
39084E818341K20209l32404l07582M78073R85010L54147p05415q58220j09167
$$ y = [27738798, 24450127, 22380693, 21371968, 21029643, 21033473, 20954587, 20214477, 18714049, 17321504, 17122771, 18077555, 18954350, 18813551, 17989992, 17230216, 16486543, 15296701, 13928671, 13167237, 13033809, 12701482, 11874157, 11335600, 11745723, 12710371, 13550242, 14233138, 14914421, 15274642, 15132974, 15123249, 15782699, 16393614, 15840597, 14413603, 13550040, 13695493, 13630771, 12356891, 10610083, 9804266, 10190660, 10822278, 10878511, 10307085, 9442346, 8660020, 8293932, 8341467, 8278550, 7600692, 6545801, 5920938, 6184894, 6980482, 7596500, 7646710, 7233548, 6641666, 6037961, 5492916, 5185902, 5341494, 5818341, 6038550, 5706146, 5398564, 5876637, 6861647, 7215794, 6510379, 5652159, 5542992]
39075E542992L04829j01198m40635q2313L30052J10713k38127Q0623P33848P23913
39065F964697n4348o45329l85305K92632N38172J03854m97535o52567l44072j40165
39055E180034l88440o09047j33657P29722Q75100m7087r86816q63103N1605O92047
39045D500358O06554J40234l33232o13331m31389K19670P11684M53660k23439
39036E030769n28801l47010j54588j2940M27420R57085Q39827P648o72678o23801
39026D922931k42051l9898P4570K39616J76692j33793l4228Q43122J761036J789503
39016I357500J088482M97667K18420k08976q14702j038883p28071m51215n90297
39007G329925q18285p96059p70954j043949j309360j047707l10925L77849P64382
$$ y = [5542992, 5847821, 5746623, 5305988, 5223675, 5553727, 5664440, 5426313, 5506936, 6240784, 6964697, 6910349, 6265020, 5879715, 6172347, 6710519, 6814373, 6316838, 5664271, 5320199, 5180034, 4791594, 4182547, 4048890, 4778612, 5653712, 5606625, 4619809, 3756706, 3808311, 4500358, 5106912, 5247146, 4913914, 4300583, 3869194, 4088864, 4800548, 5254208, 5030769, 4501968, 4154958, 4000370, 3987430, 4414850, 5371935, 6211762, 6219410, 5546732, 4922931, 4680880, 4640982, 4715552, 4955168, 5131860, 4998067, 4963839, 5806961, 7567997, 9357500, 10445982, 10943649, 11162069, 10953093, 10138391, 9099508, 8371437, 7920222, 7329925, 6511640, 5715581, 4944627, 3900678, 2591318, 1543611, 1232686, 1610535, 2374917]
38998B374917J014478J142052P95487j51949j130456j345239o25379M62555J273077
38989C809543J544617J252628M88559k95278l88495L54773J088446R35836J87592
38980H978221j43631J13929M4065q29848j676970j564728p82507k20736j8721
38971C899074K66136N38149K60680m16398o39020j17208M56639N18145L74418
38962E140615M76439O53332N54893L12489K49110L28163L40435K94150K13508
38953H563134r2915o20766q59038l94240M03251P84925N57890J58167p8942k34339
38943H187127l94322l61596M9700O09217P14490m2630j223169j652722o59304
38934E226791Q40470J170770o853j203349j102484j85431L37732L57686N43122
$$ y = [2374917, 3389395, 4531447, 5326934, 5174985, 4044529, 2699290, 2073911, 2536466, 3809543, 5354160, 6606788, 7095347, 6800069, 6411574, 6766347, 7854793, 8790629, 8978221, 8834590, 8948519, 8992584, 8162736, 6485766, 4921038, 4138531, 3917795, 3899074, 4165210, 4703359, 4964039, 4547641, 3908621, 3791413, 4248052, 4766197, 5140615, 5617054, 6270386, 6825279, 7137768, 7386878, 7715041, 8055476, 8349626, 8563134, 8470219, 7849453, 6990415, 6596175, 6999426, 7784351, 8342241, 8500408, 8421466, 8187127, 7792805, 7431209, 7480909, 8090126, 8804616, 8761986, 7538817, 5886095, 5226791, 6067261, 7238031, 7231178, 6027829, 4925345, 4739914, 5077646, 5435332, 5978454]
38925E978454Q04340M26926m66587r04524n66088r8491J77768O46644J234169
38916G232611J155867K96211l77966l74772m25192r21249q92442L38069J593805
38907G624942J382293K22224j32180O54074J243003R14699M91273O72158Q61398
38898A3933884K91578o82401j096713n70232M85215J345637J375193M74362o23944
38889A4932579r95751n94431j35844Q9596N10542J255238J752137J703183J592966
38880B0110215J740175J644910Q89926p044l24391j56884m9170j23781k21615
38871B3502341m05891o44964m87810K01731O54242J60214p75845j124847q20372
38862B0258799n81891n35463j51986M87748N65809q2069n23081j37680M10219
$$ y = [5978454, 6782794, 7209720, 6743133, 5838609, 5272521, 5174030, 5351798, 5998442, 7232611, 8388478, 8684689, 8306723, 7931951, 7506759, 6585510, 5693068, 6031137, 7624942, 9007235, 9229459, 9097279, 9751353, 10994356, 11909055, 12400328, 13072486, 13933884, 14225462, 13543061, 12446348, 11876116, 12361331, 13706968, 15082161, 15556523, 14932579, 13936828, 13342397, 13206553, 13296149, 13806691, 15061929, 16814066, 18517249, 20110215, 21850390, 23495300, 24385226, 24378182, 24053791, 23896907, 23847737, 23723956, 23502341, 23096450, 22451486, 21963676, 22165407, 22819649, 22979863, 22204018, 21079171, 20258799, 19676908, 19141445, 18989459, 19477207, 20043016, 19960947, 19437866, 19300186, 19710405]
38853A9710405J95481o42996j211837j048102m62422j0917l0986m36217o90722
38844A5371687l02345M39602O42452Q86o75157n27870J96937N84595L10324j14531
38834A5926580j87429M8286L04931M55843N46655O41212P18610O56998M05948
38825A9517634J78184K13518L30134J40444j64254J56482J218509K004082J663283
38816B5258016Q11262O92156J381576J795916J389424P98866O28500N88318K42936
38807C3586970k57720p53924j613348k957429l925612l568148k182737r91975
38799A7336077o60742q29200r52673q33564l70676M01289R13607N02108n19063
38790A4987163r89702m52507K09918J83271n8342K40622N86117r6588j538153
$$ y = [19710405, 19905886, 19262890, 18051053, 17002951, 16540529, 16529612, 16498626, 16062409, 15371687, 15069342, 15508944, 16151396, 16152282, 15477125, 14949255, 15146192, 15730787, 16041111, 15926580, 15739151, 15787437, 16092368, 16548211, 17094866, 17736078, 18454688, 19111686, 19517634, 19695818, 19909336, 20239470, 20379914, 20215660, 20372142, 21590651, 23594733, 25258016, 26069278, 26761434, 28143010, 29938926, 31328350, 32127216, 32755716, 33344034, 33586970, 33329250, 32575326, 30961978, 28004549, 24078937, 20510789, 18328052, 17336077, 16675335, 15846135, 14893462, 14059898, 13689222, 14090511, 15004118, 15506226, 14987163, 13997461, 13544954, 13754872, 13938143, 13879801, 14120423, 14706540, 14609952, 13071799]
38781A3071799k192694j431058m51428m40621q76461n68890L55546O82938M4756
38772H193887n68044l89082K6178k28516j028558j430113r27896L3242O70826
38763D351924O05517O8631l41186j67784M24862P69351M57559j60850m48608k78442
38753E280974p4637j67537m23504n02533k29464K81417O55226M66803l08588j082209
38743C895948j180954o07382k054J52938k2950j81041j64720O9560N48935J046312
38733C554592J077456M70295k80030n43642k76909P6845K13261J40477j06112
38724D326233m74081o54330k81218N23033J139203J106542N41406j43467o47550
38715E435771q51968p94834o76062o08818l39428L86414J118132R43058k47807
$$ y = [13071799, 10879105, 9448047, 8996619, 8555998, 7679537, 7110647, 7466193, 8149131, 8193887, 7625843, 7236761, 7262939, 7034423, 6005865, 4575752, 3647856, 3681098, 4351924, 4957441, 5026072, 4684886, 4517102, 4941964, 5711315, 6168874, 6008024, 5559416, 5280974, 5206337, 5038800, 4615296, 4112763, 3883299, 4164716, 4819942, 5286745, 4978157, 3895948, 2714994, 2107612, 2105558, 2258496, 2235546, 2054505, 1889785, 1959345, 2508280, 3554592, 4632048, 5102343, 4822313, 4278671, 4001762, 4078607, 4291868, 4432345, 4326233, 3852152, 3197822, 2916604, 3439637, 4578840, 5685382, 6226788, 6083321, 5435771, 4583803, 3788969, 3112907, 2504089, 2164661, 2551075, 3669207, 4612265, 4364458]
38706D364458j293728j114404j20844M06637R4371k05057J16921N21781K81645
38697C051780l41303n00454O79N16190M96842O2203m13683p81147r57214o88966
38687D44927J20032J000666J264614Q25637L29984K96286M48034K25447l04182
38678D651445n72319m71494n50809j055830j389159r60047r4370M48882N07592
38669E13891M49178L64198N6427l02881k86830J1867O8136j34284k9969M80415
38659A190148P23125L27295j53872j40274J42994K20103J04492l6665l10923o23736
38649A442687m52221K39708N73255N2334m42671J3493P48771M90205m82758p20480
38639A462323K2640M32136j58241q05017o92194l18238k01763J79648J109256
$$ y = [4364458, 3070730, 1956326, 1835482, 2242119, 2336490, 2131433, 2248354, 2770135, 3051780, 2710477, 2210023, 2210702, 2726892, 3223734, 3285937, 2872254, 2091107, 1133893, 444927, 564959, 1565625, 2830239, 3655876, 3985860, 4282146, 4730180, 4955627, 4651445, 4079126, 3607632, 3056823, 2000993, 611834, -348213, -442583, 6299, 513891, 963069, 1327267, 1383694, 1080813, 793983, 805850, 873986, 739702, 709733, 1190148, 1913273, 2240568, 2086696, 1946422, 2089416, 2309519, 2414011, 2377346, 2066423, 1442687, 990466, 1230174, 1803429, 1855763, 1413092, 1426585, 2175356, 2665561, 2182803, 1462323, 1484963, 1917099, 1758858, 953841, 261647, -56591, -258354, -78706, 1030550]
38630A030550J511605M58170j049367j245011q1166Q37809N95816r0730l20026
38621A647650j63083l4239J07522M05796O14603M76296J98559J46554K95496K88042
38611C983196p8127n79345p42463l15172L67636O38526K67548k37295l05641L155
38601C002018K77109L87003M22320L03645j3190j95886J2608J97908k24923j039712
38591C128900j431317j096636m77637O3118N50207Q64702P30220L78951M21389
38582C131897Q22049Q22622J92521l07595j68425J9316l96617r98969r96240m46945
38572A673614N1452L91443P59129Q24466J73154o64916p06126k0486L27211o568
38562B802373j01318O30045J348406J036617M6958n29132n37465p68156j439847
$$ y = [1030550, 2542155, 3000325, 1950958, 705947, 624781, 1462590, 2058406, 1967676, 1647650, 1484567, 1450328, 1557850, 1963646, 2578249, 3054545, 3253104, 3399658, 3695154, 3983196, 3905069, 3325724, 2583261, 2268089, 2635725, 3274251, 3541799, 3304504, 2998863, 3002018, 3279127, 3666130, 4088450, 4392095, 4378905, 4183019, 4195627, 4393535, 4168612, 3128900, 1697583, 600947, 123310, 186428, 736635, 1601337, 2331557, 2710508, 3131897, 3953946, 4776568, 4969089, 4661494, 4493069, 4512385, 4115768, 3116799, 2120559, 1673614, 1725066, 2116509, 2875638, 3700104, 3873258, 3208342, 2502216, 2481730, 2808941, 2802373, 2701055, 3331100, 4679506, 5716123, 5763081, 5233949, 4696484, 3928328, 2488481]
38553B488481j714890r82577J62628O97074M37914L5662k6279R5352Q4327k8133
38543A249559m061J83138K90328J65586N6893M07569J216587J722470J094136
38534F382205m32507j516910j196445r7573L91648l8908l77193O2539O46898N24410
38524D348164o1027k93967r1559k5825k49661l87282l56463m13019m08632O4099
38514B124828O90715N91794k50897p22221k26420L41925O337p55060q41428k75056
38504F84517P785k14689k05176L49644P96565O27495K46220J99031L19036J55474
38494B965902j91817j98773L15701R46551J177964Q80190L49471m6031k39605
38485E959553m13148n47915l07149L73587Q74326N65974k32915n42672J8987Q24065
$$ y = [2488481, 773591, -208986, -46358, 650716, 1088630, 1124292, 1098013, 1193365, 1277692, 1249559, 1245498, 1428636, 1718964, 1884550, 1941443, 2349012, 3565599, 5288069, 6382205, 5949698, 4432788, 3236343, 3138770, 3530418, 3491510, 3114317, 3176856, 3823754, 4348164, 4287137, 3993170, 3901611, 3875786, 3626125, 3238843, 2882380, 2469361, 2060729, 2124828, 2815543, 3407337, 3156440, 2434219, 2207799, 2549724, 2556061, 1801001, 959573, 684517, 692302, 477613, 272437, 622081, 1418646, 2046141, 2292361, 2491392, 2810428, 2965902, 2774085, 2575312, 2891013, 3837564, 5015528, 5895718, 6245189, 6199158, 5959553, 5546405, 4998490, 4691341, 5064928, 5939254, 6505228, 6272313, 5729641, 5748628, 6572693]
38475F572693J170752J043206P29552K92045j77911k81501J42766M87441J1826
38466I990869j030392j452223n17420J075030J882656J299086J84992j54107N82825
38457A1861316J517002J783973J487845J287766J443770J686724J786363J768008
38449B4622767J687055J638505J885879K525039L142354L305942L240426L429079
38441D5477046L764104L893726M239508N576891P525153Q719257Q904256R554386
38433I7654327J1632632J3985437J5133752J5608910J6934924J8847784J9187582
38426B08985348J6482964J1216368M511000k911077j0078135j5495990j8363029
38419A94347449j9255332j9036438j7856254j5743239j3345775j1360131r814427
$$ y = [6572693, 7743445, 8786651, 9516203, 9808248, 9630337, 9348836, 9491602, 9979043, 9990869, 8960477, 7508254, 6990834, 8065864, 9948520, 11247606, 11432598, 11278491, 11861316, 13378318, 15162291, 16650136, 17937902, 19381672, 21068396, 22854759, 24622767, 26309822, 27948327, 29834206, 32359245, 35501599, 38807541, 42047967, 45477046, 49241150, 53134876, 57374384, 62951275, 70476428, 79195685, 88099941, 97654327, 109286959, 123272396, 138406148, 154015058, 170949982, 189797766, 208985348, 225468312, 236684680, 241195680, 238284603, 228206468, 212710478, 194347449, 175092117, 156055679, 138199425, 122456186, 109110411, 97750280, 87935853]
38412H7935853q537071p730008p410510o885800n619014m212747l677150l963038
38404C9900515m054634l411843k514192j933219j619340j328032j144264j221206
38396B2673785j356767j194455p35226m20202o55431j279028j596261j138103
38388A4298312l56743j92948q17752j278461p66447J88026L59786n66220j640406
38379I227147j821899r65941L10300J187539J057971k6154j158193j315196m66166
38370F029408M59396P91459P78698Q52029Q53629M52472j15492k91282J7745L75591
38360A0203653M50709K93217K0835l68387q00004j050173r95747p50306m59810
38351F543987j14260L38552P95111J024998Q88115M79788N3810j94699k69011
$$ y = [87935853, 79398782, 71668774, 64258264, 57372464, 51753450, 47540703, 43863553, 39900515, 35845881, 32434038, 29919846, 27986627, 26367287, 25039255, 23894991, 22673785, 21317018, 20122563, 19387337, 18967135, 18311704, 17032676, 15436415, 14298312, 13941569, 13748621, 12930869, 11652408, 10885961, 11073987, 11433773, 10867553, 9227147, 7405248, 6439307, 6749607, 7937146, 8995117, 8968963, 7810770, 6495574, 6029408, 6488804, 7280263, 8058961, 8910990, 9764619, 10217091, 10101599, 9810317, 9828062, 10203653, 10654362, 10947579, 10968414, 10600027, 9800023, 8749850, 7754103, 7003797, 6543987, 6429727, 6768279, 7563390, 8588388, 9476503, 9956291, 10010101, 9815402, 9546391]
38342I546391l01580l86468n07002n64605m16745J3942N32331O87604K62047k84908
38332H581007k12197N36143J108456P83412k6449k43441M70056J249584J130714
38323A3377285K28360n15390n39937j90159m0335j37139j51491J9069J76604K46297
38313A2473164L87757O29807P13878M39533o1749n20945p90141q11152n94454
38304A1865698l76776m96932q90554j017009n87580n1080M1628j56255j60656
38295H170484q7118m73485j201678j418420q05699j98592m18127j025551r21541
38286A620273P6780R76910R54216L29641o2269m2718j68951p72550j382221j287372
38276B41739m04070O93338J433524J590732J093055M2376r53814j069919k63892
$$ y = [9546391, 9244811, 8858343, 8351341, 7786736, 7369991, 7383933, 7916264, 8603868, 8865915, 8581007, 8368810, 8904953, 10013409, 10796821, 10770372, 10526931, 10996987, 12246571, 13377285, 13605645, 13090255, 12550318, 12360159, 12319824, 12182685, 12031194, 12050263, 12226867, 12473164, 12860921, 13490728, 14204606, 14644139, 14582390, 14061445, 13271304, 12460152, 11865698, 11488922, 10991990, 10101436, 9084427, 8496847, 8445767, 8487395, 8331140, 8170484, 8083366, 7609881, 6408203, 4989783, 4184084, 3985492, 3567365, 2541814, 1620273, 1697053, 2673963, 3628179, 3957820, 3895551, 3852833, 3683882, 2911332, 1529111, 241739, -162331, 531007, 1964531, 3555263, 4648318, 4690694, 3736880, 2666961, 2403069]
38267B403069M87221M24647K2919J58010O93111P38472R9307m78452n23674l95374
38257C629256m45425m51962j79474J83104M16206M98489K93861l00705p95947
38248B847403n47206J02337J21714n09625n90204L32681J077285P11389M4867
38239C590641J32115M55314K1229o69572m08374N63966R03651L73643K4001K37957
38229E224571K48234k38591m84914j36047J83325R8102O2020K90036L07254J3441
38219E567431L3991N07038O41954L7230o23503p39923o07955n25472k02286L12736
38209D401241K64528m99747r66885n16441P0260M3557n5976L55603N94888j2276
38199C678752o06337j01630Q47536Q88957L00320M07860J100328R42329k59439
$$ y = [2403069, 2890290, 3314937, 3337856, 3495866, 4188977, 4927449, 5026756, 4548304, 4024630, 3629256, 3183831, 2731869, 2552395, 2735499, 3151705, 3650194, 3944055, 3643350, 2847403, 2300197, 2402534, 2524248, 2014623, 1424419, 1757100, 2834385, 3545774, 3590641, 3722756, 4178070, 4199299, 3529727, 3121353, 3685319, 4588970, 4962613, 4986614, 5224571, 5472805, 5234214, 4749300, 4613253, 4796578, 4894680, 4956700, 5246736, 5553990, 5567431, 5601422, 6108460, 6750414, 6787644, 6164141, 5424218, 4816263, 4290791, 4088505, 4401241, 4665769, 4166022, 3199137, 2682696, 2752956, 2796513, 2740537, 3096140, 3691028, 3678752, 3072415, 2970785, 3818321, 4707278, 5007598, 5415458, 6515786, 7458115, 7198676]
38190G198676j003109n46168K9796j86718n59039l61813j32263m87440p93914
38181C158008k43579O10697O43017q9458n60600m00273j88857k62872k57833O3925
38171B472175L73963L89283K90205K93112L11813K75173L32216M64874K97254
38162E500068l33198r06375p90647j58107J76971j24303m88687l29954J20822
38153B666590L00585J89873R6125r6531o41362j047828m91072P47010J287381
38144C010771N44515l71918l16386K35163J26636n68843p14835J35322J194083
38135C274508J546702R77572j72244j204900j304211l68514N49942L93767n29474
38126C163148j107582j025598q38122p29823l54899J94591M17976L74556M86133
$$ y = [7198676, 6195567, 5649399, 5679195, 5492477, 4933438, 4571625, 4439362, 3951922, 3158008, 2914429, 3525126, 4168143, 4078685, 3518085, 3117812, 2928955, 2666083, 2408250, 2472175, 2846138, 3235421, 3525626, 3818738, 4130551, 4405724, 4737940, 5202814, 5500068, 5166870, 4260495, 3469848, 3311741, 3488712, 3364409, 2875722, 2545768, 2666590, 2967175, 3157048, 3253173, 3156642, 2515280, 1467452, 976380, 1723390, 3010771, 3555286, 3183368, 2866982, 3102145, 3228781, 2659938, 1945103, 2080425, 3274508, 4821210, 5798782, 5626538, 4421638, 3117427, 2748913, 3298855, 3692622, 3163148, 2055566, 1029968, 191846, -537977, -892876, -698285, -280309, 94247, 580380]
38117E80380M70682k02993q53552k02209J314627J626682O4924j419331j067849
38108C11361K40327O63086J43785j03389J60615K08273M540J61407M76062M6666
38098B312733j135719j982227j782255q36624L77542J608372K347116K031986
38090B940924R82592K45657K52538L79587L8550n36555q30121p13051l21970J66586
38080B604737M32548J89961l60077o99178o85718o01267n09846j92133J97611
38071C76638J06210n15177q91756m12580M89897Q64433L93600l19979m91364M9902
38061c50176P45613R02236M32517o3614n4261K82109M03143J63700j51902l84936
38051A924429n87802n96388p4532Q37628J350363Q20670m36528j367619j221460
$$ y = [580380, 1051062, 848069, -5483, -207692, 1106935, 2733617, 2798541, 1379210, 311361, 551688, 1214774, 1358559, 1255170, 1415785, 1624058, 1628598, 1790005, 2266067, 2312733, 1177014, -805213, -2587468, -3424092, -3046550, -1438178, 908938, 2940924, 3923516, 4169173, 4421711, 4801298, 4839848, 4303293, 3473172, 2760121, 2438151, 2604737, 3037285, 3227246, 2867169, 2167991, 1482273, 881006, 371160, 179027, 376638, 482848, -32329, -924085, -1336665, -846768, 17665, 411265, 91286, -400078, -350176, 395437, 1297673, 1730190, 1666576, 1612315, 1894424, 2297567, 2461267, 2309365, 1924429, 1336627, 740239, 665707, 1503335, 2853698, 3674368, 3237840, 1870221, 648761]
38042F48761k99435L93180K68204k31091l35597l6418M3449k36015k85159J81155
38032A11034O37655O23991L63760Q1893m38406j021967p83344M63018J375225
38023A412859Q27070k85980l59038M13776M65000n23393j186062p44129j9414
38014F89J89304K07454M18037M79983K71135L68018Q66575Q78112m558p96033
38004B878716n40158K89669O99630O32198N76782M82665P0271l50109l47235k22897
37994D169532n17677j036315j179413r19978o93365o02034m27331j87430p2203
37985a466214m2957L1872J29304L01884O87549R63695M73417o33383j165586m36405
37975a156824P26719J223348J081217P71602R0690j083188j751718j000799K75696
$$ y = [648761, 349326, 742506, 1010710, 779619, 444022, 407604, 451053, 215038, -70121, 111034, 748689, 1372680, 1736440, 1818333, 1379927, 357960, -425384, 37634, 1412859, 2239929, 1953949, 1594911, 2008687, 2473687, 1950294, 764232, 20103, 689, 189993, 397447, 815484, 1295467, 1566602, 1934620, 2801195, 3679307, 3674749, 2878716, 2338558, 2628227, 3327857, 3960055, 4536837, 5019502, 5089773, 4739664, 4392429, 4169532, 3651855, 2615540, 1436127, 516149, -177216, -779250, -1206581, -1394011, -1466214, -1509171, -1477299, -1347995, -1046111, -358562, 605133, 1078550, 445167, -720419, -1156824, -430105, 793243, 1874460, 2646062, 2736752, 1653564, -98154, -1098953, -823257]
37966h23257M03473n88153j056496k61107P46253R33920N71598L10417J90283
37957D26931L7806j00787k84659n94741n71835K81200J314517J222574P53q28727
37947I03032m01647L30955K75379k05648k60301l6077j08555k53637K5990L23644
37937E93135j19258r92905j180483l76918M96626N61572p6401p36921r06348m78272
37927c216173K49708P16527N83417J12782j73198r4952J77884N02772P93521Q70819
37917E23107O72455M54883M18104L10490j90419q70432j192037j007138o39147
37908a520134l50003j50082o3895j33375j62038J15437N61781P22673M56190J13434
37898d10012j4624o8309k32318k71821K04101J074612J612725J238564K58735
$$ y = [-823257, -419784, -1007937, -2064433, -2325540, -1579287, -645367, -73769, 236648, 426931, 464737, 363950, 79291, -515450, -1087285, -806085, 508432, 1731006, 1731759, 903032, 501385, 832340, 1107719, 902071, 641770, 605693, 497138, 243501, 269491, 593135, 473877, -519028, -1699511, -2076429, -1579803, -1018231, -1094632, -1831553, -2737901, -3216173, -2966465, -2249938, -1666521, -1553739, -1726937, -1821889, -1644005, -1141233, -347712, 523107, 1195562, 1650445, 2068549, 2379039, 2188620, 1318188, 126151, -880987, -1520134, -1870137, -2020219, -2084114, -2217489, -2379527, -2264090, -1702309, -979636, -523446, -410012, -424636, -492945, -725263, -997084, -792983, 281629, 1894354, 3132918, 3391653]
37889C391653m12137l53809j70151o15207j437658j647033r03136J3980L36361
37880a797137K70237L98970O84095O92202M55238L87527M90540L32785j51562
37871A762895m55368k39005K05624M24596L57066K16633J15957L3572k8312m4065
37861B349593m9371j28980l27056n30346m29676K03945J058666J340185N99252
37852D086212o36416j375433j211311n57360K4213L21117L65750K93731L81120
37843A691623Q39810J461033J758064J533196J027548N15719J29825J10589P33158
37834I800565J758470K383743K093097J295039P67428O49997L72906m40952j365673
37825A7314620j656210j195781o85653p69382j189011j187216o94088n04988r85097
$$ y = [3391653, 2979516, 2625707, 2455556, 1840349, 402691, -1244342, -2147478, -2133498, -1797137, -1526900, -1127930, -443835, 248367, 703605, 1091132, 1581672, 1914457, 1762895, 1307527, 1068522, 1274146, 1698742, 2055808, 2272441, 2388398, 2421970, 2393658, 2349593, 2300222, 2171242, 1844186, 1313840, 884164, 1088109, 2146775, 3486960, 4086212, 3449796, 2074363, 863052, 305692, 329905, 651022, 1016772, 1310503, 1691623, 2531433, 3992466, 5750530, 7283726, 8311274, 8826993, 8956818, 9067407, 9800565, 11559035, 13942778, 16035875, 17330914, 18098342, 18748339, 19121245, 18680293, 17314620, 15658410, 14462629, 13776976, 13007594, 11818583, 10631367, 9937279, 9432291, 8447194]
37816H447194j263104m28483R39848J451461R49614P05731J367700J937384J429281
37807A5536626M88656L76315J077825J546905J388151J120428R45747M54662l13751
37798B2621564n96470o2162N79338N17701k66912j359860k449483l132214k918451
37789A2933051j978159j255683j239383j202242l82084O18892N49896o37059j622473
37780E784756j424201m34899L76181N47648J72986m70129r64408q96671l25275
37771B365988J90489K54073L4574j33335j92070k44328l55179o09664r81832j065425
37761g36709m64858M11462O35658J36010j0459P80261J488774R45977k40626m50010
37751B495480N17082J118012L66790q05525j044348m12589O1380j3038j41780
$$ y = [8447194, 7184090, 6755607, 7695455, 9146916, 10096530, 10802261, 12169961, 14107345, 15536626, 16025282, 16401597, 17479422, 19026327, 20414478, 21534906, 22480653, 22935315, 22621564, 22025094, 21962932, 22542270, 23059971, 22793059, 21433199, 18983716, 15851502, 12933051, 10954892, 9699209, 8459826, 7257584, 6875500, 7494392, 8044288, 7407229, 5784756, 4360555, 3925656, 4301837, 4849485, 5022471, 4552342, 3587934, 2691263, 2365988, 2556477, 2810550, 2845124, 2711789, 2519719, 2275391, 1920212, 1310548, 328716, -736709, -1201567, -790105, -154447, -18437, -28896, 751365, 2240139, 3186116, 2945490, 2495480, 3012562, 4130574, 4497364, 3691839, 2647491, 2234902, 2296282, 2283244, 2141464]
37742B141464K4502K35396J78283j01694l57001l68217q2417K08552K0021o52232
37732A246657j045206m96952N39620R14897K37652o29462o92747K5894P41152
37723H41505R17601O23687Q8999n86842j200713j319686p09098K30944P69878
37714c43725O36223K54472J06145J70891K45361M63344R71414J265395N86521
37705D356041q50163j717004j117622K15143Q11364K32714o24840p96546k17764
37696B91323N21052Q37726N16066j58950n50346l11024J19559M4273n09588q46232
37686d6141o75513n11929p55552r67705n40698L03072P53134N05166J01394J50552
37676a684220N99558R16320P62284L23021M6640J47401L90059L83955N7886k67564
$$ y = [2141464, 2165966, 2401362, 2579645, 2477951, 2120950, 1752733, 1670316, 1878868, 1898889, 1246657, 201451, -295501, 244119, 1159016, 1396668, 767206, 74459, 100353, 841505, 1759106, 2382793, 2471792, 1884950, 684237, -635449, -1344547, -1113603, -343725, 292498, 546970, 653115, 824006, 1069367, 1532711, 2504125, 3769520, 4356041, 3505878, 1788874, 671252, 886395, 1697759, 1930473, 1305633, 509087, 291323, 812375, 1650101, 2166167, 2007217, 1456871, 1145847, 1265406, 1309679, 800091, -46141, -721654, -1233583, -1989135, -2956840, -3497538, -3194466, -2441332, -1936166, -1834772, -1684220, -1084662, -168342, 593942, 916963, 963603, 1111004, 1501063, 1885018, 1942904, 1675340]
37666A675340k98122j14601k7054j89611m48503n10028k26167K09666L73840P4222
37656E18982l15356k19186L86512Q49698O13983j20828o98819p72639n50249m23842
37646g31744n68760q15581p63155j51475P28514J184209Q76223K20949j83338
37637b04158k58647k32373k5784N63560J188352J142041L51764m21396o14821
37628A488538n32670o36853p30510m04169J07977K05436j19067k70732J0157L26434
37618e55459L32882J85056R4590k7748k19802k44748m4783L0846j68947k13403
37608h31516J88590M95870M5781p80171q85771L2160J031401J153548M80085k78202
37598F51775o50291n22349O1203P37585Q87222L80164n7726K25934P86189O47665
$$ y = [1675340, 1377218, 1262617, 1235563, 1045952, 597449, 87421, -138746, 70920, 444760, 518982, 203626, -15560, 370952, 1220650, 1834633, 1713805, 1014986, 242347, -307902, -731744, -1300504, -2116085, -2879240, -3030715, -2302201, -1117992, -241769, -20820, -204158, -462805, -695178, -720962, -157402, 1030950, 2172991, 2524755, 2103359, 1488538, 955868, 319015, -411495, -815664, -707687, -502251, -621318, -892050, -881893, -555459, -222577, -37521, 57069, 29321, -190481, -435229, -480012, -449166, -618113, -831516, -642926, -147056, -101275, -881446, -1767217, -1735057, -703656, 449892, 929977, 651775, 1484, -520865, -459662, 277923, 1165145, 1545309, 1487583, 1713517, 2499706, 3147371]
37588C147371k33504q38290n51630k7638j56337p04217o57353K48520J039559
37579A266481P68655k18256p39337l05320L49235L53694j96582n81907n10715
37570A85948k75711o4571K06825L69660M8520n38659n43326L17881J158231J083333
37560A948131M07790N262p6830m44229j070024j218350o88845j66135q7641l3191
37550a424062L76890P54367O38649L00115K50489L98217K90584j03367l96866
37541A085016l70534j09165K45139M81466L03642k54829o51260n28507l19752
37532a18784n94736j032978p74868K36815J029070Q94397K23111k86666o01312
37523a025951r78867j105975l93362R45737J827123J527575N06194k89058n46551
$$ y = [3147371, 2913867, 2075577, 1523947, 1496309, 1339972, 635755, -21598, 226922, 1266481, 2035136, 1816880, 1077543, 772223, 1121458, 1475152, 1278570, 696663, 185948, -89763, -154334, 52491, 422151, 470671, -67988, -611314, -293433, 864798, 1948131, 2355921, 2361183, 2284353, 1840124, 770100, -448250, -1137095, -1303230, -1390871, -1424062, -1047172, -292805, 345844, 645959, 896448, 1294665, 1585249, 1481882, 1085016, 714482, 605317, 850456, 1331922, 1635564, 1380735, 729475, 200968, -118784, -713520, -1746498, -2521366, -2284551, -1255481, -361084, -137973, -424639, -1025951, -2004818, -3110793, -3504155, -2558418, -731295, 796280, 1302474, 1013416, 466865]
37514D66865o22437p23143o25963k32239J30951K05066K15623M63104P68545P19552
37504G65924L13929n5186k02589l35264n98025p99235p04365l47196L8440K14272
37494a709295Q3723j43648m0687M75755Q35374N36716L4076K25509J038799J344575
37484B680897N57759m76348o97700k32547P5549m9900k91295n63392r80901j224248
37474a202126q24240l9701L55303K06787J42039M84231P65429N62687J27151j57059
37464D20501l30739m73599l13390K57962O89773L95919l33076o17285j56076L94436
37454f5574L35028j83150m57026k22460K3238k27121p11317o96275J5824P76301
37444a412532R14588N18060J53166J29203L37923N12015K96496n67049j647345
$$ y = [466865, -155572, -878715, -1504678, -1736917, -1605966, -1400900, -1185277, -722173, 46372, 765924, 1079853, 1024667, 822078, 486814, -111211, -910446, -1614811, -1962007, -1923567, -1709295, -1625572, -1769220, -1809907, -1334152, -498778, 37938, 72014, 297523, 1336322, 2680897, 3238656, 2762308, 2064608, 1832061, 1907610, 1857710, 1566415, 1003023, 22122, -1202126, -2026366, -2066067, -1710764, -1503977, -1361938, -877707, -112278, 450409, 577560, 420501, 89762, -383837, -697227, -439265, 250508, 646427, 313351, -303934, -460010, -65574, 269454, 86304, -370722, -593182, -569944, -797065, -1508382, -2204657, -2188833, -1412532, -497944, 20116, 173282, 302485, 640408, 1152423, 1448919, 881870, -765475]
37435g65475j817932n59964R99285J218029K6553j039083r31000j85805L14880
37426b740512N39919O63965K84815p46274j451601q13344O46673J445037J112303
37417a059019N57949M92041N45179K16976k29549l23946k01487l12133o87972
37408a001961r53714q45997m03703J67871N83618O27287M19121L35049M81397
37399e91032M89548N8115n25575o87868k53380M30090R42595J110111R43764N43618
37389B459986J00873k07264l97596o28191r12155j010541p25153k45059m7418
37380a612518l67634q52517r11668m38621J6958n8766m48909m62926J67845R38397
37370d030359J166129P00137m8781n58585n44356o2386N33918Q47261Q06165P11332
$$ y = [-765475, -2583407, -3143371, -2144086, -926057, -899504, -1938587, -2869587, -3055392, -2740512, -2200593, -1536628, -1251813, -1998087, -3449688, -4263032, -3616359, -2171322, -1059019, -501070, -9029, 536150, 753126, 523577, 199631, -1856, -313989, -1001961, -1955675, -2801672, -3205375, -3037504, -2453886, -1826599, -1407478, -1072429, -591032, -101484, -43369, -568944, -1256812, -1510192, -1080102, -137507, 972604, 1916368, 2459986, 2560859, 2353595, 1955999, 1327808, 415653, -594888, -1320041, -1565100, -1612518, -1980152, -2832669, -3744337, -4182958, -4166000, -4224766, -4673675, -5136601, -4968756, -4030359, -2864230, -2164093, -2212874, -2771459, -3315815, -3378201, -2844283, -1997022, -1190857, -479525]
37360d79525Q14518R82515R23680O09437K59102j0989k81275n75947p36197o17529
37350H87790k86031L1484J18918q3075l86526m49078j19087L26092M69851K85175
37340G95513J47917K69376L76057J15308m21847p92264o94835k01850L70459O34109
37330E97943L29028l70382q33840n71916J50688N89046M21870O3682N236K06358
37320E87713L51479L90478M81249N58297L38589k23529p69136r28197p22425m66654
37310d02136l49656k39920M7503L66619L04852k53919p98181p04721m8542M38582
37300a639519K88675j77631m10497l37985k00465L779M36382R03122R06658L13604
37290H6123l51567m40791J25316P80417Q74922L24069k92246l70666K584K18331
$$ y = [-479525, 334993, 1317508, 2241188, 2850625, 3109727, 3098738, 2817463, 2241516, 1505319, 887790, 601759, 633243, 752161, 669086, 282560, -166518, -285605, 40487, 510338, 795513, 943430, 1212806, 1588863, 1704171, 1282324, 490060, -204775, -406625, -36166, 597943, 926971, 556589, -277251, -849167, -698479, -109433, 312437, 376119, 381355, 587713, 939192, 1329670, 1810919, 2369216, 2707805, 2484276, 1715140, 786943, 64518, -402136, -751792, -991712, -944209, -577590, -272738, -526657, -1324838, -2029559, -2078101, -1639519, -1350844, -1528475, -1938972, -2276957, -2477422, -2473643, -2037261, -1134139, -227481, 86123, -265444, -706235, -580919, 199498, 1074420, 1398489, 1106243, 735577, 738161, 956492]
37280I56492K2619j85850q4757N8703l7239q0679K56170O10210M07423k06055
37270A717037o17288p12392q24524q91784n47227L277J38798p0296R7107O79818
37260a027474Q03044J55129l71807r7786L85507L09885k7227N47J75297J0090
37250C15205j77476J19201M43776M7297o63483o24693J20938M58451K713m28531
37240c86602l33598k39792m79147m41051K92048J032273R94553M92226L26931
37231A257841N20981M55159o3246n90788p38115n04420l6743M89168Q18569P75988
37221B384394M10798j56181p92952j139263p55769K04901Q74073O20320j71669
37212A478652o55520n50617j98852J03244L15383L74796K10421k1039r3673l3102
$$ y = [956492, 979111, 793261, 708504, 767207, 729968, 649289, 905459, 1515669, 1923092, 1717037, 1099749, 387357, -437167, -1328951, -1876178, -1872901, -1734103, -1804399, -1707292, -1027474, -224430, -69301, -441108, -538894, -153387, 156498, 129271, 129818, 305115, 315205, 137729, 256930, 700706, 748003, 84520, -540173, -419235, 39216, 41929, -386602, -720200, -959992, -1439139, -1880190, -1588142, -555869, 438684, 930910, 1257841, 1778822, 2233981, 2170735, 1579947, 841832, 337412, 300669, 789837, 1608406, 2384394, 2795192, 2639011, 1846059, 706796, -48973, 155928, 1030001, 1650321, 1478652, 823132, 272515, 73663, 176907, 492290, 867086, 1077507, 1056468, 962795, 929693]
37202I29693K3452J15755K59719J74174l35949q78007q57862k99064K11158L52840
37192c04091L42228L72453L39775K28193K24607K67726J0102m99661o16035Q788
37182C74085P56017P92142J96564k57703k84831l51492o97594q14082k84650L89425
37172a82119L96867k14102o06586l60142J0841p7925m25238m17839P1973N62795
37162a241475N82600J04962n05621p39035l00016N13212R72977P35765K64097
37153C87466J29364K17107R9882j15731Q220L57711L55250o4650l38756k43476
37143G92387j98074l86943l74193O3188M73525N21754N04447N91495L37618m03312
37133A921892q42864l84237K59965P2029o34300o97546M6616N83452L66648K0591
$$ y = [929693, 953145, 1068900, 1328619, 1502793, 1166844, 288837, -569025, -868089, -656931, -304091, 38137, 410590, 750365, 978558, 1203165, 1470891, 1480993, 981332, 365297, 374085, 1130102, 1922244, 2118808, 1861105, 1576274, 1224782, 527188, -286894, -571544, -182119, 214748, 646, -605940, -966082, -955241, -1033166, -1458404, -1876243, -1804270, -1241475, -658875, -553913, -1059534, -1798569, -2098585, -1585373, -612396, 123369, 387466, 516830, 733937, 833819, 718088, 726308, 1084019, 1439269, 1374619, 1035863, 792387, 594313, 207370, -166823, -103635, 369890, 891644, 1396091, 1987586, 2325204, 1921892, 1079028, 694791, 954756, 1026785, 392485, -305061, -258445, 325007, 691655, 712246]
37123G12246J78086N87043P34002N87289L45072O2151j51564j05840L9902j41472
37113B846915o14672q12327n40750l38012n84392q41946n36193J61600O12198
37104f47579N52258K48807M4226P2471K45495L12385J16775j36515j55796p0498
37094E82029j95682l19018Q7655Q20338R35490J61888n01472j94845N12228N00692
37084B389303k86994r70079j079756q98297o55522k56205K05585L92720K56303
37075i02942O8973o2394k08053k33298K3871K81476J45285j38165N9679P00084
37065b65484R83234M59714l90818q89093q84411n39388L1249O04418Q24619O51292
37055E85332M21904K37151k25745r84077j356870p66381M28518J338861J488387
$$ y = [712246, 890332, 1477375, 2211377, 2798666, 3143738, 3205889, 3054325, 2948485, 2988387, 2846915, 2232243, 1419916, 879166, 541154, -43238, -885184, -1421377, -1259777, -647579, -95321, 153486, 197712, 270183, 515678, 828063, 944838, 808323, 652527, 582029, 386347, 67329, 154984, 975322, 1910812, 2072700, 1571228, 1376383, 1888611, 2389303, 2102309, 1132230, 52474, -845823, -1501345, -1757550, -1551965, -1159245, -902942, -833969, -896363, -1104416, -1337714, -1313843, -1032367, -887082, -1025247, -965568, -265484, 717750, 1177464, 786646, -102447, -986858, -1526246, -1494997, -890579, -65960, 585332, 1007236, 1244387, 1018642, 34565, -1322305, -2088686, -1660168, -321307, 1167080]
37046A167080R68585K9799r48458j360518q93908q5374J98251j56147m55936k68035
37036a804661M4055M9429m5819J56558M97582N15335K66542K84814O78530Q69101
37026A511466M89873J8856M7100L12848J18510m84862p12981l13791m606l09755
37016F72658p11840n38765q2298n8148l61326k61823L05694N53365M3552o93245
37006a132176r70033p37074l09147J38025N00846O42026O38316P48085R17280
36997D36148P33359J00703m51871m03250J54476P25285Q75743M01401m97693j092994
36987I81307p59407P8438K80223m58873j120117q35062p0943K67733J89771K58740
36977a188190M74488M56348L48934N70675Q90723P18419K04943J08660N42938
$$ y = [1167080, 2135665, 2165464, 1217006, -143512, -1037420, -1122794, -924543, -1080690, -1536626, -1804661, -1760606, -1711177, -1756996, -1600438, -1102856, -587521, -320979, -36165, 642365, 1511466, 2001339, 2020195, 2067295, 2380143, 2498653, 2013791, 1300810, 987019, 982413, 672658, -39182, -577947, -660245, -718393, -1079719, -1341542, -1035848, -482483, -438931, -1132176, -2102209, -2839283, -3148430, -3010405, -2509559, -1867533, -1229217, -481132, 436148, 1169507, 1270210, 818339, 415089, 569565, 1294850, 2170593, 2571994, 2074301, 981307, 221900, 300338, 580561, 121688, -998429, -1833491, -1904434, -1636701, -1446930, -1188190, -713702, -257354, 91580, 662255, 1552978, 2271397, 2476340, 2585000, 3127938]
36968C127938P59752L13235l76563p99600r28300p94784k55248M80789P41568
36959B268787K39163m57601o72637m43934k59458l26968m48635l81451n6109L94843
36949a44000O69574N09130m3655o89568j084058r02819n1169Q74046Q29860l30317
36939c62976j224951n66007R37306J450897O11081j71129j28972k20949j125426
36930h01126j725532q25181P52735J240895M38459k73330p3466M90847P47357
36921b8342P26305O17963M11956K83255N06174P85458M29249n72240j311128j097578
36911G51072k98888K39525J86510j31711k70330r8507J72326K84113K64032L22304
36901A420446L90368J43009l27692l88057J67733N67598J05677p41014j005459
$$ y = [3127938, 3887690, 4200925, 3824362, 3024762, 2096462, 1301678, 1046430, 1527219, 2268787, 2507950, 2050349, 1377712, 933778, 674320, 347352, -101283, -482734, -538843, -144000, 525574, 1034704, 991049, 301481, -782577, -1685396, -1736565, -862519, -32659, -362976, -1587927, -2153934, -1216628, 234269, 845350, 674221, 545249, 324300, -801126, -2526658, -3351839, -2599104, -1358209, -919750, -1193080, -1266546, -775699, -28342, 697963, 1315926, 1727882, 2011137, 2517311, 3302769, 3732018, 3159778, 1848650, 751072, 452184, 691709, 878219, 746508, 476178, 377671, 549997, 834110, 1098142, 1420446, 1810814, 1953823, 1626131, 1238074, 1405807, 1973405, 2079082, 1338068, 332609]
36892C32609o38250l32760k56136J3139M14892L71403j00929k86066J5688J43804
36882c22606k41059n43619k17677M07663P04660N04560l1533o39390q14664k12478
36872a406143N63661M42523n12250r49595j65318Q38107R21898M32477L08189
36863D73549M45345J44114m12328m16397R3513K42948k21357n78119l90125j65775
36853g84632m39302r08245q87121j94280O96840J130449P87206j4251n03344j87714
36843a304394O05828J100307Q85043K12359l18834k12100M85619R84972M10567
36834B849367j040374k068415j796601p98581j04386J97643O05562R96445P98052
36825c61288J39663j73079J57966N90854O29213L21953j12349m72821m45833J9675
$$ y = [332609, -305641, -638401, -894537, -881398, -466506, -95103, -196032, -482098, -466410, -322606, -563665, -1107284, -1324961, -917298, -212638, 291922, 260389, -379001, -1193665, -1406143, -842482, -399959, -912209, -1861804, -2027122, -1189015, -267117, 165360, 473549, 918894, 1063008, 650680, 234283, 327796, 570744, 349387, -228732, -618857, -784632, -1223934, -2132179, -3019300, -3213580, -2516740, -1386291, -599085, -613336, -1116680, -1304394, -698566, 401741, 1286784, 1499143, 1180309, 968209, 1453828, 2438800, 2849367, 1808993, -259422, -2056023, -2854604, -2958990, -2761347, -2155785, -1159340, -361288, -221625, -394704, -236738, 354116, 983329, 1305282, 1192933, 720112, 274279, 293954]
36815B93954L27240l0721n50621m28037L4472j20670p27583n50310O44698J500684
36805C93106J136931M72985O28163J148662R24954J6057o25955o87821o25843
36796B781239o46064o08709o93100j144209j487003r57832K69558J137498J069031
36787b79591N51884K68468L24526M84069N54167L45575k25407p98180p81378j06209
$$ y = [293954, 621194, 590473, 39852, -388185, -353713, -474383, -1201966, -1752276, -1107578, 393106, 1530037, 2003022, 2631185, 3779847, 4704801, 4720858, 4094903, 3407082, 2781239, 2135175, 1526466, 833366, -310843, -1797846, -2755678, -2486120, -1348622, -279591, 272293, 540761, 865287, 1349356, 1903523, 2249098, 2023691, 1225511, 444133, 337924]
$$ [...]
##END NTUPLES=NMR SPECTRUM
##END=
