##TITLE=31Pdec_B4f-1
 CDCl3
 64 sc
 25.6.2024
##JCAMPDX= 6.0         $$ Bruker NMR JCAMP-DX V2.0
##DATA TYPE= NMR SPECTRUM
##DATA CLASS= NTUPLES
##ORIGIN= UXNMR, Bruker Analytische Messtechnik GmbH
##OWNER= root
$$ XWIN-NMR		Version 3.5
$$ Tue Jun 25 13:58:32 2024 Russian Standard Time (UT+4h)  she@DPX200
##.OBSERVE FREQUENCY= 81.013821
##.OBSERVE NUCLEUS= ^31P
##.ACQUISITION MODE= SIMULTANEOUS
##.ACQUISITION SCHEME= undefined
##.AVERAGES= 64
##.DIGITISER RES= 16
##SPECTROMETER/DATA SYSTEM= spect
##.PULSE SEQUENCE= zgpg30
##.SOLVENT NAME= DMSO
##.SHIFT REFERENCE= (INTERNAL, DMSO, 0, 248.564)
##AUDIT TRAIL= $$ (NUMBER, WHEN, WHO, WHERE, WHAT)
$$ ##TITLE= Audit trail, XWIN-NMR		Version 3.5
$$ ##JCAMPDX= 5.01
$$ ##ORIGIN= Bruker BioSpin GmbH
$$ ##OWNER= she
$$ F:/spectra/data/she/nmr/P31/1/pdata/1/auditp.txt
$$ ##AUDIT TRAIL=  $$ (NUMBER, WHEN, WHO, WHERE, WHAT)
(   1,<2024-06-25 13:57:37.93 +0400>,<she>,<DPX200>,
      <continue with go, POWCHK disabled, PULCHK disabled
       configuration hash MD5:
       00 E9 B6 7A A2 85 ED C7 34 08 36 98 17 FE 4E 26
       data hash MD5: 32K
       FA 55 E5 7C 65 17 F1 40 ED 14 88 0D 1E 1B A6 6F>)
(   2,<2024-06-25 13:57:39.50 +0400>,<she>,<DPX200>,
      <Start of raw data processing
       efp BC_mod = 2 LB = 10 FT_mod = 6 PKNL = 1 PHC0 = 3622.076 PHC1 = -8582.159 SI = 64K 
       data hash MD5: 64K
       E4 A9 C6 A6 C6 53 5A DF 1C B7 E0 21 A5 16 19 B6>)
(   3,<2024-06-25 13:58:07.71 +0400>,<she>,<DPX200>,
      <pk PHC0 = 48.11796 PHC1 = 0.3999977 
       data hash MD5: 64K
       D5 2F 37 D4 C7 27 C1 31 29 54 0A 2D 2C 1B CB 75>)
$$ ##END=
$$ 
$$ hash MD5
$$ 9C F8 04 46 EE 67 56 13 8C 99 60 5E F1 1E 98 A5
##$RELAX= 
##$RELAX= 
##$RELAX= 
##$RELAX= 
##$RELAX= 
##$RELAX= 
##$RELAX= 
##$RELAX= 
##$RELAX= 
$$ Bruker specific parameters
$$ --------------------------
##$DU= <F:/spectra>
##$EXPNO= 1
##$NAME= <P31>
##$PROCNO= 1
##$TYPE= <nmr>
##$USER= <she>
##$AMP= (0..31)
100 100 100 100 100 100 100 100 100 100 100 100 100 100 100 100 100 100 
100 100 100 100 100 100 100 100 100 100 100 100 100 100 
##$AQSEQ= 0
##$AQ_mod= 1
##$AUNM= <au_zg>
##$AUTOPOS= <>
##$BF1= 81.014009
##$BF2= 200.13
##$BF3= 200.13
##$BF4= 200.13
##$BF5= 200.13
##$BF6= 200.13
##$BF7= 200.13
##$BF8= 200.13
##$BYTORDA= 1
##$CFDGTYP= 0
##$CFRGTYP= 5
##$CHEMSTR= <none>
##$CNST= (0..31)
1 1 145 1 1 1 1 1 1 1 1 1 1 1 1 1 1 1 1 1 1 1 1 1 1 1 1 1 1 1 1 1 
##$CPDPRG= <waltz16>
##$CPDPRG1= <>
##$CPDPRG2= <waltz16>
##$CPDPRG3= <>
##$CPDPRG4= <mlev>
##$CPDPRG5= <mlev>
##$CPDPRG6= <mlev>
##$CPDPRG7= <mlev>
##$CPDPRG8= <mlev>
##$CPDPRGB= <>
##$CPDPRGT= <>
##$D= (0..31)
0 1 0 0 0 0 0 0 0 0 0 0.03 2e-05 3e-06 0 0 0 0 0 0 0 0 0 0 0 0 0 0 0 0 
0 0 
##$DATE= 1719309370
##$DBL= (0..7)
120 120 120 11 120 120 24 19 
##$DBP= (0..7)
150 150 150 150 150 150 150 150 
##$DBP07= 0
##$DBPNAM0= <>
##$DBPNAM1= <>
##$DBPNAM2= <>
##$DBPNAM3= <>
##$DBPNAM4= <>
##$DBPNAM5= <>
##$DBPNAM6= <>
##$DBPNAM7= <>
##$DBPOAL= (0..7)
0.5 0.5 0.5 0.5 0.5 0.5 0.5 0.5 
##$DBPOFFS= (0..7)
$$ [...]
##$SUBNAM2= <"">
##$SUBNAM3= <"">
##$SUBNAM4= <"">
##$SUBNAM5= <"">
##$SUBNAM6= <"">
##$SUBNAM7= <"">
##$SUBNAM8= <"">
##$SUBNAM9= <"">
##$SW= 501.771253377433
##$SWIBOX= (0..15)
0 1 3 0 0 0 0 0 0 0 0 0 0 0 0 0 
##$SW_h= 40650.406504065
##$TD= 32768
##$TD0= 1
##$TE= 0
##$TE2= 300
##$TE3= 300
##$TEG= 300
##$TL= (0..7)
0 120 53 12 22 120 120 120 
##$TP= (0..7)
150 150 150 150 150 150 150 150 
##$TP07= 0
##$TPNAME0= <>
##$TPNAME1= <>
##$TPNAME2= <>
##$TPNAME3= <>
##$TPNAME4= <>
##$TPNAME5= <>
##$TPNAME6= <>
##$TPNAME7= <>
##$TPOAL= (0..7)
0.5 0.5 0.5 0.5 0.5 0.5 0.5 0.5 
##$TPOFFS= (0..7)
0 0 0 0 0 0 0 0 
##$TUNHIN= 0
##$TUNHOUT= 0
##$TUNXOUT= 0
##$USERA1= <user>
##$USERA2= <user>
##$USERA3= <user>
##$USERA4= <user>
##$USERA5= <user>
##$V9= 5
##$VALIST= <valist>
##$VCLIST= <CCCCCCCCCCCCCCC>
##$VD= 0
##$VDLIST= <DDDDDDDDDDDDDDD>
##$VPLIST= <PPPPPPPPPPPPPPP>
##$VTLIST= <TTTTTTTTTTTTTTT>
##$WBST= 1024
##$WBSW= 4
##$XGAIN= (0..3)
0 0 0 0 
##$XL= 0
##$YL= 0
##$YMAX_a= 6387
##$YMIN_a= -2088
##$ZGOPTNS= <>
##$ZL1= 120
##$ZL2= 120
##$ZL3= 120
##$ZL4= 120
##$ABSF1= 0
##$ABSF2= 0
##$ABSG= 0
##$ABSL= 0
##$ALPHA= 0
##$AQORDER= 0
##$ASSFAC= 0
##$ASSFACI= 0
##$ASSFACX= 0
##$ASSWID= 0
##$AUNMP= <proc_1d>
##$AZFE= 0.1
##$AZFW= 0.5
##$BCFW= 0
##$BC_mod= 2
##$BYTORDP= 0
##$COROFFS= 0
##$CY= -3
##$DATMOD= 1
##$DC= 0
##$DFILT= <>
##$DTYPP= 0
##$F1P= 0
##$F2P= 0
##$FCOR= 1
##$FTSIZE= 65536
##$FT_mod= 6
##$GAMMA= 0
##$GB= 0
##$INTBC= 1
##$INTSCL= 6.047779e-11
##$ISEN= 30
##$LB= 10
##$LEV0= 0
##$LPBIN= 0
##$MAXI= 10000
##$MC2= 0
##$MEAN= 0
##$ME_mod= 0
##$MI= 50
##$NCOEF= 0
##$NC_proc= -11
##$NLEV= 6
##$NOISF1= 182.463
##$NOISF2= 159.3651
##$NSP= 0
##$NTH_PI= 0
##$NZP= 0
##$OFFSET= 248.5645
##$PC= 4
##$PHC0= 3670.194
##$PHC1= -8581.759
##$PH_mod= 1
##$PKNL= yes
##$PPARMOD= 0
##$PSCAL= 0
##$PSIGN= 0
##$REVERSE= no
##$SF= 81.0140089999694
##$SI= 65536
##$SIGF1= 159.3651
##$SIGF2= -187.1042
##$SINO= 113.3802
##$SIOLD= 16384
##$SREGLST= <1H.CDCl3>
##$SSB= 0
##$STSI= 65536
##$STSR= 0
##$SW_p= 40650.406504065
##$SYMM= 0
##$S_DEV= 0
##$TDeff= 32768
##$TDoff= 0
##$TI= <>
##$TILT= no
##$TM1= 0
##$TM2= 0
##$TOPLEV= 0
##$USERP1= <user>
##$USERP2= <user>
##$USERP3= <user>
##$USERP4= <user>
##$USERP5= <user>
##$WDW= 1
##$XDIM= 65536
##$YMAX_p= 462968377
##$YMIN_p= -129993464
$$ End of Bruker specific parameters
$$ ---------------------------------
##NTUPLES= NMR SPECTRUM
##VAR_NAME=  FREQUENCY,     SPECTRUM/REAL,   SPECTRUM/IMAG
##SYMBOL=    X,             R,               I
##VAR_TYPE=  INDEPENDENT,   DEPENDENT,       DEPENDENT
##VAR_FORM=  AFFN,          ASDF,            ASDF
##VAR_DIM=   65536,         65536,           65536
##UNITS=     HZ,            ARBITRARY UNITS, ARBITRARY UNITS
##FACTOR=    0.620285442955139, 1,           1
##FIRST=     20137.2065510682, 0,            0
##LAST=      -20513.1999529968, 0,           0
##MIN=       -20513.1999529968, -129993464,  0
##MAX=       20137.2065510682, 462968377,    0
$$ Real data points
##PAGE= N=1
##DATA TABLE= (X++(R..R)), XYDATA
$$ [...]
12915H163041l733666m071392m352790m570743m696540m700448m570431m313997
$$ 8163041 4429375 357983 -3994807 -8565550 -13262090 -17962538 -22532969 -26846966
12907b6846966l946475l478827k912375k238784j443071n10571N61710J752728
$$ -26846966 -30793441 -34272268 -37184643 -39423427 -40866498 -41377069 -40815359 -39062631
12899c9062631L009618M249325N371688O282192O917182P259243P332102P176726
$$ -39062631 -36053013 -31803688 -26432000 -20149808 -13232626 -5973383 1358719 8535445
12891H535445O826369O300901N622598M834152L998356L178691K417238J725670
$$ 8535445 15361814 21662715 27285313 32119465 36117821 39296512 41713750 43439420
12883D3439420J094085N12213j0975m47021p73369j005610j204936j448027j780158
$$ 43439420 44533505 45045718 45034743 44587722 43814353 42808743 41603807 40155780 38375622
12874C8375622k186046k596771k925301l108291l131173l024138k834681k598098
$$ 38375622 36189576 33592805 30667504 27559213 24428040 21403902 18569221 15971123
12866A5971123k327363k026960j715168j431799j219456j090650j010910r17884
$$ 15971123 13643760 11616800 9901632 8469833 7250377 6159727 5148817 4230933
12858D230933p61565n27799k25680J41164N86226J126550J761807K461943L164425
$$ 4230933 3469368 2941569 2715889 2857053 3443279 4569829 6331636 8793579 11958004
12849A1958004L779986M211605M384627M270906L890476L293571K541662J700842
$$ 11958004 15737990 19949595 24334222 28605128 32495604 35789175 38330837 40031679
12841D0031679Q43769M6605o26824j146645j527277j815657k065245k315696k588849
$$ 40031679 40875448 40922053 40295229 39148584 37621307 35805650 33740405 31424709 28835860
12832B8835860k893176l224294l561682l870564m111336m249183m258398m123634
$$ 28835860 25942684 22718390 19156708 15286144 11174808 6925625 2667227 -1456407
12824a456407l841870l424763k899701k307954j695934j097242n15096P5658O99633
$$ -1456407 -5298277 -8723040 -11622741 -13930695 -15626629 -16723871 -17238967 -17163309 -16463676
12815a6463676J344825J950589K431770K721263K801970K710056K509868K255327
$$ -16463676 -15118851 -13168262 -10736492 -8015229 -5213259 -2503203 6665 2261992
12807B261992J959477J589055J084899L95200m91792j523112k572845l461820
$$ 2261992 4221469 5810524 6895423 7290623 6798831 5275719 2702874 -758946
12799g58946m006033m074029l626929k730395j544528k95576P75142J480818J750195
$$ -758946 -4764979 -8839008 -12465937 -15196332 -16740860 -17036436 -16261294 -14780476 -13030281
12790a3030281J645365J324287R69736P21541O37854O91412P94658Q43094P60726
$$ -13030281 -11384916 -10060629 -9090893 -8369352 -7731498 -7040086 -6245428 -5402334 -4641608
12781d641608N27381J76298k29006o16942r18212j073216j047758q50562n35162
$$ -4641608 -4114227 -3937929 -4166935 -4783877 -5702089 -6775305 -7823063 -8673625 -9208787
12772i208787j80680J35630L59564M71861M91738M67405M50395M65418M97096
$$ -9208787 -9389467 -9253837 -8894273 -8422412 -7930674 -7463269 -7012874 -6547456 -6050360
12763f050360N03532M44412L02257Q7075j69303m20578o15506p14110p06387o20185
$$ -6050360 -5546828 -5102416 -4800159 -4713084 -4882387 -5302965 -5918471 -6632581 -7338968 -7959153
12753g959153n10033m33814m31872n16851o73784q69013j066819j246358j405537
$$ -7959153 -8469186 -8903000 -9334872 -9851723 -10525507 -11394520 -12461339 -13707697 -15113234
12744a5113234j546287j653230j685874j592897j338195r21390l83683J98987
$$ -15113234 -16659521 -18312751 -19998625 -21591522 -22929717 -23851107 -24234790 -24035803
12736b4035803P31719J125406J328008J348719J256041J144480J088371J111198
$$ -24035803 -23304084 -22178678 -20850670 -19501951 -18245910 -17101430 -16013059 -14901861
12728a4901861J184542J249172J242461J121779Q80264N52956K11841n0042j43235
$$ -14901861 -13717319 -12468147 -11225686 -10103907 -9223643 -8670687 -8458846 -8508888 -8652123
12719h652123r754L55888R02984J539946K159718K664733K986951L101549L029325
$$ -8652123 -8661877 -8305989 -7403005 -5863059 -3703341 -1038608 1948343 5049892 8079217
12710H079217K822313K535863K202475J825187J396313R27901M69184R5177j26142
$$ 8079217 10901530 13437393 15639868 17465055 18861368 19789269 20258453 20353630 20227488
12701B0227488j64399l6607K03656M85592P37785Q97030R09717P31780L35880
$$ 20227488 20063089 20026482 20230138 20715730 21453515 22350545 23260262 23992042 24327922
12692B4327922k72338j039965j869871k645186l263432l662977l831126l794747
$$ 24327922 24055584 23015619 21145748 18500562 15237130 11574153 7743027 3948280
12684C948280l602530l309227k966072k614321k278623j963164j656696j346900
$$ 3948280 345750 -2963477 -5929549 -8543870 -10822493 -12785657 -14442353 -15789253
12676a5789253j035561p43645n01468l29137k19829j37234k8398J56847M49025
$$ -15789253 -16824814 -17568459 -18069927 -18399064 -18618893 -18756127 -18784525 -18627678 -18178653
12667a8178653Q46332J305800J744078K056059K149311J979995J575108J033978
$$ -18178653 -17332321 -16026521 -14282443 -12226384 -10077073 -8097078 -6521970 -5487992
12659e487992N07359J54935R0890L40012Q27665J409638J926147K254671K341234
$$ -5487992 -4980633 -4825698 -4734808 -4394796 -3567131 -2157493 -231346 2023325 4364559
12650D364559K200911J891965J479955J011222N05066l8938o25116j240181j832469
$$ 4364559 6565470 8457435 9937390 10948612 11453678 11414740 10789624 9549443 7716974
12641G716974k308766k563847k533536k236009j768639j261580q23129n13576
$$ 7716974 5408208 2844361 310825 -1925184 -3693823 -4955403 -5778532 -6292108
12633f292108l54333l47829m81023p11588r60453j129593j136435r39975n45817
$$ -6292108 -6646441 -6994270 -7475293 -8186881 -9147334 -10276927 -11413362 -12353337 -12899154
12624a2899154K350O35238J274903J856056K340693K715436K976519L116199L116712
$$ -12899154 -12896804 -12261566 -10986663 -9130607 -6789914 -4074478 -1097959 2018240 5134952
12615E134952K950209K586737K012944J252431L71074n37237j373355k054194
$$ 5134952 8085161 10671898 12684842 13937273 14308347 13771110 12397755 10343561
12607A0343561k531185k800935k896065k856240k701768k432036k044792j553223
$$ 10343561 7812376 5011441 2115376 -740864 -3442632 -5874668 -7919460 -9472683
12599i472683r87737l89428J94192P10848J109055J351854J436048J405813J344803
$$ -9472683 -10460420 -10849848 -10655656 -9944808 -8835753 -7483899 -6047851 -4642038 -3297235
12590c297235J341293J443879J638222J860861K036627K111694K064751J900099
$$ -3297235 -1955942 -512063 1126159 2987020 5023647 7135341 9200092 11100191
12582A1100191J637296J306674R46985N96260K76209j6462l00061n85179q58623
$$ 11100191 12737487 14044161 14991146 15587406 15863615 15847153 15547092 14961913 14103290
12573A4103290j086581j231692j270318j201924j049858q54280o58679m95807
$$ 14103290 13016709 11785017 10514699 9312775 8262917 7408637 6749958 6254151
12565F254151l81457l18148l00612l13576l23938k80882j33258J43797N30781
$$ 6254151 5872694 5554546 5253934 4940358 4616420 4335538 4202280 4346077 4876858
12556D876858R64279J352618J601222J644386J473343J141813P41119L63076P8019
$$ 4876858 5841137 7193755 8794977 10439363 11912706 13054519 13795638 14158714 14236733
12547A4236733o6934m8224J22929L92837O82805R29458J119404J290805J500008
$$ 14236733 14169799 14121575 14244504 14637341 15320146 16249604 17369008 18659813 20159821
12538B0159821J776124K092970K375171K533426K505917K280476J887748J377061
$$ 20159821 21935945 24028915 26404086 28937512 31443429 33723905 35611653 36988714
12530C6988714P95033J76468m58163j105042j774570k476831l201537l910399
$$ 36988714 37783747 37960215 37502052 36397010 34622440 32145609 28944072 25033673
12522B5033673m548110n057041n379606n453486n218286m638947l730915k570113
$$ 25033673 20485563 15428522 10048916 4595430 -622856 -5261803 -8992718 -11562831
12514a1562831j284322l1631J028828J768228K112364K051283J634616R58408
$$ -11562831 -12847153 -12878784 -11849956 -10081728 -7969364 -5918081 -4283465 -3325057
12506c325057J47143o69057j380598j920735k273304k460137k515014k461010
$$ -3325057 -3177914 -3846971 -5227569 -7148304 -9421608 -11881745 -14396759 -16857769
12498a6857769k304652k046338j695398j277879q30738l84193N5018N01364R65038
$$ -16857769 -19162421 -21208759 -22904157 -24182036 -25012774 -25396967 -25341949 -24840585 -23875547
12489b3875547J424503J824608K102273K214444K146290J902350J496111R46528
$$ -23875547 -22451044 -20626436 -18524163 -16309719 -14163429 -12261079 -10764968 -9818440
12481i818440K81340m55511j199863j877465k427665k822514l065424l175816
$$ -9818440 -9537100 -9992611 -11192474 -13069939 -15497604 -18320118 -21385542 -24561358
12473b4561358l177475l094988k949284k751159k503168k211745j895094j575095
$$ -24561358 -27738833 -30833821 -33783105 -36534264 -39037432 -41249177 -43144271 -44719366
12465d4719366j260781r39890n84677j65700L34534R13062J545749K192562K801727
$$ -44719366 -45980147 -46920037 -47504714 -47670414 -47335880 -46422818 -44877069 -42684507 -39882780
12456c9882780L308703L637138L713257L493876K992930K288605J504009P68399
$$ -39882780 -36574077 -32936939 -29223682 -25729806 -22736876 -20448271 -18944262 -18175863
12448a8175863J75154k44446n18613p05715q56499r90678j099087j165209j188964
$$ -18175863 -18000709 -18245155 -18763768 -19469483 -20325982 -21316660 -22415747 -23580956 -24769920
12439b4769920j196617j229750j318582j455861j589761j643682j552800j295866
$$ -24769920 -25966537 -27196287 -28514869 -29970730 -31560491 -33204173 -34756973 -36052839
12431c6052839r04686m47886J167L96229P34027J046082J372211J732709K115321
$$ -36052839 -36957525 -37405411 -37404244 -37008015 -36273988 -35227906 -33855695 -32122986 -30007665
12422c0007665K480812K779115K964718L004197K876031K569674K091722J477436
$$ -30007665 -27526853 -24747738 -21783020 -18778823 -15902792 -13333118 -11241396 -9763960
12414i763960P93733J22382m68412r41006j281436j481402j531905j434344j212738
$$ -9763960 -8970227 -8847845 -9316257 -10257263 -11538699 -13020101 -14552006 -15986350 -17199088
12405a7199088r09576n66783k09867J50460N02925Q24212J084982J268858J384285
$$ -17199088 -18108664 -18675447 -18885314 -18734854 -18231929 -17407717 -16322735 -15053877 -13669592
12396a3669592J452579J477290J421347J217194Q09523K02209n23310j229101
$$ -13669592 -12217013 -10739723 -9318376 -8101182 -7291659 -7089450 -7612760 -8841861
12388h841861j766212k021339j950649j594848j069133n23306q2963J98154L45149
$$ -8841861 -10608073 -12629412 -14580061 -16174909 -17244042 -17767348 -17850311 -17652157 -17307008
12379a7307008M26202N03229O03991P26785Q60596R97357J130197J249943J352120
$$ -17307008 -16880806 -16377577 -15773586 -15046801 -14186205 -13188848 -12058651 -10808708 -9456588
12370i456588J450372J579621J778683K062012K402860K741169L008391L149891
$$ -9456588 -8006216 -6426595 -4647912 -2585900 -183040 2558129 5566520 8716411
12362H716411L133613K947844K595498K088118J441758O80143j52729r80063j695827
$$ 8716411 11850024 14797868 17393366 19481484 20923242 21603385 21450656 20470593 18774766
12353A8774766k191379k395313k306988k005993j630059j329233j217888j345819
$$ 18774766 16583387 14188074 11881086 9875093 8245034 6915801 5697913 4352094
12345D352094j693327k181162k690346l096903l317926l344321l234523l073626
$$ 4352094 2658767 477605 -2212741 -5309644 -8627570 -11971891 -15206414 -18280040
12337a8280040k930635k839720k801536k786484k735599k571453k227759j687379
$$ -18280040 -21210675 -24050395 -26851931 -29638415 -32374014 -34945467 -37173226 -38860605
12329c8860605j004566k91256L32320P96614J113733J359248J618713J936308
$$ -38860605 -39865171 -40156427 -39824107 -39027493 -37913760 -36554512 -34935799 -32999491
12321c2999491K295631K635825K884969K989037K923716K690213K308232J819110
$$ -32999491 -30703860 -28068035 -25183066 -22194029 -19270313 -16580100 -14271868 -12452758
12313a2452758J295980Q41332N58555N10454O93988J045904J466737J843051K063775
$$ -12452758 -11156778 -10315446 -9756891 -9246437 -8552449 -7506545 -6039808 -4196757 -2132982
12304b132982K039748J728946J155700M09584l79228j079030j594469j887996
$$ -2132982 -93234 1635712 2791412 3200996 2821768 1742738 148269 -1739727
12296a739727j977404j914401j757867j553842j328021j091600q56342o47835
$$ -1739727 -3717131 -5631532 -7389399 -8943241 -10271262 -11362862 -12219204 -12867039
12288a2867039n05519m70063n71002q23219j226003j756212k361723k969727l510715
$$ -12867039 -13372558 -13842621 -14413623 -15236842 -16462845 -18219057 -20580780 -23550507 -27061222
12279b7061222l939906m239308m403365m425622m298905m026684l633327l161653
$$ -27061222 -31001128 -35240436 -39643801 -44069423 -48368328 -52395012 -56028339 -59189992
12271e9189992k656016k141490j614533j051457m27306K66230J008231J741038
$$ -59189992 -61846008 -63987498 -65602031 -66653488 -67080794 -66814564 -65806333 -64065295
12263f4065295K372710K797787K934501K760584K326256J737946J123943N98316
$$ -64065295 -61692585 -58894798 -55960297 -53199713 -50873457 -49135511 -48011568 -47413252
12255d7413252K33629M8022J0560O3044J45922K13170K33297J87681P5151q3330
$$ -47413252 -47179623 -47131601 -47121041 -47057997 -46912075 -46698905 -46465608 -46277927 -46202776 -46286106
12245d6286106k51380l93834m89167n29058n11443m36924l08871j31584R3496
$$ -46286106 -46537486 -46931320 -47420487 -47949545 -48460988 -48897912 -49206783 -49338367 -49244871
12236d9244871L67624O88647J044070J408830J748579K027552K221218K331174
$$ -49244871 -48877247 -48188600 -47144530 -45735700 -43987121 -41959569 -39738351 -37407177
12228c7407177K392778K464720K601318K824574L117348L443142L775725M114465
$$ -37407177 -35014399 -32549679 -29948361 -27123787 -24006439 -20563297 -16787572 -12673107
12220a2673107M475384M867628N272379N635626N878568N923462N724480N286446
$$ -12673107 -8197723 -3330095 1942284 7577910 13456478 19379940 25104420 30390866
12212C0390866M659482L914932L120889K331149J586012R14308L30163j72180
$$ 30390866 35050348 38965280 42086169 44417318 46003330 46917638 47247801 47075621
12204D7075621o17885j042346j478299j946722k453018k983020l495917l921624
$$ 47075621 46457736 45415390 43937091 41990369 39537351 36554331 33058414 29136790
12196B9136790m173821m179314l908635l388486k687926j887294j049804k13462
$$ 29136790 24962969 20783655 16875020 13486534 10798608 8911314 7861510 7648048
12188G648048N93894J331686J937373K340890K492881K386363K057253J564799
$$ 7648048 8241942 9573628 11511001 13851891 16344772 18731135 20788388 22353187
12180B2353187R67056L10268l60012r77388j445757j658128j536893j073745l48834
$$ 22353187 23320243 23630511 23270499 22293111 20847354 19189226 17652333 16578588 16229754
12171A6229754M78889J206414J636392J628953J140766K36843r32988k185389
$$ 16229754 16708643 17915057 19551449 21180402 22321168 22558011 21625023 19439634
12163A9439634l357859m339053n067851n519013n697493n643395n431069n150944
$$ 19439634 16081775 11742722 6674871 1155858 -4541635 -10185030 -15616099 -20767043
12155b0767043m882090m672121m530910m432378m319056m112787l737126l148140
$$ -20767043 -25649133 -30321254 -34852164 -39284542 -43603598 -47716385 -51453511 -54601651
12147e4601651k359005j442097n03818L54845J069627J621014K021523K296111
$$ -54601651 -56960656 -58402753 -58906571 -58551726 -57482099 -55861085 -53839562 -51543451
12139e1543451K466776K544223K527041K410500K202975J939184J678148J484296
$$ -51543451 -49076675 -46532452 -44005411 -41594911 -39391936 -37452752 -35774604 -34290308
12131c4290308J401810J434855J542462J652249J689455J605753J388697J047548
$$ -34290308 -32888498 -31453643 -29911181 -28258932 -26569477 -24963724 -23575027 -22527479
12123b2527479N92393K7329o37878j369304k097452k721372l130733l238508l006490
$$ -22527479 -21935086 -21907757 -22545635 -23914939 -26012391 -28733763 -31864496 -35103004 -38109494
12114c8109494k449873j626356o25859M35834J431973K253231K834290L160695
$$ -38109494 -40559367 -42185723 -42811582 -42375748 -40943775 -38690544 -35856254 -32695559
12106c2695559L256543L166743K942957K634572K285966J939387J635887J406869
$$ -32695559 -29439016 -26272273 -23329316 -20694744 -18408778 -16469391 -14833504 -13426635
12098a3426635J260957J177663J111223R99904P81243M18533o8012n88226j005258
$$ -13426635 -12165678 -10988015 -9876792 -8876888 -8095645 -7677112 -7745124 -8333350 -9338608
12089i338608j187645j061689o37394p2P20103J381069J854802K051741J947839
$$ -9338608 -10526253 -11587942 -12225336 -12225408 -11505305 -10124236 -8269434 -6217693 -4269854
12080d269854J598854J118697O24930J88547j77300m94621p96762j121927j512344
$$ -4269854 -2671000 -1552303 -927373 -738826 -916126 -1410747 -2207509 -3329436 -4841780
12071d841780k001736k593841l249496l893925m441052m822681n009332n013962
$$ -4841780 -6843516 -9437357 -12686853 -16580778 -21021830 -25844511 -30853843 -35867805
12063c5867805m878250m649669m360464m016964l603756l101365k506848j840958
$$ -35867805 -40746055 -45395724 -49756188 -53773152 -57376908 -60478273 -62985121 -64826079
12055f4826079j134505m06859L39700J100166J838799K481604K941869L163995
$$ -64826079 -65960584 -66367443 -66027743 -64927577 -63088778 -60607174 -57665305 -54501310
12047e4501310L157088K997770K799953K666158K644661K715688K813906K870021
$$ -54501310 -51344222 -48346452 -45546499 -42880341 -40235680 -37519992 -34706086 -31836065
12039c1836065K840841K709459K465846K096553J601960J029069M84631J02409
$$ -31836065 -28995224 -26285765 -23819919 -21723366 -20121406 -19092337 -18607706 -18505297
12031a8505297k3042J11292M20371P87033J125122J406158J643261J856970K048289
$$ -18505297 -18528339 -18417047 -17996676 -17209643 -16084521 -14678363 -13035102 -11178132 -9129843
12022i129843K189006K229653K122135J847636J433356R44618M53164q83m28405
$$ -9129843 -6940837 -4711184 -2589049 -741413 691943 1636561 2089725 2088842 1660437
12013A660437q75540j380103j930406k456388k856786l039388k950473k588013
$$ 1660437 784897 -595206 -2525612 -4982000 -7838786 -10878174 -13828647 -16416660
12005a6416660k005367j306728o27705r9210J94005K41288J06297j01811k73694
$$ -16416660 -18422027 -19728755 -20356460 -20455670 -20261665 -20020377 -19914080 -20015891 -20289585
11996b0289585l41797l01943k07688j41458j74245l30183n71333q09263r36860
$$ -20289585 -20631382 -20933325 -21141013 -21282471 -21456716 -21786899 -22358232 -23167495 -24104355
11987b4104355q65424n52715j4104O82778J432885K111144K593431K786745K663024
$$ -24104355 -24969779 -25522494 -25536598 -24853820 -23420935 -21309791 -18716360 -15929615 -13266591
11978a3266591K273355J722838J117069N17912o3358o41910j230039j819289k375595
$$ -13266591 -10993236 -9270398 -8153329 -7635417 -7698775 -8340685 -9570724 -11390013 -13765608
11969a3765608k847265l185720l367994l401641l306656l093107k757695k300790
$$ -13765608 -16612873 -19798593 -23166587 -26568228 -29874884 -32967991 -35725686 -38026476
11961c8026476j744427j133258n18181O4143O01783J101621J570736J996417K336301
$$ -38026476 -39770903 -40904161 -41422342 -41358199 -40756416 -39654795 -38084059 -36087642 -33751341
11952c3751341K524657K494574K210013J693742J032987L55148k12110n71711
$$ -33751341 -31226684 -28732110 -26522097 -24828355 -23795368 -23440220 -23652330 -24224041
11944b4224041o67777m85729n4672N49293J210886J801505K217230K412881K413078
$$ -24224041 -24891818 -25377547 -25432219 -24882926 -23672040 -21870535 -19653305 -17240424 -14827346
11935a4827346K290155K119913J944410J765659J566890J336835J077481P96167
$$ -14827346 -12537191 -10417278 -8472868 -6707209 -5140319 -3803484 -2726003 -1929836
11927a929836M95271J69936j84565n62108r41741j296275j606456j865093k064789
$$ -1929836 -1434565 -1264629 -1449194 -2011302 -2953043 -4249318 -5855774 -7720867 -9785656
11918i785656k182291k179080k022505j711978j291572q42128m56678k06347j07126
$$ -9785656 -11967947 -14147027 -16169532 -17881510 -19173082 -20015210 -20471888 -20678235 -20785361
11909b0785361j03972q7075O1711M15291R69063J643198K312509K847186L149026
$$ -20785361 -20889333 -20976408 -20914697 -20499406 -19530343 -17887145 -15574636 -12727450 -9578424
11900i578424L172364K924661K451244J817879J102979L97065k05270o30232q55448
$$ -9578424 -6406060 -3481399 -1030155 787724 1890703 2287768 2082498 1452266 596818
11891E96818r20853r04563q77021q66730q60837q32898p69463o75612n64331m47075
$$ 596818 -324035 -1228598 -2105619 -2972349 -3833186 -4666084 -5435547 -6111159 -6675490 -7122565
11881g122565l33715k35148j60255j08957p0791l3945P35J1897l6613j77759m19928
$$ -7122565 -7456280 -7691428 -7851683 -7960640 -8031431 -8065376 -8064641 -8052744 -8089357 -8267116 -8687044
11870h687044p34051j058807j324034j479960j514599j450597j327688j182727
$$ -8687044 -9421095 -10479902 -11803936 -13283896 -14798495 -16249092 -17576780 -18759507
11862a8759507j034100q73628o71836l99880n7732L12420O39811Q57336R32329
$$ -18759507 -19793607 -20667235 -21339071 -21738951 -21796683 -21484263 -20844452 -19987116 -19054787
11853a9054787Q80098P55376O27477N53628N64774O64627Q30547J012069J139436
$$ -19054787 -18174689 -17419313 -16791836 -16238208 -15673434 -15008807 -14178260 -13166191 -12026755
11844a2026755J151783J029896Q06840N50506L38547K42666L16165N73960R75304
$$ -12026755 -10874972 -9845076 -9038236 -8487730 -8149183 -7906517 -7590352 -7016392 -6041088
11835f041088J432625J850635K169312K378452K496931K538752K494152K337431
$$ -6041088 -4608463 -2757828 -588516 1789936 4286867 6825619 9319771 11657202
11827A1657202K052399J656605J207909P86694M60256K48315J11966k4480k31217
$$ 11657202 13709601 15366206 16574115 17360809 17821065 18069380 18181346 18156866 17925649
11818A7925649n36609r17919j321241j694685k013159k281411k517593k730715
$$ 17925649 17389040 16471121 15149880 13455195 11442036 9160625 6643032 3912317
11810C912317k905576l002206k971515k783235k452859k048077j665138j387375
$$ 3912317 1006741 -1995465 -4966980 -7750215 -10203074 -12251151 -13916289 -15303664
11802a5303664j250912j234529j274524j295928j247405j123098r56964p92098
$$ -15303664 -16554576 -17789105 -19063629 -20359557 -21606962 -22730060 -23687024 -24479122
11794b4479122o47912n11037l56345j79806j5254Q0412O3966o2911k49960m20260
$$ -24479122 -25127034 -25638071 -25994416 -26174222 -26189476 -26109064 -26045098 -26108009 -26357969 -26778229
11784b6778229m97988m27367j84204K14359P06949J203676J620671J913233K081173
$$ -26778229 -27276217 -27703584 -27887788 -27673429 -26966480 -25762804 -24142133 -22228900 -20147727
11775b0147727K140160K085517J885965J517143J003995M32412p8173m18550n27410
$$ -20147727 -18007567 -15922050 -14036085 -12518942 -11514947 -11082535 -11160708 -11579258 -12106668
11766a2106668m14610j61140J15817L22750M34621M90996N53550O64287Q27957
$$ -12106668 -12521278 -12682418 -12566601 -12243851 -11809230 -11318234 -10764684 -10100397 -9272440
11757i272440J012144J154477J179613J027488O79678J69029m26802r98283j421739
$$ -9272440 -8260296 -7105819 -5926206 -4898718 -4219040 -4050011 -4476813 -5475096 -6896835
11748f896835j587616j436487r85898l30406L87698J022938J466938J671304J650341
$$ -6896835 -8484451 -9920938 -10906836 -11237242 -10849544 -9826606 -8359668 -6688364 -5038023
11739e038023J467384J210448R62941P76294O52172N41403L63505M2941m52682
$$ -5038023 -3570639 -2360191 -1397250 -620956 31216 572619 936124 979065 526383
11730E26383j092046j787157k421111k881990l093051l033948k744573k304587
$$ 526383 -565663 -2352820 -4773931 -7655921 -10748972 -13782920 -16527493 -18832080
11722a8832080j796839j277701p72117k89540J57461N45242Q42409J018662J053633
$$ -18832080 -20628919 -21906620 -22678737 -22968277 -22810816 -22265574 -21423165 -20404503 -19350870
11713a9350870R41482O89289L13116j60292o84089j185322j579066j804478j859750
$$ -19350870 -18409388 -17720099 -17406983 -17567275 -18251364 -19436686 -21015752 -22820230 -24679980
11704b4679980j804999j725979j685310j696109j728559j733480j665209j499501
$$ -24679980 -26484979 -28210958 -29896268 -31592377 -33320936 -35054416 -36719625 -38219126
11696c8219126j246234r50146o74159m72896l71544l58122l87255l92470l06510
$$ -38219126 -39465360 -40415506 -41089665 -41562561 -41934105 -42292227 -42679482 -43071952 -43378462
11687d3378462q5660K71599P21342J189763J602812J916694K131713K280496K401048
$$ -43378462 -43464122 -43192523 -42471181 -41281418 -39678606 -37761912 -35630199 -33349703 -30948655
11678c0948655K517040K637816K769919K922707L099875L283312L424405L456626
$$ -30948655 -28431615 -25793799 -23023880 -20101173 -17001298 -13717986 -10293581 -6836955
11670f836955L329623L043895K656370K247804J877199J558136J266608R62802
$$ -6836955 -3507332 -463437 2192933 4440737 6317936 7876072 9142680 10105482
11662A0105482O10248J91604k78786p55860j183866j520284j742970j840833j807622
$$ 10105482 10715730 10907334 10628548 9872688 8688822 7168538 5425568 3584735 1777113
11653A777113j648999j390698j072128p27742l72361j063L98829Q32623J287713
$$ 1777113 128114 -1262584 -2334712 -3062454 -3434815 -3435878 -3037049 -2204426 -916713
11644i16713J731807K119956K406893K560712K574841K474306K310929K146804
$$ -916713 815094 2935050 5341943 7902655 10477496 12951802 15262731 17409535
11636A7409535K033603J998263K039693K133555K240204K312838K305609K183157
$$ 17409535 19443138 21441401 23481094 25614649 27854853 30167691 32473300 34656457
11628C4656457J931678J566123J124419O47790J61496l26039q05026j246528j604592
$$ 34656457 36588135 38154258 39278677 39926467 40087963 39761924 38956898 37710370 36105778
11619C6105778j837724j932298j912357j833590j768574j789966j953975k284090
$$ 36105778 34268054 32335756 30423399 28589809 26821235 25031269 23077294 20793204
11611B0793204k757109l298263l794168m125655m209027m024945l619264l077592
$$ 20793204 18036095 14737832 10943664 6818009 2608982 -1415963 -5035227 -8112819
11603h112819k490833j930084j437386j026539o87169l92600j15889J49693L80457
$$ -8112819 -10603652 -12533736 -13971122 -14997661 -15684830 -16077430 -16193319 -16043626 -15663169
11594a5663169N35061N84126N33132M19167K85422J55482K4978j30001l37533
$$ -15663169 -15128108 -14543982 -14010850 -13591683 -13306261 -13150779 -13125801 -13255802 -13593335
11585a3593335o12775r40369j263763j494550j545078j367320r71876m14957K33694
$$ -13593335 -14206110 -15146479 -16410242 -17904792 -19449870 -20817190 -21789066 -22204023 -21970329
11576b1970329R15524J584460K191880K677077K977947L056602K921281K629759
$$ -21970329 -21054805 -19470345 -17278465 -14601388 -11623441 -8566839 -5645558 -3015799
11568c015799K272202J941423J702954J577639J543662J552752J547515J471901
$$ -3015799 -743597 1197826 2900780 4478419 6022081 7574833 9122348 10594249
11560A0594249J277760R33155M30859k08804r42958j716112k471114l157607l735570
$$ 10594249 11872009 12805164 13236023 13027219 12084261 10368149 7897035 4739428 1003858
11551A003858m175816m462482m596025m587234m439948m139317l663346l008203
$$ 1003858 -3171958 -7634440 -12230465 -16817699 -21257647 -25396964 -29060310 -32068513
11543c2068513k197133j262656k29437Q73092J980529K987040L780449M289496
$$ -32068513 -34265646 -35528302 -35757739 -34884647 -32904118 -29917078 -26136629 -21847133
11535b1847133M501597M442204M142988L628575K927661K092212J204649L65055
$$ -21847133 -17345536 -12903332 -8760344 -5131769 -2204108 -111896 1092753 1457808
11527A457808l33523q25948j083660j115203r64893p06842m26717j93699l8349
$$ 1457808 1124285 298337 -785323 -1900526 -2865419 -3572261 -3998978 -4192677 -4231026
11518d231026M8137R2094J06904P3462n3859l15922p10441j173101j593585j859559
$$ -4231026 -4182889 -4090795 -3983891 -3910429 -3964288 -4280210 -4990651 -6163752 -7757337 -9616896
11508i616896j905788j744191j459195j167645r62357q71659q58342q53953q02586
$$ -9616896 -11522684 -13266875 -14726070 -15893715 -16856072 -17727731 -18586073 -19440026 -20242612
11499b0242612o89188n42190m13166l44773l44981l83617m12157l90568l03494
$$ -20242612 -20931800 -21473990 -21887156 -22231929 -22576910 -22960527 -23372684 -23763252 -24066746
11490b4066746j60267J5046J94596L52626M66418N18811N07332M53707M00874
$$ -24066746 -24227013 -24211967 -24017371 -23664745 -23198327 -22679516 -22172184 -21718477 -21317603
11481b1317603L95350M68424O28708Q64314J147914J446195J735561K012924K286900
$$ -21317603 -20922253 -20453829 -19825121 -18960807 -17812893 -16366698 -14631137 -12618213 -10331313
11472a0331313K553994K783503K927568K948393K842651K649892K442000K296278
$$ -10331313 -7777319 -4993816 -2066248 882145 3724796 6374688 8816688 11112966
11464A1112966K262388K341296K489600K643897K745724K752924K640076K399710
$$ 11112966 13375354 15716650 18206250 20850147 23595871 26348795 28988871 31388581
11456C1388581K049218J635550J225916Q83225O39043M79816L52066J82230r5046
$$ 31388581 33437799 35073349 36299265 37182490 37821533 38301349 38653415 38835645 38740599
11447C8740599n06961j023922j567102k042993k384603k574155k639105k632180
$$ 38740599 38233638 37209716 35642614 33599621 31215018 28640863 26001758 23369578
11439B3369578k609417k612163k655450k727538k803871k868440k926402k996687
$$ 23369578 20760161 18147998 15492548 12765010 9961139 7092699 4166297 1169610
11431A169610l089984l190242l253388l221656l042830k687218k160028j505113
$$ 1169610 -1920374 -5110616 -8364004 -11585660 -14628490 -17315708 -19475736 -20980849
11423b0980849p94944j09750M82142R33290J217067J325615J270017J084080Q31536
$$ -20980849 -21775793 -21885543 -21403401 -20470111 -19253044 -17927429 -16657412 -15573332 -14741796
11414a4741796O09371N31408O83615J069465J585394K055752K315395K289829
$$ -14741796 -14132425 -13601017 -12917402 -11847937 -10262543 -8206791 -5891396 -3601567
11406c601567K021300J629052J240988R48382Q03405Q36003J058373J453236J966227
$$ -3601567 -1580267 48785 1289773 2238155 3041560 3877563 4935936 6389172 8355399
11397H355399K515018L007431L357994L504315L426149L157035K773754K364810
$$ 8355399 10870417 13877848 17235842 20740157 24166306 27323341 30097095 32461905
11389C2461905J998433J709963J509987J398221J368902J406731J483604J564850
$$ 32461905 34460338 36170301 37680288 39078509 40447411 41854142 43337746 44902596
11381D4902596J622254J641901J618628J542120J389020J130847P53371K72596
$$ 44902596 46524850 48166751 49785379 51327499 52716519 53847366 54600737 54873333
11373E4873333k64683p95318j258638j608718j816394j864216j741453j446917
$$ 54873333 54608650 53813332 52554694 50945976 49129582 47265366 45523913 44076996
11365D4076996j002005m64791P1685N04544P56627P99915O56974L88706P8307
$$ 44076996 43074991 42610200 42681885 43186429 43943056 44742971 45399945 45788651 45866958
11356D5866958j89833l59880m32750m71276n70728q08261j202565j708550k247032
$$ 45866958 45677125 45317245 44884495 44413219 43842491 43034230 41831665 40123115 37876083
11347C7876083k745705l163367l485554l702048l788994l713287l458686l052942
$$ 37876083 35130378 31967011 28481457 24779409 20990415 17277128 13818442 10765500
11339A0765500k570403k103489j723949j461440j304888j210592j106874r05563
$$ 10765500 8195097 6091608 4367659 2906219 1601331 390739 -716135 -1621698
11331a621698n30546M8880Q04699J664627K538420L338229L990578M446155M687987
$$ -1621698 -2152244 -2103364 -1298665 365962 2904382 6242611 10233189 14679344 19367331
11322A9367331M731785M614469M374922M038294L614402L109633K538355J921446
$$ 19367331 24099116 28713585 33088507 37126801 40741203 43850836 46389191 48310637
11314D8310637J277715O24760q425n75748j029602j346078j535205j628904j661664
$$ 48310637 49588352 50213112 50204687 49628939 48599337 47253259 45718054 44089150 42427486
11305D2427486j659492j638471j607074j569097j524928j469261j390670j283386
$$ 42427486 40767994 39129523 37522449 35953352 34428424 32959163 31568493 30285107
11297C0285107j168165j098272j131806j287879j528412j783013j987394k095693
$$ 30285107 29116942 28018670 26886864 25598985 24070573 22287560 20300166 18204473
11289A8204473k066542j858091j452001q83664k43087L58265Q27792J115123J216685
$$ 18204473 16137931 14279840 12827839 11944175 11701088 12059353 12887145 14002268 15218953
11280A5218953J169971J040473R01543Q12892Q06237Q82075J016493J174080J319421
$$ 15218953 16388924 17429397 18330940 19143832 19950069 20832144 21848637 23022717 24342138
11271B4342138J419404J438277J338868J098767P30897K87772j57837n42176q30870
$$ 24342138 25761542 27199819 28538687 29637454 30368351 30656123 30498286 29956110 29125240
11262B9125240j022536j138991j209108j254345j283283j296981j298546j297854
$$ 29125240 28102704 26963713 25754605 24500260 23216977 21919996 20621450 19323596
11254A9323596j307739j335063j373902j407544j420611j412761j400385j400707
$$ 19323596 18015857 16680794 15306892 13899348 12478737 11065976 9665591 8264884
11246H264884j409506j391724j295539j084105p67927m19123j55048r3445l00089
$$ 8264884 6855378 5463654 4168115 3084010 2316083 1896960 1741912 1648467 1348378
11237A348378p58076j374919k018246k555851k882736k934425k693812k193541
$$ 1348378 590302 -784617 -2802863 -5358714 -8241450 -11175875 -13869687 -16063228
11229a6063228j509663p45436j2684N80498R37296R87136P15376J94848m09658
$$ -16063228 -17572891 -18318327 -18331011 -17750513 -16813217 -15826081 -15110705 -14915857 -15325515
11220a5325515q83599j039397p87352j61633P07921J654618K529409L229794L704252
$$ -15325515 -16209114 -17248511 -18035863 -18197496 -17489575 -15834957 -13305548 -10075754 -6371502
11211f371502L946282L989568L903818L782334L715978L761120L918091M131243
$$ -6371502 -2425220 1564348 5468166 9250500 12966478 16727598 20645689 24776932
11203B4776932M307217M339511M131906L620653K794411J704509M57958q05119
$$ 24776932 29084149 33423660 37555566 41176219 43970630 45675139 46133097 45327978
11195D5327978j939953k822791l370553l552044l386481k929247k254828j450242
$$ 45327978 43388025 40565234 37194681 33642637 30256156 27326909 25072081 23621839
11187B3621839o20829J06028N96815P50247N40870M1461n94323j186696j596293
$$ 23621839 23001010 23107038 23703853 24454100 24994970 25036431 24442108 23255412 21659119
11178B1659119j767434j727467j550558j312662j059146p90883m68866l9496N23770
$$ 21659119 19891685 18164218 16613660 15300998 14241852 13450969 12982103 12942607 13466377
11169A3466377J183080J830366K324093K551951K484990K191632J801280J437075
$$ 13466377 14649457 16479823 18803916 21355867 23840857 26032489 27833769 29270844
11161B9270844J158465R48614P49659N15737K46464j5542k11919k96564k48276
$$ 29270844 30429309 31377923 32127582 32643319 32889783 32874241 32662322 32365758 32117482
11152C2117482o9891K14414N59986R10115J217805J466305J665417J822154J913126
$$ 32117482 32047591 32262005 32821991 33732106 34949911 36416216 38081633 39903787 41816913
11143D1816913J885932J688444J302815P65290J66541l68443p20284q22016o86348
$$ 41816913 43702845 45391289 46694104 47459394 47625935 47257492 46537208 45715192 45028844
11134D5028844l93083m3112K90714N85072Q51298J101239J321421J472028J506159
$$ 45028844 44635761 44592649 44883363 45468435 46319733 47420972 48742393 50214421 51720580
11125E1720580J392776J130752P51237L09751j30339n17967q28776j066266j250383
$$ 51720580 53113356 54244108 54995345 55305096 55174757 54656790 53828014 52761748 51511365
11116E1511365j401366j527891j625199j682804j695450j669606j623092j580888
$$ 51511365 50109999 48582108 46956909 45274105 43578655 41909049 40285957 38705069
11108C8705069j569561j609244j703442j831779j951954k012550j973785j830098
$$ 38705069 37135508 35526264 33822822 31991043 30039089 28026539 26052754 24222656
11100B4222656j624488j443058j386254j527991j882657k396267k966768l485168
$$ 24222656 22598168 21155110 19768856 18240865 16358208 13961941 10995173 7510005
11092G510005l876154m113713m204392m158307l976116l658794l222905k705350
$$ 7510005 3633851 -479862 -4684254 -8842561 -12818677 -16477471 -19700376 -22405726
11084b2405726k158340j640154j200077q59100o01917l93918k12072o0780M2110
$$ -22405726 -24564066 -26204220 -27404297 -28263397 -28865314 -29259232 -29471304 -29532084 -29489974
11075b9489974R4062J24003J81393L05548M97950P20874R26316J091044J226175
$$ -29489974 -29395912 -29271909 -29090516 -28784968 -28287018 -27566144 -26639828 -25548784 -24322609
11066b4322609J356349J494540J635558J762981J852507J872300J793603J610167
$$ -24322609 -22966260 -21471720 -19836162 -18073181 -16220674 -14348374 -12554771 -10944604
11058a0944604J345671J036271P02232L34754r0432n83708j118649j632713k051823
$$ -10944604 -9598933 -8562662 -7860430 -7525676 -7616108 -8199816 -9318465 -10951178 -13003001
11049a3003001k320891k418026k346437k118771j750998j266624o99101q6190
$$ -13003001 -15323892 -17741918 -20088355 -22207126 -23958124 -25224748 -25923849 -26010039
11041b6010039N35536J125100J623393J949890K026116J819247J375583Q14041
$$ -26010039 -25474503 -24349403 -22726010 -20776120 -18750004 -16930757 -15555174 -14741133
11033a4741133K77150j31797l87507n35427o44870p52978q36749q30644o71774
$$ -14741133 -14463983 -14595780 -14983287 -15518714 -16163584 -16916562 -17753311 -18583955 -19255729
11024a9255729l33879J72868Q24154J597201K466286L387975M293130N093900
$$ -19255729 -19589608 -19416740 -18592586 -16995385 -14529099 -11141124 -6847994 -1754094
11016a754094N703295O058203O133330N937400N495397M832275L972102K952832
$$ -1754094 3949201 10007404 16140734 22078134 27573531 32405806 36377908 39330740
11008C9330740J843564P48100k13428r39837j383888j567090j564701j469606
$$ 39330740 41174304 41922404 41708976 40769139 39385251 37818161 36253460 34783854
11000C4783854j356782j267645j217461j212055j255423j341523j440639j498164
$$ 34783854 33427072 32159427 30941966 29729911 28474488 27132965 25692326 24194162
10992B4194162j454450j276912r85099o52833l83744k67857l35031n27953p17011
$$ 24194162 22739712 21462800 20477701 19824868 19441124 19173267 18838236 18310283 17593272
10983A7593272p60527n80248k03178K57359O61093Q94368Q92075O39743J77429
$$ 17593272 16832745 16252497 16049319 16306678 16967771 17862139 18754214 19393957 19571386
10974A9571386l95812r37948j309881j430443j304572j006149o31672k61492M7540
$$ 19571386 19175574 18237626 16927745 15497302 14192730 13186581 12554909 12293417 12340957
10965A2340957K47984K95961J69318j05211m43243p23904q28853o79250k58415
$$ 12340957 12588941 12884902 13054220 12949009 12505766 11781862 10953009 10273759 10015344
10956A0015344L82774J136631J863724K427886K732320K744251K498013K076314
$$ 10015344 10398118 11534749 13398473 15826359 18558679 21302930 23800943 25877257
10948B5877257J579793J097821O89048L75691J52502N688p0121o8385J8288J82744
$$ 25877257 27457050 28554871 29243919 29619610 29772112 29777800 29707679 29639294 29657582 29840326
10938B9840326L94845O03479P45850P60990O07241K80803j75301o84025j166484
$$ 29840326 30235171 30838650 31584500 32345490 32952731 33233534 33058233 32374208 31207724
10929C1207724j571023j876331k071518k140793k073038j884788j627629j367693
$$ 31207724 29636701 27760370 25688852 23548059 21475021 19590233 17962604 16594911
10921A6594911j153687r98697q85358p83948o66736n10545k93255L489L80223
$$ 16594911 15441224 14442527 13557169 12773221 12106485 11595940 11302685 11306174 11686397
10912A1686397Q03037J200115J480464J569719J446555J159936Q14615N28770
$$ 11686397 12489434 13689549 15170013 16739732 18186287 19346223 20160838 20689608
10904B0689608L84834L99328N26149O88735Q21210Q94202R12022Q89456Q30843
$$ 20689608 21074442 21473770 21999919 22688654 23509864 24404066 25316088 26205544 27036387
10895B7036387P25810N56715L07217k7227m22319q11311j094867j178641j017889
$$ 27036387 27762197 28318912 28626129 28598902 28176583 27365272 26270405 25091764 24073875
10886B4073875o44062j63695K68445M97662M25810M8471n50702j241765j893505
$$ 24073875 23429813 23266118 23534563 24032225 24458035 24506506 23955804 22714039 20820534
10877B0820534k396178k666034k651307k347239j808911j146657m99026J0100
$$ 20820534 18424356 15758322 13107015 10759776 8950865 7804208 7305182 7315282
10869G315282L14604M27902M26905M04053M18629M80310N69889O71529P88245
$$ 7315282 7629886 8057788 8484693 8888746 9307375 9787685 10357574 11029103 11817348
10860A1817348R34688J120801J339990J565339J752540J849074J808866J607600
$$ 11817348 12752036 13872837 15212827 16778166 18530706 20379780 22188646 23796246
10852B3796246J251575P75182K29625l28186q39880j247701j504520j590574j520378
$$ 23796246 25047821 25823003 26052628 25724442 24884562 23636861 22132341 20541767 19021389
10843A9021389j329027j051776p21793l88787j31290l6173j51497m47542q17987
$$ 19021389 17692362 16640586 15918793 15530006 15398716 15362543 15211046 14763504 13945517
10834A3945517j125388j266094j217216j038620q30733o76865o05537n90075n77288
$$ 13945517 12820129 11554035 10336819 9298199 8467466 7790601 7185064 6594989 6017701
10825F017701n23798m20980k98945k10400k05002l09043n19151q06511j122802
$$ 6017701 5493903 5072923 4773978 4563578 4358576 4049533 3530382 2723871 1601069
10816A601069j405154j584282j597382j400042r72554l23303N07496J448071K405655
$$ 1601069 195915 -1388367 -2985749 -4385791 -5358345 -5681648 -5174152 -3726081 -1320426
10807a320426L283872L997089M478267M684127M597209M220774L572130K686965
$$ -1320426 1963446 5960535 10438802 15122929 19720138 23940912 27513042 30200007
10799C0200007J631913N03115n99592j599343k440418l065512l409091l424199
$$ 30200007 31831920 32335035 31735443 30136100 27695682 24630170 21221079 17796880
10791A7796880l118585k566584j889224j216852o49121k24226Q7601L57834O53565
$$ 17796880 14678295 12111711 10222487 9005635 8356514 8132288 8219889 8577723 9231288
10782I231288R99555J367900J693594J901260J929014J742672J340466P52476
$$ 9231288 10230843 11598743 13292337 15193597 17122611 18865283 20205749 20958225
10774B0958225L7623p23084j440106k035287k461163k708129k792349k733054
$$ 20958225 20995848 20272764 18832658 16797371 14336208 11628079 8835730 6102676
10766F102676k541924k237875j870379j518243j254483j106496j047165j019988
$$ 6102676 3560752 1322877 -547502 -2065745 -3320228 -4426724 -5473889 -6493877
10758f493877r70644q60365o61192l49608Q7182O32192J221996J752287K110875
$$ -6493877 -7464521 -8324886 -8986078 -9335686 -9248504 -8616312 -7394316 -5642029 -3531154
10749c531154K220943K070768J719617J282006Q91510O47609N67624N78993N66837
$$ -3531154 -1310211 760557 2480174 3762180 4653690 5301299 5868923 6447916 7014753
10740G014753M48577K24044l0315k12229k50653j35006R0770L52327N67101O59340
$$ 7014753 7463330 7687374 7657059 7444830 7194177 7059171 7149941 7502268 8069369 8728709
10730H728709N74477K94250j56254p16042j304537j837194k237906k450815k450439
$$ 8728709 9303186 9597436 9441182 8725140 7420603 5583409 3345503 894688 -1555751
10721a555751k246376j882142j429522r75756o01444l57022k53486k74681m00801
$$ -1555751 -3802127 -5684269 -7113791 -8089547 -8690991 -9048013 -9301499 -9576180 -9976981
10712i976981o23335r38847j324923j716041k000992k051843j772803j142486
$$ -9976981 -10600316 -11539163 -12864086 -14580127 -16581119 -18632962 -20405765 -21548251
10704b1548251k27528Q37330J892461K801452L483134L913599M102490M064065
$$ -21548251 -21775779 -20938449 -19045988 -16244536 -12761402 -8847803 -4745313 -681248
10696f81248L801811L311497K597504J693647O73060l68973j352986k238661l004433
$$ -681248 3120563 6432060 9029564 10723211 11396271 11027298 9674312 7435651 4431218
10687D431218l601745l935958l900694l438178k578718j439536j94017R71476
$$ 4431218 829473 -3106485 -7007179 -10445357 -13024075 -14463611 -14657628 -13686152
10679a3686152J900141K493560K718430K597207K195003J605232R28600K48707
$$ -13686152 -11786011 -9292451 -6574021 -3976814 -1781811 -176579 752021 1000728
10671A000728l82061r38176j405676j770367k018971k152672k201242k219495
$$ 1000728 618667 -319509 -1725185 -3495552 -5514523 -7667195 -9868437 -12087932
10663a2087932k257984k324882k370562k310891k074229j641002j053866l97393
$$ -12087932 -14345916 -16670798 -19041360 -21352251 -23426480 -25067482 -26121348 -26518741
10655b6518741K36693P77332J183583J442011J564792J588563J561514J515697
$$ -26518741 -26282048 -25504716 -24321133 -22879122 -21314330 -19725767 -18164253 -16648556
10647a6648556J443424J300960J040732O48528J59268l56759q24458j190486j432715
$$ -16648556 -15205132 -13904172 -12863440 -12214912 -12055644 -12412403 -13236861 -14427347 -15860062
10638a5860062j554622j575510j524268j435374j341662j262093j189910j091283
$$ -15860062 -17414684 -18990194 -20514462 -21949836 -23291498 -24553591 -25743501 -26834784
10630b6834784r21103o49929k84381J33209N43529Q93475J153011J321424J419533
$$ -26834784 -27755887 -28405816 -28690197 -28556988 -28013459 -27119984 -25966973 -24645549 -23226016
10621b3226016J467694J462031J368207J139344P44887J92529m64835j138403
$$ -23226016 -21758322 -20296291 -18928084 -17788740 -17043853 -16851324 -17316159 -18454562
10613a8454562j729016k161271k407130k483042k425882k269826k040699j764707
$$ -18454562 -20183578 -22344849 -24751979 -27235021 -29660903 -31930729 -33971428 -35736135
10605c5736135j476498j215796j013490q75692p74212o48893m24801m2336N11276
$$ -35736135 -37212633 -38428429 -39441919 -40317611 -41091823 -41740716 -42165517 -42207853 -41696577
10596d1696577J186188J877968K452208K775726K753413K367674J699596R07769
$$ -41696577 -40510389 -38632421 -36180213 -33404487 -30651074 -28283400 -26583804 -25676035
10588b5676035J70122l74070o51082o51004m16141k5453M29628Q71849J250546
$$ -25676035 -25505913 -25879983 -26531065 -27182069 -27598210 -27623663 -27194035 -26322186 -25071640
10579b5071640J534602J701433J739768J665704J533517J423232J405563J505877
$$ -25071640 -23537038 -21835605 -20095837 -18430133 -16896616 -15473384 -14067821 -12561944
10571a2561944J692925J899767K059188K127059K080205J896759J540355R67018
$$ -12561944 -10869019 -8969252 -6910064 -4783005 -2702800 -806041 734314 1701332
10563A701332J55773q57342j968886l032187l903306m484486m744832m709831
$$ 1701332 1857105 999763 -969123 -4001310 -7904616 -12389102 -17133934 -21843765
10555b1843765m428166l940092l270842k449015j526834n82046K97000J030454
$$ -21843765 -26271931 -30212023 -33482865 -35931880 -37458714 -38040760 -37743760 -36713306
10547c6713306J563797J881932K015868K034149K017212K023396K063739K103774
$$ -36713306 -35149509 -33267577 -31251709 -29217560 -27200348 -25176952 -23113213 -21009439
10539b1009439K096744K026559J925575J851569J843323J889000J927364J879058
$$ -21009439 -18912695 -16886136 -14960561 -13108992 -11265669 -9376669 -7449305 -5570247
10531e570247J688741J351199R03557L93660j43645o83853j198240j650695k006725
$$ -5570247 -3881506 -2530307 -1626750 -1233090 -1376735 -2060588 -3258828 -4909523 -6916248
10522f916248k238510k320619k226900j936049j440918p53483R6165J062364K082085
$$ -6916248 -9154758 -11475377 -13702277 -15638326 -17079244 -17832727 -17736562 -16674198 -14592113
10513a4592113L068983L915118M514233M801801M786220M549734M222326L946582
$$ -14592113 -11523130 -7608012 -3093779 1708022 6494242 11043976 15266302 19212884
10505A9212884L848224M020215M522624N389730O632052Q235309J0170530J2415218
$$ 19212884 23061108 27081323 31603947 36993677 43625729 51861038 62031568 74446786
10497G4446786J4967132J7843349K1077127K4712100K8766210L3146006L7526638
$$ 74446786 89413918 107257267 128334394 153046494 181812704 214958710 252485348
10490B52485348M1236084M3216575M2195776L7164575K8009383J5862452K798184
$$ 252485348 293721432 336938007 379133783 416298358 444307741 460170193 462968377
10483D62968377r009152j8101585k4032135k7125694k8052412k7508536k6060867
$$ 462968377 453959225 435857640 411825505 384699811 356647399 329138863 303077996
10476C03077996k4096971k1846910j9452640j7033194j4706371j2579304j0738280
$$ 303077996 278981025 257134115 237681475 220648281 205941910 193362606 182624326
10469A82624326r243886q125169p377678o969544o846141o928304p117694p321239
$$ 182624326 173380440 165255271 157877593 150908049 144061908 137133604 130015910 122694671
10461A22694671p483301p602729p723339p901345q161505q461471q686218q680833
$$ 122694671 115211370 107608641 99885302 91983957 83822452 75360981 66674763 57993930
10453E7993930q307729p502171o302003m837836l288632j827912n87741L53366
$$ 57993930 49686201 42184030 35882027 31044191 27755559 25927647 25339906 25693272
10445B5693272R70592J288022J365592J280311J113133R43527Q40474Q46748R71139
$$ 25693272 26663864 27951886 29317478 30597789 31710922 32654449 33494923 34341671 35312810
10436C5312810J198875J507582J870268K247327K585355K830091K941301K895007
$$ 35312810 36511685 38019267 39889535 42136862 44722217 47552308 50493609 53388616
10428E3388616K673255K255553J625417P90401k01998j269452k318539l268012
$$ 53388616 56061871 58317424 59942841 60733242 60531244 59261792 56943253 53675241
10420E3675241m058570m654237n044652n245623n290478n216898n063020m874795
$$ 53675241 49616671 44962434 39917782 34672159 29381681 24164783 19101763 14226968
10412A4226968m707927m609669m589862m608310m593954m481968m241038l877927
$$ 14226968 9519041 4909372 319510 -4288800 -8882754 -13364722 -17605760 -21483687
10404b1483687l428275k944891k482238k074413j718387j379497j016865o04431
$$ -21483687 -24911962 -27856853 -30339091 -32413504 -34131891 -35511388 -36528253 -37132684
10396c7132684j28653M27874J089754J864339K704113L488543M049259M233001
$$ -37132684 -37261337 -36833463 -35743709 -33879370 -31175257 -27686714 -23637455 -19404454
10388a9404454L969311L305426K391308J426143N94505J9303k56071k62059q6576
$$ -19404454 -15435143 -12129717 -9738409 -8312266 -7717761 -7698458 -7954529 -8216588 -8303164
10379h303164J48172L22247L64818K85739J63825R4399J31586K61413M14904N06943
$$ -8303164 -8154992 -7832745 -7467927 -7182188 -7018363 -6923964 -6792378 -6530965 -6116061 -5609118
10369e609118M79643L30364J10811j00756k35901k61647j88950o6834L6055O0014
$$ -5609118 -5129475 -4799111 -4688300 -4789056 -5024957 -5286604 -5475554 -5542388 -5506333 -5446319
10359e446319j7997j73803l51464m97329n92502o61901p52093q92955j071130
$$ -5446319 -5464316 -5638119 -5989583 -6486912 -7079414 -7741315 -8493408 -9386363 -10457493
10350a0457493j231694j300772j212264r30125m63883J29450P62494J343346J790651
$$ -10457493 -11689187 -12989959 -14202223 -15132348 -15596231 -15466781 -14704287 -13360941 -11570290
10341a1570290K033664K014572J706150J132810L72514m64302j261605j916836
$$ -11570290 -9536626 -7522054 -5815904 -4683094 -4310580 -4774882 -6036487 -7953323
10333g953323k354974k542556k493845k259025j900400j474559j027951n95843
$$ -7953323 -10308297 -12850853 -15344698 -17603723 -19504123 -20978682 -22006633 -22602476
10325b2602476j95860J76027N34022Q79246J185302J408125J514288J506585J427465
$$ -22602476 -22798336 -22622309 -22088287 -21209041 -20023739 -18615614 -17101326 -15594741 -14167276
10316a4167276J335211J265806J205969J099006Q82941N36305J01898l25183o37554
$$ -14167276 -12832065 -11566259 -10360290 -9261284 -8378343 -7842038 -7740140 -8065323 -8702877
10307h702877p62876o95330m95517k59968p9068o341m9224j76518l33392m58909
$$ -8702877 -9465753 -10161083 -10656600 -10916568 -10995636 -11001977 -11051201 -11227719 -11561111 -12020020
10297a2020020n02853m37199k59037J3691L50419P18500J093835J466003J833633
$$ -12020020 -12522873 -12960072 -13219109 -13205418 -12854999 -12136499 -11042664 -9576661 -7743028
10288g743028K194384K539028K852750L116580L303691L377373L300902L056115
$$ -7743028 -5548644 -3009616 -156866 2959714 6263405 9640778 12941680 15997795
10280A5997795K654112K128165J518160Q62584K00904m24131r70838j403757j692688
$$ 15997795 18651907 20780072 22298232 23160816 23361720 22937589 21966751 20562994 18870306
10271A8870306j809608j733199j462350j028290m94974N2042N20366Q24208Q97990
$$ 18870306 17060698 15327499 13865149 12836859 12341885 12393927 12914293 13738501 14636491
10262A4636491P11132K78752l38787j047867j739404k308683k676973k810219
$$ 14636491 15347623 15626375 15287588 14239721 12500317 10191634 7514661 4704442
10254D704442k723542k466316k099482j683718j282813r67765q06917q44040j078711
$$ 4704442 1980900 -485416 -2584898 -4268616 -5551429 -6519194 -7326111 -8170151 -9248862
10245i248862j460879j902920k306640k596294k740477k747076k635272k411490
$$ -9248862 -10709741 -12612661 -14919301 -17515595 -20256072 -23003148 -25638420 -28049910
10237b8049910k073985j640012j162893p16434l60768j23600j1453l2475k04498
$$ -28049910 -30123895 -31763907 -32926800 -33643234 -34004002 -34127602 -34139055 -34171530 -34376028
10228c4376028n42228j036485j638453k254347k755199l007109k917715k478796
$$ -34376028 -34918256 -35954741 -37593194 -39847541 -42602740 -45609849 -48527564 -51006360
10220e1006360j779283r75699k31294L44439P23355R43500J070364J162510J253231
$$ -51006360 -52785643 -53761342 -53992636 -53648197 -52924842 -51981342 -50910978 -49748468 -48495237
10211d8495237J342344J394729J353828J174365Q58831M71996J21194q6879r0398
$$ -48495237 -47152893 -45758164 -44404336 -43229971 -42371140 -41899144 -41777950 -41864829 -41955227
10202d1955227J01769M12566P25427R24839R29054P03459K59308l49591j027175
$$ -41955227 -41853458 -41440892 -40715465 -39790626 -38861572 -38158113 -37898805 -38248396 -39275571
10193c9275571j641176k047230k131779j857780j289609n80237P9627N31878P09031
$$ -39275571 -40916747 -42963977 -45095756 -46953536 -48243145 -48823382 -48743755 -48211877 -47502846
10184d7502846O50033M64923K69274J26542K8752p9757k55090n12459q12470j077334
$$ -47502846 -46852813 -46387890 -46118616 -45992074 -45963322 -46043079 -46298169 -46810628 -47623098 -48700432
10174d8700432j220884j172851q90823l67339L61270J209900K056260K773571
$$ -48700432 -49921316 -51094167 -51984990 -52352329 -51991059 -50781159 -48724899 -45951328
10166d5951328L273044L534188L604765L569907L510183L474507L478201L514711
$$ -45951328 -42678284 -39144096 -35539331 -31969424 -28459241 -24984734 -21506533 -17991822
10158a7991822L563966L594462L569649L465064L287309L078624K899442K796829
$$ -17991822 -14427856 -10833394 -7263745 -3798681 -511372 2567252 5466694 8263523
10150H263523K776957K798104K788631K678813K426984K025940J490790Q41683
$$ 8263523 11040480 13838584 16627215 19306028 21733012 23758952 25249742 26091425
10142B6091425R5120p32187j613538k506820l359186m118667m743578n203465
$$ 26091425 26186545 25454358 23840820 21334000 17974814 13856147 9112569 3909104
10134C909104n475365n545526n419295n126832m709742m192935l568072k811483
$$ 3909104 -1566261 -7111787 -12531082 -17657914 -22367656 -26560591 -30128663 -32940146
10126c2940146j928533r89463j26238N10372Q08733P40552L73459j52466o75376
$$ -32940146 -34868679 -35858142 -35984380 -35474008 -34665275 -33924723 -33551264 -33703730 -34379106
10117c4379106j068162j273899j303774j204314j019925p75723m84899j64342
$$ -34379106 -35447268 -36721167 -38024941 -39229255 -40249180 -41024903 -41509802 -41674144
10109d1674144J59948M61471P26451R60836J185853J422004J667992J888952K027136
$$ -41674144 -41514196 -41052725 -40326274 -39365438 -38179585 -36757581 -35089589 -33200637 -31173501
10100c1173501K031495J885162J611487J258204Q74558M95928J42312j70433m15497
$$ -31173501 -29142006 -27256844 -25645357 -24387153 -23512595 -23016667 -22874355 -23044788 -23460285
10091b3460285n51370n38827l68887p7889K65776N94981Q73667J104291J311131
$$ -23460285 -24011655 -24550482 -24919369 -24997258 -24731482 -24136501 -23262834 -22158543 -20847412
10082b0847412J512523J700697J842337J899828J859755J750236J634313J579777
$$ -20847412 -19334889 -17634192 -15791855 -13892027 -12032272 -10282036 -8647723 -7067946
10074g067946J620589J733138J843708J862983J725380J411525R48999M00962
$$ -7067946 -5447357 -3714219 -1870511 -7528 1717852 3129377 4078376 4479338
10066D479338j48363o11615r22652j061912j067180j017258r93591j042910j163419
$$ 4479338 4330975 3719360 2796708 1734796 667616 -349642 -1343233 -2386143 -3549562
10057c549562j316477j446256j491148j388244j083672n54730J64936R73171J711966
$$ -3549562 -4866039 -6312295 -7803443 -9191687 -10275359 -10830089 -10665153 -9691982 -7980016
10048g980016K206288K318181J995137J290766L47568o50275j532556k183835
$$ -7980016 -5773728 -3455547 -1460410 -169644 177924 -472351 -2004907 -4188742
10040d188742k556368k659393k541593k280182j973045j719679j586939j577187
$$ -4188742 -6745110 -9404503 -11946096 -14226278 -16199323 -17919002 -19505941 -21083128
10032b1083128j624351j626877j500138j216944q13188l59706P6019M51131P43257
$$ -21083128 -22707479 -24334356 -25834494 -27051438 -27864626 -28224332 -28148313 -27697182 -26953925
10023b6953925R36753J020725J003019R23952Q50586Q48472R47222J123756J315654
$$ -26953925 -26017172 -24996447 -23993428 -23069476 -22218890 -21370418 -20423196 -19299440 -17983786
10014a7983786J454326J493555J418440J242435J006875P79518O34038O09047
$$ -17983786 -16529460 -15035905 -13617465 -12375030 -11368155 -10588637 -9954599 -9345552
10006i345552O76693P53509P49009O11245L34818o3037n65369j154963j797702
$$ -9345552 -8668859 -7915350 -7166341 -6555096 -6220278 -6283315 -6848684 -8003647 -9801349
9997i801349k431796k975578l349579l500674l417387l129829k694303k171532
$$ -9801349 -12233145 -15208723 -18558302 -22058976 -25476363 -28606192 -31300495 -33472027
9989c3472027j611871j054068n31779p8671K69816M75165M98063L11538p7881
$$ -33472027 -35083898 -36137966 -36669745 -36748416 -36478600 -36003435 -35505372 -35193834 -35271715
9980c5271715o17792j219591j782826k214496k435064k382041k023785j379700
$$ -35271715 -35889507 -37109098 -38891924 -41106420 -43541484 -45923525 -47947310 -49327010
9972d9327010n30073L96304J253257J913514K296477K379206K189187J784969
$$ -49327010 -49857083 -49460779 -48207522 -46294008 -43997531 -41618325 -39429138 -37644169
9964c7644169J236157O12257j9842n97967j072353j414428j616448j678671j593816
$$ -37644169 -36408012 -35795755 -35815597 -36413564 -37485917 -38900345 -40516793 -42195464 -43789280
9955d3789280j343535r12292l08917M20404J196664J926120K521989K922819L104096
$$ -43789280 -45132815 -46045107 -46354024 -45933620 -44736956 -42810836 -40288847 -37366028 -34261932
9946c4261932L078589K882674K555275K124046J607192J024816M08908j90923
$$ -34261932 -31183343 -28300669 -25745394 -23621348 -22014156 -20989340 -20580432 -20771355
9938b0771355p04742j047965j143599r55937n15024Q5967P19103J257872J602132
$$ -20771355 -21476097 -22524062 -23667661 -24623598 -25138622 -25052655 -24333552 -23075680 -21473548
9929b1473548J684135J464165R32757J25732q64729j905635k863326l638802m175904
$$ -21473548 -19789413 -18325248 -17392491 -17266759 -18131488 -20037123 -22900449 -26539251 -30715155
9920c0715155m451632m470640m265985l890399l394928k814422k176990j528047
$$ -30715155 -35166787 -39637427 -43903412 -47793811 -51188739 -54003161 -56180151 -57708198
9912e7708198r41870n03853k71799k40139l27200l90616k63114K05854J119768
$$ -57708198 -58650068 -59153921 -59425720 -59665859 -59993059 -60383675 -60646789 -60440935 -59321167
9903e9321167K529391M449377O873920R765224J3009631J6360525J9398171K1546250
$$ -59321167 -56791776 -52342399 -45468479 -35703255 -22693624 -6333099 13065072 34611322
9895C4611322K2191361K0911583J7716859J3128953Q001662L176462q03099l765264
$$ 34611322 56802683 77714266 95431125 108560078 116561740 119738202 118935103 115169839
9887A15169839n801279p107542p875996q247941q309775q110871p685106p060522
$$ 115169839 109368560 102261018 94385022 86137081 77827306 69716435 62031329 54970807
9879E4970807o258105n293614m189654k992721j787227o97950J30886N80895O05238
$$ 54970807 48712702 43419088 39229434 36236713 34449486 33751536 33882422 34463317 35068555
9870C5068555K43123m01937j197072k010210k737659l329417l794441m172462
$$ 35068555 35311678 34909741 33712669 31702459 28964800 25635383 21840942 17668480
9862A7668480m489114m727911m834458m741064m394159l776593k920814j906300
$$ 17668480 13179366 8451455 3616997 -1124067 -5518226 -9294819 -12215633 -14121933
9854a4121933q40340J66168J013655J618729J920526J894829J566415J006229
$$ -14121933 -14962273 -14796105 -13782450 -12163721 -10243195 -8348366 -6781951 -5775722
9846e775722L14430l95878j005649j397348j477511j211786o50094P9968Q13303
$$ -5775722 -5461292 -5857170 -6862819 -8260167 -9737678 -10949464 -11599558 -11519590 -10706287
9837a0706287J401432J753881J849793J721535J426960J027131N74660J08295
$$ -10706287 -9304855 -7550974 -5701181 -3979646 -2552686 -1525555 -950895 -842600
9829h42600l49333p89060j207271j597054j943481k224104k413609k491292k448330
$$ -842600 -1191933 -1980993 -3188264 -4785318 -6728799 -8952903 -11366512 -13857804 -16306134
9820a6306134k290286k033627j701160j321830r34000n85381l24453j85346j73444
$$ -16306134 -18596420 -20630047 -22331207 -23653037 -24587037 -25172418 -25496871 -25682217 -25855661
9811b5855661k58462l77917m51531m06740k10917J04904M51437P22087Q47715
$$ -25855661 -26114123 -26492040 -26943571 -27350311 -27561228 -27456324 -27004887 -26282800 -25435085
9802b5435085Q28760P25024O16170N63689N95108P09741Q92465J123307J379352
$$ -25435085 -24606325 -23881301 -23265131 -22701442 -22106334 -21396593 -20504128 -19380821 -18001469
9793a8001469J633476J855766K018249K097473K071026J912554J595472J110064
$$ -18001469 -16367993 -14512227 -12493978 -10396505 -8325479 -6412925 -4817453 -3707389
9785c707389M84759k06291q60012j376990j688188j762020j598201j224054o97143
$$ -3707389 -3222630 -3428921 -4288933 -5665923 -7354111 -9116131 -10714332 -11938386 -12635529
9776a2635529j02956M61793R14666J208088J336696J330650J236499J091102R02453
$$ -12635529 -12738485 -12276692 -11362026 -10153938 -8817242 -7486592 -6250093 -5158991 -4256538
9767d256538O53323L28961n1365m26258p18037q75266q99257q32980p20651n70198
$$ -4256538 -3603215 -3274254 -3325619 -3751877 -4469914 -5345180 -6244437 -7077417 -7798068 -8368266
9757h368266l48326j1205M53321J003362J556450K029617K378215K607017K748717
$$ -8368266 -8716592 -8727797 -8274476 -7271114 -5714664 -3685047 -1306832 1300185 4048902
9748D048902K830194K852742K795198K629085K331540J891962J315948O29500
$$ 4048902 6879096 9731838 12527036 15156121 17487661 19379623 20695571 21325071
9740B1325071j17495q52370j490052j952916k191263k192603j977970j594851
$$ 21325071 21207576 20355206 18865154 16912238 14720975 12528372 10550402 8955551
9732H955551j112714o15131j82892J23758K70829K45200N0996k86633p18342j175734
$$ 8955551 7842837 7227706 7044814 7168572 7439401 7684601 7735597 7448964 6730622 5554888
9722E554888j584022j880264k036899k080895k088816k150393k321714k598580
$$ 5554888 3970866 2090602 53703 -2027192 -4116008 -6266401 -8588115 -11186695
9714a1186695k919879l188884l301230l177110k790189k176537j415711n96763
$$ -11186695 -14106574 -17295458 -20596688 -23773798 -26563987 -28740524 -30156235 -30752998
9706c0752998K10352R67370J663340K295613K845277L265886L499555L511773
$$ -30752998 -30542646 -29575276 -27911936 -25616323 -22771046 -19505160 -16005605 -12493832
9698a2493832L318570K985902K603058K247832J963031J755229J612815J527490
$$ -12493832 -9175262 -6189360 -3586302 -1338470 624561 2379790 3992605 5520095
9690E520095J502188J541582J636166J753420J841284J840466J697522J370413
$$ 5520095 7022283 8563865 10200031 11953451 13794735 15635201 17332723 18703136
9682A8703136Q25324L6581r95043k209192l467281m576814n352583n676022n519868
$$ 18703136 19528460 19565041 18569998 16360806 12893525 8316711 2964128 -2711894 -8231762
9673h231762m939904m055497l028098k030164j204909o36071l43440k95804m22929
$$ -8231762 -13171666 -17227163 -20255261 -22285425 -23490334 -24126405 -24469845 -24765649 -25188578
9664b5188578o25657p97943q60537p83194n77104k68214J21631N72858J055668
$$ -25188578 -25814235 -26612178 -27472715 -28255909 -28833013 -29101227 -28979596 -28406738 -27351070
9655b7351070J523787J922741K208637K364661K402086K344700K210627K005497
$$ -27351070 -25827283 -23904542 -21695905 -19331244 -16929158 -14584458 -12373831 -10368334
9647a0368334J726032J363946R07374L45538l21570j073359j861796k609243l218875
$$ -10368334 -8642302 -7278356 -6370982 -6025444 -6347014 -7420373 -9282169 -11891412 -15110287
9638a5110287l605182l732047l627926l361368k995906k560548k053883j471649
$$ -15110287 -18715469 -22447516 -26075442 -29436810 -32432716 -34993264 -37047147 -38518796
9630c8518796q35970k07703L28496P02928R00686R73015J009237J088216J241488
$$ -38518796 -39354766 -39562469 -39233973 -38531045 -37630359 -36657344 -35648107 -34559891 -33318403
9621c3318403J446942J648283J782837J804089J696019J480371J213610R68710
$$ -33318403 -31871461 -30223178 -28440341 -26636252 -24940233 -23459862 -22246252 -21277542
9613b1277542Q06660P53889P99260R08320J041292J164256J251860J284850J247718
$$ -21277542 -20470882 -19716993 -18917733 -18009413 -16968121 -15803865 -14552005 -13267155 -12019437
9604a2019437J132178R47006P25492N20477L87686L67745M75295O97187J000152
$$ -12019437 -10887259 -9940253 -9214761 -8694284 -8306598 -7938853 -7463558 -6766371 -5766219
9595e766219J346321J707394K065367K400136K678748K857201K889779K735723
$$ -5766219 -4419898 -2712504 -647137 1752999 4431747 7288948 10178727 12914450
9587A2914450K363482J758134R29555q5885j228292k413527l530936m454937n077475
$$ 12914450 15277932 17036066 17965621 17879736 16651444 14237917 10706981 6252044 1174569
9578A174569n344038n265826m899647m314554l571983k729501j855638j034814
$$ 1174569 -4169469 -9435295 -14334942 -18649496 -22221479 -24950980 -26806618 -27841432
9570b7841432l52050J33303M04293M80384L96625J89583r7234m00422o41382p57432
$$ -27841432 -28193482 -28060179 -27655886 -27175502 -26778877 -26589294 -26686528 -27086950 -27728332 -28485764
9560b8485764p37168o27591n04529m30449m29729m89082n70229o23019n98662
$$ -28485764 -29222932 -29850523 -30355052 -30785501 -31215230 -31704312 -32274541 -32897560 -33496222
9551c3496222m64626k15848J24741N15666R08500J254051J501422J595238J481247
$$ -33496222 -33960848 -34176696 -34051955 -33536289 -32627789 -31373738 -29872316 -28277078 -26795831
9542b6795831J127445N54401j45987q24014j320226j526716j428833j102917o70653
$$ -26795831 -25668386 -25113985 -25259972 -26083986 -27404212 -28930928 -30359761 -31462678 -32133331
9533c2133331k37719J45961M84536Q03990J117958J413619J660955J834208J929147
$$ -32133331 -32371050 -32225089 -31740553 -30936563 -29818605 -28404986 -26744031 -24909823 -22980676
9524b2980676J962961J956488J915200J829290J695134J536594J401714J333437
$$ -22980676 -21017715 -19061227 -17146027 -15316737 -13621603 -12085009 -10683295 -9349858
9516i349858J338161J378610J396932J350935J238867J098313R81879R25270R27239
$$ -9349858 -8011697 -6633087 -5236155 -3885220 -2646353 -1548040 -566161 359109 1286348
9507A286348R54058R64973R38335Q76268P85484O55911M61712J86789j46269m67292
$$ 1286348 2240406 3205379 4143714 5019982 5805466 6461377 6923089 7109878 6963609 6496317
9497F496317o77638o88556m59995j9746N46471J124343J600119J879286J899349
$$ 6496317 5818679 5130123 4670128 4650382 5196853 6321196 7921315 9800601 11699950
9488A1699950J641782J138668M67859k62407r36234j458387j779502j900454j849790
$$ 11699950 13341732 14480400 14948259 14685852 13749618 12291231 10511729 8611275 6761485
9479F761485j655340j337750r25415m63639k582M20319P81571J059714J231600
$$ 6761485 5106145 3768395 2842980 2379341 2376759 2797078 3578649 4638363 5869963
9470E869963J285850J239727J140484J046142R96889R94445J002208R66103Q43072
$$ 5869963 7155813 8395540 9536024 10582166 11579055 12573500 13575708 14541811 15384883
9461A5384883O20393L16428l5126m06780p90382j191968j611772k025492k381709
$$ 15384883 16005276 16321704 16286578 15879798 15089416 13897448 12285676 10260184 7878475
9452G878475k615785k669354k507625k133806j598014r90239m09887P7122M65532
$$ 7878475 5262690 2593336 85711 -2048095 -3646109 -4636348 -5046235 -4969113 -4503581
9443d503581P99344J127692J460853J758584J955360K000095J883767J642251
$$ -4503581 -3704237 -2576545 -1115692 642892 2598252 4598347 6482114 8124365
9435H124365J336443J020809P17602M13336P9779k97207p03315j104859j472785
$$ 8124365 9460808 10481617 11199219 11612555 11692334 11395127 10691812 9586953 8114168
9426H114168j804005k123331k460013k812702l131733l338005l366419l200439
$$ 8114168 6310163 4186832 1726819 -1085883 -4217616 -7555621 -10922040 -14122479
9418a4122479k874696k450768j987039j519437j058761o02156j50261K81714O65799
$$ -14122479 -16997175 -19447943 -21434982 -22954419 -24013180 -24615336 -24765597 -24483883 -23818084
9409b3818084R72537J181395J282556J271590J146374R14005O02831K63737m8323
$$ -23818084 -22845547 -21664152 -20381596 -19110006 -17963632 -17049627 -16446796 -16183059 -16231382
9400a6231382l00318m92087o44543p79065r04968j018067j103959j142132j110735
$$ -16231382 -16531700 -17023787 -17668330 -18447395 -19352363 -20370430 -21474389 -22616521 -23727256
9391b3727256r91346p73650m61529p8378L34946P30922J065781J302333J411202
$$ -23727256 -24718602 -25492252 -25953781 -26032159 -25697213 -24966291 -23900510 -22598177 -21186975
9382b1186975J380436J229088J009088P89516O34915N90246O71494Q55805J076867
$$ -21186975 -19806539 -18577451 -17568363 -16778847 -16143932 -15553686 -14882192 -14026387 -12949520
9373a2949520J241038J268024J134505Q87580O14477L90108K41038J46590O6246
$$ -12949520 -11708482 -10440458 -9305953 -8418373 -7803896 -7413788 -7172750 -7026160 -6959914
9364f959914l0186j42344k30846k24902n1632L21151Q53626J436689J929937K214778
$$ -6959914 -6990100 -7132444 -7363290 -7588192 -7639824 -7318673 -6465047 -5028358 -3098421 -883643
9354h83643K235531K009554J606175J113339O13994J77129j49459l53122m66792
$$ -883643 1351888 3361442 4967617 6080956 6694950 6872079 6722620 6369498 5902706
9345E902706n60778p17693j006744j467224k097489k846509l616446m284254m734533
$$ 5902706 5341928 4624235 3617491 2150267 52778 -2793731 -6410177 -10694431 -15428964
9336a5428964m884689m692841m156695l315433k253244j091244L9312J032642
$$ -15428964 -20313653 -25006494 -29163189 -32478622 -34731866 -35823110 -35783798 -34751156
9328c4751156J833982K442683K893327L224548L450551L551801L492313L251682
$$ -34751156 -32917174 -30474491 -27581164 -24356616 -20906065 -17354264 -13861951 -10610269
9320a0610269K846914K328412J758291J191289O68609K19578j35800l82388n01630
$$ -10610269 -7763355 -5434943 -3676652 -2485363 -1816754 -1597176 -1732976 -2115364 -2616994
9311b616994m66543k50928J47736O88627J289721J853439K298503K577988K676864
$$ -2616994 -3083537 -3334465 -3186729 -2498102 -1208381 645058 2943561 5521549 8198413
9302H198413K596512K338690J899206J277027M95672l77888j235316j955128k442156
$$ 8198413 10794925 13133615 15032821 16309848 16805520 16427632 15192316 13237188 10795032
9293A0795032k655914k616380k390723k070782j748938j497195j353150j316319
$$ 10795032 8139118 5522738 3132015 1061233 -687705 -2184900 -3538050 -4854369
9285d854369j356875j435236j523930j618417j728942j860051j994487k094045
$$ -4854369 -6211244 -7646480 -9170410 -10788827 -12517769 -14377820 -16372307 -18466352
9277a8466352k115568k029141j826028j514104j109326o33011j14770M08718R05056
$$ -18466352 -20581920 -22611061 -24437089 -25951193 -27060519 -27693530 -27808300 -27399582 -26494526
9268b6494526J359874J779272K177710K561397K918303L217509L415334L466671
$$ -26494526 -25134652 -23355380 -21177670 -18616273 -15697970 -12480461 -9065127 -5598456
9260e598456L339411L026779K552404J967420J341092P45140K33417j75353n00830
$$ -5598456 -2259045 767734 3320138 5287558 6628650 7373790 7607207 7431854 6931024
9251F931024p85725j068209j355653j613851j780951j803897j679292j471352
$$ 6931024 6145299 5077090 3721437 2107586 326635 -1477262 -3156554 -4627906
9243d627906j289990j238749j363764j633409j956958k228569k373480k375625
$$ -4627906 -5917896 -7156645 -8520409 -10153818 -12110776 -14339345 -16712825 -19088450
9235a9088450k275498k142066k037103j992959k011296k073707k151617k212069
$$ -19088450 -21363948 -23506014 -25543117 -27536076 -29547372 -31621079 -33772696 -35984765
9227c5984765k223313k162308k020526j803714j525666j201683q48417m89807
$$ -35984765 -38208078 -40370386 -42390912 -44194626 -45720292 -46921975 -47770392 -48260199
9219d8260199j58514J17094L33728N20608P21352R62827J234487J489479J663046
$$ -48260199 -48418713 -48301619 -47967891 -47447283 -46725931 -45763104 -44528617 -43039138 -41376092
9210d1376092J699812J579707J327315R95197O34193K76113o3135l76324o66401
$$ -41376092 -39676280 -38096573 -36769258 -35774061 -35139868 -34863755 -34926890 -35303214 -35969615
9201c5969615r47196j230795j509847j752558j911401j932110j759916j354220
$$ -35969615 -36916811 -38147606 -39657453 -41410011 -43321412 -45253522 -47013438 -48367658
9193d8367658p13913J04914R97956J846268K554624L076923L422228L642122L801950
$$ -48367658 -49081571 -48976657 -47978701 -46132433 -43577809 -40500886 -37078658 -33436536 -29634586
9184b9634586L943290M054076M067942L901441L508730K913824K197263J455181
$$ -29634586 -25691296 -21637220 -17569278 -13667837 -10159107 -7245283 -5048020 -3592839
9176c592839P68659J98744k10371m38745n02208m49008l37942k13957r7841P738
$$ -3592839 -2824180 -2625436 -2835807 -3274552 -3776760 -4225768 -4563710 -4777667 -4875508 -4867770
9166d867770J06026J99828K94463M01564N33003O87115Q42247R66128J031234
$$ -4867770 -4761744 -4561916 -4267453 -3865889 -3332886 -2645771 -1803524 -837396 193838
9157A93838J021657R30669P57299N03205J65497k69101q15854j469519k187903
$$ 193838 1215495 2146164 2903463 3406668 3572165 3303064 2487210 1017691 -1170212
9148a170212k899468l529937m026960m368518m556525m604600m527147m333106
$$ -1170212 -4069680 -7599617 -11626577 -15995095 -20551620 -25156220 -29683367 -34016473
9140c4016473m025112l604081l079693k484227j878927j339866r25341o48570
$$ -34016473 -38041585 -41645666 -44725359 -47209586 -49088513 -50428379 -51353720 -52002290
9132e2002290m80703l83190l41964l77000n23272p97730j169768j549522j803880
$$ -52002290 -52482993 -52866183 -53208147 -53585147 -54108419 -54906149 -56075917 -57625439 -59429319
9123e9429319j799017j450555p54576K13984J326489K430239L373010M026144
$$ -59429319 -61228336 -62678891 -63433467 -63219483 -61892994 -59462755 -56089745 -52063601
9115e2063601M309900M212724L788478L126287K310080J397132M30806n27833
$$ -52063601 -47753701 -43540977 -39752499 -36626212 -34316132 -32919000 -32488194 -33016027
9107c3016027j382257k015488k326313k259214j812412j030263N701J182445K364275
$$ -33016027 -34398284 -36413772 -38740085 -40999299 -42811711 -43841974 -43836273 -42653828 -40289553
9098d0289553L411208M204675M671550M796290M614686M190180L583192K830314
$$ -40289553 -36878345 -32673670 -28002120 -23205830 -18591144 -14400964 -10817772 -7987458
9090g987458J946816R51965r9537j103843j927410k454763k640353k534881k268913
$$ -7987458 -6040642 -5088677 -5188214 -6292057 -8219467 -10674230 -13314583 -15849464 -18118377
9081a8118377j998651j838692j815386j866807j890580j810168j617070j365394
$$ -18118377 -20117028 -21955720 -23771106 -25637913 -27528493 -29338661 -30955731 -32321125
9073c2321125j130986r67334q81210q31292p44454n43803j77385L67893J071360
$$ -32321125 -33452111 -34419445 -35300655 -36131947 -36876401 -37420204 -37597589 -37229696 -36158336
9064c6158336J888696K753310L576045M260016M727433M933448M854240M470232
$$ -36158336 -34269640 -31516330 -27940285 -23680269 -18952836 -14019388 -9165148 -4694916
9056d694916L773376K795969J628097M00331p56616j746116k518106l064300l404820
$$ -4694916 -921540 1874429 3502526 3902857 3146241 1400125 -1117981 -4182281 -7587101
9047g587101l569718l578585l427413l093049k557317j839760j018609k22055
$$ -7587101 -11156819 -14735404 -18162817 -21255866 -23813183 -25652943 -26671552 -26893607
9039b6893607M11476P85133Q81038P67576N76923M60883N35506Q31989J277850
$$ -26893607 -26482131 -25696998 -24815960 -24048384 -23471461 -23010578 -22475072 -21643083 -20365233
9030b0365233J722723J996942J971477J593542Q93552k7610j023785j937555k635619
$$ -20365233 -18642510 -16645568 -14674091 -13080549 -12186997 -12214607 -13238392 -15175947 -17811566
9021a7811566l034383l109193k889399k444673j865824j243018o47574j25109
$$ -17811566 -20845949 -23955142 -26844541 -29289214 -31155038 -32398056 -33045630 -33170739
9013c3170739K97338N97352P50163P37567N65854K74212p6680m24388p13025q88702
$$ -33170739 -32873401 -32276049 -31525886 -30788319 -30222465 -29948253 -30024933 -30449321 -31162346 -32051048
9003c2051048r01808p29012l98935P583L90740O76064Q40733R11132R40671R83361
$$ -32051048 -32952856 -33681868 -34080803 -34073220 -33682480 -33006416 -32165683 -31254551 -30313880 -29330519
8993b9330519J075693J233048J457499J745192K082479K432566K728114K885465
$$ -29330519 -28254826 -27021778 -25564279 -23819087 -21736608 -19304042 -16575928 -13690463
8985a3690463K840735K588242K194719J776130J448406J280043J271556J368239
$$ -13690463 -10849728 -8261486 -6066767 -4290637 -2842231 -1562188 -290632 1077607
8977A077607J492643J575324J571182J465785J281303J077734R31779Q90793R33299
$$ 1077607 2570250 4145574 5716756 7182541 8463844 9541578 10473357 11364150 12297449
8968A2297449R75703R26303P42251M46052J01734k16860m43145n25327m37893
$$ 12297449 13273152 14199455 14941706 15387758 15489492 15272632 14829487 14304160 13866267
8959A3866267j97338J30354M42264O32029O31099M36401J09386k50371n40202
$$ 13866267 13668929 13799283 14241547 14873576 15504675 15941076 16050462 15800091 15259889
8950A5259889o82678o41030m20987o1470L79283Q34746J237468J527151J660403
$$ 15259889 14577211 13936181 13515194 13453724 13833007 14667753 15905221 17432372 19092775
8941A9092775J617561J404107J048884N99316J09795l75684q35899j269251j677226
$$ 19092775 20710336 22114443 23163327 23762643 23872438 23496754 22660855 21391604 19714378
8932A9714378k047754k351326k552997k631001k585850k431228k177877j832388
$$ 19714378 17666624 15315298 12762301 10131300 7545450 5114222 2936345 1103957
8924A103957j416632r85774o19422l88359l24898m19126o36630r37971j286659
$$ 1103957 -312675 -1298449 -1917871 -2306230 -2631128 -3050254 -3686884 -4624855 -5911514
8915e911514j647099j981314k250726k421387k465632k357274k068694j581258
$$ -5911514 -7558613 -9539927 -11790653 -14212040 -16677672 -19034946 -21103640 -22684898
8907b2684898r07199j04445P33066J507123K148578K632438K969724L185059L293793
$$ -22684898 -23592097 -23696542 -22963476 -21456353 -19307775 -16675337 -13705613 -10520554 -7226761
8898g226761L290382L153749K866431K435735J902861J333575P95729L36110l2060
$$ -7226761 -3936379 -782630 2083801 4519536 6422397 7755972 8551701 8887811 8855751
8889H855751l25532n74184q02244j020957j234598j446096j649938j821224j922177
$$ 8855751 8530219 7956035 7153791 6132834 4898236 3452140 1802202 -19022 -1941199
8880a941199j928960j854383j744004j651725j616629j649097j721678j770071
$$ -1941199 -3870159 -5724542 -7468546 -9120271 -10736900 -12385997 -14107675 -15877746
8872a5877746j718767j526759j220366q83092o08183m49371m02404m23578m64965
$$ -15877746 -17596513 -19123272 -20343638 -21226730 -21834913 -22284284 -22686688 -23110266 -23575231
8863b3575231m95744m93337m19461k15083J69198P28388J381187J989656K410529
$$ -23575231 -24070975 -24564312 -24983773 -25198856 -25029658 -24301270 -22920083 -20930427 -18519898
8854a8519898K553987K423792K117448J781990J546741J468753J515830J589831
$$ -18519898 -15965911 -13542119 -11424671 -9642681 -8095940 -6627187 -5111357 -3521526
8846c521526J576882J402566J066289O37904K22368q3507k21530j84494j2710
$$ -3521526 -1944644 -542078 524211 1162115 1384483 1300976 1079446 894952 882242
8837H82242K23717M52166O22569P18474P51499P45418P19797O82207O31850N67674
$$ 882242 1105959 1558125 2180694 2899168 3650667 4396085 5115882 5798089 6429939 6997613
8827F997613M91069M02706L02503J96751J04685N6456Q4758K16297M62769Q08501
$$ 6997613 7488682 7891388 8193891 8390642 8495327 8551783 8636541 8852838 9315607 10124108
8817A0124108J199708J546403J742242J696641J367371P80546K7710p60498j450561
$$ 10124108 11323816 12870219 14612461 16309102 17676473 18457019 18484729 17724231 16273670
8808A6273670j933266k133250k008102j549751p92389J81520J250459K281982
$$ 16273670 14340404 12207154 10199052 8649301 7856912 8038432 9288891 11570873
8800A1570873L166397L835468M258647M429296M357129M069140L610204L038130
$$ 11570873 14737270 18572738 22831385 27260681 31617810 35686950 39297154 42335284
8792D2335284K414956J795928J217513O92132K18139k00849n47368q03661r73986
$$ 42335284 44750240 46546168 47763681 48455813 48673952 48473103 47925735 47122074 46148088
8783D6148088j090573j192736j292986j355585j306176j072257o32663m4026N75189
$$ 46148088 45057515 43864779 42571793 41216208 39910032 38837775 38205112 38161086 38736275
8774C8736275J093525J417390J516294J415493J168155Q26132M23974k0226m93537
$$ 38736275 39829800 41247190 42763484 44178977 45347132 46173264 46597238 46577012 46083475
8765D6083475r75468j428751j796202k008366k004602j759420j297778o90179
$$ 46083475 45108007 43679256 41883054 39874688 37870086 36110666 34812888 34122709
8757C4122709l4214N65391J015068J252521J265071J092454Q04692M64369R7930
$$ 34122709 34088495 34653886 35668954 36921475 38186546 39279000 40083692 40548061 40645991
8748D0645991l03033p51178j227797j672217k005845k169883k145086j943506
$$ 40645991 40342958 39591780 38363983 36691766 34685921 32516038 30370952 28427446
8740B8427446j591813j129453o20537j57873J55318K37671N6090l66289r60069
$$ 28427446 26835633 25706180 25085643 24927770 25083088 25320759 25376849 25010560 24050491
8731B4050491j628949k268985k783441l097170l176141l046920k798622k553934
$$ 24050491 22421542 20152557 17369116 14271946 11095805 8048885 5250263 2696329
8723B696329k416687k422075k516957k583069k494013k175639j633768r35236
$$ 2696329 279642 -2142433 -4659390 -7242459 -9736472 -11912111 -13545879 -14481115
8715a4481115j64992O02712J304037J874675K252105K392778K289622J980793
$$ -14481115 -14646107 -14043395 -12739358 -10864683 -8612578 -6219800 -3930178 -1949385
8707a949385J549628J112978P91827O69702P60477J004835J293778J500683J507263
$$ -1949385 -399757 713221 1505048 2174750 2935227 3940062 5233840 6734523 8241786
8698H241786J223792O10989k97442j385813k476802l380834l952236m123153l902754
$$ 8241786 9465578 10076567 9779125 8393312 5916510 2535676 -1416560 -5539713 -9442467
8689i442467l353640k566275j641646o78692K38434J051143J728575K257271K621666
$$ -9442467 -12796107 -15362382 -17004028 -17682720 -17444286 -16393143 -14664568 -12407297 -9785631
8680i785631K787257K702941K330699J688689Q75611N1639o17115j016642j114289
$$ -9785631 -6998374 -4295433 -1964734 -276045 599566 651205 34090 -982552 -2096841
8671b096841r53537o29259k57997N3421K39617K97272K76905K41896K17627J67712
$$ -2096841 -3050378 -3679637 -3937634 -3884213 -3644596 -3347324 -3070419 -2828523 -2610896 -2443184
8661b443184J6974k95760p73975j355846j939156k417012k707734k774671k635116
$$ -2443184 -2426210 -2721970 -3495945 -4851791 -6790947 -9207959 -11915693 -14690364 -17325480
8652a7325480k354310k023966j734354j552938j514633j619111j831203k087832
$$ -17325480 -19679790 -21703756 -23438110 -24991048 -26505681 -28124792 -29955995 -32043827
8644c2043827k315832k454897k471338k354474k102887j714977j189008n25341
$$ -32043827 -34359659 -36814556 -39285894 -41640368 -43743255 -45458232 -46647240 -47172581
8636d7172581K75464J212643K271773L399696M488627N392327N974436O161729
$$ -47172581 -46897117 -45684474 -43412701 -40013005 -35524378 -30132051 -24157615 -17995886
8628a7995886N969256N485712M835282M141696L508155L009996K691907K566785
$$ -17995886 -12026630 -6540918 -1705636 2436060 5944215 8954211 11646118 14212903
8620A4212903K617472K800182L046391L265035L354254L229169K856751K275908
$$ 14212903 16830375 19630557 22676948 25941983 29296237 32525406 35382157 37658065
8612C7658065J586643R12969L59068k3767k50461l90430n30818p30409r92648
$$ 37658065 39244708 40157677 40516745 40492978 40242517 39852087 39321269 38590860 37598212
8603C7598212j273885j513397j657619j667009j515496j193411p12526j08015
$$ 37598212 36324327 34810930 33153311 31486302 29970806 28777395 28064869 27956854
8595B7956854N62447J222088J785345K176320K347446K289105K029064J624017
$$ 27956854 28519301 29741389 31526734 33703054 36050500 38339605 40368669 41992686
8587D1992686J142278O39951J43945l44674q30483j304503j737421k082306k281907
$$ 41992686 43134964 43774915 43918860 43574186 42743703 41439200 39701779 37619473 35337566
8578C5337566k282428k053357j602678r76834k49546M87226J125920J550183J657120
$$ 35337566 33055138 31001781 29399103 28422269 28172723 28659949 29785869 31336052 32993172
8569C2993172J391805P77391p7619j003817j820555k389306k644216k586918k257675
$$ 32993172 34384977 35162368 35084749 34080932 32260377 29871071 27226855 24639937 22382262
8560B2382262j709888j005446k24532N30208J148200J540295J667169J550043
$$ 22382262 20672374 19666928 19442396 19972604 21120804 22661099 24328268 25878311
8552B5878311J255880Q65299M44857M1587l03405n43516o34169n55503l31305
$$ 25878311 27134191 27999490 28444347 28485934 28182529 27639013 27004844 26449341 26118036
8543B6118036k6610K79382N30213P12316Q41737R30871R70119R43193Q56354P46147
$$ 26118036 26091426 26370808 26901021 27613337 28455074 29385945 30356064 31299257 32155611 32901758
8533C2901758O55061N97900N48149M53956K71684n356l41790o79780r63851j150095
$$ 32901758 33556819 34154719 34702868 35156824 35428508 35423152 35081362 34401582 33437731 32287636
8523C2287636j201428j088740q07032l91618Q4053N28668Q57076J008386R57205
$$ 32287636 31086208 29997468 29190436 28798818 28882871 29411539 30268615 31277001 32234206
8514C2234206P18000L41452r5468n02612p92632q99152p91280m77990k724N66778
$$ 32234206 32952206 33293658 33198190 32695578 31902946 31003794 30212514 29734524 29731800 30298578
8504C0298578J151428J676273K083967K339928K430518K361457K157612J856380
$$ 30298578 31450006 33126279 35210246 37550174 39980692 42342149 44499761 46356141
8496D6356141J491239J076223O06673P8931m84306j020653j437068j640296j576235
$$ 46356141 47847380 48923603 49530276 49609207 49124901 48104248 46667180 45026884 43450649
8487D3450649j257615p62735k06362K96514O52762P96866O94299L50641j82409
$$ 43450649 42193034 41430299 41223937 41520451 42173213 42970079 43664378 44015019 43832610
8478D3832610q16841j452494k001437k401807k621062k652707k508783k211555
$$ 43832610 43015769 41563275 39561838 37160031 34538969 31886262 29377479 27165924
8470B7165924j790017j282424p38265k12326K48557O18245Q96145J101453J259293
$$ 27165924 25375907 24093483 23355218 23142892 23391449 24009694 24905839 26007292 27266585
8461B7266585J385698J480670J534334J541383J511181J462931J408082J335863
$$ 27266585 28652283 30132953 31667287 33208670 34719851 36182782 37590864 38926727
8453C8926727J218432J034148P87325N04796K14395p0761l48558o14973q58801
$$ 38926727 40145159 41179307 41966632 42471428 42685823 42615062 42266504 41651531 40792730
8444D0792730j066848j231290j354731j453558j556884j696204j888707k124989
$$ 40792730 39725882 38494592 37139861 35686303 34129419 32433215 30544508 28419519
8436B8419519k368211k562587k646775k570392k310958j884634j344282p63315
$$ 28419519 26051308 23488721 20841946 18271554 15960596 14075962 12731680 11968365
8428A1968365k08962K85924P36888J192992J694611K228633K714157L033874L094624
$$ 11968365 11759403 12045327 12782215 13975207 15669818 17898451 20612608 23646482 26741106
8419B6741106K879107K455108J936230J421035R51297N13504P3927l84130q44646
$$ 26741106 29620213 32075321 34011551 35432586 36383883 36897387 36971314 36587184 35742538
8410C5742538j264710j588552j762075j748383j541091j165810o66578q8442N30147
$$ 35742538 34477828 32889276 31127201 29378818 27837727 26671917 26005339 25916897 26447044
8401B6447044J154207J747088K268471K675194K926924K998831K893442K638010
$$ 26447044 27601251 29348339 31616810 34292004 37218928 40217759 43111201 45749211
8393D5749211K266567J803028J260351O53372J3183o05690j130372j490145j645109
$$ 45749211 48015778 49818806 51079157 51732529 51745712 51140022 50009650 48519505 46874396
8384D6874396j603152j411936j136102q40193n82244m07119l35452l58458m46328
$$ 46874396 45271244 43859308 42723206 41883013 41300769 40893650 40558198 40199740 39753412
8375C9753412n63341o78129p65451q02515p64061o21513l50850N3633N69563J146687
$$ 39753412 39190071 38511942 37746491 36943976 36179915 35558402 35207552 35261185 35830748 36977435
8365C6977435J714179K191353K503005K598233K463654K122400J621415J017461
$$ 36977435 38691614 40882967 43385972 45984205 48447859 50570259 52191674 53209135
8357E3209135L68176k73404q64462j378032j804654k146719k407635k584167k668619
$$ 53209135 53577311 53303907 52439445 51061413 49256759 47110040 44702405 42118238 39449619
8348C9449619k658288k563785k411563k240418k089900j980324j896123j790195
$$ 39449619 36791331 34227546 31815983 29575565 27485665 25505341 23609218 21819023
8340B1819023j609984j323005r22509m19957J56604P55730J302033J709688J901644
$$ 21819023 20209039 18886034 17963525 17543568 17700172 18455902 19757935 21467623 23369267
8331B3369267J826864J477978R08086K30851m09944q90548j146776j182722j054743
$$ 23369267 25196131 26674109 27582195 27813046 27403102 26512554 25365778 24183056 23128313
8322B3128313q48871o59163n62790n93410p27874q99425j030784j065557r83222
$$ 23128313 22279442 21620279 21057489 20464079 19736205 18836780 17805996 16740439 15757217
8313A5757217p99749n60940l28883j60089q2798q6207j27839j54416j25762k9772
$$ 15757217 14957468 14396528 14067645 13907556 13824758 13738551 13610712 13456296 13330534 13300762
8303A3300762J21240L10758N37159Q12484J141984J505472J857935K146326K328344
$$ 13300762 13422002 13732760 14269919 15082403 16224387 17729859 19587794 21734120 24062464
8294B4062464K385244K328114K195172K036476J891478J774688J679907J596883
$$ 24062464 26447708 28775822 30970994 33007470 34898948 36673636 38353543 39950426
8286C9950426J523064J458850J391197J282686J080679P45383K78531k68709q14861
$$ 39950426 41473490 42932340 44323537 45606223 46686902 47432285 47710816 47442107 46627246
8277D6627246j279824j608479j778430j799243j710313j572784j448797j375548
$$ 46627246 45347422 43738943 41960513 40161270 38450957 36878173 35429376 34053828
8269C4053828j353233j355938j352949j321855j249530j129914r62103p43409
$$ 34053828 32700595 31344657 29991708 28669853 27420323 26290409 25328306 24584897
8261B4584897m59638q9051L70557Q70714J311369J580733J606953J382761R54237
$$ 24584897 24125259 24036208 24406765 25277479 26588848 28169581 29776534 31159295 32113532
8252C2113532L97152j96889p28224j106629j278727j246333j060058p92609n09394
$$ 32113532 32510684 32313795 31585571 30478942 29200215 27953882 26893824 26101215 25591821
8243B5591821k51735l8856J14734J80587J15310j16058n08757j005222j511080
$$ 25591821 25340086 25301230 25415964 25596551 25711861 25595803 25087046 24081824 22570744
8234B2570744j929002k192222k285778k249061k156884k086812k090530k182142
$$ 22570744 20641742 18449520 16163742 13914681 11757797 9670985 7580455 5398313
8226E398313k339840k511618k625929k613898k437378k103964j657731j155111
$$ 5398313 3058473 546855 -2079074 -4692972 -7130350 -9234314 -10892045 -12047156
8218a2047156o43775j53448L01894P12665J059152J307972J429779J426512J339266
$$ -12047156 -12690931 -12844379 -12542485 -11829820 -10770668 -9462696 -8032917 -6606405 -5267139
8209e267139J222425J104675R73069P93620N47012K48824n5801l10679m65420
$$ -5267139 -4044714 -2940039 -1966970 -1173350 -626338 -377514 -433315 -743994 -1209414
8200a209414m86415l64052j16307K12689N59261Q52783J036241J090001J042580
$$ -1209414 -1695829 -2059881 -2176188 -1963499 -1404238 -551455 484786 1574787 2617367
8191B617367R54670Q84781Q63052Q89964R50368J024828J095407J152983J203163
$$ 2617367 3572037 4456818 5319870 6209834 7160202 8185030 9280437 10433420 11636583
8182A1636583J260203J332366J416071J503889J589642J658568J676122J595049
$$ 11636583 12896786 14229152 15645223 17149112 18738754 20397322 22073444 23668493
8174B3668493J377180J010109N11282p3229o74834j221926j667050j998313k224312
$$ 23668493 25045673 26055782 26567064 26493835 25819001 24597075 22930025 20931712 18707400
8165A8707400k352959k389835k353898k286410k239101k249628k319823k407806
$$ 18707400 16354441 13964606 11610708 9324298 7085197 4835569 2515746 107940
8157A07940k441357k352208k113409j752165j327315q91651m70365o7206L16596
$$ 107940 -2333417 -4685625 -6799034 -8551199 -9878514 -10770165 -11240530 -11307736 -10991140
8148a0991140O71250R80389J225991J386560J431801J326423J050048O23900J24173
$$ -10991140 -10319890 -9339501 -8113510 -6726950 -5295149 -3968726 -2918678 -2294778 -2170605
8139b170605l31500o19190o46282l74833J72187R15594J732681K481316L034229
$$ -2170605 -2502105 -3121295 -3767577 -4142410 -3970223 -3054629 -1321948 1159368 4193597
8130D193597L309848L283896K981007K460956J810506J136239N47465J28598q6657
$$ 4193597 7503445 10787341 13768348 16229304 18039810 19176049 19723514 19852112 19765455
8121A9765455j24251n4249M3928J16492J49101J54788J53478J62488J97173K66814
$$ 19765455 19641204 19586955 19630883 19747375 19896476 20051264 20204742 20367230 20564403 20831217
8111B0831217L61690M44358M56694L38646M8032m23445j040008j723879k374082
$$ 20831217 21192907 21637265 22093959 22432605 22480637 22057192 21017184 19293305 16919223
8102A6919223k894063l212522l289932l117110k715600k141471j485618q62714
$$ 16919223 14025160 10812638 7522706 4405596 1689996 -451475 -1937093 -2799807
8094b799807l87048j41946j55129l90794p61586j155669j470709j645257j677084
$$ -2799807 -3186855 -3328801 -3483930 -3874724 -4636310 -5791979 -7262688 -8907945 -10585029
8085a0585029j619773j557907j572630j713693j987050k356850k757138l110075
$$ -10585029 -12204802 -13762709 -15335339 -17049032 -19036082 -21392932 -24150070 -27260145
8077b7260145l345803l414560l285231k937991k366077j589661o65959L20343
$$ -27260145 -30605948 -34020508 -37305739 -40243730 -42609807 -44199468 -44865427 -44545084
8069d4545084J280878K139969K831063L284002L424761L197184K594207J674236
$$ -44545084 -43264206 -41124237 -38293174 -35009172 -31584411 -28387227 -25793020 -24118784
8061b4118784N48351o51258j795300k760066l423668l680079l471807k815593
$$ -24118784 -23570433 -24221691 -26016991 -28777057 -32200725 -35880804 -39352611 -42168204
8053d2168204j800204n62701P37040J936920K896628L527250L811511L796252
$$ -42168204 -43968408 -44531109 -43794069 -41857149 -38960521 -35433271 -31621760 -27825508
8045b7825508L557093L158768K640099K032042J387611P92903L48343J35177J87109
$$ -27825508 -24268415 -21109647 -18469548 -16437506 -15049895 -14256992 -13908649 -13773472 -13586363
8036a3586363M74983R06340J345066J650359J717149J496032R90584K48596o43198
$$ -13586363 -13111380 -12205040 -10859974 -9209615 -7492466 -5996434 -5005850 -4757254 -5400452
8027e400452j570301k417561l103062l597389l916702m096278m161309m110800
$$ -5400452 -6970753 -9388314 -12491376 -16088765 -20005467 -24101745 -28263054 -32373854
8019c2373854l922199l571174l050207k373329j570796o87343K12540J045837
$$ -32373854 -36296053 -39867227 -42917434 -45290763 -46861559 -47548902 -47336362 -46290525
8011d6290525J732039K226370K540135K730304K865439K992015L119746L227083
$$ -46290525 -44558486 -42332116 -39791981 -37061677 -34196238 -31204223 -28084477 -24857394
$$ [...]
##END NTUPLES=NMR SPECTRUM
##END=
