##TITLE=31Pdec_B4e-R11
 CDCl3, 24 sc
 13.8.2024
##JCAMPDX= 6.0         $$ Bruker NMR JCAMP-DX V2.0
##DATA TYPE= NMR SPECTRUM
##DATA CLASS= NTUPLES
##ORIGIN= UXNMR, Bruker Analytische Messtechnik GmbH
##OWNER= root
$$ XWIN-NMR		Version 3.5
$$ Tue Aug 13 13:58:55 2024 Russian Standard Time (UT+4h)  she@DPX200
##.OBSERVE FREQUENCY= 81.013821
##.OBSERVE NUCLEUS= ^31P
##.ACQUISITION MODE= SIMULTANEOUS
##.ACQUISITION SCHEME= undefined
##.AVERAGES= 24
##.DIGITISER RES= 17
##SPECTROMETER/DATA SYSTEM= spect
##.PULSE SEQUENCE= zgpg30
##.SOLVENT NAME= D2O
##.SHIFT REFERENCE= (INTERNAL, D2O, 0, 198.062)
##AUDIT TRAIL= $$ (NUMBER, WHEN, WHO, WHERE, WHAT)
$$ ##TITLE= Audit trail, XWIN-NMR		Version 3.5
$$ ##JCAMPDX= 5.01
$$ ##ORIGIN= Bruker BioSpin GmbH
$$ ##OWNER= she
$$ F:/spectra/data/she/nmr/P31/2/pdata/1/auditp.txt
$$ ##AUDIT TRAIL=  $$ (NUMBER, WHEN, WHO, WHERE, WHAT)
(   1,<2024-08-13 13:57:28.31 +0400>,<she>,<DPX200>,
      <created by zg, POWCHK disabled, PULCHK disabled
       configuration hash MD5:
       00 E9 B6 7A A2 85 ED C7 34 08 36 98 17 FE 4E 26
       data hash MD5: 32K
       09 CB 0C C4 B4 F5 CD D2 8F 41 9D DA 88 BE E4 3B>)
(   2,<2024-08-13 13:58:08.28 +0400>,<she>,<DPX200>,
      <Start of raw data processing
       efp BC_mod = 2 LB = 1.5 FT_mod = 6 PKNL = 1 PHC0 = 2701.249 PHC1 = 84.08804 SI = 64K 
       data hash MD5: 64K
       43 C1 B1 12 5B C9 3D 24 B4 1C DE 15 27 CE 9D 9A>)
(   3,<2024-08-13 13:58:24.12 +0400>,<she>,<DPX200>,
      <pk PHC0 = -2.737351 PHC1 = 0 
       data hash MD5: 64K
       E8 0E 1F 69 C1 7B 12 55 09 FB E0 19 FE F7 5D 6C>)
$$ ##END=
$$ 
$$ hash MD5
$$ 79 5B 97 B0 64 84 56 77 F8 CB A0 D9 2C E0 26 BC
##$RELAX= 
##$RELAX= 
##$RELAX= 
##$RELAX= 
##$RELAX= 
##$RELAX= 
##$RELAX= 
##$RELAX= 
$$ Bruker specific parameters
$$ --------------------------
##$DU= <F:/spectra>
##$EXPNO= 2
##$NAME= <P31>
##$PROCNO= 1
##$TYPE= <nmr>
##$USER= <she>
##$AMP= (0..31)
100 100 100 100 100 100 100 100 100 100 100 100 100 100 100 100 100 100 
100 100 100 100 100 100 100 100 100 100 100 100 100 100 
##$AQSEQ= 0
##$AQ_mod= 1
##$AUNM= <au_zg>
##$AUTOPOS= <>
##$BF1= 81.014009
##$BF2= 200.13
##$BF3= 200.13
##$BF4= 200.13
##$BF5= 200.13
##$BF6= 200.13
##$BF7= 200.13
##$BF8= 200.13
##$BYTORDA= 1
##$CFDGTYP= 0
##$CFRGTYP= 5
##$CHEMSTR= <none>
##$CNST= (0..31)
1 1 145 1 1 1 1 1 1 1 1 1 1 1 1 1 1 1 1 1 1 1 1 1 1 1 1 1 1 1 1 1 
##$CPDPRG= <waltz16>
##$CPDPRG1= <>
##$CPDPRG2= <waltz16>
##$CPDPRG3= <>
##$CPDPRG4= <mlev>
##$CPDPRG5= <mlev>
##$CPDPRG6= <mlev>
##$CPDPRG7= <mlev>
##$CPDPRG8= <mlev>
##$CPDPRGB= <>
##$CPDPRGT= <>
##$D= (0..31)
0 1 0 0 0 0 0 0 0 0.06 0 0.03 2e-05 3e-06 0 0 0.0002 0 0 0 0 0 0 0 0 0 
0 0 0 0 0 0 
##$DATE= 1723543047
##$DBL= (0..7)
120 120 120 11 120 120 24 19 
##$DBP= (0..7)
150 150 150 150 150 150 150 150 
##$DBP07= 0
##$DBPNAM0= <>
##$DBPNAM1= <>
##$DBPNAM2= <>
##$DBPNAM3= <>
##$DBPNAM4= <>
##$DBPNAM5= <>
##$DBPNAM6= <>
##$DBPNAM7= <>
##$DBPOAL= (0..7)
0.5 0.5 0.5 0.5 0.5 0.5 0.5 0.5 
##$DBPOFFS= (0..7)
$$ [...]
##$SUBNAM2= <"">
##$SUBNAM3= <"">
##$SUBNAM4= <"">
##$SUBNAM5= <"">
##$SUBNAM6= <"">
##$SUBNAM7= <"">
##$SUBNAM8= <"">
##$SUBNAM9= <"">
##$SW= 400.765351723535
##$SWIBOX= (0..15)
0 1 3 0 0 0 0 0 0 0 0 0 0 0 0 0 
##$SW_h= 32467.5324675325
##$TD= 32768
##$TD0= 1
##$TE= 0
##$TE2= 300
##$TE3= 300
##$TEG= 300
##$TL= (0..7)
0 120 53 12 22 120 120 120 
##$TP= (0..7)
150 150 150 150 150 150 150 150 
##$TP07= 0
##$TPNAME0= <>
##$TPNAME1= <>
##$TPNAME2= <>
##$TPNAME3= <>
##$TPNAME4= <>
##$TPNAME5= <>
##$TPNAME6= <>
##$TPNAME7= <>
##$TPOAL= (0..7)
0.5 0.5 0.5 0.5 0.5 0.5 0.5 0.5 
##$TPOFFS= (0..7)
0 0 0 0 0 0 0 0 
##$TUNHIN= 0
##$TUNHOUT= 0
##$TUNXOUT= 0
##$USERA1= <user>
##$USERA2= <user>
##$USERA3= <user>
##$USERA4= <user>
##$USERA5= <user>
##$V9= 5
##$VALIST= <valist>
##$VCLIST= <CCCCCCCCCCCCCCC>
##$VD= 0
##$VDLIST= <DDDDDDDDDDDDDDD>
##$VPLIST= <PPPPPPPPPPPPPPP>
##$VTLIST= <TTTTTTTTTTTTTTT>
##$WBST= 1024
##$WBSW= 4
##$XGAIN= (0..3)
0 0 0 0 
##$XL= 0
##$YL= 0
##$YMAX_a= 6214
##$YMIN_a= -5647
##$ZGOPTNS= <>
##$ZL1= 120
##$ZL2= 120
##$ZL3= 120
##$ZL4= 120
##$ABSF1= 0
##$ABSF2= 0
##$ABSG= 0
##$ABSL= 0
##$ALPHA= 0
##$AQORDER= 0
##$ASSFAC= 0
##$ASSFACI= 0
##$ASSFACX= 0
##$ASSWID= 0
##$AUNMP= <proc_1d>
##$AZFE= 0.1
##$AZFW= 0.5
##$BCFW= 0
##$BC_mod= 2
##$BYTORDP= 0
##$COROFFS= 0
##$CY= -3
##$DATMOD= 1
##$DC= 0
##$DFILT= <>
##$DTYPP= 0
##$F1P= 0
##$F2P= 0
##$FCOR= 1
##$FTSIZE= 65536
##$FT_mod= 6
##$GAMMA= 0
##$GB= 0
##$INTBC= 1
##$INTSCL= 9.790993e-09
##$ISEN= 30
##$LB= 1.5
##$LEV0= 0
##$LPBIN= 0
##$MAXI= 10000
##$MC2= 0
##$MEAN= 0
##$ME_mod= 0
##$MI= 50
##$NCOEF= 0
##$NC_proc= -7
##$NLEV= 6
##$NOISF1= 182.463
##$NOISF2= 159.3651
##$NSP= 0
##$NTH_PI= 0
##$NZP= 0
##$OFFSET= 198.0616
##$PC= 4
##$PHC0= 2698.512
##$PHC1= 84.08804
##$PH_mod= 1
##$PKNL= yes
##$PPARMOD= 0
##$PSCAL= 0
##$PSIGN= 0
##$REVERSE= no
##$SF= 81.0140089999434
##$SI= 65536
##$SIGF1= 159.3651
##$SIGF2= -187.1042
##$SINO= 113.3802
##$SIOLD= 16384
##$SREGLST= <1H.CDCl3>
##$SSB= 0
##$STSI= 65536
##$STSR= 0
##$SW_p= 32467.5324675325
##$SYMM= 0
##$S_DEV= 0
##$TDeff= 32768
##$TDoff= 0
##$TI= <>
##$TILT= no
##$TM1= 0
##$TM2= 0
##$TOPLEV= 0
##$USERP1= <user>
##$USERP2= <user>
##$USERP3= <user>
##$USERP4= <user>
##$USERP5= <user>
##$WDW= 1
##$XDIM= 65536
##$YMAX_p= 287009078
##$YMIN_p= -13142366
$$ End of Bruker specific parameters
$$ ---------------------------------
##NTUPLES= NMR SPECTRUM
##VAR_NAME=  FREQUENCY,     SPECTRUM/REAL,   SPECTRUM/IMAG
##SYMBOL=    X,             R,               I
##VAR_TYPE=  INDEPENDENT,   DEPENDENT,       DEPENDENT
##VAR_FORM=  AFFN,          ASDF,            ASDF
##VAR_DIM=   65536,         65536,           65536
##UNITS=     HZ,            ARBITRARY UNITS, ARBITRARY UNITS
##FACTOR=    0.49542278885378, 1,            1
##FIRST=     16045.7642231865, 0,            0
##LAST=      -16421.768244346, 0,            0
##MIN=       -16421.768244346, -13142366,    0
##MAX=       16045.7642231865, 287009078,    0
$$ Real data points
##PAGE= N=1
##DATA TABLE= (X++(R..R)), XYDATA
$$ [...]
43459 659485 1023497 797281 218397 -381110 -866668 -1296163 -1517932 -1069015 203940
43450 203940 1622080 2206379 1728533 896878 487284 615517 902462 991921 747835 228387
43440 228387 -310372 -544843 -402230 -154159 -70021 -74228 134654 700631 1456022 2098990
43430 2098990 2419349 2355399 1931987 1256106 609340 398428 765563 1234749 1068933 181953
43420 181953 -571941 -329944 738180 1659374 1763088 1136896 110057 -1122690 -2249698
43411 -2249698 -2778907 -2557892 -2017025 -1605282 -1272493 -786904 -257077 46278 188525
43402 188525 475556 925696 1198239 1070001 712047 449548 438943 594218 661298 369921
43392 369921 -319654 -1116480 -1679469 -1964369 -2144499 -2258675 -2167842 -1850591 -1489099 -1203177
43382 -1203177 -933043 -676528 -584769 -637983 -473002 129079 693324 420154 -775675 -1965121
43372 -1965121 -2234575 -1770208 -1517631 -1876625 -2251493 -2035563 -1543762 -1535713 -2044885 -2191304
43362 -2191304 -1250359 386645 1494087 1205602 -108857 -1187436 -1196369 -636704 -635560
43353 -635560 -1358610 -1729957 -1059093 -274484 -760647 -2380808 -3663676 -3838655 -3557523
43344 -3557523 -3415407 -2991943 -1997427 -1272456 -1598438 -2234687 -1838225 -458426 606966
43335 606966 807975 917001 1432981 1672124 1020758 78007 -248729 -57941 4402 -33921
43325 -33921 294105 729313 431972 -642296 -1469829 -1362728 -850841 -730772 -930197 -928546
43315 -928546 -781080 -962259 -1453768 -1746726 -1669125 -1490088 -1185720 -372182 824677 1576993
43305 1576993 1425057 910004 672298 541122 150327 -121153 295842 1027378 1181951
43296 1181951 794770 807744 1492457 1926677 1404784 440044 -171756 -472761 -858656 -1170084
43286 -1170084 -1078171 -873520 -1005301 -1159823 -673651 301575 900909 792348 532958 597936
43276 597936 790348 819820 838359 1114231 1633708 2258886 2897460 3365843 3485938 3444910
43266 3444910 3630459 3988806 4027258 3603017 3153966 2898528 2418366 1476902 698197 770813
43256 770813 1283880 1068030 -326935 -2041049 -2864615 -2407239 -1271622 -421460 -451113
43247 -451113 -1171267 -1784601 -1639241 -845144 -13091 505265 829969 1093307 1205144 1174876
43237 1174876 1244260 1454697 1425544 895983 220477 -90994 -151904 -516116 -1247507 -1731564
43227 -1731564 -1586055 -1238383 -1246857 -1474139 -1426686 -1115717 -974490 -1045562 -904449 -447207
43217 -447207 -122845 -186379 -302017 -175964 -17200 32582 370787 1250793 2068841 2072291
43207 2072291 1542891 1488669 2202938 2909195 2973452 2736304 2816859 3184876 3366756 3165183
43197 3165183 2728210 2189719 1682275 1525077 1955643 2699047 3129990 2890865 2142602
43188 2142602 1237048 384034 -326863 -798839 -955788 -816270 -449276 113059 852721
43179 852721 1653227 2263235 2416557 1983874 1014913 -263080 -1406597 -1887471 -1562338
43170 -1562338 -990118 -923206 -1375112 -1559697 -951752 -6339 519315 589662 737746 1133231
43160 1133231 1395517 1282854 1014022 825882 667688 473227 387837 574491 1002210 1470251
43150 1470251 1699866 1531308 1236379 1372367 1975452 2231258 1492834 324452 -193832
43141 -193832 4103 15458 -510566 -904066 -725493 -486792 -684979 -984804 -938888 -804964
43131 -804964 -1018315 -1432723 -1701422 -1907312 -2221579 -2412134 -2282682 -2127026 -2114308 -1686087
43121 -1686087 -306727 1510957 2669879 2793240 2447498 2253249 2351147 2570848 2599490
43112 2599490 2166286 1495871 1254658 1574891 1602147 665669 -588147 -1073403 -867287
43103 -867287 -928984 -1464047 -1683145 -1180968 -471314 25001 544323 1267469 1918975 2353896
43093 2353896 2697669 2624317 1440097 -640517 -2197611 -2256063 -1524985 -1255246 -1457626
43084 -1457626 -1143809 -7970 1067895 1233930 699001 304052 479176 896583 1010750
43075 1010750 720108 397056 312969 273292 -964 -387136 -622011 -825022 -1211197 -1404477
43065 -1404477 -764329 493047 1256426 944911 323189 425674 1214737 1892415 2135022
43056 2135022 2317215 2649446 2735373 2112077 869081 -394407 -1049642 -837927 62858
43047 62858 1263384 2374985 2982458 2672163 1434703 -66347 -1043856 -1401677 -1624030
43038 -1624030 -1935962 -2109526 -2094198 -2180286 -2379930 -2289089 -1805215 -1358908 -1154443 -831294
43028 -831294 -224283 225018 259611 315541 676122 791594 162804 -646405 -674602 158414
43018 158414 1178601 1973876 2517383 2668464 2431772 2428130 3170243 4029180 3856696 2568294
43008 2568294 1190232 371363 -144150 -465228 -83037 1098118 2126862 2017197 905880
42999 905880 -216145 -517706 181615 1438723 2418043 2548544 2204629 2312545 3135267
42990 3135267 3979938 4238134 4011366 3442836 2257569 525292 -817936 -949777 -227688
42981 -227688 368289 438328 148543 -520161 -1611837 -2509511 -2371930 -1338436 -506061
42972 -506061 -516851 -837216 -674715 9465 726589 1154450 1182423 684987 -231515 -966734
42962 -966734 -904308 -139494 604613 799820 586987 398454 357468 193467 -340682 -1079980
42952 -1079980 -1504073 -1214897 -382168 346991 438790 -77773 -769238 -1237935 -1267733 -740783
42942 -740783 219635 1030901 1007816 172240 -596293 -529490 137225 602313 607936 571618
42932 571618 670355 473664 -259659 -1015786 -1230920 -1143592 -1358439 -1805884 -1799279 -1104859
42922 -1104859 -317380 7161 62513 316919 713237 783447 429330 192381 645569 1693406
42912 1693406 2601729 2707502 2035818 1166543 542606 75697 -506752 -1133725 -1415721
42903 -1415721 -1100886 -326691 504923 966405 873431 518240 482209 994894 1664353 2082379
42893 2082379 2388911 2813017 2975921 2334805 1203842 552537 678168 830069 410065
42884 410065 -175770 -263529 120049 558865 922361 1148158 868176 -15458 -744042 -496417
42874 -496417 407165 871469 525595 72374 81132 222875 -18050 -510156 -722597 -357334
42864 -357334 562343 1796094 2763025 2760670 1755633 663614 397334 812391 975602
42855 975602 314143 -884038 -1964898 -2458923 -2183874 -1262719 -178986 486484 541411
42846 541411 278882 83981 123951 378897 686394 732390 326563 -209709 -256018 331715
42836 331715 958641 1021145 593777 97927 -382221 -981188 -1471021 -1420889 -956902 -757264
42826 -757264 -1083809 -1348558 -993021 -378776 -348097 -1159158 -2314535 -3266710 -3791170 -3726325
42816 -3726325 -2915839 -1623691 -632248 -590215 -1321274 -1935084 -1649242 -527035 560475
42807 560475 789564 269020 -81902 345801 1105281 1334752 887555 382024 266281 379292
42797 379292 471155 596349 770167 689853 129566 -650270 -1145297 -1066024 -416779 589688
42787 589688 1491556 1740497 1187574 249600 -566395 -1078560 -1247348 -950954 -243501 460904
42777 460904 815973 929113 985971 756088 -67611 -1201713 -1967967 -2150481 -2185240 -2405433
42767 -2405433 -2528031 -2108059 -1210324 -360591 49490 94252 68186 71512 -32272 -243867
42757 -243867 -209796 358145 1090866 1187400 411013 -503414 -761575 -533138 -615902 -1251272
42747 -1251272 -1805483 -1653141 -903531 -106903 364165 410555 -10005 -859626 -1846511 -2492059
42737 -2492059 -2415895 -1540072 -113486 1364034 2303694 2304400 1460307 449760 134234 791298
42727 791298 1731958 1947448 1227843 379813 214712 642051 1009909 1036684 1010759 1214904
42717 1214904 1546936 1697961 1429168 692201 -296634 -1122051 -1471796 -1332896 -853963
42708 -853963 -244541 127396 -33375 -387941 -148362 748859 1204289 368452 -969614
42699 -969614 -1311929 -498495 226140 150120 -57794 282677 755410 713245 381507 348686
42689 348686 581450 718899 893226 1460276 2156939 2248815 1454092 209562 -892476
42680 -892476 -1528824 -1687819 -1706427 -2072623 -2792348 -3216369 -2946672 -2566622 -2829945 -3407735
42670 -3407735 -3266400 -2204209 -1100917 -486150 215299 1555359 2964651 3506755 3250870
42661 3250870 3059022 3159635 2779147 1424403 -115499 -575147 224626 1141325 1089390
42652 1089390 255002 -293245 67774 952444 1636897 1828441 1611342 1048618 242207
42643 242207 -416082 -547028 -383328 -655407 -1685015 -2889376 -3462207 -3349470 -3184443
42634 -3184443 -3305307 -3278933 -2612245 -1589049 -969995 -984871 -1119111 -964372 -743734 -706341
42624 -706341 -505892 280246 1317842 1822248 1563699 962485 285465 -522136 -1167696
42615 -1167696 -1030775 -191429 312894 -203071 -1071019 -1168721 -380024 468603 791279 701524
42605 701524 498045 346237 413202 774399 1175698 1271785 1024045 542772 -223826 -1195820
42595 -1195820 -1823930 -1639299 -991373 -648065 -781861 -961205 -1016135 -1184314 -1416261 -1312568
42585 -1312568 -882984 -645669 -767151 -775866 -374176 107887 338913 429364 442199 105350
42575 105350 -599579 -1158374 -1252735 -1205322 -1298845 -1304613 -1206000 -1679258 -3089620 -4579155
42565 -4579155 -5055299 -4688779 -4472228 -4580997 -4271486 -3357931 -2622466 -2470894 -2231639
42556 -2231639 -1335819 -331379 16962 7457 486681 1356955 1517961 371794 -1339184
42547 -1339184 -2465186 -2698330 -2536348 -2385120 -2198366 -1898592 -1663892 -1639703 -1662203 -1473379
42537 -1473379 -1025978 -387268 454274 1382945 1896419 1499467 460317 -196313 288901
42528 288901 1563400 2522304 2384551 1286417 -3836 -743228 -695599 -203250 158588
42519 158588 45028 -507935 -1238563 -1741515 -1510362 -338276 1204689 2109017 1988641
42510 1988641 1480793 1346592 1549038 1560497 1201927 693100 148019 -430615 -820835 -801235
42500 -801235 -620157 -713519 -999187 -986042 -561306 -91469 279707 770173 1248224 1099050
42490 1099050 189030 -625239 -485190 355313 928763 793592 344527 62105 20786 151516
42480 151516 500529 1062834 1662700 2160579 2593859 3001639 3258303 3199914 2853440 2475626
42470 2475626 2381615 2716734 3327766 3845432 3939767 3537613 2848229 2239523 2040891 2308293
42460 2308293 2709006 2726955 2077035 939609 -164669 -687154 -363286 589775 1601544
42451 1601544 2230464 2487795 2555367 2367728 1820551 1264301 1248498 1694128 1902375 1644174
42441 1644174 1630230 2382869 3152974 2744658 1209310 -133129 -436754 -268726 -464527
42432 -464527 -785722 -399335 716330 1658778 1853784 1671337 1564852 1271927 423282
42423 423282 -477578 -475650 418803 961524 175866 -1369145 -2264636 -1951267 -1176965 -900958
42413 -900958 -1274617 -1742427 -1703446 -961277 140827 944165 1109537 1007718 1136688 1263619
42403 1263619 706948 -525687 -1569504 -1849033 -1678295 -1412021 -788790 318702 1211699
42394 1211699 1200237 614021 164828 -240729 -1090888 -1998406 -1969074 -917605 156272
42385 156272 653409 1007668 1548221 1766953 1269895 596208 382466 337567 -227926 -1298776
42375 -1298776 -2251804 -2708420 -2681916 -2204572 -1451688 -987914 -1233957 -1824347 -2070606 -1907998
42365 -1907998 -1776675 -1718232 -1343294 -732412 -583211 -1158732 -1717848 -1458159 -626234 -179727
42355 -179727 -521826 -1045468 -973633 -324815 121644 -299274 -1434787 -2477930 -2740109
42346 -2740109 -2196729 -1326036 -568545 -25504 411024 766384 851736 428727 -460251 -1382664
42336 -1382664 -1860834 -1798346 -1433397 -973015 -543033 -410603 -790370 -1309667 -1154588 -87436
42326 -87436 1019608 1070607 -14092 -1277134 -1799700 -1500076 -980874 -855076 -1159900
42317 -1159900 -1297466 -701817 382470 1114009 1141406 982515 1094626 1202688 1014678
42308 1014678 932805 1303950 1517743 825150 -289363 -648887 -180012 -27571 -761393
42299 -761393 -1591304 -1710887 -1396047 -1243415 -1188149 -904675 -485476 -95164 453055 1168761
42289 1168761 1504191 1158427 755565 1022463 1719234 2113189 2140307 2290440 2594661 2604124
42279 2604124 2335202 2398667 2995102 3428982 2953468 1738893 726097 663451 1410454
42270 1410454 2148477 2300749 2202746 2614339 3568072 4173463 3762083 2692162 1658500
42261 1658500 775706 -102260 -689900 -661496 -378987 -407910 -514126 34518 1273426 2465024
42251 2465024 3182719 3646844 3936226 3724536 3009077 2329677 1959568 1519297 688349
42242 688349 -272826 -985751 -1415419 -1639507 -1667825 -1670938 -1845928 -1923006 -1447739 -695454
42232 -695454 -519366 -1024306 -1267911 -733697 -212796 -551044 -1312232 -1523777 -1115783 -703631
42222 -703631 -450228 -133893 29300 -304605 -673736 -262092 737093 1246155 891604 438276
42212 438276 401198 300516 -180470 -287558 681255 1977931 2140561 929100 -352891
42203 -352891 -522038 236702 1016505 1454568 1846367 2290741 2322824 1551322 340062 -425139
42193 -425139 -207145 691035 1471363 1542238 905356 28349 -582722 -746753 -578995 -143218
42183 -143218 641685 1582541 2015316 1515712 673199 514856 1074194 1231243 277771 -1040426
42173 -1040426 -1544564 -1088328 -363172 227192 664735 660722 -99837 -1120718 -1435060 -897441
42163 -897441 -315752 -153737 33855 593476 1076217 1041324 817330 858953 957326 773099
42153 773099 655678 1141174 1930845 2160415 1571734 702498 -52553 -846399 -1727811 -2259247
42143 -2259247 -2114399 -1611417 -1299037 -1283248 -1265878 -1070166 -846573 -821679 -1042227 -1372892
42133 -1372892 -1652736 -1830719 -1934588 -1901377 -1567836 -971064 -525312 -609268 -988824 -986862
42123 -986862 -356090 316450 313209 -323176 -911626 -1029124 -927821 -1038507 -1415325 -1836418
42113 -1836418 -2152941 -2245254 -1845531 -845011 214475 414053 -511210 -1677783 -1908093
42104 -1908093 -972788 270939 875760 649318 62409 -344993 -381125 -259343 -324411 -582227
42094 -582227 -556767 122974 1050023 1365419 844107 205064 102231 243744 -76169 -895177
42084 -895177 -1560711 -1644010 -1344013 -982961 -604741 -206351 49367 61019 -67711 -271496
42074 -271496 -597766 -865490 -649815 32658 362099 -400046 -1774401 -2423237 -1766237
42065 -1766237 -669970 -236368 -460460 -656455 -799747 -1545396 -2869552 -3605104 -2837112
42056 -2837112 -1162240 77962 416238 387154 305788 -154300 -1060568 -1769043 -1776105 -1379236
42046 -1379236 -1019265 -531840 337300 1114090 1060767 296542 -251741 -9818 745871 1562018
42036 1562018 2302961 2787032 2582327 1587907 414699 -223287 -235465 39509 426635
42027 426635 862601 965449 228437 -1253609 -2611749 -2936101 -2061903 -628572 465436
42018 465436 699433 303075 97034 753251 2059170 3040101 2960715 2135089 1606799 2062050
42008 2062050 3200622 4187104 4545002 4455947 4271983 4018191 3533844 2910297 2458148
41999 2458148 2211103 1776759 877553 -162057 -723075 -579927 -25995 608496 1236752
41990 1236752 1790275 2079563 2074375 2053426 2201483 2228497 1704904 711145 -158239 -456555
41980 -456555 -260323 189021 897118 1919725 2926498 3288220 2679007 1463241 414235
41971 414235 77395 407066 971875 1452524 1874354 2354372 2785692 2954031 2875787 2752965
41961 2752965 2601185 2241532 1729936 1416090 1387673 1256643 819392 523845 768526 1051832
41951 1051832 517162 -744548 -1672198 -1626289 -1125241 -963045 -1233162 -1567132 -1739321
41942 -1739321 -1587764 -894928 77965 415227 -390594 -1508306 -1630273 -595875 544041
41933 544041 963002 814000 569480 393297 331757 444472 519362 245987 -154024 -108334
41923 -108334 312961 344422 -222492 -583801 -252680 32020 -421061 -819323 82356 1874081
41913 1874081 2731843 1854600 484753 124521 737057 1310274 1405229 1344878 1317112 1102177
41903 1102177 597709 45308 -271648 -201611 329893 1216536 2073374 2530417 2574699 2397822
41893 2397822 2062240 1595683 1244123 1252556 1469584 1542994 1477394 1608334 1989428 2209968
41883 2209968 1972991 1526035 1303525 1371787 1448121 1309864 967694 527153 83154 -262309
41873 -262309 -423749 -404380 -278794 -88371 204399 624054 1044298 1201213 937880 428948
41863 428948 39837 -50647 59334 253855 451298 348385 -420161 -1573309 -2123582 -1589450
41853 -1589450 -906828 -1359796 -2748341 -3505861 -2752388 -1345175 -548327 -490538 -508542
41844 -508542 -333262 -187258 -117322 61153 390265 875933 1659888 2557022 2826354 2082422
41834 2082422 1077726 801746 1115650 1178367 964518 1239197 2045209 2447635 2101632
41825 2101632 1919878 2582516 3347361 3115135 1955732 769902 -1421 -493096 -672803
41816 -672803 -386758 26003 -27347 -519088 -756525 -255231 754675 1641543 1844528 1209949
41806 1209949 266032 -48198 577436 1225986 740797 -789826 -2104730 -2316259 -1832561
41797 -1832561 -1640986 -2130247 -2775813 -2690283 -1420238 548667 2095216 2509448 2134404
41788 2134404 1731364 1499702 1187449 888090 1012904 1501569 1756516 1492180 1061324
41779 1061324 793636 586087 338640 223130 245132 49758 -515057 -1072496 -1262172 -1209620
41769 -1209620 -1141736 -937787 -444217 86158 273176 120740 -74798 -149021 -143445 -145987
41759 -145987 -276742 -618171 -975461 -994688 -737787 -787982 -1457295 -2225110 -2398702 -2072676
41749 -2072676 -1905704 -2059287 -1929264 -1043148 232865 1159475 1560741 1983602 2926424
41740 2926424 4139886 4874073 4747405 4092403 3341702 2430704 1191538 87319 -75419
41731 -75419 750064 1575266 1452007 461141 -574060 -1023546 -899097 -668452 -790008 -1180101
41721 -1180101 -1136376 -205492 910077 981186 -79656 -981377 -832445 -280823 -252635 -405493
41711 -405493 178869 1339443 2026067 1896251 1598659 1501822 1250091 773487 683448 1196110
41701 1196110 1483160 704458 -821331 -1999066 -2162038 -1509792 -690921 -331531 -682127
41692 -682127 -1351990 -1604089 -1213647 -798358 -984773 -1494645 -1468531 -576728 594107 1249988
41682 1249988 1127721 464242 -413230 -1218570 -1627616 -1423526 -776963 -126807 347306
41673 347306 890304 1591852 1925825 1324209 80431 -886560 -1190665 -1280587 -1469027 -1429969
41663 -1429969 -1048523 -1011333 -1894544 -3232309 -4186389 -4612736 -4708902 -4213713 -3010129
41654 -3010129 -2057011 -2414461 -3497079 -3647877 -2507036 -1396912 -1071300 -614390 703987
41645 703987 1881475 1625976 350065 -520116 -558544 -404891 -246674 438653 1642151
41636 1642151 2447462 2173567 1180214 322865 106925 454721 839000 603954 -421855
41627 -421855 -1592560 -2030861 -1476795 -318635 921139 1736934 1672876 852905 238207
41618 238207 654141 1684251 2201565 1863340 1326145 1069229 886732 629960 547625 621190
41608 621190 389595 -202661 -555821 -444302 -527886 -1253433 -1942767 -1726797 -870092 -336696
41598 -336696 -372632 -363580 75232 695247 1234751 1597854 1332541 -179731 -2624059 -4533431
41588 -4533431 -4722337 -3536344 -2220748 -1446643 -1023545 -753766 -795129 -1115577 -1250852
41579 -1250852 -927572 -538075 -654576 -1284868 -1892308 -2009388 -1591584 -901951 -322138
41570 -322138 -205982 -633059 -1277514 -1717037 -1878085 -1983740 -2063656 -1770095 -814333 545759
41560 545759 1601066 1800120 1273700 735606 744721 1044845 863080 -31535 -922127 -1123310
41550 -1123310 -1020057 -1538735 -2720286 -3521133 -3159256 -2045904 -1145003 -948263 -1368102
41541 -1368102 -2109185 -2736443 -2796219 -2310241 -1855870 -1827213 -1956659 -1856406 -1562413 -1153974
41531 -1153974 -394824 659271 1223011 741452 -82901 -118070 545619 736570 -5575
41522 -5575 -759567 -605268 162675 639087 512524 188413 102380 330840 693547 1008928
41512 1008928 1345612 1966918 2773743 3007443 2022064 229647 -1332267 -2256186 -2825766
41503 -2825766 -2928983 -2001268 -318519 769752 513053 -248729 -473872 -433509 -943652
41494 -943652 -1834651 -2305836 -2341545 -2611111 -3180842 -3454748 -3352356 -3443254 -3761250 -3514394
41484 -3514394 -2329613 -950490 -272156 -346449 -744656 -1285027 -1914478 -2352806 -2375630
41475 -2375630 -2166709 -2001601 -1823653 -1434760 -867647 -332467 -52781 -312182 -1265566
41466 -1265566 -2453801 -2948449 -2363718 -1357927 -725608 -388876 158901 739603 577331
41457 577331 -516367 -1717389 -2148444 -1801051 -1286605 -1029342 -956329 -766685 -290070
41448 -290070 343613 838669 1124572 1502706 2149956 2613489 2278966 1386901 1017702 1764793
41438 1764793 2880002 3173649 2434005 1449123 858178 598450 440958 411920 472374 305974
41428 305974 -221761 -734669 -830900 -646860 -573319 -608955 -440536 -102261 -60948 -471088
41418 -471088 -711776 -4783 1616607 3247145 4049656 4032370 3755642 3442160 2706713
41409 2706713 1261086 -410149 -1404405 -1360311 -762245 -296542 -226275 -447056 -769097
41400 -769097 -951571 -795476 -452785 -349284 -568803 -705323 -667167 -1125936 -2513766 -3943235
41390 -3943235 -4036064 -2774189 -1571755 -1305876 -1255276 -508407 486677 680201 150979
41381 150979 -25005 496040 797989 164231 -813691 -1138179 -846693 -845907 -1494049 -2012395
41371 -2012395 -1477618 -3080 1352302 1705343 1142541 431673 171996 346250 589952
41362 589952 697188 782580 1020859 1341454 1452221 1165305 607972 20748 -556782 -1184377
41352 -1184377 -1647721 -1548444 -915131 -347139 -226298 -112045 603116 1657902 2134264
41343 2134264 1648060 718747 -112554 -901236 -1804289 -2523253 -2609181 -1981633 -894199
41334 -894199 282204 1074277 1145121 749946 515412 545355 261120 -609491 -1509311 -1913289
41324 -1913289 -2054614 -2253991 -2204668 -1669612 -1290731 -1765602 -2622272 -2806984 -2234358 -1737601
41314 -1737601 -1636643 -1442792 -987325 -729970 -763365 -584079 -169778 -230706 -900596 -1171710
41304 -1171710 -340171 786631 955870 181730 -459535 -416458 -220820 -511702 -1130592
41295 -1130592 -1353279 -793751 -5329 -77312 -1349532 -2671678 -2565235 -1157359 -145797
41286 -145797 -570245 -1525504 -1645917 -983378 -532833 -553725 -429474 131269 766763 1216724
41276 1216724 1528684 1568458 1144556 628556 682615 1292087 1742562 1618011 1178016 721330
41266 721330 293688 137546 692753 1877491 2943996 3299535 2997674 2296196 1317255
41257 1317255 333664 -231059 -396904 -696763 -1349199 -1853545 -1712006 -1069179 -312218
41248 -312218 470343 1249942 1750871 1846661 1901780 2257196 2647293 2535098 1796267 746032
41238 746032 -228307 -749722 -540335 148070 521374 128618 -529810 -762750 -732957 -1101285
41228 -1101285 -1830045 -2105730 -1526621 -694962 -359181 -447307 -307023 348188 1064031 1191070
41218 1191070 653820 94718 165493 694703 811596 27473 -1109360 -1708648 -1603913
41209 -1603913 -1341213 -1329961 -1482445 -1599460 -1649651 -1682945 -1851902 -2446069 -3471817 -4269724
41199 -4269724 -4057256 -2865254 -1464373 -390338 397855 908019 906339 530309 392603
41190 392603 692005 846094 470777 125542 458071 1072202 991916 7226 -1159379 -1914189
41180 -1914189 -2308212 -2442190 -2023024 -824284 746738 1810087 1699135 559268 -595339
41171 -595339 -646111 478076 1584854 1522555 501052 -345805 -473492 -320487 -286176 -172258
41161 -172258 127639 166309 -345719 -910220 -836884 -101397 815641 1571325 1989711 1826240
41151 1826240 1069709 232666 -222312 -556345 -1263167 -2044675 -1984789 -840775 473144
41142 473144 962166 650424 293477 335758 531218 464595 124564 -117164 1439 278495
41132 278495 331488 224983 481076 1234258 1751896 1295257 205562 -536763 -739092 -1165082
41122 -1165082 -2119085 -2727522 -2126184 -690543 546769 1183959 1444885 1313502 570965
41113 570965 -423602 -857439 -513922 -41390 -7763 -266820 -439950 -435961 -222174 356922
41103 356922 1140248 1495326 1076424 408452 232855 504635 526984 -57923 -889920 -1444187
41093 -1444187 -1518367 -1165208 -567999 -64526 81238 55906 308133 829158 966020 236568
41083 236568 -891772 -1378689 -733155 463590 1155488 783672 -307131 -1254622 -1420751
41074 -1420751 -854004 -91415 469475 925348 1549676 2250619 2552959 2162621 1403520
41065 1403520 968026 1235485 1871430 2101398 1407638 24761 -1223326 -1608638 -1049741
41056 -1049741 -19880 958054 1582901 1645013 981328 -214127 -1227538 -1317684 -412350
41047 -412350 897115 2052588 2928172 3473671 3406360 2669371 1957257 2194932 3387325
41038 3387325 4459774 4493343 3734591 3022138 2555852 1819827 630863 -410737 -755432
41029 -755432 -669030 -747909 -1007767 -961974 -455372 116843 453823 711150 1027321 1108996
41019 1108996 632429 -178921 -741412 -795489 -616134 -568463 -699768 -795677 -664048 -339782
41009 -339782 -111793 -275695 -704786 -780132 -15194 1285613 2282841 2533893 2367212 2277128
40999 2277128 2312087 2239132 1968163 1518164 828959 -24389 -593724 -440722 266358 862820
40989 862820 884891 373994 -436055 -1305495 -1813672 -1495641 -441262 580128 938388
40980 938388 869697 1052361 1640105 2119158 2046310 1497643 750799 -35437 -643791 -698620
40970 -698620 -95285 681364 1030687 937119 855190 936547 789216 156492 -519249 -529742
40960 -529742 258007 1290477 1974904 2112149 1676611 576146 -1059729 -2538248 -2982849
40951 -2982849 -2232929 -1161035 -818239 -1254995 -1442408 -534460 981589 1745170 1150536
40942 1150536 113918 -49820 792758 1591388 1561724 1053198 792725 781476 418741 -476678
40932 -476678 -1257889 -1143214 -46059 1379854 2340059 2449270 1840236 935830 188639
40923 188639 -62602 254682 731117 568794 -713645 -2584075 -3856237 -3930575 -3364413
40914 -3364413 -2996451 -2905844 -2652509 -2203080 -1982124 -2087974 -2085771 -1693441 -1168155 -843225
40904 -843225 -706420 -613533 -528726 -374462 -30562 328971 306553 -88853 -312231 -55652
40894 -55652 309733 409020 457616 657585 506136 -517691 -1868502 -2433544 -2090578 -1892217
40884 -1892217 -2514829 -3339561 -3440600 -2762874 -1783473 -592974 977081 2633268 3742231
40875 3742231 4099589 4021407 3711035 3071674 2183094 1432417 994338 597653 27147 -474995
40865 -474995 -548319 -198079 286337 675649 844068 693145 300677 -35504 -188690 -465763
40855 -465763 -1126823 -1778875 -1717110 -893123 -59194 232326 329609 849794 1691509 2158834
40845 2158834 1955594 1599024 1779946 2631862 3719035 4482951 4588825 4045039 3129453
40836 3129453 2118686 1083377 70307 -625777 -703190 -375388 -241656 -464319 -462285
40827 -462285 272754 1374404 2022929 1964530 1655048 1478214 1317140 989757 680704 691523
40817 691523 970488 1090527 630591 -441277 -1624801 -2144748 -1575598 -268165 995325
40808 995325 1737545 1978204 1824742 1314430 725957 570890 1011737 1607362 1864604 1730750
40798 1730750 1335495 665653 -158896 -706666 -821248 -1034937 -1802409 -2598717 -2491907
40789 -2491907 -1464266 -386213 272834 815373 1297381 1186246 492679 256163 1111260
40780 1111260 2127766 2037724 1062260 429349 441665 282316 -317380 -559552 -69269 307985
40770 307985 -151481 -870680 -923859 -405539 26843 368575 1034526 1805546 2050074 1839652
40760 1839652 1857418 2214307 2317177 2022550 1952432 2355224 2541380 1943311 1021903 564512
40750 564512 671427 1035328 1712804 2889726 4151244 4672854 4094404 2772879 1302603
40741 1302603 180497 -265116 -116848 50648 -241997 -797484 -1105174 -1089761 -1043001 -1016404
40731 -1016404 -874614 -852520 -1387130 -2317142 -2864501 -2594351 -1877134 -1219633 -669220 -149860
40721 -149860 100955 -183911 -882424 -1638277 -2168676 -2213522 -1531886 -245542 1094861
40712 1094861 2059123 2695422 3132070 3192292 2730693 2009022 1338087 636787 -218004 -875583
40702 -875583 -882770 -425927 -151141 -263934 -318795 18953 455950 495610 74484 -408389
40692 -408389 -535279 -248805 126562 269752 331070 812556 1806347 2662500 2794661 2543944
40682 2543944 2697814 3310337 3656919 3366370 2906573 2759107 2739066 2437472 1808719 982655
40672 982655 -15475 -975970 -1405866 -1187826 -949858 -1264039 -1789129 -1763717 -1126043 -559330
40662 -559330 -528626 -823458 -1048779 -1089374 -1032056 -998987 -1104431 -1315184 -1416294 -1348323
40652 -1348323 -1351366 -1425873 -997743 269020 1588984 1809676 1019847 539751 1152001 2200697
40642 2200697 2752251 2778130 2674222 2407930 1852277 1340675 1114303 744870 -36559 -404165
40632 -404165 596906 2341735 3028799 1953271 386883 -161573 281771 629165 317063
40623 317063 -218355 -314116 195444 886206 1078832 427819 -649094 -1352946 -1405868 -1231768
40613 -1231768 -1165476 -1009312 -615372 -329689 -421528 -574859 -498658 -604661 -1381703 -2384730
40603 -2384730 -2650646 -2076794 -1621965 -1973893 -2647871 -2700621 -1893111 -841216 -316916
40594 -316916 -659727 -1647536 -2686675 -3214845 -3067640 -2467555 -1751752 -1239425 -1178382 -1491465
40584 -1491465 -1664881 -1271342 -593051 -352183 -819896 -1572016 -2098258 -2182954 -1705064 -709046
40574 -709046 166288 44144 -1005165 -1759661 -1378028 -615494 -817366 -2066985 -3137546
40565 -3137546 -3141661 -2423165 -1754347 -1408990 -1302074 -1441658 -1816509 -2162250 -2185083 -1843870
40555 -1843870 -1231828 -407532 473821 1072151 1090892 466145 -700039 -2116296 -3151997
40546 -3151997 -3132123 -2064454 -778963 -44305 198145 415344 621188 445123 -89044
40537 -89044 -446408 -334336 -72956 12077 165658 815186 1814555 2457472 2266218 1544785
40527 1544785 1064714 1275865 1873145 2150621 1793272 1249346 1202113 1722156 2156367 1909660
40517 1909660 1125137 472609 451568 1045970 1856539 2336838 2070402 1157007 300286 198282
40507 198282 782132 1302300 1235692 859963 814397 1319175 1996367 2285969 1854247 753529
40497 753529 -556724 -1398201 -1360583 -705683 -144403 -97487 -247715 52384 938277 1756148
40487 1756148 1758745 979593 154293 -251825 -562194 -1176822 -1711136 -1411180 -321747 612368
40477 612368 764100 551114 647306 1023933 1250723 1302932 1445964 1583106 1391816 1021629
40467 1021629 1000238 1377420 1542958 1069372 267920 -286569 -385572 -157958 201993 453630
40457 453630 398533 205160 368155 1084915 1882206 2095049 1567529 727088 133127 65091
40447 65091 357694 544462 375789 237360 744999 1857015 2789901 2972821 2656625 2349089
40437 2349089 2130985 1913148 1918681 2350043 2833986 2748689 1979523 905877 -188727 -1190168
40427 -1190168 -1795083 -1707433 -1241523 -1176210 -1838219 -2725105 -3160274 -2953903 -2317984 -1534811
40417 -1534811 -881327 -516918 -240509 319695 1063391 1295233 545216 -735775 -1644709
40408 -1644709 -1842127 -1745504 -1766051 -1745877 -1311368 -532345 61817 122764 -77544 9997
40398 9997 526417 1057787 1182575 961939 769173 769063 723668 288325 -551714 -1300785 -1290004
40387 -1290004 -425525 431732 218879 -1064040 -2243623 -2359596 -1720339 -1211633 -1050126
40378 -1050126 -859546 -621863 -682041 -857815 -442548 646294 1463129 1209078 283052
40369 283052 -290250 -83240 527345 1044464 1241528 1050394 546427 49202 -81191 215548
40359 215548 714790 1168541 1380780 1175380 560837 -144022 -626840 -1025497 -1782368 -2937589
40349 -2937589 -3763929 -3361808 -1680383 201002 989875 377540 -828770 -1723275 -2112448
40340 -2112448 -2194252 -1901598 -1044154 141508 1131619 1708488 1907800 1529968 429279
40331 429279 -700419 -732141 324235 963077 52934 -1506608 -1802453 -284515 1689966
40322 1689966 2609533 2299846 1487479 609019 -396741 -1415872 -1883613 -1365786 -184427
40313 -184427 792574 1021931 782171 683941 831126 709925 -119510 -1446488 -2525538
40304 -2525538 -2606830 -1480949 199560 1250408 1018671 96104 -411064 -205222 156424
40295 156424 404459 900526 1698250 2187250 2094341 1978201 2136821 1863722 626383 -720587
40285 -720587 -950299 -252369 91676 -401516 -956633 -947374 -685501 -604165 -612272 -619544 -891289
40274 -891289 -1391945 -1384755 -252089 1585124 2983369 3190183 2468200 1738383 1632434
40265 1632434 1765607 1111666 -639658 -2393007 -2791527 -1769846 -324795 987564 2404628
40256 2404628 3844772 4510130 3974249 2849328 1926235 1307696 790159 433664 274888
40247 274888 76867 -129763 183901 1194540 2164054 2318182 1845993 1431919 1221177
40238 1221177 925650 614545 640166 926239 1019570 815478 646950 654154 599885 361112
40228 361112 123670 -30196 -340962 -998098 -1768869 -2156720 -1880222 -1165463 -523537 -133548
40218 -133548 438594 1595199 2870488 3275407 2564108 1531054 812001 103201 -971518
40209 -971518 -1929253 -2071117 -1528319 -899702 -277890 542833 1270313 1471343 1480445 1941350
40199 1941350 2535917 2222669 826952 -625536 -1369390 -1696832 -1976526 -1902590 -1299433
40190 -1299433 -809974 -1038862 -1616275 -1817067 -1611057 -1406571 -1201752 -756851 -288870
40181 -288870 -198448 -282402 173 545167 686072 347293 308035 970589 1535687 983163
40171 983163 -504071 -1726725 -1958270 -1636500 -1467395 -1443299 -1198448 -952694 -1362134
40162 -1362134 -2353286 -2805593 -1870367 -192394 784884 546773 -94563 -308912 -267025
40153 -267025 -601427 -1399978 -2151461 -2378325 -1953528 -1012252 88723 829170 830892 105804
40143 105804 -1058669 -2282692 -3100404 -3123548 -2466989 -1792315 -1656357 -1960970 -2228698
40134 -2228698 -2177709 -1765693 -940088 232817 1295018 1672408 1310209 827996 991761
40125 991761 2074293 3580532 4481088 3955207 2168094 177958 -1119113 -1739512 -2111029
40116 -2111029 -2209732 -1708738 -807207 -303328 -711211 -1659798 -2281961 -2012173 -1057031 -292774
40106 -292774 -524605 -1530003 -2066791 -1283119 129792 826090 644397 667526 1395702
40097 1395702 1918428 1390922 403308 52824 279820 102086 -803930 -1737838 -2135673
40088 -2135673 -2162843 -1984188 -1319528 -169635 686462 562834 -103531 -225558 513447
40079 513447 1248371 1040768 -12834 -1021059 -1394354 -1355359 -1374750 -1454216 -1238442 -689820
40069 -689820 -251069 -204906 -202485 243889 960699 1211667 635868 -254287 -661797 -337962
40059 -337962 355877 985382 1340105 1298148 780340 3360 -448758 -101011 837504 1570092
40049 1570092 1499222 807483 129338 -228406 -480803 -796453 -885284 -389723 493424 1077080
40039 1077080 879661 98132 -617072 -759748 -369508 84131 256726 367367 910351
40030 910351 1897063 2706041 2890517 2785497 2925011 3143356 2811613 1852863 920472 520839
40020 520839 512252 575208 609399 480952 -29536 -710610 -900143 -398730 74668 -177664
40010 -177664 -859434 -1200454 -1085387 -1005179 -1111224 -1037160 -636022 -251679 -148968 -164258
40000 -164258 -33144 311520 791395 1158133 976116 110354 -780416 -786924 101768 868609
39990 868609 606920 -642274 -2220124 -3438296 -3709234 -2761475 -1100064 234983 734396
39981 734396 843154 1064400 1197032 877678 317785 -100429 -534422 -1308691 -2135058 -2438297
39971 -2438297 -2303814 -2354158 -2686604 -2658778 -1890427 -844089 -119746 339202 983522 1926956
39961 1926956 2817970 3273219 3205833 2839253 2523419 2382938 2060324 1054623 -491750
39952 -491750 -1566595 -1184624 487514 2149309 2613419 1904680 1009688 672736 720425
39943 720425 624653 354973 281368 418734 350840 15406 -15033 597347 1243394 1022522
39933 1022522 -150176 -1565071 -2595297 -2992848 -2529689 -1126508 572045 1493125 1349017
39924 1349017 1025042 1383642 2125536 2272445 1427518 70655 -1136251 -1793352 -1666383
39915 -1666383 -778666 299822 769991 443070 -79533 -235131 -116305 -21932 122050
39906 122050 391648 314034 -526441 -1452947 -1217519 180072 1119590 407957 -1090788
39897 -1090788 -1730129 -1329347 -1002077 -1166430 -1170732 -898286 -1174578 -2082789 -2331704 -1189546
39887 -1189546 162972 310075 -380559 -677553 -557011 -848407 -1405876 -1319772 -721484
39878 -721484 -660762 -1102610 -756182 683580 1725833 1234302 22267 -564891 -470510
39869 -470510 -350142 -223128 161036 424743 233748 267006 1300952 2744858 3311534
39860 3311534 2898454 2566520 2710971 2519109 1481256 289708 -278435 -475622 -923754
39851 -923754 -1469972 -1435958 -689132 208076 823835 1246805 1561409 1447498 668532 -288934
39841 -288934 -563046 2673 538251 191691 -822575 -1628673 -1880883 -1970157 -2159138 -2214894
39831 -2214894 -2008247 -1813092 -1787124 -1758361 -1758123 -2113012 -2704550 -2831218 -2207146 -1397817
39821 -1397817 -819243 -128215 752522 906489 -272811 -1744129 -2000165 -1182397 -755725
39812 -755725 -1263413 -1724711 -1370547 -721815 -539507 -719241 -765904 -617692 -478216 -381219
39802 -381219 -348637 -527607 -825647 -808405 -249848 531677 1043140 1008558 385686 -565774
39792 -565774 -1238085 -1215506 -858876 -791411 -867162 -399222 546782 971382 325157 -724141
39782 -724141 -1266335 -1163518 -717771 -77128 532348 654334 246659 -63388 137557 465172
39772 465172 521581 631272 1167973 1717523 1649171 1099900 664157 441855 106312 -356478
39762 -356478 -682236 -907601 -1270343 -1687317 -1894873 -1904350 -1771102 -1210043 -111500 842022
39752 842022 884397 346597 282306 936936 1461790 1277941 854720 809267 992248 946557
39742 946557 705048 606638 714550 924213 1369623 2208126 3126633 3531349 3262435 2784766
39732 2784766 2577659 2580245 2393798 1888229 1394849 1287492 1556562 1910270 2142657 2193810
39722 2193810 1968212 1430291 885909 796398 1182528 1530379 1434073 1012088 541716 74928
39712 74928 -348674 -512904 -367414 -194154 -118321 115151 485815 342690 -661304 -1692416
39702 -1692416 -1605594 -525752 229515 -195466 -1318288 -2146475 -2210684 -1654252 -935358
39693 -935358 -660187 -1177623 -2080714 -2501006 -2066985 -1221573 -533932 -136836 79809 201192
39683 201192 349914 593987 717064 521216 344989 678311 1225182 1110034 236526 -361368
39673 -361368 56104 898365 1196429 934159 722168 664825 391931 -51828 -157989 272784
39663 272784 955967 1673082 2409774 2992318 3192982 3225035 3539441 4022909 3974565 3096262
39653 3096262 1995021 1384361 1201080 930267 537402 564649 1282382 2149367 2360709
39644 2360709 1793114 1149081 1105035 1504173 1573585 845771 -377369 -1456967 -2018123
39635 -2018123 -2044092 -1690244 -1224795 -954584 -995177 -1236972 -1631716 -2254844 -2934809 -3185955
39625 -3185955 -2844401 -2463269 -2619185 -3028131 -2885923 -2030400 -1214079 -1112158 -1527576
39616 -1527576 -1795231 -1620211 -1234746 -921723 -657088 -228269 380872 782194 515179
39607 515179 -315289 -976511 -955855 -633913 -693583 -1073663 -1136007 -815128 -813287 -1414487
39597 -1414487 -1870434 -1473339 -626343 -171477 -86442 349519 1280983 1980111 1882039 1240874
39587 1240874 606215 245112 293030 888507 1775408 2202435 1678051 619456 -89232
39578 -89232 -33447 466857 796489 471932 -619710 -2002325 -2727816 -2103235 -376900
39569 -376900 1467385 2562209 2687320 2148270 1415916 812365 318770 -255244 -806958
39560 -806958 -912408 -513691 -288004 -855787 -1863483 -2427565 -2324857 -2074523 -1935921
39551 -1935921 -1655641 -1308340 -1453779 -2050440 -2066672 -835005 846071 1705117 1601917
39542 1601917 1351648 1345939 1262347 958163 710426 527244 72258 -559055 -759678 -371123
39532 -371123 -33482 -230647 -590435 -552776 -219560 -47897 -81328 -9728 236180 439941
39522 439941 551641 785049 1264816 1835444 2220388 2223701 1829302 1199513 498330 -277361
39512 -277361 -1081997 -1487612 -1022663 -10918 438274 -311187 -1558061 -2165719 -2002995
39503 -2002995 -1798496 -1709010 -921592 1013011 3166028 4156636 3719291 2706277 1723492
39494 1723492 555403 -877574 -1766779 -1278092 174553 1243599 1214697 631843 285374
39485 285374 275197 376962 641323 1053377 1136053 642081 292208 969824 2310079 2949685
39475 2949685 2223177 807896 -408877 -1218240 -1586088 -1199643 -100917 916399 1195136
39466 1195136 1013358 936433 886687 515107 49637 -1891 267690 323439 73258 -95214
39456 -95214 -56943 -50167 -82274 92709 385838 431923 332816 672741 1554935 2199353 1847815
39445 1847815 686832 -411700 -754712 -228372 799709 1695178 1963528 1746143 1718082
39436 1718082 2252113 2894216 2945978 2381664 1827592 1699709 1770969 1725111 1769192 2296617
39426 2296617 3055410 3178968 2293086 1177243 836423 1162396 1170089 493427 -178334 -369774
39416 -369774 -622026 -1434216 -2176187 -1964951 -1129661 -741295 -897476 -620608 426191
39407 426191 1238800 945990 97957 -172392 333593 919362 1184507 1439437 1992249 2611978
39397 2611978 2864851 2683811 2442492 2557075 3072006 3618512 3782679 3484534 2958755
39388 2958755 2456838 2062993 1669405 999047 -139171 -1392676 -1925096 -1311116 -160615
39379 -160615 602246 884273 1279580 1931922 2281508 2029251 1642310 1647703 1986584 2305020
39369 2305020 2361211 1956762 1071086 313178 561850 1754033 2661086 2366679 1390124
39360 1390124 780350 674950 505794 194343 232701 704263 1057138 951507 688570 611689
39350 611689 557272 124423 -792064 -1890904 -2739812 -3151367 -3404625 -3981946 -4909935 -5515748
39340 -5515748 -5084703 -3675206 -2106149 -1238480 -1340748 -1912006 -2030163 -1239534 -254293
39331 -254293 -309114 -1543381 -2600479 -2289625 -1071384 -243894 -176636 -221382 -36118 24907
39321 24907 -196106 -330836 -211110 -129210 -157771 74352 659050 1098599 1027657 713489
39311 713489 548513 517117 426869 244518 7472 -174288 56098 889355 1633280 1162835
39301 1162835 -544715 -2022592 -1975514 -738783 473937 1186670 1786379 2461347 2872738
39292 2872738 2771340 2262235 1501061 671469 165578 238384 570862 701499 738405 1012042
39282 1012042 1174349 494135 -853863 -1669531 -1248906 -282575 232759 298612 501308
39273 501308 876435 1025708 1025346 1261895 1419770 635038 -1042727 -2230637 -1880201 -763065
39263 -763065 -501383 -1414014 -2181335 -1667406 -262632 892598 1344111 1424693 1356214 999540
39253 999540 469307 340835 972470 2000289 2793313 3144351 3193475 2889232 2015534 800073
39243 800073 21941 185358 836670 1104907 827938 687649 1157261 1799196 1896931 1403211
39233 1403211 856316 633421 746538 1141611 1639406 1752789 1240414 764539 1189741
39224 1189741 2155469 2288178 1151576 -8368 -60598 438759 371482 -94673 -5601 595751
39214 595751 812211 614619 933803 1875742 2273328 1497859 463844 147261 181645 -243387
39204 -243387 -995200 -1458264 -1674559 -2028357 -2318374 -2155129 -1911409 -2255630 -2941664 -3042115
39194 -3042115 -2319337 -1461524 -956020 -609002 -271820 -170296 -272609 -96650 530744
39185 530744 1162681 1498353 1860590 2536911 3178216 3293047 2937748 2500220 2129248 1771706
39175 1771706 1488954 1341759 1186390 955036 938525 1394416 1991240 2039056 1302110 328074
39165 328074 -89570 322156 1046084 1207724 392451 -893646 -1712315 -1682883 -1277518 -1090885
39155 -1090885 -1150778 -1126985 -869625 -416566 272348 1198447 2086526 2629354 2883394 3096317
39145 3096317 3242751 3105827 2768652 2608530 2737726 2800230 2422216 1574695 445439
39136 445439 -665400 -1191197 -508303 1289614 3069650 3599004 2839005 1972199 2044505
39127 2044505 2832932 3219673 2506631 1105972 -52802 -534357 -637562 -780122 -985217
39118 -985217 -1087180 -1145175 -1330611 -1523783 -1403107 -982385 -709132 -874457 -1231294 -1429685
39108 -1429685 -1547109 -1825012 -2055117 -1699797 -674169 387600 829250 673392 439368
39099 439368 491569 828155 1371294 2130009 3022982 3778309 4153356 4149665 3890060 3361889
39089 3361889 2466903 1364646 568322 470179 799773 818109 176407 -630521 -872345 -461774
39079 -461774 77169 393055 625738 893900 930180 498288 -144966 -543546 -617417 -640392
39069 -640392 -782974 -974507 -1104090 -1049850 -606937 269418 1201792 1732130 1911361 2162105
39059 2162105 2527663 2520051 1900270 1190018 1074992 1559622 2053760 2143300 1953140 1811699
39049 1811699 1833756 1860235 1664751 1225224 835850 813693 1024918 959437 488068 271560
39039 271560 1011814 2407911 3314882 3011815 1933772 1007886 624709 536331 511897 685644
39029 685644 1227153 1929442 2286315 1961205 1132332 327853 -120088 -378214 -721347 -917468
39019 -917468 -360381 1006514 2227871 2208796 950501 -483425 -1210371 -1283241 -1127355
39010 -1127355 -804113 -227226 331846 548758 644382 1050195 1542917 1395853 513255 -265590
39000 -265590 -298943 40075 134061 157602 690161 1638848 2284581 2315641 2177568 2356886
38990 2356886 2830982 3287317 3452819 3162833 2487041 1783757 1282378 749807 28140
38981 28140 -325541 346053 1624519 2299872 1959220 1454319 1526523 1808645 1604120 869554
38971 869554 -87304 -1149867 -2058698 -2264099 -1789808 -1548710 -2018619 -2282808 -1333886
38962 -1333886 257388 1078545 842186 405110 104107 -559509 -1528269 -1822009 -945660
38953 -945660 387873 1341939 1835443 1965371 1514014 562269 -241559 -600568 -1020350
38944 -1020350 -1783556 -2229303 -1734035 -736764 -16349 479993 1216461 1890982 1639575
38935 1639575 329161 -1128864 -1807400 -1565384 -836907 -118347 294123 425032 530198
38926 530198 733666 909115 1050353 1395199 1916016 2121817 1768020 1332684 1284255 1283319
38916 1283319 719235 -285997 -1048730 -1225245 -911598 -156521 873444 1500366 1183454
38907 1183454 467819 418970 1119367 1600937 1327643 813459 582255 477519 380388 705055
38897 705055 1607218 2417561 2488725 2058464 1702271 1451906 1072141 750648 821900 1113355
38887 1113355 1225535 1255039 1622194 2300831 2766607 2640204 1925147 721490 -799318
38878 -799318 -2168893 -2825739 -2600452 -1736354 -541054 657117 1371554 1237733 432370
38869 432370 -510428 -1239410 -1652344 -1615653 -1094041 -502928 -448792 -1040527 -1787217 -2178061
38859 -2178061 -2049725 -1453463 -547448 407801 1286412 2215669 3090830 3252168 2301473
38850 2301473 1069621 902821 1891307 2682875 2331384 1463366 1158088 1509849 1966493
38841 1966493 2367792 2786951 2852179 2178865 1217269 784355 903746 973343 986238 1603856
38831 1603856 2856445 3702544 3319713 2180565 1381447 1359223 1674957 1700785 1151278
38822 1151278 207477 -591621 -786987 -482726 -148710 59180 321226 468207 -17971
38813 -17971 -1011463 -1468396 -714331 544721 1150842 988164 827180 1047740 1373898 1695811
38803 1695811 2232124 2814302 2865494 2339187 1959338 2179841 2496314 2200261 1354628 588009
38793 588009 262444 270137 409716 541445 490314 164413 -228481 -318793 23074 505642
38783 505642 642190 189747 -540629 -871123 -415719 521729 1390358 2048709 2621794 2895436
38773 2895436 2469516 1572843 1085409 1471212 2193089 2505380 2373738 2241809 2287584 2333049
38763 2333049 2201453 1799553 1112596 422091 204902 494347 694424 364152 -215303
38754 -215303 -610760 -857546 -1020596 -724056 146816 773390 365763 -509259 -569643 360117
38744 360117 1230322 1469418 1656813 2231565 2644622 2342198 1687951 1251816 901462 287964
38734 287964 -339897 -489881 -150303 428064 1209521 2046110 2405396 2165620 2217960 3392187
38724 3392187 5079497 5854631 5317788 4369112 3683738 2947288 1844645 848157 512665
38715 512665 660727 784473 747059 622142 312358 -166102 -409618 -153254 250100 378938
38705 378938 452779 918588 1603892 1974301 2091090 2528178 3269551 3476496 2653122 1386484
38695 1386484 512942 109685 -179016 -322175 -93940 236297 160051 -258027 -555580 -778545
38685 -778545 -1353277 -1965177 -1573277 -8764 1356316 1301378 398949 14267 238499
38676 238499 61776 -634931 -736024 139787 704178 -125804 -1416908 -1400679 86682
38667 86682 1511534 1815515 1567191 1773488 2499321 3149516 3487150 3772582 4172546 4525488
38657 4525488 4611566 4326123 3641224 2689791 1902443 1783667 2383194 3109445 3281321 2899546
38647 2899546 2677476 3156065 3964824 4271034 3889570 3507703 3697395 4175557 4337603
38638 4337603 4087698 3690982 3187980 2594171 2441795 3315897 4797669 5638514 5246171
38629 5246171 4334985 3753904 3351113 2587213 1706149 1434165 1729783 1736870 1107650 575587
38619 575587 805666 1267713 883820 -448143 -1618047 -1649834 -777261 68727 465122
38610 465122 744354 1161998 1362822 957935 336254 448431 1725991 3506397 4677517
38601 4677517 4702911 3840932 2545822 1034914 -452964 -1324722 -1014455 237302 1373285
38592 1373285 1624628 1440267 1880314 3131256 4193275 4248115 3728771 3495066 3412937
38583 3412937 2592428 947902 -348625 -223803 1161548 2965627 4718706 6309360
38575 6309360 7413300 7614797 6941452 5813760 4638725 3837681 3937448 5013111 6236368
38566 6236368 6677639 6520897 6803872 7928888 9170916 9807368 9927552 9766224 9052654
38557 9052654 7703424 6583397 6714576 7929593 9033358 9220302 8696597 7970516 7266277
38548 7266277 6794912 6913814 7595211 8133513 7815140 6738907 5714120 5440453 5929450
38539 5929450 6614835 6925630 6841725 6882275 7394244 7961716 7873408 7144682 6581137 6686091
38529 6686091 7032271 7040055 6888933 7132370 7716039 7986138 7602874 6942031 6560104 6651718
38519 6651718 7082039 7636019 8176399 8758683 9542303 10412152 10896716 10773950 10519318
38510 10519318 10722267 11301697 11858195 12555297 13859034 15485712 16564480 17031730 17885073
38501 17885073 19612283 21293941 21949859 22005673 22591115 23994138 25736063 27702837 30177454
38492 30177454 33060371 36137463 39960379 45309211 51744614 57885627 63415297 69683294
38484 69683294 77827926 87370708 97432107 108459225 121747141 137741835 155762839
38477 155762839 175111192 195465975 216056877 235044136 249927926 258530149 260105013
38470 260105013 256172663 250109297 245254769 243254817 244326503 248535591 255968969 265781180
38462 265781180 275884030 283735764 287009078 283775882 273081477 255737926 234002635
38455 234002635 210223715 186185910 163577200 143962976 127734437 113826237 101126288
38448 101126288 89664801 79904144 71535360 63830173 56766970 50855426 45984114 41364459
38440 41364459 36724767 32764864 30130641 28495701 26954958 24920731 22408480 19832838
38432 19832838 17770620 16587667 16030710 15424058 14450563 13468372 12878010 12505213 11913578
38423 11913578 11093298 10479694 10362744 10555236 10645062 10404311 9946157 9566797 9409703
38414 9409703 9274006 8857143 8175291 7544329 7113850 6686266 6107713 5545824 5169472
38405 5169472 4815626 4273234 3715151 3498158 3602754 3612988 3308757 3033506 3349588 4411637
38395 4411637 5737265 6596156 6658869 6233800 5778880 5324090 4700209 4236295 4592078
38386 4592078 5637717 6153984 5252501 3647131 2770384 2936667 3287650 3429377 3992732
38377 3992732 5253085 6256046 6060679 5153486 4757672 5124786 5376022 4888427 4024766
38368 4024766 3427946 3274601 3406014 3653035 3811192 3733886 3657826 4020834 4728258 5028504
38358 5028504 4446444 3463834 2859574 2708487 2592786 2581818 3224408 4423538 5061418
38349 5061418 4266217 2619724 1489930 1371699 1535281 1268193 734387 392448 257415
38340 257415 192133 357198 741938 690499 -287872 -1445494 -1438646 -96377 1326141 1887533
38330 1887533 2067776 2672399 3469553 3718044 3517254 3696154 4519706 5311386 5390934 4749593
38320 4749593 3729522 2615056 1695453 1259472 1311527 1563037 1767929 1815595 1582120
38311 1582120 1093339 768668 991521 1415124 1262390 455342 -130473 184821 984279
38302 984279 1357192 984595 227337 -502913 -981167 -1019127 -593908 -74370 75218 -179761
38292 -179761 -491388 -639652 -686634 -651650 -384583 132105 626601 879443 1086819 1646186
38282 1646186 2532343 3078513 2636222 1477715 723591 1103589 2019264 2266095 1574315
38273 1574315 856065 817191 958176 375875 -875223 -1778603 -1551253 -396159 858801
38264 858801 1490041 1290689 621150 110234 99902 390782 648975 867358 1164322 1337302
38254 1337302 1034304 311376 -363819 -656696 -580841 -228159 298078 693484 693398 603862
38244 603862 1060662 2010323 2448480 1614575 80131 -876814 -755108 -128854 398499
38235 398499 837615 1264301 1303998 652412 -258420 -658798 -372878 118758 479563 866369
38225 866369 1413265 1899481 2174084 2438523 2732855 2566869 1623610 559344 394428
38216 394428 1105946 1503517 710139 -808377 -2002949 -2511367 -2697203 -2780221 -2523892
38207 -2523892 -1731983 -598821 517019 1410658 2085473 2665990 3248288 3718195 3812369
38198 3812369 3498881 3132101 2991042 2800334 2032661 666227 -666605 -1367387 -1485669
38189 -1485669 -1516002 -1699245 -1679324 -915266 584732 2068220 2725383 2499547 2000017
38180 2000017 1694117 1560441 1557420 1917231 2717477 3600822 4262814 4811087 5232817 4956419
38170 4956419 3579022 1757321 661664 624463 982669 1209877 1454912 1824403 1893205
38161 1893205 1339597 544815 86290 -62265 -405361 -1160805 -1953192 -2226779 -1781736
38152 -1781736 -929215 -180810 246362 545645 866263 1002356 842041 826250 1369975 1976157
38142 1976157 1698608 570393 -268646 -185853 56060 -378754 -945275 -490770 958845
38133 958845 2187371 2425221 2031726 1484139 687357 -319065 -842707 -443735 189231
38124 189231 111024 -368552 53249 1773465 3472343 3689154 2657953 1900214 2254517
38115 2254517 3070361 3382633 3106783 2704183 2289351 1712001 1224372 1367338 2154634
38106 2154634 2872789 2848884 2140084 1393971 1238168 1785141 2505332 2650222 2059680 1453002
38096 1453002 1613814 2412430 3028594 3039406 2803651 2779360 2962437 3081601 2899941 2233727
38086 2233727 1109673 9673 -445603 -139060 584916 1546671 2781999 4008446 4750189
38077 4750189 5133560 5862288 7193925 8642173 9924330 11398530 13199311 14810115
38069 14810115 16074876 17841663 20857623 24637881 28145400 30985966 33165521 34313617
38061 34313617 34140429 33218844 32293417 31122543 29007148 26198245 23678882 21648258
38053 21648258 19332138 16386827 13475664 11247984 9632274 8371031 7456778 6802713
38045 6802713 6191542 5718244 5590091 5431652 4632010 3487501 3031346 3477259 3837667
38036 3837667 3480871 3040833 3192840 3485827 3167101 2380174 1696678 1105390 357023
38027 357023 -205484 -88856 440283 766880 960974 1512902 2230131 2324125 1612607 840579
38017 840579 688638 1077324 1504849 1489859 675243 -857671 -2293170 -2728174 -2257257
38008 -2257257 -1827547 -1883517 -1833516 -1149404 -316186 -154790 -650211 -1037966 -817317 -167052
37998 -167052 481426 774847 425841 -574715 -1625946 -1876878 -1178455 -352279 -225196
37989 -225196 -663144 -920409 -727694 -515149 -581984 -638051 -398149 -96812 16073 259752
37979 259752 990840 1734010 1565193 359312 -1023890 -1924484 -2581297 -3381263 -4061458
37970 -4061458 -4123346 -3557731 -2647999 -1446410 -21723 1057721 1143327 356647 -485991
37961 -485991 -782723 -571910 -142276 278995 445517 223659 -48291 234402 1166283 2094258
37951 2094258 2379510 2119641 1862844 1837433 1802540 1579117 1368708 1415059 1576894 1484730
37941 1484730 1067264 654419 491148 446037 405664 611519 1140713 1295667 253436 -1570172
37931 -1570172 -2552763 -1677415 229722 1543344 1640705 1104066 571975 161704 -136744
37922 -136744 -257622 -332637 -622489 -1094320 -1478166 -1711668 -1876947 -1762248 -1039058 87817
37912 87817 935278 1139420 945912 676052 414784 277347 415521 634516 562304 337119
37902 337119 516370 1097463 1287191 584000 -519221 -1315700 -1772840 -2138447 -2216727 -1696656
37892 -1696656 -854963 -324063 -405108 -1083905 -2341749 -3839903 -4679505 -4283595 -3343606
37883 -3343606 -3085541 -3653536 -4017686 -3501299 -2544799 -1784395 -1251477 -878136 -997521
37874 -997521 -1717304 -2352441 -2166504 -1351481 -670892 -398392 -225528 -21222 13472 -67776
37864 -67776 112946 571369 757736 311229 -413887 -897932 -1180579 -1624925 -2163838 -2258930
37854 -2258930 -1659239 -866182 -674768 -1381541 -2539374 -3396581 -3482761 -2828576 -1775592
37845 -1775592 -708856 19519 99481 -527678 -1404537 -1739516 -1103680 64928 800395
37836 800395 486467 -627681 -1693883 -1953436 -1289881 -306612 174282 -113713 -596994
37827 -596994 -513398 184570 823994 927291 797919 991087 1470714 1651514 1218514 558210
37817 558210 248383 327306 277498 -298915 -1168239 -1727702 -1693033 -1348013 -1080499 -874077
37807 -874077 -420826 409281 1428774 2350929 2900383 2829876 2178200 1451904 1141622 1072296
37797 1072296 712991 138388 9022 383875 342779 -660457 -1771370 -1891609 -1363493
37788 -1363493 -1458215 -2390263 -2995825 -2541972 -1746633 -1508606 -1558795 -1143412 -421284 -280826
37778 -280826 -1018026 -1998326 -2609564 -2875075 -2984309 -2772447 -1998300 -863544 86966
37769 86966 570562 870542 1410727 2084579 2244370 1532671 522473 159432 626978 1213500
37759 1213500 1356331 1281661 1376539 1467445 1168855 557780 -11711 -496908 -1053430 -1544542
37749 -1544542 -1708692 -1681002 -1796898 -1962893 -1790252 -1301549 -883918 -541241 84048 798582
37739 798582 757108 -333804 -1596631 -2105908 -2053508 -2147836 -2362163 -2136367 -1542029 -1273739
37729 -1273739 -1448129 -1329163 -533045 266866 280429 -347843 -908198 -1051765 -833038 -287067
37719 -287067 392856 581390 -154929 -1303712 -1938151 -1888192 -1679551 -1403797 -556453 821731
37709 821731 1757501 1567812 769069 261672 239448 448715 859742 1351562 1316468 476720
37699 476720 -329360 -153721 572701 629341 -85209 -442897 39073 480376 173084 -357872
37689 -357872 -459006 -447199 -752857 -848357 -91838 936169 1055443 184450 -588222 -554803
37679 -554803 -129894 1347 -288366 -734341 -1065849 -1049607 -582232 144912 865257 1558015
37669 1558015 2237069 2621140 2460665 1999203 1608597 1177609 438243 -332587 -637801
37660 -637801 -602746 -706035 -827087 -509100 -115374 -569210 -1702178 -2052782 -872755
37651 -872755 714379 1294660 968445 673704 536448 59348 -559277 -551922 122559 723401
37641 723401 976775 1349247 1939344 2101284 1527227 857886 731586 888975 759210 421522
37631 421522 396266 796215 1225155 1355504 1177753 791575 319005 -38931 -159134 -170602
37621 -170602 -246683 -289526 -34907 578445 1311778 1827408 1857294 1319680 466276 -220690
37611 -220690 -511531 -703691 -1181365 -1835656 -2239111 -2300563 -2333708 -2442756 -2276545 -1585008
37601 -1585008 -670262 -22560 215654 131072 -335562 -1198182 -1985614 -2030801 -1332987 -710838
37591 -710838 -835819 -1403903 -1588167 -1130623 -596933 -549210 -814208 -742925 -22721 951163
37581 951163 1471328 1175836 325511 -482299 -825564 -709871 -412670 -210147 -282624 -726270
37571 -726270 -1476362 -2236829 -2629696 -2454145 -1758137 -741180 270093 854539 815654
37562 815654 533112 676801 1359110 1837464 1394932 345314 -281627 -36493 472966
37553 472966 567686 423459 550754 739535 267502 -832540 -1449944 -705872 904841
37544 904841 2144993 2465668 2263502 1934925 1378619 551794 -75356 20230 784416 1676876
37534 1676876 2192456 2124836 1568599 900280 576396 725712 1066848 1359589 1710181 2234224
37524 2234224 2670566 2630775 2073693 1260810 406648 -327342 -666371 -453716 -8715 108707
37514 108707 -271389 -796272 -1083779 -1092446 -1016485 -1071897 -1371240 -1756928 -1796127 -1224027
37504 -1224027 -356642 250558 527106 905687 1593154 2229312 2413095 2229964 2061847
37495 2061847 2111030 2270749 2271435 1842380 924734 -182049 -1067265 -1642193 -2104018 -2446198
37485 -2446198 -2302399 -1390774 107131 1681009 2813284 3208739 3009531 2751692 2744647
37476 2744647 2553103 1607419 335755 -6215 1079210 2528429 2936995 2118147 997855
37467 997855 397834 467090 984774 1604751 1926167 1817758 1606759 1603968 1621914 1323337
37457 1323337 791651 294760 -276117 -1160776 -2051566 -2262359 -1611473 -672280 -119435
37448 -119435 -213016 -860663 -1717403 -2246512 -2166357 -1850427 -1825754 -1923513 -1524377 -698874
37438 -698874 -400685 -1211059 -2445683 -2937552 -2342903 -1273422 -424320 -13240 43138
37429 43138 -190439 -699849 -1362517 -1837705 -1718339 -927800 113719 913489 1385235 1633503
37419 1633503 1447694 531240 -774596 -1601951 -1599284 -1339488 -1392888 -1486483 -1015685 -18410
37409 -18410 873474 1264269 1316337 1326034 1365114 1335172 1093280 522730 -312005 -1091858 -1475989
37398 -1475989 -1394827 -1065775 -827549 -957722 -1398018 -1598140 -987938 208139 991314
37389 991314 703895 -217339 -934959 -1266215 -1531113 -1664453 -1211575 -206686 615274
37380 615274 700210 292110 -63092 -221939 -352309 -450165 -326973 27965 373764 517618
37370 517618 508188 489119 464596 295574 -58880 -374126 -375702 -134129 -23835 -146483 -30400
37359 -30400 801078 2105694 3129704 3486975 3431289 3224852 2721266 1840523 1084398 1127949
37349 1127949 1966447 2812255 2924122 2374311 1912645 2127050 2789137 3070486 2438407
37340 2438407 1239287 236446 -327500 -862610 -1580588 -1984848 -1579438 -762601 -450358
37331 -450358 -885851 -1428780 -1665395 -2087688 -3198536 -4394350 -4462965 -3124991 -1407667
37322 -1407667 -337016 128558 540042 925390 938127 714407 825465 1353860 1663540
37313 1663540 1290929 565773 108521 162757 705547 1738694 3008302 3791382 3547217
37304 3547217 2659049 2030130 1999268 2113189 1930593 1544012 1235507 1094530 1132780 1358166
37294 1358166 1539057 1275296 532779 -235000 -732111 -1214235 -1914356 -2437280 -2216012
37285 -2216012 -1391862 -737873 -721245 -1052400 -1203461 -1015492 -704394 -556256 -718533 -1072097
37275 -1072097 -1255664 -1031875 -631653 -454774 -425986 -43412 806016 1504474 1462345 876953
37265 876953 366196 120592 -122005 -432026 -566311 -497717 -538857 -773545 -813338 -392090
37255 -392090 142073 258835 -71975 -476316 -776443 -1094515 -1415551 -1473985 -1196776 -927423
37245 -927423 -970509 -1108802 -885468 -355821 -231970 -1019535 -2140507 -2334730 -1130548
37236 -1130548 434962 998183 561598 363068 1030932 1690269 1361041 515580 395096
37227 395096 1170249 1793247 1638778 1268438 1278374 1310655 787951 -41914 -490362 -433843
37217 -433843 -281354 -258374 -385994 -912024 -1977095 -2889095 -2521091 -685260 1427910
37208 1427910 2450372 2087425 987064 -174152 -1106546 -1705466 -1883383 -1630046 -1081171
37199 -1081171 -542619 -439425 -1022708 -2009738 -2712332 -2700194 -2232370 -1926135 -2129718 -2705472
37189 -2705472 -3232261 -3253985 -2510906 -1197240 38684 566849 325073 -154455 -261715
37180 -261715 166615 752219 919972 390864 -574158 -1406381 -1707155 -1482492 -991546 -522998
37170 -522998 -303651 -393204 -546927 -356045 281817 893742 808928 -152541 -1435774 -2245438
37160 -2245438 -2313323 -2168064 -2543974 -3467825 -4110728 -3745467 -2675829 -1852592 -1642043
37151 -1642043 -1463733 -755736 218852 828873 896595 635218 115699 -647656 -1248947 -1114296
37141 -1114296 -219980 828358 1460643 1523357 1043766 101730 -971455 -1710174 -1990928
37132 -1990928 -2046637 -1938742 -1474523 -792147 -495249 -889568 -1524793 -1838468 -1823554 -1667912
37122 -1667912 -1228606 -464257 6377 -444088 -1400413 -1780713 -1263203 -595195 -391939
37113 -391939 -418473 -336933 -380807 -752589 -952810 -397098 627460 1267654 1182562 723937
37103 723937 154884 -664507 -1716595 -2513345 -2634611 -2264999 -1918532 -1795363 -1657109
37094 -1657109 -1306358 -993239 -1197383 -1979504 -2707295 -2666987 -1931141 -1312919 -1375624 -1836587
37084 -1836587 -2121724 -2096906 -1926598 -1616674 -1189765 -999781 -1272108 -1526830 -1113897 -229858
37074 -229858 301087 281712 430337 1225617 2176785 2596569 2491653 2233207 1840786 1142441
37064 1142441 350862 -30083 240760 986257 1836323 2361533 2220568 1478499 631720
37055 631720 122994 7799 183246 604744 1122641 1486234 1683385 1859147 1783763 1034348
37045 1034348 -45147 -365729 400146 1127663 821330 159542 440620 1541353 2149717
37036 2149717 1759367 1154222 930788 798027 525171 362261 149562 -825796 -2510611
37027 -2510611 -3642258 -3334564 -2280148 -1651748 -1561802 -1412645 -1111221 -1011943 -1092917 -1064566
37017 -1064566 -991160 -1034401 -902759 -347043 120602 -106420 -586933 -345320 566624 1069579
37007 1069579 709461 240391 251452 277155 -115747 -276646 573238 1880849 2265822 1341386
36997 1341386 169819 -181163 169371 392064 54372 -610092 -1198102 -1521293 -1624278
36988 -1624278 -1688067 -1861547 -2027319 -1822430 -1052761 -1992 836937 1246454 1307207 1055464
36978 1055464 458027 -232920 -464628 31968 828282 1215111 960753 479192 317150
36969 317150 643211 1182837 1470874 1170224 301298 -758557 -1503509 -1555317 -854463 183495
36959 183495 795798 538172 -123341 -310323 52462 60346 -823515 -1830771 -1858366 -913172
36949 -913172 91510 610611 748980 549689 -52906 -607081 -390481 571161 1479656
36940 1479656 1833758 1772850 1385207 636973 52484 325293 999921 782184 -397756
36931 -397756 -1008542 -344218 139310 -858251 -2131146 -1645317 276560 1379517 749074
36922 749074 -282054 -602214 -819931 -1705598 -2705394 -2946173 -2640072 -2540661 -2738541 -2832902
36912 -2832902 -2738898 -2561757 -2089316 -1108424 50598 855487 1234585 1433787 1450220 1083506
36902 1083506 406762 -228603 -606908 -790943 -903129 -936398 -725641 -85467 838220 1398039
36892 1398039 1016284 24296 -489959 102970 1253874 1958030 1857359 1329130 772350
36883 772350 209315 -462635 -1099674 -1289337 -729344 338565 1259502 1751647 2323810
36874 2323810 3482428 4727457 4989002 4060975 2895182 2305299 2084304 1722695 1316206
36865 1316206 1236101 1380168 1312709 880748 282256 -230494 -416402 -135905 338883 477347
36855 477347 235628 191137 597326 864530 491830 -37831 1722 365378 189252 -664983
36845 -664983 -1451846 -1663034 -1500406 -1161188 -440954 666396 1577725 1712554 1138446
36836 1138446 386699 -89746 -128627 149876 406074 424769 504702 1148816 2203092 2706968
36826 2706968 1934364 328218 -941768 -1177924 -581946 339768 1318385 2230037 2929644
36817 2929644 3435487 3961099 4439167 4287183 3131585 1629683 937548 1245442 1485096
36808 1485096 801275 -337835 -1024967 -1266196 -1606947 -1859374 -1322396 -209536 278617
36799 278617 -418975 -1499088 -2102474 -2452213 -3121063 -3925571 -4249368 -3946763 -3300591
36790 -3300591 -2506884 -1737017 -1284253 -1147342 -908621 -479881 -423835 -1009155 -1550561 -1330171
36780 -1330171 -586653 102938 759750 1458256 1540294 554494 -462463 39629 1985046
36771 1985046 3704762 4099379 3617183 3013312 2348136 1529640 791406 199184 -490713
36762 -490713 -1167643 -1374077 -1218368 -1370334 -1844065 -1784228 -938860 -346670 -856151 -1793430
36752 -1793430 -1927419 -1140432 -316364 -46711 -277351 -904788 -1864399 -2701485 -2770853 -2003835
36742 -2003835 -1076347 -696855 -901126 -1070204 -613780 301794 855946 654232 413170
36733 413170 988889 1977910 2193670 1501153 1048999 1390737 1582093 790196 -319978
36724 -319978 -729325 -627492 -678495 -490282 783565 2692081 3764120 3538078 3058955
36715 3058955 3148456 3307380 2752067 1619846 579576 -117075 -622756 -928918 -822944
36706 -822944 -252269 580893 1410729 2046728 2387689 2335532 1682669 276180 -1536720
36697 -1536720 -2882252 -3111446 -2427926 -1498945 -696960 -77308 222546 110361 -134800
36688 -134800 -215822 -322439 -713657 -1019793 -699582 -67720 9043 -496016 -615549 80731
36678 80731 712355 408373 -348390 -482429 28925 150188 -672278 -1742034 -2070777 -1559227
36668 -1559227 -894726 -585583 -498383 -297921 36022 329091 609259 1028952 1451928 1538906
36658 1538906 1335353 1312353 1585508 1590786 970524 318379 393479 906573 883452 140469
36648 140469 -440989 -245198 245205 260954 -239279 -781017 -1136854 -1426541 -1723278 -1932601
36638 -1932601 -1951450 -1775099 -1562249 -1584025 -1859869 -1939150 -1471817 -909188 -1008065 -1585755
36628 -1585755 -1539744 -412756 802660 937110 117670 -641068 -822729 -681466 -480280
36619 -480280 -226446 -26485 -11644 55911 482138 938488 680362 -404488 -1511764 -1888642
36609 -1888642 -1615060 -1156089 -572650 381888 1591357 2489602 2726551 2616609 2720643
36600 2720643 3110485 3287027 2849065 2018386 1371107 1252861 1679503 2593269 3789357
36591 3789357 4641964 4420272 3085539 1445615 330772 -109866 -172144 -35526 310412
36582 310412 853855 1508029 2069730 2156638 1557480 756647 592053 1116091 1332654 481168
36572 481168 -911935 -1756430 -1696447 -1107673 -276612 664232 1334922 1495919 1647075 2384751
36562 2384751 3267953 3228419 2129304 998610 571309 518760 392135 402157 794615 1250159
36552 1250159 1465051 1661729 1960695 1891229 1177190 436081 369205 736082 907626 1010753
36542 1010753 1618361 2564026 3044416 2868621 2675485 2773203 2631785 1837802 815808
36533 815808 180881 -38028 -70753 188663 866333 1492471 1316084 243306 -925118
36524 -925118 -1267596 -573477 556830 1251256 1038046 184529 -556367 -602807 -18481 588859
36514 588859 580116 -219217 -1382415 -2249745 -2522648 -2410939 -2129138 -1555151 -707946 -224764
36504 -224764 -706850 -1680124 -1992036 -1419317 -1077719 -1792511 -2789457 -2701602 -1374159 114387
36494 114387 906364 1032109 824653 544152 600011 1320103 2309737 2718395 2339133 1802823
36484 1802823 1499278 1051716 224822 -371042 -65812 887597 1704922 2053231 2069835 1759321
36474 1759321 1035936 169369 -443227 -854387 -1351635 -1752821 -1521610 -619728 307876
36465 307876 705329 591785 182209 -465115 -1199754 -1612106 -1447333 -952017 -559001 -398331
36455 -398331 -302935 -120017 187870 635518 1213942 1817117 2269779 2435740 2302529 1996385
36445 1996385 1676264 1364294 967321 533310 322834 460074 659243 518408 -13379
36436 -13379 -661752 -1193174 -1526578 -1607582 -1434379 -1129592 -792176 -419445 -131427 -174417
36426 -174417 -445724 -416852 55916 296624 -201003 -783145 -484547 424574 764680 237018
36416 237018 -225296 -33478 273552 199031 159538 600761 1160663 1364837 1350027 1259646
36406 1259646 752606 -166608 -684236 -401171 -181212 -762161 -1345990 -857378 59850
36397 59850 -142362 -1419492 -2079320 -1272289 1231 668510 907990 1131110 946682
36388 946682 -7779 -1130256 -1599041 -1405568 -969344 -367663 353049 689125 287832
36379 287832 -350636 -487961 -171043 -16222 -227391 -424020 -273182 204524 795891 1164865
36369 1164865 1009242 544223 503423 1171843 1748301 1278631 -1362 -902843 -750702
36360 -750702 23070 728173 1220750 1731855 2407686 3216277 3961234 4271544 3897439 3093707
36350 3093707 2390976 1929055 1365229 534647 -164304 -232938 333875 1080208 1519833 1438266
36340 1438266 1005529 715569 963280 1491712 1483596 487757 -843476 -1252870 -199759
36331 -199759 1500023 2494158 2258828 1465588 1016235 1017857 945586 582661 308733 392436
36321 392436 487626 150400 -468242 -855273 -890403 -945492 -1259080 -1576139 -1477746 -828051
36311 -828051 141026 991001 1333592 1148412 853719 878047 1201378 1516149 1724637 1946924
36301 1946924 2103391 1935371 1530088 1377013 1662124 1883285 1525122 852906 582629
36292 582629 839862 909419 164995 -1073293 -1867236 -1706751 -970640 -358960 -123621 2689
36282 2689 308047 809501 1415746 2047386 2454568 2202847 1142917 -227345 -1171825 -1465777
36272 -1465777 -1487756 -1581300 -1611392 -1230023 -356180 697881 1405684 1312225 414488 -626242
36262 -626242 -917135 -198061 865026 1398660 1173934 609024 168987 34956 183668
36253 183668 418442 350352 -300323 -1294377 -1996342 -1970069 -1265672 -143058 1158395 2296263
36243 2296263 2868394 2860810 2780032 2994033 3118589 2449008 934609 -663727 -1608511 -1830812
36233 -1830812 -1704363 -1564159 -1582500 -1742489 -1697176 -975491 371939 1584619 1975593
36224 1975593 1704108 1434560 1421043 1334967 872059 86717 -816907 -1564399 -1698895 -931358
36214 -931358 248367 801879 260009 -734462 -1243807 -1072704 -749835 -820901 -1480196 -2596014
36204 -2596014 -3690784 -4091519 -3536939 -2584486 -2074818 -2217460 -2481600 -2332635 -1767054
36195 -1767054 -1127160 -700537 -589495 -745586 -992037 -1089293 -839159 -135147 983955
36186 983955 2246964 3243413 3749757 3874871 3758185 3259621 2154054 578099 -892957
36177 -892957 -1623006 -1347236 -383707 483545 527579 -299030 -1326702 -1851557 -1737743 -1295404
36167 -1295404 -813542 -374192 81943 657563 1268621 1462384 827474 -315822 -1130545
36158 -1130545 -1359293 -1565339 -1918129 -1552331 78603 1879978 2261226 1300400 627977
36149 627977 1231369 2498149 3485639 3915376 3608306 2200343 115369 -1192841 -861720
36140 -861720 202797 600304 297832 326368 1066577 1825703 1965235 1573122 993776 406590
36130 406590 -24902 -146323 -74541 -51786 -1443 372483 1022388 1492393 1482906 1148880
36120 1148880 767499 390825 -83748 -689713 -1314591 -1787559 -2074602 -2346227 -2627348
36111 -2627348 -2428777 -1215165 595431 1677903 1251671 -8232 -981263 -1464681 -1840307
36102 -1840307 -1908152 -1082931 390397 1441664 1546863 1260955 1175781 1137336 836003 488494
36092 488494 475132 764305 1079786 1260354 1149440 522727 -522654 -1395452 -1536865 -954087
36082 -954087 -114485 439575 342562 -324976 -912836 -744365 110220 973714 1447762 1624443
36072 1624443 1469980 793816 -28326 -206137 245451 375939 -90978 -23556 1414331
36063 1414331 3235646 3900951 3399194 2782229 2163995 732976 -1356643 -2686484 -2488156
36054 -2488156 -1531604 -666890 238795 1256432 1528175 497243 -834208 -1027510 -121592
36045 -121592 621899 582128 329744 385191 450553 127351 -369227 -599005 -521373 -393119
36035 -393119 -346009 -325090 -250566 -72095 196553 431402 555837 765133 1356617 2241466
36025 2241466 2827568 2558199 1525440 471530 152871 647325 1283970 1355800 875862
36016 875862 413336 209761 -101895 -715107 -1116482 -819163 -234931 -158792 -599844 -854675
36006 -854675 -676697 -569844 -784863 -833077 -374192 83849 -118022 -884502 -1664859 -2232886
35996 -2232886 -2617246 -2618208 -2051116 -1285615 -897822 -827283 -460008 403243 1187135 1285684
35986 1285684 742454 25071 -520438 -783918 -727065 -347398 279682 1018882 1674378 2011849
35976 2011849 1947681 1699254 1568821 1588500 1544129 1304781 929985 493125 16761 -438515
35966 -438515 -814939 -1140079 -1388804 -1382516 -1069045 -754165 -728276 -798469 -587195 -177010
35956 -177010 29856 34873 249179 716970 944054 702384 429442 516966 715152 631417
35946 631417 382139 299618 328943 178155 -168744 -502785 -757519 -961950 -1025653 -913079
35936 -913079 -818285 -835167 -721702 -382040 -285505 -887626 -1842081 -2365729 -2294218 -2200403
35926 -2200403 -2458450 -2729324 -2472572 -1538489 -184008 1093413 1701972 1393444 657647
35917 657647 261763 305200 177762 -445536 -1120715 -1395675 -1496504 -1795817 -2018899 -1596060
35907 -1596060 -634624 87538 169298 101373 494133 1191276 1552138 1406023 1216854 1264236
35897 1264236 1211701 828094 666787 1357639 2404271 2521019 1348963 44086 -279448
35888 -279448 23682 -89171 -759500 -1324888 -1628961 -2177651 -3029539 -3531057 -3345626 -2879119
35878 -2879119 -2402522 -1569752 -228996 979515 1342204 886491 80906 -753544 -1336875
35869 -1336875 -1329733 -891930 -848466 -1677264 -2703094 -2921241 -2332173 -1835965 -2012791 -2611264
35859 -2611264 -3102421 -3170127 -2740314 -2042141 -1580064 -1600573 -1695243 -1367766 -812182 -591661
35849 -591661 -695861 -549194 65140 692279 858926 490905 -344975 -1513849 -2537469
35840 -2537469 -2874564 -2672698 -2655213 -3016854 -3037553 -2173365 -987854 -471603 -788518 -1231516
35830 -1231516 -1222503 -870500 -617352 -714709 -1027093 -1099323 -521883 517867 1205837 958769
35820 958769 204283 -81491 416902 1037316 1126024 891352 950407 1323356 1388093 862928
35810 862928 360940 629782 1472043 1890567 1364687 562831 518995 1373157 2278635 2416463
35800 2416463 1741976 805201 235180 415722 1229650 1947835 1729907 510193 -819139
35791 -819139 -1335620 -1047400 -755484 -1122305 -2058358 -2875633 -2848098 -1749426 -50325
35782 -50325 1466670 2388181 2848887 3008324 2705085 1889034 1043688 693614 670492 422541
35772 422541 895 89121 880658 1574458 1422619 793508 605383 1007357 1311831 1142362
35762 1142362 914081 1028384 1268451 1325514 1331436 1381490 1028069 -93284 -1456241 -2193791
35752 -2193791 -2270865 -2300048 -2260952 -1412082 246016 1443486 1256679 473758 460126 1193293
35742 1193293 1461959 779063 3402 -35450 441189 814817 939471 954381 884528 860233
35732 860233 1164587 1619846 1487637 507361 -491588 -656337 -339326 -487738 -1117952 -1304945
35722 -1304945 -626527 301536 898727 1352621 1872466 1967266 1141315 -123197 -780865
35713 -780865 -458688 296273 900319 1266286 1422272 1223851 737670 457519 714774 1115242
35703 1115242 990646 312846 -255021 -237533 121747 357195 458826 748712 1274807 1696483
35693 1696483 1770040 1638016 1524614 1376288 1007948 494822 171709 185744 225929 -136084
35683 -136084 -891531 -1577519 -1853626 -1866530 -1867012 -1689841 -987654 73870 796313 755715
35673 755715 252962 -227996 -606213 -936659 -958167 -412953 408362 966286 1187503 1363048
35663 1363048 1455294 1140449 543312 221033 230331 -82082 -985180 -1710745 -1487243 -773952
35653 -773952 -741693 -1682519 -2598264 -2442985 -1305962 -218008 -61585 -756763 -1348505
35644 -1348505 -916284 423331 1487827 1206475 -253699 -1744100 -2372279 -2190668 -1796658
35635 -1796658 -1690845 -2065510 -2796258 -3429474 -3437882 -2712924 -1692377 -887998 -402527 9742
35625 9742 540172 1092507 1387679 1252537 839254 505538 380218 161453 -429607 -1072789
35615 -1072789 -1075332 -258688 704480 1030029 646716 68465 -286017 -302011 98952 927894
35605 927894 1790224 2055979 1585406 919340 492184 58592 -663518 -1165062 -708057 370743
35595 370743 783252 -19006 -1063865 -1248258 -769953 -447573 -281412 231726 732247
35586 732247 285446 -877809 -1246233 -180450 956357 632717 -768256 -1684789 -1564230
35577 -1564230 -1198997 -1192298 -1227585 -913664 -417626 -26210 230648 296071 -2162 -543105
35567 -543105 -894912 -889874 -802336 -833324 -864667 -861468 -1038621 -1387271 -1433902 -764259 455487
35556 455487 1668923 2421320 2557417 2206623 1721056 1418850 1287227 1091975 730302
35547 730302 222552 -517366 -1464765 -2081492 -1675414 -291993 1215612 2133469 2430744
35538 2430744 2260659 1572569 565881 -80527 -20139 76272 -739378 -2395819 -3752333
35529 -3752333 -3849987 -2871816 -1851201 -1673566 -2352678 -3089042 -3025501 -2035695 -746263
35520 -746263 175753 557228 566226 382100 168449 79907 116571 218988 606282 1624914
35510 1624914 3034729 3877726 3484041 2352606 1610689 1762816 2366376 2810168 2965301
35501 2965301 3038983 3153268 3238139 3193837 3023489 2779838 2398154 1712781 788506 97770
35491 97770 85794 647504 1351475 2015858 2577053 2587221 1639439 318831 -204858 201479
35481 201479 397130 -210900 -711386 -329498 85200 -569300 -1645118 -1653467 -697751 -302689
35471 -302689 -898964 -1245895 -729015 -539987 -1717867 -3373207 -3976899 -3431064 -2653955
35462 -2653955 -1829645 -441085 1239044 2031236 1424287 302183 -238979 -106586 109770
35453 109770 112703 76299 161371 332535 601794 1072087 1610445 1723913 1040325 -116140
35443 -116140 -923872 -963104 -631338 -427059 -173014 533332 1324079 1281047 254880 -799376
35433 -799376 -1156803 -1283249 -1865956 -2467095 -2025356 -491231 937004 1331592 1040756
35424 1040756 877825 942506 774358 297179 -24977 88781 409772 728547 1233826 2028982
35414 2028982 2608629 2352135 1479106 945254 1196587 1547877 1217357 567009 645893 1597909
35404 1597909 2227335 1396633 -595160 -2335474 -2733503 -1885258 -707169 29169 322110
35395 322110 695248 1355097 1779214 1382777 423617 -192308 5127 603722 982348 938373
35385 938373 528753 -169443 -863362 -1058765 -595894 155586 838484 1416395 1733496 1356618
35375 1356618 290674 -660411 -786594 -323965 96794 392974 781195 1037606 847438
35366 847438 615348 999178 1734702 1885557 1329443 1001154 1368445 1622695 926951 -318142
35356 -318142 -1153162 -1409817 -1578954 -1720246 -1418567 -771040 -566625 -1220514 -2119554 -2390515
35346 -2390515 -1937348 -1335881 -966062 -720816 -521151 -618003 -1129896 -1585023 -1330788 -364527
35336 -364527 607381 1052559 1241362 1740619 2475450 2642549 1583550 -467401 -2560664
35327 -2560664 -3833458 -4128246 -3945179 -3850929 -3925679 -3803195 -3208679 -2310541 -1514938 -1092210
35317 -1092210 -1070359 -1279586 -1380263 -1075024 -468545 -15190 50642 -19443 25665 26501 -188502
35306 -188502 -328969 -36260 471286 667709 511248 433386 578974 601505 285143 -113188
35296 -113188 -281419 -240793 -218021 -448618 -1124101 -2160061 -2996479 -3040743 -2374489 -1653666
35286 -1653666 -1304607 -1232043 -1267532 -1336137 -1145207 -384159 559396 752034 -33146 -752099
35276 -752099 -245595 1376989 2879328 3157554 2114353 596683 -306624 -201545 245804
35267 245804 217081 -47466 395890 1603805 2457663 2298235 1834846 1816696 1813763 1224378
35257 1224378 574892 624691 886919 430038 -315316 -97241 977418 1429003 750144
35248 750144 173398 588967 1181813 982232 512902 783181 1550854 1781599 1267230 646674
35238 646674 177655 -411028 -1009378 -1123248 -838133 -877147 -1487914 -1996283 -1735846 -854687
35228 -854687 59264 661805 875210 650411 73471 -521454 -848995 -970919 -1106524 -1245135
35218 -1245135 -1119058 -546526 269410 793984 576039 -293955 -1184786 -1474857 -1029686
35209 -1029686 -70954 1174890 2392534 2932641 2195119 436063 -1174204 -1603268 -941923
35200 -941923 -171594 -95426 -677210 -1286543 -1320601 -605684 530647 1443929 1594334 993423
35190 993423 214776 -185672 -243540 -388954 -664601 -495833 458683 1496587 1474530 268744
35180 268744 -921580 -1013849 -334791 -46590 -619060 -1430936 -1726244 -1343317 -459909 758097
35170 758097 1970954 2588784 2305355 1534737 1026055 1149752 1743457 2480374 3121704
35161 3121704 3487098 3427556 2871004 1842559 545795 -510526 -704022 119802 1353998
35152 1353998 2161946 2256625 1959133 1613248 1286669 1033644 1023308 1206567 1190197 774590
35142 774590 422791 788286 1795183 2594321 2591664 2190247 2216553 2827671 3393754 3413994
35132 3413994 3089758 2836425 2648835 2293622 1833804 1501518 1195504 616198 -119109
35123 -119109 -555012 -710825 -1197990 -2170966 -2732886 -2023481 -575190 168030 -355531
35114 -355531 -1216146 -1314591 -656709 20340 343110 499116 638320 632435 401049 96841
35104 96841 -75703 -12248 277340 609497 684372 460608 387034 942216 1945241 2640104
35094 2640104 2544057 1948801 1465086 1293926 1113269 555549 -351556 -1173894 -1434994 -1030976
35084 -1030976 -286069 440733 1097117 1742623 2161631 2004842 1338675 729119 655293 1090774
35074 1090774 1766868 2534843 3251564 3576386 3194844 2138335 692504 -844215 -2119761
35065 -2119761 -2712131 -2523111 -2044764 -1834222 -1789889 -1376852 -572675 -75645 -345077 -844835
35055 -844835 -633583 471740 1678828 2103828 1551814 399127 -948313 -2226779 -3114448
35046 -3114448 -3245435 -2602564 -1715633 -1205891 -1146305 -1099817 -812585 -582764 -794450 -1343682
35036 -1343682 -1768852 -1770627 -1356980 -657689 101107 605655 805213 1113458 1823899 2445693
35026 2445693 2204218 1224715 549603 749585 1168231 959653 277677 -196996 -478563
35017 -478563 -1209829 -2473379 -3417304 -3224652 -1950284 -268097 1140000 1776957 1385778
35008 1385778 149870 -1376782 -2733579 -3768362 -4346260 -4222237 -3423801 -2433288 -1672249
34999 -1672249 -1024360 -197610 608105 794700 138763 -843107 -1433022 -1470813 -1443502 -1802711
34989 -1802711 -2242006 -1833756 -123660 1981688 2848478 1839462 45160 -1022944 -1115395
34980 -1115395 -1112988 -1477926 -1627000 -1009982 -100044 200677 -241906 -747215 -807575 -572835
34970 -572835 -313165 84655 783772 1439654 1388477 456458 -642707 -897617 26151 1491405
34960 1491405 2554257 2772024 2280769 1309725 -13780 -1356645 -2086749 -1803417 -816841
34951 -816841 171059 803203 1267431 1824624 2389814 2607196 2169396 1074201 -264314
34942 -264314 -1201594 -1374858 -1016724 -565040 -52096 796055 1898053 2699193 2841276
34933 2841276 2561116 2252428 2025443 1910382 2028853 2193295 1782794 554841 -751468
34924 -751468 -1247421 -1088927 -1113698 -1415823 -1168185 -21655 1199312 1644347 1565159 1686430
34914 1686430 1996472 1922952 1420741 1092971 1251668 1533297 1575856 1520630 1604807 1680977
34904 1680977 1464924 1030433 752447 804607 891483 531741 -386135 -1339836 -1589161 -946777
34894 -946777 16462 667749 981606 1255870 1437127 1228206 764236 585960 833625 1034166
34884 1034166 939096 1033002 1768969 2692325 2881626 2090625 947140 92107 -377583 -571051
34874 -571051 -419187 104735 676440 860011 612549 367485 574535 1200004 1719645 1653913
34864 1653913 1086390 508525 143325 -280710 -900982 -1227299 -736161 239786 814425
34855 814425 738813 638608 872426 837635 -111874 -1582353 -2601541 -2826030 -2622661 -2187437
34845 -2187437 -1375810 -393412 140786 22168 -304123 -540929 -868101 -1161296 -683348
34836 -683348 801435 2218120 2311030 1249369 316532 216185 491451 524138 279484
34827 279484 384 -90284 307109 1230729 1942133 1585806 539185 155299 791172 1117308
34817 1117308 59183 -1537841 -2173662 -1896170 -2024001 -3031247 -3960224 -3946555 -3251021
34808 -3251021 -2590078 -2329856 -2560574 -3155489 -3479225 -2776443 -1187110 234405 775120
34799 775120 714300 491375 -8087 -890394 -1666643 -1831801 -1566558 -1336922 -1215882 -1088687
34789 -1088687 -1072444 -1170262 -939662 -150224 588456 571925 117465 162386 849710 1293157
34779 1293157 839918 -97263 -663778 -508296 91714 638911 770502 533766 441465 963103
34769 963103 1878415 2427358 2159857 1344530 522622 26741 1047 472177 1194839 1740121
34759 1740121 1960331 2156813 2633026 3286440 3772008 3857323 3492609 2771114 2009892 1664283
34749 1664283 1880634 2166589 1744914 397709 -1053900 -1313388 78792 2021464 2838351
34740 2838351 2153017 1320162 1613021 2478771 2313135 695041 -1057485 -1613822 -1044212
34731 -1044212 -244537 240122 337881 48540 -461892 -759023 -649400 -458575 -377514 14676
34721 14676 1010686 2007108 2242518 2018925 2304151 3186560 3666919 3187319 2467319 2335394
34711 2335394 2465888 2009438 1028502 433458 569178 701860 178918 -557318 -628386 8094
34701 8094 598816 789588 1065780 1794687 2465663 2380787 1694056 1154389 1036469 987810
34691 987810 860561 967511 1380005 1641292 1426544 895999 154811 -943384 -2087294
34682 -2087294 -2397449 -1679361 -1090749 -1692463 -2884527 -3308983 -2883349 -2673419 -2896996
34673 -2896996 -2526578 -1221413 -267491 -789940 -2056326 -2535663 -1936558 -1181693 -859909
34664 -859909 -788321 -873888 -1325525 -1949108 -2147400 -1830021 -1579960 -1677939 -1643822 -1062945
34654 -1062945 -262762 219346 326147 221133 -162228 -750673 -884416 46544 1594899
34645 1594899 2527158 2240068 1425878 1094949 1292469 1128916 -31246 -1703424 -2702573
34636 -2702573 -2377032 -1342074 -864947 -1482438 -2419338 -2554997 -1756055 -877355 -536439
34627 -536439 -426823 -24044 545881 784813 642239 488503 367894 -125747 -1087464 -1918426
34617 -1918426 -2020277 -1544011 -1082158 -820615 -402343 434655 1493014 2455442 3215925
34608 3215925 3682572 3574134 2775263 1753787 1199399 1178978 1024743 267137 -644327
34599 -644327 -905913 -431747 123137 379465 721358 1549191 2501555 2813193 2195754 1014212
34589 1014212 -193031 -1008250 -1176301 -820884 -511547 -666429 -962619 -786765 -166945
34580 -166945 302265 416377 558182 819292 651757 -258068 -1367771 -1959700 -1968695 -1731976
34570 -1731976 -1397598 -1037395 -889630 -984295 -948536 -675843 -669629 -1099017 -1116317 -52045
34560 -52045 1162904 975658 -498554 -1442303 -840914 174516 50008 -1125106 -2068547
34551 -2068547 -2112968 -1673952 -1311062 -1169429 -1210846 -1286210 -968643 114831 1661677 2779112
34541 2779112 2829106 2003532 1030162 460313 270825 107227 -95829 112446 1055397 2185840
34531 2185840 2485138 1701603 679556 250942 345987 514139 695082 910303 749346
34522 749346 -33441 -750547 -519596 342495 614989 -18003 -418867 323510 1517835
34513 1517835 1895857 1420800 1126261 1353120 1173853 -127674 -1809583 -2550594 -2143712
34504 -2143712 -1551472 -1385322 -1158757 -323643 675288 990528 592817 208534 253337 547271
34494 547271 994029 1719330 2409790 2351151 1485488 709924 655547 827462 536827 71878
34484 71878 183091 851522 1415713 1658429 1908105 2178287 2070577 1590227 1276459 1356070
34474 1356070 1446780 1301912 1206730 1352154 1378123 895437 45092 -771520 -1359130 -1647623
34464 -1647623 -1494005 -891710 -153387 374213 631243 759475 900620 1163624 1551340
34455 1551340 1846712 1813221 1518322 1163567 658424 -176272 -983696 -1053265 -313757 436263
34445 436263 594351 512310 791650 1312181 1484205 1129815 584937 153436 -43260 149149
34435 149149 761746 1376392 1403347 743618 -103388 -594088 -590616 -328269 -164072 -302799
34425 -302799 -589908 -651948 -359390 31002 331148 725370 1351256 1869491 1854456 1431483
34415 1431483 1089697 944195 612876 -155640 -1086350 -1668400 -1588767 -884565 61354 674369
34405 674369 635838 261735 222988 802157 1552148 1713880 883425 -656091 -2097991 -2671934
34395 -2671934 -2254175 -1446705 -952297 -924288 -1020311 -952576 -793925 -816263 -1184524 -1741847
34385 -1741847 -2008135 -1568606 -624680 30509 -200762 -1105782 -1996271 -2420969 -2318627
34376 -2318627 -1773029 -1033531 -601060 -825922 -1435796 -1811833 -1696521 -1306586 -832831
34367 -832831 -246909 378134 767584 812060 767102 936912 1294194 1497783 1265123 781141
34357 781141 687713 1367582 2186108 1954178 464249 -968952 -1071009 -274957 -75620
34348 -75620 -1007516 -2165552 -2685384 -2766671 -3014180 -3550235 -4101789 -4342106 -3867628 -2460068
34338 -2460068 -700393 272560 23709 -627240 -667626 -52666 516403 487681 -233783 -1395950
34328 -1395950 -2395487 -2569009 -1890130 -1024626 -415365 180331 917207 1305132 1003858
34319 1003858 554027 558340 644199 148658 -521112 -278443 929902 1811571 1362183 7292
34309 7292 -1213611 -1937582 -2514127 -3197535 -3771959 -3845769 -3297959 -2507758 -2122969 -2383873
34299 -2383873 -2741424 -2458708 -1529592 -622840 -172159 5113 172586 307261 422804
34290 422804 744293 1284949 1661415 1643719 1553151 1765820 2058614 1804813 722006 -821891
34280 -821891 -2181848 -2953639 -3191804 -3218021 -3165657 -2761589 -1763031 -565031 -14343 -500329
34270 -500329 -1533483 -2357179 -2656803 -2506527 -2016393 -1376371 -971703 -1048749 -1388251 -1627073
34260 -1627073 -1775088 -2075404 -2449549 -2475164 -1954232 -1182206 -551394 -132000 224521 552468
34250 552468 719376 647269 451332 313467 241702 21965 -499422 -1095141 -1278240 -844427
34240 -844427 -168177 202013 184641 232953 754332 1602742 2229914 2306482 2119694 2265007
34230 2265007 2898146 3432116 3204010 2394784 1921793 2256689 2704992 2227374 774528
34221 774528 -643241 -1168324 -920128 -538615 -384165 -451240 -681190 -921684 -748471 220319
34211 220319 1791494 3259065 4020625 3916596 3053297 1699259 422321 -132657 92990
34202 92990 403184 130772 -633152 -1355659 -1791621 -1961964 -1683194 -786399 225644 472998
34192 472998 -89649 -354864 630440 2461275 3888320 4166380 3455466 2259356 1068674
34183 1068674 346579 209170 124651 -537207 -1640816 -2445359 -2592011 -2367692 -1973496
34174 -1973496 -1215575 -134641 718911 1024981 1162618 1474532 1541400 789393 -483063
34165 -483063 -1329642 -1301916 -814817 -400551 -130269 144082 431092 644522 687148 394143
34155 394143 -277133 -904136 -839145 -25256 750692 737440 124601 -291048 -187094 6904
34145 6904 -45053 38217 786596 1965909 2714502 2589368 2048644 1748479 1769770 1862330
34135 1862330 2094793 2686312 3288988 3094103 1872549 401416 -492280 -914337 -1496526
34126 -1496526 -2322278 -2825268 -2639807 -1966194 -1046237 132551 1358260 1934119 1392977
34117 1392977 269959 -314349 122704 927691 1121420 499456 -184716 -19226 1167537
34108 1167537 2640765 3440220 3266659 2694497 2465421 2652198 2690596 2209642 1548832
34099 1548832 1298434 1550601 1870722 1889939 1618922 1207645 728292 273356 -19233 -157953
34089 -157953 -267957 -282314 16841 506867 678803 376983 181663 593745 1164181 1037029
34079 1037029 170506 -660236 -1015935 -1200245 -1417253 -1328797 -802188 -384993 -503664 -755292
34069 -755292 -619841 -415798 -793814 -1555185 -1805095 -1264216 -670002 -707991 -1174100 -1465153
34059 -1465153 -1390874 -1167702 -998992 -1024505 -1402410 -2061329 -2530368 -2348806 -1562681 -567848
34049 -567848 402414 1309232 1923416 1853604 1092344 185896 -383008 -736580 -1240938 -1814266
34039 -1814266 -2012606 -1746767 -1446379 -1408231 -1429497 -1292645 -1146403 -1049578 -591044 486037
34029 486037 1615362 2030392 1846145 1762906 1797215 1223241 -78584 -1174845 -1418302
34020 -1418302 -1395488 -1899944 -2632472 -2706821 -2010783 -1268179 -983746 -1029760 -1129091 -1111105
34010 -1111105 -779204 -87483 610704 946348 1033601 1160724 1230714 1038942 857128 1113811
34000 1113811 1663555 1986573 1938325 1680728 1128945 247094 -328928 78450 982464 1159385
33990 1159385 391549 -215195 116025 870317 1301882 1465111 1625523 1517382 892813
33981 892813 139882 -330357 -733641 -1284686 -1490400 -849030 161933 610582 407897
33972 407897 361420 1020620 2056471 2774169 2810519 2341059 1883338 1815902 1933246 1700451
33962 1700451 1070950 669247 963401 1684460 2285501 2487585 2158770 1298408 489201
33953 489201 649822 1817967 2826972 2735647 1897153 1032835 94550 -1101870 -1924998
33944 -1924998 -1730967 -1047970 -828585 -1008102 -968578 -929154 -1501581 -2226035 -2085103 -1328802
33934 -1328802 -1167780 -1589993 -1209989 323743 1476851 1108032 90544 -261773 -47629
33925 -47629 24936 102698 530734 610507 -549693 -2401963 -3455207 -3168755 -2268585 -1385752
33915 -1385752 -488828 329622 538179 -69495 -957950 -1455432 -1380921 -999514 -716865 -828163
33905 -828163 -1257810 -1570403 -1441502 -959659 -296678 581898 1608484 2432720 2933287
33896 2933287 3495303 4332513 4968627 4919977 4455808 4066280 3614523 2763791 1868111 1543555
33886 1543555 1555495 1064046 -39083 -906077 -945469 -489204 -94831 118452 230613 227865
33876 227865 188447 299730 545914 772680 1042497 1434588 1581287 1047917 134867 -441959
33866 -441959 -694897 -1322381 -2335696 -2664141 -1612483 31981 928997 688510 -58159
33857 -58159 -596095 -626251 -254110 26076 -304352 -1026133 -1211149 -479461 225532 -274805
33847 -274805 -1847886 -3219372 -3500842 -2956645 -2337206 -2008091 -1818444 -1474431 -937980
33838 -937980 -559094 -717688 -1289735 -1740604 -1799758 -1602220 -1077588 90919 1549077
33829 1549077 2137638 1389895 468030 661765 1505661 1556588 698927 275036 877882 1474698
33819 1474698 1218755 819890 1228250 1939518 1737766 586721 -334791 -299161 242136
33810 242136 626823 829296 1088866 1309490 1197728 681809 -59247 -773577 -1183536 -1055625
33800 -1055625 -398270 504900 1335214 1910293 2101544 1783829 1020563 210465 -127965
33791 -127965 195345 808793 1044161 526880 -455003 -1240987 -1512336 -1626151 -2124864 -2985468
33781 -2985468 -3554744 -3300786 -2485947 -1912265 -1979855 -2163943 -1601949 -167601 1257054
33772 1257054 1675602 958641 -213780 -1172442 -1722520 -1920618 -1811884 -1474712 -1014168
33763 -1014168 -397980 442417 1276572 1669229 1551890 1364428 1421635 1475411 1189606 739178
33753 739178 574229 821300 1285649 1824896 2301727 2364302 1786953 955959 518548 551226
33743 551226 542569 217002 -107525 -42992 465282 1324839 2351882 3009635 2685241 1520924
33733 1520924 470749 220043 515255 826261 1037990 1050144 426464 -776005 -1402977
33724 -1402977 -456244 1326272 2224211 1800172 1269681 1461696 1679386 1178850 620149
33715 620149 990596 1813639 1671156 263738 -1193013 -1674023 -1416462 -1021294 -440894
33706 -440894 531621 1406102 1410599 576819 -179405 -73210 801987 1703901 1919461 1270083
33696 1270083 259365 -270523 112197 1013567 1757278 2242118 2884356 3744703 4271498
33687 4271498 4147586 3848677 3857987 3732174 2691821 1020244 14792 288867 880409
33678 880409 595830 -320494 -619625 115753 913079 781797 -59919 -653096 -531446 -106975
33668 -106975 -46927 -538411 -1071295 -878825 208617 1343726 1442036 465901 -470982 -431018
33658 -431018 373526 1170039 1637562 1852557 1694637 1023001 276564 203250 920843 1740933
33648 1740933 1994016 1626706 977877 415005 248923 564494 1014623 1143804 993141
33639 993141 1024460 1402223 1751767 1668194 1027310 -192789 -1761720 -2741180 -1983591 389336
33629 389336 2572694 2800943 1211304 -508835 -1023740 -353153 711039 1445661 1477205
33620 1477205 890949 254277 123837 404730 530370 327294 310245 979123 2144749
33611 2144749 3133448 3451822 3121846 2527626 2028563 1614217 940222 -159215 -1269097
33602 -1269097 -1743760 -1441804 -858842 -503373 -383234 -182972 237105 623824 585543 126665
33592 126665 -75758 750153 2387751 3492916 3012938 1507532 491012 628003 1269443
33583 1269443 1709453 2028684 2448365 2679971 2442030 2039034 1869363 1790504 1494163 1125788
33573 1125788 1001147 1047931 1051259 1096439 1184689 785839 -472942 -1915257 -2451475 -2032382
33563 -2032382 -1626830 -1723335 -1779294 -1410562 -1189432 -1674360 -2344299 -2252913 -1359802 -484263
33553 -484263 -108402 94424 509655 931239 890544 331239 -279624 -440650 -120364 226592
33543 226592 154199 -301181 -738516 -908038 -865850 -637636 -109646 603334 1056553 993854
33533 993854 654773 314366 -103028 -595130 -701972 -146495 439528 166428 -815168 -1417559
33523 -1417559 -1104733 -540558 -511916 -920905 -1268378 -1509290 -1833979 -2058197 -1911185 -1651318
33513 -1651318 -1698297 -1794760 -1258929 -107457 761561 705018 68704 -495462 -908466 -1436471
33503 -1436471 -1992110 -2204323 -2010690 -1700428 -1431524 -1129432 -852024 -817215 -960218 -846927
33493 -846927 -231169 592567 1222388 1675231 2171308 2584582 2520698 1918265 1166203 529502
33483 529502 -132262 -837880 -1079442 -426606 652253 1149548 744095 115334 -159317
33474 -159317 -429021 -1213196 -2075085 -1995945 -789303 553700 1054431 685878 -64517
33465 -64517 -916075 -1649969 -1805562 -1197987 -467260 -424308 -926688 -1047090 -388996 417076
$$ [...]
##END NTUPLES=NMR SPECTRUM
##END=
