##TITLE=31Pdec_B4e-K1
 CDCl3, 64 sc
 13.8.2024
##JCAMPDX= 6.0         $$ Bruker NMR JCAMP-DX V2.0
##DATA TYPE= NMR SPECTRUM
##DATA CLASS= NTUPLES
##ORIGIN= UXNMR, Bruker Analytische Messtechnik GmbH
##OWNER= root
$$ XWIN-NMR		Version 3.5
$$ Tue Aug 13 13:50:51 2024 Russian Standard Time (UT+4h)  she@DPX200
##.OBSERVE FREQUENCY= 81.013821
##.OBSERVE NUCLEUS= ^31P
##.ACQUISITION MODE= SIMULTANEOUS
##.ACQUISITION SCHEME= undefined
##.AVERAGES= 64
##.DIGITISER RES= 17
##SPECTROMETER/DATA SYSTEM= spect
##.PULSE SEQUENCE= zgpg30
##.SOLVENT NAME= D2O
##.SHIFT REFERENCE= (INTERNAL, D2O, 0, 198.062)
##AUDIT TRAIL= $$ (NUMBER, WHEN, WHO, WHERE, WHAT)
$$ ##TITLE= Audit trail, XWIN-NMR		Version 3.5
$$ ##JCAMPDX= 5.01
$$ ##ORIGIN= Bruker BioSpin GmbH
$$ ##OWNER= she
$$ F:/spectra/data/she/nmr/P31/2/pdata/1/auditp.txt
$$ ##AUDIT TRAIL=  $$ (NUMBER, WHEN, WHO, WHERE, WHAT)
(   1,<2024-08-13 13:49:53.42 +0400>,<she>,<DPX200>,
      <created by zg, POWCHK disabled, PULCHK disabled
       configuration hash MD5:
       00 E9 B6 7A A2 85 ED C7 34 08 36 98 17 FE 4E 26
       data hash MD5: 32K
       B2 7D 2E 17 5A A3 5A C5 89 E0 ED DA B8 88 A0 54>)
(   2,<2024-08-13 13:49:55.79 +0400>,<she>,<DPX200>,
      <Start of raw data processing
       efp BC_mod = 2 LB = 1.5 FT_mod = 6 PKNL = 1 PHC0 = 2670.895 PHC1 = 84.08804 SI = 64K 
       data hash MD5: 64K
       D8 64 67 72 1B C6 50 A0 DD 2C 4F E7 BB D1 FE B9>)
(   3,<2024-08-13 13:50:13.79 +0400>,<she>,<DPX200>,
      <pk PHC0 = 30.35415 PHC1 = 0 
       data hash MD5: 64K
       40 49 C3 7D 12 F7 AB A4 92 26 3D DB 8F 98 C4 FF>)
(   4,<2024-08-13 13:50:17.06 +0400>,<she>,<DPX200>,
      <abs ABSG = 5 
       data hash MD5: 64K
       08 EA 62 20 F6 F9 77 2D A5 9C 02 03 B1 13 FE 25>)
$$ ##END=
$$ 
$$ hash MD5
$$ 49 DD 5B 8F 31 D8 BC 04 BA 5B E4 04 26 F5 A5 58
##$RELAX= 
##$RELAX= 
##$RELAX= 
##$RELAX= 
##$RELAX= 
##$RELAX= 
##$RELAX= 
##$RELAX= 
$$ Bruker specific parameters
$$ --------------------------
##$DU= <F:/spectra>
##$EXPNO= 2
##$NAME= <P31>
##$PROCNO= 1
##$TYPE= <nmr>
##$USER= <she>
##$AMP= (0..31)
100 100 100 100 100 100 100 100 100 100 100 100 100 100 100 100 100 100 
100 100 100 100 100 100 100 100 100 100 100 100 100 100 
##$AQSEQ= 0
##$AQ_mod= 1
##$AUNM= <au_zg>
##$AUTOPOS= <>
##$BF1= 81.014009
##$BF2= 200.13
##$BF3= 200.13
##$BF4= 200.13
##$BF5= 200.13
##$BF6= 200.13
##$BF7= 200.13
##$BF8= 200.13
##$BYTORDA= 1
##$CFDGTYP= 0
##$CFRGTYP= 5
##$CHEMSTR= <none>
##$CNST= (0..31)
1 1 145 1 1 1 1 1 1 1 1 1 1 1 1 1 1 1 1 1 1 1 1 1 1 1 1 1 1 1 1 1 
##$CPDPRG= <waltz16>
##$CPDPRG1= <>
##$CPDPRG2= <waltz16>
##$CPDPRG3= <>
##$CPDPRG4= <mlev>
##$CPDPRG5= <mlev>
##$CPDPRG6= <mlev>
##$CPDPRG7= <mlev>
##$CPDPRG8= <mlev>
##$CPDPRGB= <>
##$CPDPRGT= <>
##$D= (0..31)
0 1 0 0 0 0 0 0 0 0.06 0 0.03 2e-05 3e-06 0 0 0.0002 0 0 0 0 0 0 0 0 0 
0 0 0 0 0 0 
##$DATE= 1723542592
##$DBL= (0..7)
120 120 120 11 120 120 24 19 
##$DBP= (0..7)
150 150 150 150 150 150 150 150 
##$DBP07= 0
##$DBPNAM0= <>
##$DBPNAM1= <>
##$DBPNAM2= <>
$$ [...]
##$SUBNAM3= <"">
##$SUBNAM4= <"">
##$SUBNAM5= <"">
##$SUBNAM6= <"">
##$SUBNAM7= <"">
##$SUBNAM8= <"">
##$SUBNAM9= <"">
##$SW= 400.765351723535
##$SWIBOX= (0..15)
0 1 3 0 0 0 0 0 0 0 0 0 0 0 0 0 
##$SW_h= 32467.5324675325
##$TD= 32768
##$TD0= 1
##$TE= 0
##$TE2= 300
##$TE3= 300
##$TEG= 300
##$TL= (0..7)
0 120 53 12 22 120 120 120 
##$TP= (0..7)
150 150 150 150 150 150 150 150 
##$TP07= 0
##$TPNAME0= <>
##$TPNAME1= <>
##$TPNAME2= <>
##$TPNAME3= <>
##$TPNAME4= <>
##$TPNAME5= <>
##$TPNAME6= <>
##$TPNAME7= <>
##$TPOAL= (0..7)
0.5 0.5 0.5 0.5 0.5 0.5 0.5 0.5 
##$TPOFFS= (0..7)
0 0 0 0 0 0 0 0 
##$TUNHIN= 0
##$TUNHOUT= 0
##$TUNXOUT= 0
##$USERA1= <user>
##$USERA2= <user>
##$USERA3= <user>
##$USERA4= <user>
##$USERA5= <user>
##$V9= 5
##$VALIST= <valist>
##$VCLIST= <CCCCCCCCCCCCCCC>
##$VD= 0
##$VDLIST= <DDDDDDDDDDDDDDD>
##$VPLIST= <PPPPPPPPPPPPPPP>
##$VTLIST= <TTTTTTTTTTTTTTT>
##$WBST= 1024
##$WBSW= 4
##$XGAIN= (0..3)
0 0 0 0 
##$XL= 0
##$YL= 0
##$YMAX_a= 15049
##$YMIN_a= -13966
##$ZGOPTNS= <>
##$ZL1= 120
##$ZL2= 120
##$ZL3= 120
##$ZL4= 120
##$ABSF1= 198.0616
##$ABSF2= -202.7028
##$ABSG= 5
##$ABSL= 3
##$ALPHA= 0
##$AQORDER= 0
##$ASSFAC= 0
##$ASSFACI= 0
##$ASSFACX= 0
##$ASSWID= 0
##$AUNMP= <proc_1d>
##$AZFE= 0.1
##$AZFW= 0.5
##$BCFW= 0
##$BC_mod= 2
##$BYTORDP= 0
##$COROFFS= 0
##$CY= -3
##$DATMOD= 1
##$DC= 0
##$DFILT= <>
##$DTYPP= 0
##$F1P= 0
##$F2P= 0
##$FCOR= 1
##$FTSIZE= 65536
##$FT_mod= 6
##$GAMMA= 0
##$GB= 0
##$INTBC= 1
##$INTSCL= 9.790993e-09
##$ISEN= 30
##$LB= 1.5
##$LEV0= 0
##$LPBIN= 0
##$MAXI= 10000
##$MC2= 0
##$MEAN= 0
##$ME_mod= 0
##$MI= 50
##$NCOEF= 0
##$NC_proc= -5
##$NLEV= 6
##$NOISF1= 182.463
##$NOISF2= 159.3651
##$NSP= 0
##$NTH_PI= 0
##$NZP= 0
##$OFFSET= 198.0616
##$PC= 4
##$PHC0= 2701.249
##$PHC1= 84.08804
##$PH_mod= 1
##$PKNL= yes
##$PPARMOD= 0
##$PSCAL= 0
##$PSIGN= 0
##$REVERSE= no
##$SF= 81.0140089999434
##$SI= 65536
##$SIGF1= 159.3651
##$SIGF2= -187.1042
##$SINO= 113.3802
##$SIOLD= 16384
##$SREGLST= <1H.CDCl3>
##$SSB= 0
##$STSI= 65536
##$STSR= 0
##$SW_p= 32467.5324675325
##$SYMM= 0
##$S_DEV= 0
##$TDeff= 32768
##$TDoff= 0
##$TI= <>
##$TILT= no
##$TM1= 0
##$TM2= 0
##$TOPLEV= 0
##$USERP1= <user>
##$USERP2= <user>
##$USERP3= <user>
##$USERP4= <user>
##$USERP5= <user>
##$WDW= 1
##$XDIM= 65536
##$YMAX_p= 273554471
##$YMIN_p= -12141946
$$ End of Bruker specific parameters
$$ ---------------------------------
##NTUPLES= NMR SPECTRUM
##VAR_NAME=  FREQUENCY,     SPECTRUM/REAL,   SPECTRUM/IMAG
##SYMBOL=    X,             R,               I
##VAR_TYPE=  INDEPENDENT,   DEPENDENT,       DEPENDENT
##VAR_FORM=  AFFN,          ASDF,            ASDF
##VAR_DIM=   65536,         65536,           65536
##UNITS=     HZ,            ARBITRARY UNITS, ARBITRARY UNITS
##FACTOR=    0.49542278885378, 1,            1
##FIRST=     16045.7642231865, 0,            0
##LAST=      -16421.768244346, 0,            0
##MIN=       -16421.768244346, -12141946,    0
##MAX=       16045.7642231865, 273554471,    0
$$ Real data points
##PAGE= N=1
##DATA TABLE= (X++(R..R)), XYDATA
$$ [...]
41430e14172N2801r7939k28884k75800k24511k3948K62397L94516K45160K0232
41420c90148m645J31136J53563l2211k10737j65683K6968R6606q1412l19378l34405
41409a130346j07899Q8434R5087J33943M57452Q36300P52602J54201l65163l37574
41399E77037l0679K8624j42655j01347K37386M36671K13934j55980k85558j87233
41389E90200j18585j58525j80370r9690N8847K45327L76933L38878J28197r2674
41379A088538j92147k06665j90802j00068L9253L8982j62666k98454j28482J37434
41369B4923R9559k16830l63028j07051K67195L95271K64764P0427r8390k31636
41359A05204k55198j25993L7984Q7326K5379m8542r1137j15476j31014j56590
$$ y = [-514172, -461371, -559310, -788194, -1063994, -1288505, -1312453, -1050056, -655540, -410380, -390148, -394793, -263657, -110094, -142305, -353042, -518725, -491757, -395151, -476563, -795941, -1130346, -1238245, -1149811, -1054724, -920781, -463329, 372971, 1125573, 1279774, 914611, 577037, 546358, 574982, 432327, 330980, 568366, 1005037, 1218971, 1062991, 777433, 590200, 471615, 313090, 132720, 33030, 91877, 337204, 714137, 1053015, 1181212, 1088538, 896391, 689726, 498924, 398856, 438109, 477091, 314425, 15971, -112511, 24923, 124482, -92348, -455376, -562427, -295232, 100039, 364803, 435230, 336840, 105204, -149994, -275987, -238003, -150677, -125298, -173840, -264977, -380453, -511467, -668057]
41349f68057j92597j42075Q4983L43113L40849N8025j56463n2886J82949K48788
41339D6629J47831N4441j3793r1256l2145K57299M98891L50604m8409k49538j66593
41328G53961j29139k44464k00621J39332M05081K55268j05285k62278j88524j66141
41318B57190k72417k82023n4137K29386K61288m8234m32201m84243j09431K91518
41308f43304K82544j5878j03961J32980K65388N1076j56674l0825J42364n5291
41298a31581m32827m55448o6471K70480K63811N9781j32976k37149j49449J75985
41288h35844M88297M92589L15618K85229L06300J0133m63475m92257M4258M63676
41278F14524K87781o1126k4054J82360K4099l71283l95529M7579L93582K70442
$$ y = [-668057, -860654, -1002729, -917746, -574633, -233784, -175759, -332222, -385108, -202159, 46629, 194460, 248901, 235108, 143852, 111707, 369006, 867897, 1218501, 1170092, 920554, 753961, 624822, 380358, 179737, 319069, 724150, 979418, 874133, 611855, 423331, 257190, -15227, -297250, -351387, -122001, 139287, 91053, -341148, -825391, -934822, -643304, -360760, -376638, -480599, -347619, -82231, -31155, -187829, -218654, -76290, -131581, -564408, -1019856, -1086327, -815847, -552036, -492255, -625231, -862380, -1011829, -835844, -347547, 145042, 460660, 745889, 1052189, 1062322, 598847, 106590, 150848, 614524, 902305, 841179, 817125, 999485, 1023584, 652301, 256772, 304351, 697933, 968375]
41268I68375n0019j55399j7336J27623J10342q3684l44537m85342m14695k47446
41258e92118r9648J09898M33553O27144M34122L0645j78298j38413j30449k22571
41248B73865j86570J2104J02650j1624r6194l4512j842m4893M5688K43890J74935
41237D77497k09837l56677P0836N62590M86230N0477q9732R6908P5350k58451
41227I05191m19279k36182j59269m15649n26774p8069N38329O44142K12609j98067
41217B66982k52438j22235m9905m4316l8722l2911N223J65721M33209O16602N04955
41206A452165O2317n00499q15895o26885o4052M24351N10017K71242j5810k13921
41196D83030l27957l40392k46841j53096j39452j06976N8039K56572L15395K64432
$$ y = [968375, 918356, 762957, 745621, 873244, 983586, 899902, 555365, 70023, -344672, -592118, -691766, -581868, -148315, 478829, 912951, 943596, 765298, 626885, 496436, 273865, 87295, 99399, 202049, 190425, 94231, 59719, 57877, 12984, 58672, 302562, 477497, 267660, -89017, -18181, 544409, 1030639, 1081116, 991384, 1088292, 1163642, 905191, 485912, 249730, 90461, -325188, -851962, -930031, -391702, 252440, 465049, 266982, 14544, -107691, -157596, -201912, -240634, -273545, -268322, -102601, 330608, 947210, 1452165, 1514482, 1013983, 198088, -428797, -492849, -68498, 441519, 712761, 696951, 483030, 155073, -185319, -432160, -585256, -724708, -831684, -773645, -517073, -201678, 62754]
41186F2754K49271K45990J21671p3858j58530j37093j72658k40246j40347R4160
41176a48886J64487j866r0120P3605J89354k3251l00437j99957J93814L67702
41166B24445J28902j62346j67191j0992l256j85777l48349l25745j14670J83354
41156g81625L89692L19810j4048l18086k79017Q3453M23549M46609K10933K7063
41146E08333J04508L39753M40161K19641k32503o29948p03390l93840P4302L26925
41136E3942J62474k25411m43879l47230j62449j25002j68820j07559M7756J60764
41126a155414K37174L65655M58254L36851P7373l3458N1274L9671k04792l69023
41116a96435j40502K69433L72986P1299k52580k94035j68237j10461j11597m0007
$$ y = [62754, 312025, 558015, 679686, 605828, 447298, 310205, 137547, -102699, -243046, -148886, 15601, 13735, -76385, -2780, 186574, 163323, -137114, -337071, -143257, 224445, 353347, 191001, 23810, 12818, 9562, -176215, -524564, -850309, -964979, -781625, -391933, -72123, -86171, -404257, -683274, -599821, -176272, 270337, 481270, 508333, 612841, 952594, 1392755, 1612396, 1379893, 749945, 46555, -347285, -272983, 53942, 216416, -8995, -452874, -800104, -962553, -1087555, -1256375, -1363934, -1316178, -1155414, -918240, -552585, -94331, 242520, 319893, 286435, 337709, 377380, 172588, -196435, -336937, -67504, 305482, 376781, 124201, -169834, -338071, -448532, -560129, -600136]
41106f00136M4733n4123l22454m45966j70222L36982O13529M18909K8701q3505
41096b33552J77271M13576K51426j72291l88162j90697J38607K34537R5969Q488
41086C35172J18437K45731J35359k11511n21493n33594k53955P5009K27400J86254
41076a97191R3025O3623J05461J81029K55976K59200R7346j99013m05266l13330
41066e9140j7326J46056j03k56345l41794k90580l57138n58768n63399j45910
41056b444447M33948P08959N70281L41018K99112L51626K66866M5166j11371j13706
41046C47452q3580j26431j64326p9936P0264J12236O18j17035j13348l6984K7887
41035a63183J37404L51503M84271K41361l21665p06250n12785O1929M57261L82479
$$ y = [-600136, -555403, -609526, -931980, -1377946, -1548168, -1211186, -597657, -178748, -150047, -233552, -56281, 357295, 608721, 436430, 48268, -142429, -3822, 230715, 326684, 335172, 453609, 699340, 834699, 623188, 101695, -431899, -685854, -610845, -383445, -197191, -104166, -40543, 64918, 245947, 501923, 761123, 858469, 659456, 254190, -59140, -76466, 69590, 69487, -186858, -528652, -819232, -1176370, -1735138, -2298537, -2444447, -2010499, -1301540, -731259, -390241, -91129, 260497, 527363, 572529, 461158, 347452, 263872, 137441, -26885, -106821, -36557, 75679, 76297, -40738, -154086, -191070, -163183, -25779, 325724, 809995, 1051356, 729691, 23441, -489344, -427415, 29846, 412325]
41025D12325K1804l08136m50891l70541r1989K24177L47326K36153R2307O3079
41015A75614M0311j26282l52737m15894k48061P571J94341K72432K75003K42810
41005F5108K10166J89984J63088J05455J0945j14707k40636l02370k79881k69887
40995d62735l68539m79840l87974o5964K35752K87972J44020K3603N9533K37232
40985g76940M47674N08989K86643r2369k97905k02805o7636j53073l19670k49777
40975i16869N4844K71752K08441m89j48290j83835j49500p1320L5493J57754K85280
40964d56739L46350K19166p2960k84515k35782p3468m0111r0003R201K65542M37963
40953B4644L93996K20475L250k20298l16067j78499N142m1815k10410j25111K14695
$$ y = [412325, 434129, 125993, -324898, -695439, -787428, -563251, -215925, 20228, 112535, 175614, 215925, 89643, -263094, -678988, -927049, -919478, -725137, -452705, -177702, 65108, 275274, 465258, 628346, 733801, 744746, 630039, 389403, 87033, -192848, -462735, -831274, -1311114, -1699088, -1765052, -1529300, -1241328, -1097308, -1073705, -1014172, -776940, -329266, 179723, 466366, 373997, 76092, -126713, -194349, -347422, -667092, -916869, -862025, -590273, -381832, -382321, -530611, -714446, -863946, -935266, -899773, -742019, -456739, -110389, 108777, 35817, -248698, -484480, -557948, -598059, -688062, -678861, -413319, 24644, 418640, 639115, 642365, 422067, 106000, -72499, -67357, -109172, -319582, -444693, -229998]
40942b29998L57823J00487j94638j99479r7148j56349k46663j65120q4697k18748
40932a134530l21486k9225M88566P28630N83511L68919K06958p3059m12253m56459
40922e0428j38493J58925J90398J54134K20030K04721p107j39426P424J14756
40912G14934j79341o05526n73231o4455K87378Q0754l18145l12920J43092N48760
40902b78700M97675J03183k02490j64154N6365J30730J653n7309J27859L25728
40892E40540K26798n6431j30349O4360J46762r0630l34154k53188k7651j6639
40882F9418j43072o5352J61389J25145k09680l52811o4500K24451J00497j67507
40872c22022j14218J18154N3123k33040j71853L29810O42074L46988j40227k29291
$$ y = [-229998, 127825, 228312, 33674, -165805, -262953, -419302, -665965, -831085, -915782, -1134530, -1456016, -1485241, -996675, -268045, 315466, 684385, 891343, 818284, 406031, -50428, -188921, -29996, 160402, 314536, 534566, 739287, 732180, 592754, 600178, 714934, 535593, -69933, -643164, -707619, -420241, -339487, -657632, -970552, -827460, -278700, 218975, 322158, 119668, -44486, 11879, 142609, 144262, 86953, 214812, 540540, 767338, 710907, 580558, 644918, 791680, 701050, 366896, 113708, 86057, 69418, -73654, -139006, 22383, 147528, -62152, -414963, -479463, -255012, -154515, -322022, -436240, -318086, -264963, -498003, -669856, -340046, 302028, 649016, 508789, 279498]
40862B79498N591P2966j47029l22824k39504l5730R4366J22642J09323J23038
40852F2337K07998K69594J04196k68746m71559k36141J48656J99606o2460j82638
40842b29157o871J03118j16105m14317m22996j48730J48322L21126L63336K74822
40832a27452J16316L9065P3994N3134q2416j00623J45208L45791R5829m48418
40822A10428o64809k94640J74698J60021k44051m46640j98068J11580O2224j96267
40812a425524j91207J87217N44601N14133J62305j99188l60631k58505P8268M23642
40802e24889M01268q8817o09067o33547j99089J62268J06026j89635l72871l16360
40792b264713j07404J13113K17459J84184J69409L09018M62946L92187J70130
$$ y = [279498, 285089, 358055, 211026, -111798, -351302, -387032, -292666, -170024, -60701, 62337, 270335, 539929, 644125, 375379, -96180, -332321, -183665, 15941, -46519, -229157, -236028, -132910, -249015, -663332, -1086328, -1235058, -1086736, -765610, -402274, -127452, -11136, 27929, 101923, 155057, 72641, -27982, 117226, 463017, 558846, 110428, -554381, -849021, -674323, -514302, -758353, -1204993, -1403061, -1291481, -1229257, -1425524, -1616731, -1429514, -884913, -370780, -208475, -407663, -768294, -1026799, -948531, -524889, -123621, -212438, -821505, -1455052, -1654141, -1491873, -1385847, -1575482, -1948353, -2264713, -2372117, -2259004, -2041545, -1857361, -1687952, -1378934, -915988, -523801, -353671]
40783c53671J04060K13493J50575k30189n71129m91458r4159K29056K79253J40222
40773f23947n247K7654K99050N57338M27404n1417l72513k48539o741j9811j13347
40762a30116N1607L18769K68805p8027l08107k64752j62990j10469M230J56317
40752b54733J84142J58782K95097M64542K86542k04205m74637k41896J42397K49498
40742F05529R6344r8417k65292l40811j73110J36384J69702j99272m80799k27338
40732g77080K95249N11025L42494J54276R3014n776j47679j23369O0740J30174
40722E33068j6068j74680k04188j78933j24386M4548K33242J77711j09667k42525
40712f1878l933L11693L33814J32715K5250O8227N9647p4300k04969k67429l16609
$$ y = [-353671, -249611, -36118, 114457, -115732, -686861, -1178319, -1272478, -1043422, -764169, -623947, -629194, -601540, -302490, 254848, 682252, 630835, 258322, 9783, 3042, -16769, -130116, -78509, 240260, 509065, 431038, 122931, -141821, -304811, -415280, -411050, -254733, -70591, 88191, 383288, 847830, 1134372, 930167, 455530, 213634, 356031, 605529, 701873, 603456, 338164, -2647, -175757, -39373, 130329, -68943, -549742, -777080, -481831, 29194, 371688, 525964, 618978, 613202, 465523, 342154, 402894, 533068, 517000, 342320, 138132, -40801, -165187, -120639, 112603, 290314, 180647, -61878, -65811, 245882, 579696, 712411, 737661, 805888, 865535, 791235, 586266, 318837, 2228]
40701B228l14532j24641K22014M71185M46360K43884M7639r4526k05217k31143
40691D63251j16128M6884P4050j10857m04604o07377n28036j13154M15411O57376
40681b23184M43282P9459j8276J22062J15527j42293k85486o9545K05240J55390
40671C82176q0438r4945R9656J00756k00780m33548l32790r2725L0440P9519J33061
40660d09618M2754k52254m39548k32174J51507K88762J78922J55507K70050K33246
40650a2846o347r8557J30639L38747J67018k08885l35893j16182J22559J12677
40640I2930p0959k14560k27837j42104K898J79060L35856M08462L63313K39444
40630I66503J37573J16080Q4461j12101m41787o14750l91537P2161L36199J67897
$$ y = [2228, -312304, -436945, -214931, 256254, 702614, 946498, 994137, 899611, 694394, 463251, 347123, 394007, 468057, 357200, -47404, -654781, -1182817, -1295971, -880560, -223184, 220098, 299557, 281281, 403343, 518870, 376577, 91091, 21546, 226786, 382176, 301738, 206793, 306449, 407205, 206425, -227123, -559913, -652638, -622198, -542679, -409618, -366864, -619118, -1058666, -1290840, -1139333, -850571, -671649, -516142, -246092, -12846, -19193, -117750, 12889, 351636, 518654, 309769, -26124, -142306, -19747, 92930, 21971, -192589, -420426, -562530, -559632, -380572, -44716, 363746, 727059, 966503, 1104076, 1220156, 1304617, 1192516, 750729, 135979, -255558, -183397, 152802, 320699]
40620C20699j88882l08046o8833K46583L11957J05985j25015j67292k9909J24055
40610B21302J48061Q170k13135l67011l36693j36096R5180K13912J87982J00834
40600g7494O4471J08584J26998j4882k56091l11573k4344L13110K41574k20070
40590d9717n00908k09496L23219M93095K13285p9919r5716K1027O6422O7912R4220
40579C43424Q4430J4625q972L6669J3578j00651j00960R7744K38760R2569j48980
40568E62236j39594R0117J82611j6518k78397l53430k51169j06901O605N8460
40558b45980L5929K3431J48594L64716M26666J85566j93503m06043l36557j40575
40548a37756m8174j38556k74629k39504K2770L12789L91242K67381J59941J71127
$$ y = [320699, 131817, -176229, -245062, 1521, 313478, 419463, 294448, 127156, 97247, 221302, 369363, 377533, 164398, -202613, -539306, -675402, -580222, -366310, -178328, -77494, -13023, 95561, 222559, 207677, -48414, -359987, -384331, -71221, 170353, -49717, -550625, -760121, -436902, 56193, 269478, 189559, 93843, 114870, 181292, 249204, 343424, 427854, 442479, 433507, 470176, 483754, 383103, 282143, 379887, 618647, 711216, 562236, 422642, 512759, 695370, 678852, 400455, 47025, -204144, -311045, -304440, -245980, -210051, -186620, -38026, 326690, 753356, 938922, 745419, 339376, 2819, -137756, -185930, -324486, -599115, -838619, -815849, -503060, -111818, 155563, 315504, 486631]
40538D86631J53833k7325k40010k26980M2368K87572K14527j46790m37387l31427
40528b24988Q7117L74723K21581j79517l85663k63005q8826r3664j58560q0842
40518g91644R6836K23611L18099M42913M29381O7471m37436n57080j27548L47395
40508A1998L12336j22134l70790j80164R9358R0356r1238r5922R3943J55956o1258
40497a57559k97134k33118R9673L90175M12808K10333q707n4541R3315K34849
40487F90094J36713j38923k26732O2189L95018L07375j43918m41458l25007q8039
40477B27312m9000r8133r706J13204N3344p5803K119K18394K23125n5311k99152
40466B50393l04610k33478k48787k44207j19796k6574r6407j66748m2384J54320
$$ y = [486631, 640464, 613139, 373129, 146149, 188517, 476089, 690616, 543826, 106439, -224988, -137871, 236852, 458433, 278916, -106747, -369752, -458578, -552242, -710802, -791644, -694808, -471197, -153098, 289815, 719196, 786667, 349231, -207849, -335397, 11998, 324334, 202200, -168590, -348754, -249396, -159040, -250278, -346200, -252257, -96301, -157559, -454693, -687811, -588138, -197963, 214845, 425178, 416471, 361930, 455245, 690094, 826807, 687884, 461152, 523341, 918359, 1225734, 1081816, 640358, 315351, 227312, 178312, 80179, 70473, 183677, 237021, 161218, 163337, 381731, 604856, 549545, 250393, -54217, -287695, -536482, -780689, -900485, -927059, -1023466, -1190214, -1232598, -1078278]
40456a078278J84973J10265J82939L86053M09349J28546j72176j67471J15683
40447I9883L89034M44689K90435M7082j67752k90017l19489k77421j58238K4842
40437H3048J66845J52866L5763J7688J92987M03666M27927K32114n7528l55690
40427A299686o41706p99571o22580r8635M07358M41851k6444n14335n34487j13311
40417a202174L06753L97054K06596n5943k62987l29812j73761J24052K83374J46255
40407e60593q0029r5846P7553J81680J38027J10045J60476J32136n5107k26812
40397b18470j91311J4071K10519K63959J14259k11069n21358n66743l26109m9587
40387a481839P2116J15381K10203L21813L85346M54173N26902M18384M2722l26744
$$ y = [-1078278, -893305, -783040, -600101, -214048, 195301, 323847, 151671, -15800, 99883, 488917, 933606, 1224041, 1271123, 1103371, 813354, 493865, 216444, 58206, 83048, 249893, 402759, 438522, 456210, 649197, 1052863, 1480790, 1712904, 1655376, 1299686, 657980, -141591, -764171, -862806, -455448, -13597, -40041, -554376, -1088863, -1202174, -895421, -498367, -291771, -347714, -610701, -940513, -1114274, -990222, -706848, -560593, -640622, -736468, -658915, -477235, -339208, -229163, -68687, 63449, 8342, -218470, -409781, -395710, -185191, 78768, 193027, -18042, -539400, -1106143, -1432252, -1481839, -1409723, -1294342, -1084139, -762326, -376980, 77193, 604095, 1022479, 1065201, 738457]
40377G38457l54030j02603O9968J4153r5560j17451j20743j70725j96713j50099
40367d85346r0162n2679j8892m8556k29689m45919m28080j27627J83107K90011
40357a453832K91250L38628L61856K51494J18375J21646J71471O0042j91741l65714
40347b96525l74743l15528k19348j2641K41821L20890J57703k4642k6073M8633
40337e00453k4572k37678l53913k15341Q2588K99593K48503n7526l53558k91584
40327a403941J85137O71610O85169K31989j99063k56864j16712j06953j73976
40318d83604j1603L75911N98275M32253J32406J2344k3685k52025n96358o80366
40308d96452m06280j34715j54296k48499l3015M34440O79965M40595j756k15999
$$ y = [738457, 384427, 281824, 351792, 365945, 270385, 152934, 32191, -138534, -335247, -485346, -575508, -628187, -647079, -695635, -925324, -1371243, -1799323, -1926950, -1743843, -1453832, -1162582, -823954, -462098, -210604, -92229, 29417, 200888, 260930, 69189, -296525, -671268, -986796, -1206144, -1218785, -976964, -656074, -498371, -523013, -549086, -500453, -525025, -762703, -1116616, -1331957, -1249369, -949776, -701273, -758799, -1112357, -1403941, -1218804, -547194, 137975, 369964, 170901, -85963, -202675, -309628, -483604, -495207, -119296, 478979, 911232, 1043638, 1055982, 1032297, 780272, 183914, -496452, -902732, -1037447, -1191743, -1440242, -1473257, -1038817, -358852, 81743, 79987, -136012]
40298a36012j43739l5221R999J63247M95540P42624O13010J81925k28301m74357
40288A188715o60282q05507p23926l29473J55873M38722M46226K71749N015k38494
40278b51382k91448j28280M3649O2685M2014J28840K03156P8908j30768j56883
40268c99509K641J16807J11887R7493N8363j09404k80837k29445p5554j43537
40258h51095l19915j04505N18025Q45485M49829j29488j74490J64078K09940j49549
40248D58315l91673k49625j5155O7238J09835J74856R2451j35260k11215m2267
40238a42500M5255j64420l94103l09201l1354J05318P9763J24348K83375L61140
40228d2379K59518J00105J6821K5539R1928J65928J60701M1199p5822l9660J18836
$$ y = [-136012, -279751, -314972, -304973, -141726, 353814, 1096438, 1709448, 1891373, 1663072, 1188715, 528433, -277074, -1001000, -1330473, -1174600, -735878, -289652, -17903, -12888, -251382, -542830, -671110, -627461, -564776, -522762, -393922, -190766, -111858, -242626, -399509, -396868, -280061, -168174, -70681, -12318, -121722, -402559, -632004, -707558, -851095, -1171010, -1275515, -757490, 87995, 537824, 408336, 233846, 397924, 607864, 458315, 66642, -182983, -198138, -130900, -21065, 153791, 246242, 110982, -100233, -142500, -97245, -261665, -655768, -964969, -996323, -891005, -811242, -686894, -403519, -42379, 217139, 317244, 334065, 359604, 451532, 617460, 778161, 819360, 743538, 703878, 822714]
40217H22714K03186R1173j32229k92424k98711j79254m923J66136K66480J95201
40207H37349r8708m84798o98091n93351k73597J02515M92985Q08791P78191K84052
40197A155338k73107l45532K1291K34079K1593k04700p5228J27950j1139k83320
40187C67225j54945L46171O03606K75440k94661o22036o23973m62038j97627J53230
40177f09608M43610N11151L71984J66360O278m5596K2001J00300K5996j92534
40167G99942l38627k64755p8849M1579Q9968J65143K73744L29144K75619J09475
40157A402383j46312l86958m32598k20516N9357J37977n2193l48811n49476n32684
40147a069831k64260J67842N40581O50481N04700K78724R1949q2433k84168m42077
$$ y = [822714, 1025900, 1117073, 984844, 692420, 393709, 214455, 209532, 375668, 642148, 837349, 738641, 253843, -444248, -1037599, -1311196, -1208681, -715696, 93095, 871286, 1155338, 882231, 536699, 557990, 792069, 813662, 608962, 533734, 661684, 650545, 367225, 212280, 558451, 1162057, 1437497, 1142836, 520800, -103173, -565211, -762838, -609608, -165998, 345153, 717137, 883497, 889775, 844179, 866180, 966480, 992476, 799942, 461315, 196560, 117711, 159290, 249258, 414401, 688145, 1017289, 1292908, 1402383, 1256071, 869113, 436515, 215999, 275356, 413333, 361140, 12329, -537147, -1069831, -1334091, -1166249, -625668, 24813, 529513, 808237, 900186, 817753, 533585, 91508]
40137I1508m21467j54259K76504O47038P32605N14541K14866M1902m8920k22377
40127A671941m45182m89775k75899j1028R3849P1311L8371l5270k03809l11946
40117A02563j39776K37892M73243L72383J06464o4819r1405o5841m9746j02960
40107G77998l07234n75748n99517k35435J64681J30935k45601l74064K788M06443
40097h54754K97443j47100l04523J501L14897K67511O7744R0736K99479L62800
40087C95734J83384O431L5361J80522K23979O8520k12271m46795m75647l11374
40077c52156j78815k44756l27527j03908L57920N66015K66062j52425j97238J8525
40067c48303K4500j86465j27517L22826N95509K66746k43904k72330J08815K66421
$$ y = [91508, -329959, -484218, -207714, 439324, 1171929, 1686470, 1901336, 1943238, 1894318, 1671941, 1226759, 736984, 461085, 450057, 543906, 615217, 653588, 618318, 414509, 102563, -37213, 200679, 673922, 1046305, 1152769, 1087950, 996545, 930704, 880958, 777998, 470764, -104984, -704501, -939936, -775255, -644320, -889921, -1263985, -1261197, -854754, -557311, -704411, -1008934, -1007433, -692536, -425025, -357281, -266545, 32934, 395734, 579118, 585549, 620910, 801432, 1025411, 1093931, 881660, 434865, -40782, -352156, -530971, -775727, -1103254, -1207162, -849242, -283227, -17165, -169590, -366828, -348303, -323803, -510268, -637785, -314959, 280550, 547296, 303392, 31062, 139877, 406298]
40057D06298Q751k07572j04258K439j58441k92838n5155L06568L02460k5602j86833
40046d183j7164J23090j7316k01367j43521K7700K2032j25474j23620J20272L91125
40035E1574M96004M66999L90365K39087l788j89259j39277R0831K34671J29754
40025A766961j07020k74595l35915l54010k86834n2678K14040K09296j42027n23313
40015A13905o04758m32242k68667j90586p8862P3637J26242O9472P1998J74237
40005i45624J75761l9286k60258k10402P5469L08801L10732J64570M9678N6669
39995c13890J44595J81168N9525j41163j82078L1619K55382J87970r9131k37904
39985a13907q6264P7785J35j48544n1085K19542K54740q5151m11792l03611J31041
$$ y = [406298, 415049, 207477, 103219, 105658, -52783, -345621, -400776, -94208, 208252, 182650, -4183, -21347, 101743, 84427, -116940, -260461, -232761, -210729, -336203, -459823, -339551, 51574, 547578, 1014577, 1404942, 1644029, 1640241, 1450982, 1311705, 1402536, 1637207, 1766961, 1659941, 1385346, 1049431, 695421, 408587, 355909, 569949, 779245, 637218, 113905, -490853, -923095, -1191762, -1382348, -1461210, -1387573, -1261331, -1191859, -1119861, -945624, -769863, -809149, -1069407, -1279809, -1204340, -895539, -584807, -420237, -370559, -313890, -169295, 11873, 71398, -69765, -251843, -220224, 35158, 223128, 123997, -113907, -200171, -122386, -122251, -270795, -321880, -102338, 152402, 67251, -344541, -648152, -517111]
39974e17111L95199K29098j11607k11981L6836L93516N70549M82467K34676m1803
39964A459839l01218n25488n99921l67271J09600M50191L18148j32431l89682
39955B1767k23213L2688k5688l03141l75495j09101J79136J81041l8014k03814
39945h63834j60836O5567L65511N61477M45417j8996n40308o85859k94468L34169
39935g92160P11702O26610L04757Q9379L1808q8349l65261n86125n40101l28454
39925i36194j91060j52296n7475J17768K33721K28900J65274N8522q5950r4132
39915g12922K03106N84764N84746J41258k53626k40778p0829j16118k52026j36458
39905b68883J35166J47367j51828l66133k77530j24373j46539k30007j73636j0443
$$ y = [-517111, -121912, 107186, -4421, -216402, -179566, 213950, 784499, 1266966, 1501642, 1459839, 1158621, 633133, 33212, -334059, -224459, 225732, 543880, 411449, 21767, -201446, -168758, -194446, -497587, -873082, -982183, -803047, -622006, -660020, -863834, -1024670, -959103, -593592, -32115, 413302, 394306, -146002, -831861, -1126329, -792160, -80458, 546152, 850909, 940288, 972096, 883747, 518486, -67639, -607740, -936194, -1127254, -1279550, -1337025, -1219257, -985536, -756636, -591362, -532840, -618790, -712922, -509816, 74948, 659694, 800952, 547326, 306548, 235719, 119601, -132425, -268883, -133717, 13650, -138178, -504311, -781841, -906214, -1052753, -1282760, -1456396, -1466839]
39895a466839J23354K04748K37307J53736k8859j37995q4195K977J5882M6715
39885i33169J59414J97840M3941j19428o6963R2811Q6173q4566j71056q8867J4446
39874h69424P7754J84762K75410J38736k01464m07815l00457j31697j77764k91864
39864a703823j40778K55906N15275L87157L3220k04267j56388O4822K07019J23280
39854f18577o9109j21697K5425J77341J85991J26059N6898j46923n03121o92755
39844a580468m55499m8714P8570l6828K7881L36242M66775K37725L8626J91961
39834g43729M32607L59685N1708j38710j21726k7908J26000L35859L81356J12971
39824G68113j94210j90767q679j8946j71105j05935J28341O8851l63232o30726
$$ y = [-1466839, -1343485, -1138737, -901430, -747694, -776553, -914548, -998743, -995766, -979884, -933169, -773755, -575915, -531974, -651402, -718365, -625554, -539381, -623947, -795003, -883870, -869424, -791670, -606908, -331498, -192762, -394226, -802041, -1102498, -1234195, -1411959, -1703823, -1844601, -1588695, -1073420, -686263, -653043, -857310, -1013698, -948876, -741857, -618577, -687686, -809383, -783958, -606617, -420626, -294567, -237669, -384592, -887713, -1580468, -2035967, -2084681, -2006111, -2042939, -2015058, -1678816, -1212041, -974316, -935690, -743729, -311122, 48563, 100271, -38439, -160165, -188073, -62073, 273786, 655142, 768113, 573903, 383136, 374457, 355511, 184406, 78471, 206812, 275663, -87569, -718295]
39814g18295l66548R5140K56154J17441q791j3732K0216R4809K35584L36459L26032
39803C74469L11374L36266K22169r9280l42700k73005j31801k86248o12544o43303
39793a144603k59295J70692L44117L41565L25633K69022J26482J9695P1004J95301
39783D59613J96116J450k58723l60806j80690J44639K86566O4077l24512n21855
39773d94125m06290j32422J43467L76318M95892L85200O7333k31547k89482j00151
39763a85807J40373K10501N3733j54910j85138l4860O8110j612j09830j45961
39753c45401k28457m08967m03224L7946O26143P99025M53545L6536j14106j28488
39743C24552k14852k95589k30762j10172q2705q8704J4790J88190K61359J82151
$$ y = [-718295, -1084843, -989703, -733549, -616108, -624899, -638631, -618415, -523606, -288022, 48437, 374469, 685843, 1022109, 1244278, 1144998, 802298, 529293, 397492, 111244, -501300, -1144603, -1403898, -1233206, -889089, -547524, -221891, 47131, 173613, 193308, 264312, 459613, 655729, 657179, 398456, 37650, -143040, 1599, 288165, 352242, 27730, -494125, -900415, -1032837, -889370, -513052, -17160, 368040, 435373, 203826, -85656, -185807, -45434, 165067, 218800, 63890, -121248, -156108, -87998, -89610, -199440, -345401, -573858, -982825, -1386049, -1348103, -721960, 77065, 530610, 567146, 453040, 324552, 109700, -185889, -416651, -526823, -609528, -698232, -683442, -495252, -233893, -51742]
39733e1742P1187N8070J35673J61491J5831j97350k03225O2938K64361R1074k41045
39722A67263k67147L054P4986k42147m93193k44787K87814N80593M75157J96084
39712E37677o9085k61505k84642r4609J19560J40408N4135J11808K99376L18712
39702H71835K1056l64704n02964l11437j770J54250P3274q8035j35282o4237L481
39691c44533O4975K10668L46300K29087j03639k47509J1709L33375L09005P3458
39681H82896M8310K31935J98963j94757n34867m17462R580K64662J11909k46457
39671C54712m58865l67281q7142J67176K91416L10092K41997P7187r5370j10510
39661C23412L1432J05843l1823k34514k87879j84397k6502J60979L36516L47478
$$ y = [-51742, 19445, 77515, 213188, 374679, 390510, 193160, -10065, 52873, 317234, 408308, 167263, -99884, -96830, -21844, -263991, -757184, -1001971, -714157, -133564, 341593, 537677, 468592, 207087, -77555, -172164, -52604, 87804, 141939, 253747, 553123, 871835, 892891, 528187, 25223, -286214, -287984, -133734, -60460, -148495, -283777, -348014, -344533, -279558, -68890, 277410, 506497, 402858, 155349, 167058, 500433, 809438, 882896, 931206, 1163141, 1362104, 1167347, 632480, 215018, 224598, 489260, 601169, 354712, -104153, -471434, -558576, -391400, -99984, 210108, 452105, 529292, 433922, 323412, 354844, 460687, 428864, 194350, -93529, -277926, -304428, -143449, 193067, 540545]
39651E40545J57407n35N6905J51709J7475k75515m56540m60913l92737k47859
39641i10058k2961P2422p5538j31576K36745O84696N75098J3815j89475K55381
39631E08549O31341K93618l66761n38728j41080K04893J13542j84573l20348k18041
39621a7588l6237M2285m7469j61308p2767J84815K72479J0481l13965l27753p0172
39610e37199J39936J53289L1432j84605m28630m71698j74632K06806K99216J26899
39600h39186K1206Q1558J00137Q958j258J18500J36099n3989k08939j15322P8582
39589f73654J29917R3503J96261M34877N35840L04077j33129m41663l87776o3172
39579d919J76619O8247k59795m45449l37314j10069P6192K79945N20086N74755
$$ y = [540545, 697952, 697417, 754322, 906031, 923506, 647991, 191451, -269462, -662199, -910058, -933019, -860597, -936135, -1067711, -830966, -146270, 428828, 442643, 253168, 508549, 1139890, 1433508, 1066747, 528019, 386939, 591832, 705374, 520801, 200453, -17588, -53825, -11540, -59009, -220317, -293084, -108269, 164210, 174691, -139274, -467027, -537199, -397263, -243974, -212542, -397147, -825777, -1297475, -1472107, -1265301, -966085, -839186, -817980, -736422, -636285, -627327, -628585, -510085, -373986, -427975, -636914, -752236, -673654, -543737, -450234, -253973, 180904, 716744, 1020821, 887692, 446029, 58253, -4919, 171700, 239947, -19848, -465297, -802611, -912680, -836488, -556543, -36457, 538298]
39569E38298K93814n8003r0353J45537K16897l6467k59062j37704J16613J17571
39559H47141r2019j45577L3591J18538p8019l10816k98865j08683N7552J80383
39549B03226K75348J84145j46645l75178j60640K65932L71965J13407m0080R8405
39539G89885J67806l6225j58083P2659K87399M7505m03721n05021k41813o8062
39529d7671j11971o7516J46704K21351M4241r1272l5427m1734k47522l53913j27844
39518g12574J67309J91270N0747K4941M3662j25883l57772l00549L3440K49064
39508g36345J64380M0939J29371L11857L38232J72050m4344j84626j74246P612
39498B4880K43662L31999K26359R5765N9725J8293j40460l24926l93860l89230
$$ y = [538298, 832112, 774109, 683756, 829293, 1046190, 1009723, 750661, 612957, 729570, 847141, 755122, 609545, 643136, 761674, 683655, 372839, 73974, -34709, 22843, 203226, 478574, 662719, 516074, 140896, -19744, 246188, 618153, 731560, 691480, 789885, 957691, 921466, 763383, 836042, 1123441, 1170946, 767225, 262204, 20391, -47671, -159642, -227158, -80454, 140897, 185138, 93866, 58439, 16705, -230817, -584730, -712574, -545265, -353995, -303248, -278307, -234645, -360528, -718300, -1018849, -985409, -736345, -571965, -531026, -401655, -89798, 248434, 420484, 376140, 191514, 17268, 24880, 268542, 600541, 826900, 922665, 982390, 1000683, 860223, 535297, 141437, -247793]
39488b47793m12773l67760p3709L73750O05746M22777N4792j25658k0001J73618
39478C82989K47046J62706N796j19692j52497j04843l0657N5175J69129K51327
39468H66479J85875J0514l3586J74034L65716J76337l27313o62453n24762j28606
39458A02235J44211K00239J72261J08616k6080j50953j31653j7996O144q1283
39448C25741j02858K1679J38965J03808r471m9291j1533O745j4456k7496m9678
39437C32155j34050k13437j27578J31754L19362J96425j54657l97471l27858p3552
39427d48907J31012K27665K71025K02812q7297m82687o54311m45351o2679K25820
39417a122898L99684N22803M56519K9414n59087q16731n25673p832K90102K89653
$$ y = [-247793, -660566, -1028326, -1102035, -728285, -122539, 300238, 355030, 229372, 209371, 382989, 630035, 792741, 798537, 678845, 526348, 421505, 390848, 446023, 615152, 866479, 1052354, 1062868, 1029282, 1203316, 1569032, 1745369, 1418056, 755603, 230841, 102235, 246446, 446685, 618946, 727562, 701482, 550529, 418876, 400880, 407024, 325741, 222883, 244562, 383527, 487335, 477864, 428573, 417040, 423785, 409329, 381833, 332155, 198105, -15332, -142910, -11156, 308206, 504631, 349974, -47497, -375355, -448907, -317895, -90230, 180795, 383607, 296310, -186377, -840688, -1286039, -1348718, -1122898, -723214, -200411, 256108, 285522, -273565, -1090296, -1615969, -1623801, -1333699, -1044046]
39407a044046K13252J92479J72470J43296K14089L89238M59433K62131m4803j38487
39397H19052N0905K34020J29342j84923l79574k56301P8479L62219L94134J54522
39387A401875j76066l42520k57844q3759N341K9889N0430k6644k43996l47694
39377I012j07584K05300J17083k69373l33129Q6507L64867P3519k84578n0680
39367a89056N23169O46667J68579l14336m13928l27243k44347m9424K39041L16375
39357C55497J08751l7561Q4694K23342J38655r865r711L4706m6109j79603k57968
39346D04828l57119m94204m56761j43802J89323K94934K88520L75961M79007M14146
39336I94833K15812J0492k05571m07887m19866k23610j15416k36149k46540J35850
$$ y = [-1044046, -830794, -638315, -465845, -322549, -108460, 280778, 740211, 1002342, 957539, 819052, 869957, 1103977, 1233319, 1048396, 668822, 412521, 491000, 853219, 1247353, 1401875, 1225809, 883289, 625445, 541686, 547027, 576916, 627346, 600702, 356706, 9012, -98572, 106728, 223811, -45562, -378691, -292184, 72683, 146202, -138376, -189056, 334113, 980780, 1149359, 835023, 421095, 93852, -150495, -199919, 39122, 355497, 464248, 426687, 511381, 734723, 873378, 863513, 853802, 888508, 842399, 662796, 404828, 47709, -446495, -903256, -1047058, -857735, -562801, -274281, 101680, 580687, 994833, 1210645, 1221137, 1015566, 607679, 187813, -35797, -151213, -387362, -633902, -498052]
39326d98052N52449M38880j30835n27758m10797l8395K09219K01582j1921k51661
39316d67289k24237J37122M16706K06882k29236k71998J10603K94210l5934m17023
39306d80194l39138M3268K56526J93239Q5519L9353l5366j36086j09162J09966
39296c72075L51490L38480l6550n10807o09893j70827L76870M89574J91219l7419
39286A0062K166J7297j79682l13425j05317K51542L54181J14033k05820l28021
39276c82984j88500L2919M6526j99636l21385M6408O05784O51745P1108m26543
39266f4558l07932P6508J49569k3444l6582P3270l7697l20931l88113j72947J7719
39255a035138P6597J84251L20789K34058k1630m9164K15347K91150j04058n25979
$$ y = [-498052, 54397, 493277, 362442, -165316, -576113, -614508, -405289, -203707, -215628, -467289, -691526, -554404, -137698, 69184, -160052, -432050, -321447, -27237, -63171, -480194, -819332, -776064, -519538, -326299, -240780, -201427, -236793, -372879, -482041, -372075, -20585, 317895, 281345, -229462, -839355, -1010182, -633312, -143738, 47481, 10062, 12228, 29525, -150157, -463582, -568899, -317357, 36824, 150857, -54963, -382984, -571484, -538565, -492039, -691675, -1013060, -966652, -360868, 290877, 361985, -64558, -372490, -295982, -146413, -169857, -206439, -133169, -170866, -491797, -879910, -1052857, -1035138, -958541, -774290, -453501, -219443, -241073, -290237, -74890, 216260, 112202, -413777]
39245d13777m00187J39820M37662K14697j19813r6492J97401L04205L8497k86880
39235A5133l02227o2840P5387k6915j47393r8784R286M0433Q7566K26041K60470
39224G6157M4398j41687N9358M56932M94870O3089l34551l29828j60960j80733
39214D7045k91024j95220N9736J66779M9233p4221p3838o0109j19938j51463o7269
39203g10289Q764r4192k97611l14532m1870K26211J43991j78266k54095J21615
39193a390274N52054N63427K24038m1932p9728p3628q7613K8665K43113K74401
39183B12523N4609j11668k8080R3313L2220n8125M4643K04128J36679j12292k30186
39172B37764q9153J46190L05934L52697K64465K3921k54636l71090k49789l631
$$ y = [-413777, -813964, -674144, -236482, -21785, -141598, -238090, -40689, 263516, 302013, 15133, -287094, -349934, -274547, -301462, -448855, -547639, -538353, -497920, -410354, -184313, 76157, 120555, -21132, 38226, 495158, 990028, 1053117, 718566, 388738, 227778, 47045, -243979, -439199, -379463, -212684, -163451, -237672, -311510, -371619, -491557, -643020, -710289, -701525, -795717, -1093328, -1407860, -1449730, -1223519, -1079528, -1257794, -1511889, -1390274, -838220, -274793, -50755, -92687, -172415, -246043, -333656, -304991, -61878, 212523, 267132, 155464, 127384, 220697, 252917, 194792, 239435, 443563, 580242, 467950, 237764, 148611, 294801, 600735, 953432, 1217897, 1241818, 987182, 616092, 366303, 362672]
39162C62672J94554K25279P5064j27649k08093j63186j68276k73637k71305k9919
39152c84496K19719J76275q7324k44501j91197j04024o3279N9417K90571M22229
39142I3390L04617N8966j19058k01055k58191k90266k43912j16436M9377K11234
39132e11334L08202K64076P6576j36063k28223j56183k950J11885J46592J57646
39122C0224J86455J70698O1355j7850Q7249K50027J48753k31005m59340k43472
39112a6906J06540J06968j87933k82439L2585M29913N31665L08551m3510l17359
39102F68075l32991n6432K47821K48998p574j60394p9247l8158k48512n36700
39092b95114o29975m82855j78614K10241N06970M67898J30021j37194j13812L599
$$ y = [362672, 557226, 782505, 857569, 729920, 521827, 358641, 190365, -83272, -354577, -384496, -164777, 11498, -75826, -320327, -511524, -615548, -678827, -619410, -328839, 93390, 398007, 456973, 337915, 136860, -121331, -411597, -655509, -771945, -722568, -511334, -203132, 60944, 137520, 1457, -226766, -382949, -385899, -274014, -127422, 30224, 216679, 387377, 448732, 430882, 518131, 768158, 916911, 685906, 226566, -16906, 89634, 196602, 8669, -273770, -241185, 188728, 720393, 1028944, 985434, 668075, 335084, 278652, 526473, 775471, 767897, 607503, 528256, 490098, 241586, -295114, -925089, -1407944, -1586558, -1376317, -869347, -401449, -271428, -408622, -522434, -518835]
39082e18835K805O807J62213K86262J69609j3522K2685J76414J23547j39835l04827
39071b6677k28731n4169R2358J81780J23819j15823k85733j17489J94603J93985
39061d2077j32842l02534r6043R7749n8558k68271n4342M78164P56723N07450
39051H85419K9357k83459l62254l33128k40734p4200P3957O0660j15383k94403
39041f54168l41281k59559r8687J34976L84171M68914K88840N1254O5711K82078
39031C22249K94433p9472m85072m99527j85556Q8844J94622K72368L37818K38426
39021D99133J536j17704l839J73882K46265K30339J72750M2564j44787k91406
39011H08733l52128l29813j51584K12999N21624M39894R02l86857m40665k46341
$$ y = [-518835, -516030, -509223, -347010, -60748, 108861, 95339, 118024, 294438, 417985, 278150, -26677, -255408, -309577, -217219, -35439, 88380, -27443, -313176, -430665, -236062, -42077, -174919, -477453, -573496, -475747, -534305, -802576, -856918, -378754, 377969, 885419, 914776, 631317, 269063, -64065, -304799, -378999, -305042, -244382, -359765, -654168, -995449, -1255008, -1353695, -1218719, -834548, -365634, -76794, -25540, 40171, 322249, 616682, 537210, 52138, -447389, -632945, -544101, -349479, -77111, 260707, 499133, 500669, 382965, 379126, 553008, 799273, 1029612, 1202362, 1244926, 1100139, 808733, 456605, 126792, -24792, 188207, 709831, 1149725, 1150627, 763770, 323105, 76764]
39001G6764K0902K91832M59120L88058J79709R3786J14245m1597l78202n24445
38991F80172l54223k30071l66456m36887j77365Q7855j0406k27286j28191J70938
38981i91920K82211K75178M54518O13385K71213l88328n99361j61158K24242K7753
38971G733l36900k11830L35174O94660N44495Q0789l60380n57204m38218j65217
38961d06898n8350k00793k55535R0462O30662Q40090N03519p1677m38223m38701
38951A94556k62885j84303k48142k22152P3941M46404N24849K68713J5268l1538
38941E74711n7188k38460l88869k45617J05615L56811L80510K66676Q6533j35873
38931G04849l06714l38603k78334j91337l1853J92288K79541J02041j22968j15063
$$ y = [76764, 97666, 389498, 848618, 1236676, 1416385, 1510171, 1624416, 1582819, 1204617, 680172, 325949, 95878, -270578, -707465, -884830, -796975, -807381, -1034667, -1162858, -991920, -709709, -434531, 19987, 633372, 904585, 516257, -83104, -244262, -20020, 7733, -329167, -540997, -205823, 488837, 1033332, 1114121, 753741, 196537, -241681, -406898, -465248, -666041, -921576, -831114, -200452, 639638, 1143157, 1071480, 633257, 194556, -68329, -252632, -500774, -722926, -648985, -202581, 322268, 590981, 606249, 574711, 517523, 279063, -109806, -355423, -249808, 107003, 487513, 754189, 840722, 704849, 398135, 59532, -218802, -410139, -441992, -249704, 29837, 131878, 8910, -106153]
38921a06153K5766r750j90924j60293J64129L90581K10392j72664l83181l78621
38911f10718l47248l01277j00505J91226K96428J21391q3054o4060J06002J73934
38901f17881N5654j01017j34472j5640J85025L50854L63636K19816Q1246P8059
38891D65280R8958l4097k09179j22183K05583L36634L4884l38783l46825j15769
38881b5497m9679j10392Q8869N24368O64648K60163k62891m17885k52231o8309
38871C51164P4138K51076L62342K78053J01894j1821j22236k99137l50858q5618
38861E48997K91231L70373N6520l68772o05834n15665q9530M49956O38485K19127
38851I94888m39128o97579m04966L088J35931M5490l8513m5418k7062j6503k5091
$$ y = [-106153, -80387, -90137, -281061, -441354, -277225, 113356, 323748, 151084, -232097, -610718, -957966, -1259243, -1359748, -1168522, -872094, -750703, -833757, -897817, -791815, -617881, -562227, -663244, -797716, -813356, -628331, -277477, 86159, 305975, 387221, 465280, 564238, 530141, 320962, 198779, 404362, 740996, 775880, 437097, 90272, -25497, -75176, -185568, -96699, 427669, 1092317, 1352480, 1089589, 671704, 419473, 351164, 425302, 676378, 1038720, 1316773, 1418667, 1406846, 1284610, 985473, 634615, 548997, 840228, 1210601, 1267121, 898349, 292515, -223150, -312680, 137276, 775761, 994888, 555760, -141819, -546785, -543697, -407766, -362276, -400789, -446207, -473269, -489772, -514863]
38840e14863l3352L3458J72673K00695n156k21905j16724K44302M23176J92602
38830C74906j89347l70299l12875j92775r6921K4782K14643M15046M88259L48411
38820G03830J28068J01466L17187M58821K62494r6543k83193k77123k45170j47050
38810I22787R1450J81465j86084o54112m96456K88667Q03677M17075m31485q98864
38800C8120p42798l09219P7764L09487L51684K58839J48118k4204l79616o83939
38790i55764m48892K84753P65254N10324k071q7251J54890J81596l8183r3356
38780B71300P7448J55471R0158J24548K22147R7934j76916k17917k6677l6811
38770E80685l41090m66719j32451K94443L62805J25816j00453j90101j52999M7865
$$ y = [-514863, -548215, -514757, -342084, -141389, -146545, -368450, -485174, -240872, 182304, 374906, 185559, -184740, -497615, -690390, -787311, -762529, -547886, -132840, 355419, 703830, 831898, 933364, 1250551, 1709372, 1971866, 1875323, 1592130, 1315007, 1069837, 922787, 1014237, 1195702, 1009618, 355506, -140950, 147717, 951394, 1368469, 936984, 38120, -704678, -1013897, -936133, -626646, -274962, -16123, 131995, 107791, -271825, -955764, -1404656, -1119903, -354649, 155675, 153604, 66353, 221243, 402839, 364656, 271300, 348748, 504219, 594377, 718925, 941072, 1039006, 862090, 644173, 617496, 580685, 239595, -227124, -359575, -65132, 297673, 423489, 323036, 132935, -20064, 27801]
38760B7801L54563N35349M61835K58113M7836j87106l87400l73599j72717o9716
38750D94959j65368k06585m4113Q4041l1332j91203j12183J32677K81665K67899
38740E10457J72367J4561j51504j51731L7075J49174K4073r4320O1833L39499
38730I11484M16806K75934Q4974j66417n17228p09868m60359M7708L52458L21595
38720E57087J90491J00655K4603N3110K74082M10903R9357m59042o54753l49348
38710B47145l8920j0371N5325L73411N51411K27320k66006l82741j62293k9472
38700E64809o7477l1888Q8131P0707n9558o9348n724j42989m12177l90732J4744
38689d41502L37140K00423j78667l67504k76880j04699J0672L5588m0716j04444
$$ y = [27801, 382364, 917713, 1379548, 1637661, 1685497, 1498391, 1110991, 737392, 564675, 494959, 329591, 123006, 78893, 162934, 131602, -59601, -171784, -39107, 242558, 510457, 682824, 697385, 545881, 394150, 431225, 580399, 604472, 510152, 571985, 911484, 1328290, 1604224, 1689198, 1522781, 1005553, 295685, -164674, -116966, 235492, 557087, 747578, 848233, 872836, 925946, 1200028, 1610931, 1710288, 1251246, 596493, 247145, 208225, 197854, 253179, 626590, 1178001, 1405321, 1139315, 756574, 594281, 564809, 497332, 465444, 553575, 624282, 564724, 495376, 489652, 346663, -65514, -456246, -441502, -104362, 96061, -82606, -450110, -726990, -831689, -821017, -785429, -826145, -930589]
38679i30589O6203M60193P05453N20421J15014j12033j08619j18088k28358k87894
38669H1703k04249l5086J78424M00466M68860K60020m0231j25536j7709j2068
38659I54594j68181k21745q4732m6138k86433n31260m49985j37855Q2260J34084
38649g55391J68200K24670K23402J95315K30084K49759J09876j07329j69171n2498
38639C16917L5036N619n128O1282M6702j44719l37521l01110l8527K52848L90576
38628B81975K90954j6648l42712m21475j73528J87931M08154M51048L97647K10948
38618A274294j84958o18950p07427k95710K67461M59339J62966k16048k34793
38609i3826J09216M57285N28502L36124L9984k09001k66215n9855K41511L16875
$$ y = [-930589, -864386, -404193, 301260, 821681, 936695, 824662, 716043, 597955, 369597, 81703, -122546, -157632, 20792, 421258, 890118, 1150138, 1109907, 984371, 966662, 954594, 786413, 564668, 479936, 433798, 147365, -383895, -833880, -971735, -889475, -755391, -587191, -362521, -139119, 56196, 286280, 536039, 645915, 538586, 369415, 316917, 351953, 357572, 352444, 413726, 460428, 315709, -21812, -322922, -361449, -108601, 281975, 572929, 556281, 213569, -207906, -381434, -193503, 214651, 665699, 1063346, 1274294, 1089336, 470386, -237041, -532751, -265290, 194049, 357015, 140967, -93826, 15390, 472675, 1001177, 1337301, 1377285, 1168284, 902069, 842214, 1083725, 1400600]
38599A400600Q3638j67073j78882q6701j42184k58708j52314J46401K80421Q9316
38589A014514j82901k77905k17686j01244Q7982K95786K91853n164k91056k23583
38579C90596J17190L56300L19947J61700M1692p0137k33256l68338l41891j42268
38569B31535Q4048J66183R9086R0637L23005O47316O70298K39734l00961m81140
38559A769741k08470K35401N67325O69200M96080R5691k78789l20690j3483L26626
38549C338632M01186K04456o1033j98198j22066R5474K39496J38840j17253k65407
38539C654127j92447l1929Q5023J83573K67963J93754j09569m23508m56098k17870
38529B953019M489K8821n3369j05808j52646k56795l30372k14798R0189L91165
$$ y = [1400600, 1484238, 1317165, 1138283, 1051582, 909398, 650690, 498376, 644777, 925198, 1014514, 831613, 553708, 336022, 234778, 322760, 618546, 910399, 905235, 614179, 390596, 507786, 864086, 1184033, 1345733, 1387425, 1317288, 1084032, 715694, 373803, 231535, 315583, 481766, 580852, 671489, 994494, 1641810, 2312108, 2551842, 2250881, 1769741, 1561271, 1796672, 2363997, 3033197, 3529277, 3624968, 3346179, 3025489, 3012006, 3338632, 3739818, 3944274, 3883241, 3685043, 3562977, 3658451, 3897947, 4036787, 3919534, 3654127, 3461680, 3429751, 3514774, 3698347, 3966310, 4160064, 4050495, 3626987, 3170889, 2953019, 2957508, 2986329, 2932960, 2827152, 2674506, 2417711, 2087339, 1872541, 1962730, 2353895]
38519B353895M92992L55980Q1523j67939k31706m2935K75938M69005L72483O9697
38509D028933k16164l47569l40640k53919j08409O4156J73059J37759M134n3084
38499C088256J00334L64805M53266K29535m9262r651L03812M25797J41816j14851
38489D933857J49253O94574P96176K74569k05984m8400M92120P65071O68166O99366
38479I218768J168385J774292K052030J966924J929499K348457L255406M306104
38471B8019865N111342N590790N994983O610469P578796R027660J1144982J3974056
38463I3052943J7386473K1485997K6601603L2064562L4888113L0710007J7364773
38456B73554471k037601k0145791l0282768l0875506k5420544j8611686j2862054
$$ y = [2353895, 2846887, 3202867, 3284390, 3116451, 2884745, 2841810, 3117748, 3586753, 3959236, 4028933, 3812769, 3465200, 3124560, 2870641, 2762232, 2826388, 2999447, 3137206, 3141340, 3088256, 3188590, 3553395, 4006661, 4236196, 4186934, 4177283, 4481095, 4906892, 5048708, 4933857, 5083110, 5777684, 6573860, 6848429, 6642445, 6594045, 7086165, 7851236, 8519402, 9218768, 10387153, 12161445, 14213475, 16180399, 18109898, 20458355, 23713761, 28019865, 33131207, 38721997, 44716980, 51327449, 58906245, 67933905, 79078887, 93052943, 110439416, 131925413, 158527016, 190591578, 225479691, 256189698, 273554471, 271516870, 251371079, 221088311, 190212805, 164792261, 146180575, 133318521]
38449A33318521q143634l908013j08868L354510O938935J0488956J2430257J0685067
38441A65055731M567969m336813j3026298j8718908k0184096j8184589j4748944
38434H0424052j1646466r361614p503803n873199m717438m129394l783135l394919
38426C0014084l034429k823233k661367k420904k134798j843256j497276j135623
38418A2463198r07705q11482o73902m91200m73096o13457n81739k67183o5374
38409G578060k91674o23086n52574j88290j05249m58885p37860n11970l5728J20271
38399D193015j91119n71374o12020l41524r0391l6468l5269P2659J61151K2732
38389B571392k15342j86135J52014L67228J49368k26472k97731o0031J12495O2590
$$ y = [133318521, 125174887, 121266874, 121158006, 124512516, 131451451, 141940407, 154370664, 165055731, 169623700, 165286887, 152260589, 133541681, 113357585, 95172996, 80424052, 68777586, 59415972, 51912169, 46038970, 41321532, 37192138, 33409003, 30014084, 26979655, 24156422, 21495055, 19074151, 16939353, 15096097, 13598821, 12463198, 11555493, 10744011, 10070109, 9578909, 9105813, 8492356, 7910617, 7643434, 7578060, 7286386, 6663300, 6110726, 5922436, 5817187, 5358302, 4620442, 4108472, 4072744, 4193015, 4001896, 3430522, 2818502, 2476978, 2386587, 2350119, 2314850, 2387509, 2548660, 2571392, 2356050, 2169915, 2321929, 2689157, 2838525, 2612053, 2314322, 2254291, 2366786, 2429376]
38379B429376O827J15304K56942K34489M9228j40158j76030q850K13544K07697
38369C188369j06095l78901j98814L26263O36559M29568J2534j80398j43849j51488
38359C433748k61162k74339j22651j581n5646j42403m7442J76022K46891L0941
38349B982378k66254l59891k45044j54791j86624j55324J00552M20018M91662
38340B626682K58668j6625r5155l0313n1017k63449n25999n97776l94907r7466
38330H12643K9645p1738k00384j49200P8192L36267N01048M92833K70928o7231
38320B033003k86247k56829j24048j00456j79831k07380j43845p6666l5133J2614
38310F35182K8221l4885q4067j3606O2555m9772k61792k53984N2713L43126L37682
$$ y = [2429376, 2436203, 2551507, 2808449, 3042938, 3092166, 2952008, 2775978, 2767128, 2980672, 3188369, 3082274, 2703373, 2504559, 2830822, 3467381, 3896949, 3909483, 3729085, 3585236, 3433748, 3172586, 2898247, 2775596, 2774015, 2718369, 2575966, 2528524, 2704546, 2951437, 2982378, 2716124, 2356233, 2111189, 1956398, 1769774, 1614450, 1715002, 2135020, 2626682, 2885350, 2868725, 2773570, 2743257, 2692240, 2428791, 1902792, 1305016, 910109, 812643, 842288, 770550, 570166, 420966, 499158, 835425, 1336473, 1829306, 2100234, 2033003, 1746756, 1489927, 1365879, 1265423, 1085592, 878212, 734367, 657701, 622568, 635182, 663403, 628518, 544451, 530845, 593400, 543628, 281836, 27852, 80565, 423691, 761373]
38299G61373J48411N7646J24434J87045J40323L9887k3396l2519l6575q2765j42090
38288A141774j18421J0567J04886J8161k02437l97953n14838n71236m85089j81669
38278a196255J64185K80801K05836K35920M33604N28954M02392K85990L13020
38269A654447K51870n3363l34954l24550k09167k77784l87656k38717L0158L8432
38259A48716j56548j28414J75556L14995Q7704j41431n3296J42679J27033j1014
38249E05980j9785M4779k2017j43893q6936R0175Q9218j35974k80487j46613P4855
38238c0698J00838o3832j85083j23015L7969J38901J23822N3646j0867q9657k07646
38227b55622k65659r9948K67326N39278M37336M9178k45332k04915K4461J20585
$$ y = [761373, 909784, 967430, 1091864, 1278909, 1419232, 1459119, 1435723, 1403204, 1366629, 1283864, 1141774, 1023353, 1033920, 1138806, 1156967, 954530, 556577, 41739, -529497, -1014586, -1196255, -1032070, -751269, -545433, -309513, 124091, 653045, 1055437, 1341427, 1654447, 1906317, 1852954, 1518000, 1193450, 984283, 706499, 318843, 80126, 110284, 148716, -7832, -136246, 39310, 354305, 442009, 300578, 247282, 389961, 516994, 505980, 486195, 530974, 508957, 365064, 278128, 368303, 457521, 321547, 41060, -105553, -30698, 70140, 6308, -178775, -301790, -263821, -124920, -1098, 52548, 41681, -47976, -255622, -521281, -621229, -353903, 185375, 622711, 671889, 426557, 221642, 246103, 366688]
38217C66688m8708l24089m55649l32648k9900K99210N18031N12650K15540k59970
38207D61155n55183l40082K47919O02327K81190m23400p62415l87628K69917N50106
38197e6094L06122m9439j13302J00105L04954L07798J36938p9255k27162k19092
38187D11573k2044K56796L94645K70976K8292j04360j31208k60077n12263n88227
38177b55897k90365J14498K27728R6738J13496L49778L92710j4012n20999o27645
38167d13970l31325k0373R7927J26749J45104R7786N390k8058l7571j40997k36848
38156g36186p3841K97533M67678K28452q5579m0261L20337N83651N16354K59505
38146A737643N3983r436J3768J7038o1176j56031j49420p3971r9888k26573j92814
$$ y = [366688, 317980, -6109, -461758, -794406, -824306, -525096, -7065, 505585, 721125, 461155, -94028, -434110, -186191, 416136, 697326, 273926, -488489, -876117, -606200, -56094, 250028, 200589, 87287, 187392, 492346, 800144, 937082, 857827, 630665, 411573, 389529, 646325, 1040970, 1311946, 1340238, 1235878, 1104670, 844593, 332330, -255897, -546262, -431764, -204036, -107298, 6198, 355976, 748686, 734674, 213675, -413970, -745295, -765668, -667741, -540992, -395888, -298102, -292712, -320770, -358341, -499338, -736186, -810027, -512494, -44816, 183636, 98057, 57796, 378133, 961784, 1478138, 1737643, 1791626, 1782190, 1795958, 1812996, 1751820, 1595789, 1446369, 1372398, 1272510, 1045937, 853123]
38135H53123J15532L66353J78243l06297n77221m43604k16671j71035j76107j3284
38125c90968K26832K92554J48969j2248n9061l6747l4320p2052j22663j56831
38115b16535j53786j01317R161J73318L30946L72452K60383J08642M8013N3480
38105H84757K2336k7525n034L8388m7114k30296k91042j62362n3643j14096j87379
38094a73010p4990J26073J57006l0806k25914k24917j1078K74554M25732L15742
38084E58392N9232p2965q784N837k02560m09072l09669k5973M4227j58419k43769
38073g63523N4058M98014O81104N08276K01871J0252M5471K47709L84523K42344
38063B110099o3295j45760J49777N06645N88318N13847O06197Q44393R33109Q40054
$$ y = [853123, 968655, 1335008, 1513251, 1206954, 629733, 186129, -30542, -201577, -377684, -390968, -164136, 128418, 277387, 265139, 206078, 169331, 135011, 62959, -59704, -216535, -370321, -471638, -462477, -289159, 41787, 414239, 674622, 783264, 831277, 884757, 907093, 879568, 874534, 912922, 865808, 635512, 344470, 182108, 128465, 14369, -173010, -248000, -121927, 35079, 4273, -221641, -446558, -457636, -183082, 242650, 558392, 617624, 544659, 535875, 541712, 339152, -69920, -379589, -405562, -361335, -519754, -763523, -709465, -211451, 469653, 977929, 1179800, 1190052, 1235523, 1483232, 1867755, 2110099, 2046804, 1901044, 2050821, 2557466, 3145784, 3659631, 4265828, 5110221, 6043330, 6883384]
38053F883384Q63275J136997J460684J717522K068993K545868K828802K731922
38045B2237447K570000K638269K564171J671565p5807j938517l203600l711760
38037B2751768l596683l012861k274910j799685j646281j460124j084313q28322
38029G048589q72063q69618n55265l01288n09416q06502n56462L2581J22155m36318
38019B296393q20043m83344P3769J68599q3463j66717m0565k1763j21705r8541
38009G02620J1650m2378k29616k80882j70393j09525r7473P9109L84144M94755
37999G42011K96861M2581p6882j62003k91440l14514j30674R1309J53679Q1043
37989D31971j6581j24232k05728j08396K06633M70596L60961r0927n00965n37136
$$ y = [6883384, 7746659, 8883656, 10344340, 12061862, 14130855, 16676723, 19505525, 22237447, 24807447, 27445716, 30009887, 31681452, 31605645, 29667128, 26463528, 22751768, 19155085, 16142224, 13867314, 12067629, 10421348, 8961224, 7876911, 7048589, 6176526, 5306908, 4751643, 4450355, 3940939, 3134437, 2577975, 2610556, 2732711, 2296393, 1476350, 993006, 1066775, 1235374, 1151911, 985194, 944629, 922866, 801161, 702620, 714270, 671892, 442276, 161394, -8999, -118524, -215997, -136888, 247256, 742011, 1038872, 1081453, 1004571, 842568, 551128, 236614, 105940, 197249, 350928, 431971, 415390, 291158, 85430, -22966, 183667, 654263, 1015224, 924297, 423332, -113804]
37979a13804k33724R2247J79762O4428k1755L0729R5538P0969Q6886K66429M18645
37968I36350K58300j16581k95310j37267N0572K1471o5400L827J12882N7520o7653
37957G58711m9359L7020n3371k87505l73418k26362r0229j25081j67262l7771
37947f14627J47571J67182M0648j6940Q2156K01604J98213R6950K1966L9200R7780
37936D61703Q7537m2590j91926j79412J9053J57039k4484m33910o89697n90711
37926a427398l41456j96727q4970J86800N00388N27761K48151K8579J02657K74504
37916a81711K89942K14103K17254K29786R5206j04648j74916j35055j23774q4968
37906B41219J15129L20267K08537j93652m80331m23958k24602r2004O4794L30427
$$ y = [-113804, -347528, -255281, -75519, -11091, -32846, -2117, 93421, 164390, 251276, 517705, 936350, 1194650, 1078069, 782759, 645492, 696064, 717535, 652135, 655962, 768844, 826364, 758711, 709352, 746372, 693001, 405496, 32078, -194284, -284513, -409594, -576856, -614627, -467056, -299874, -259226, -276166, -194010, 7594, 205807, 302757, 324723, 363923, 461703, 549240, 506650, 314724, 135312, 154365, 311404, 286920, -146990, -836687, -1427398, -1768854, -1965581, -2050551, -1863751, -1363363, -835602, -587451, -558872, -456215, -181711, 108231, 322334, 539588, 769374, 864580, 759932, 585016, 449961, 326187, 241219, 356348, 676615, 885152, 691500, 211169, -212789, -437391, -529395, -464601, -134174]
37896a34174M86132L13968j3666j57137r2039o4365j33037p9708J79871L72016
37886F77861K09334j91585m21562k83791l5638n3945l46695n39094l53807N2538
37876a286384L27087L55492K93058K58999K20742J60085J31831J24460N5563m9123
37866E91810n6879L6548N6264r1001k71850l21136k25686m2681J93232L90107
37856B58728L99001K15807M2259K7316P2115L255j77162l26416l48667k53327
37846h7091j09861q896J4671M4555J64328K92674K96182K29929K31456J99749
37836A267696r4916n32061o48033k75658J76088K87983J35132j7510j58488l25755
37826a85522k90983J05391N25534N06573J23047j73010k60889m02422o16239n38453
$$ y = [-134174, 351958, 665926, 652260, 495123, 403084, 338719, 205682, 125974, 305845, 677861, 887195, 695610, 274048, -9743, -45381, -99326, -446021, -985115, -1338922, -1286384, -959297, -603805, -310747, -51748, 168994, 329079, 460910, 585370, 640933, 591810, 534931, 571479, 627743, 536742, 264892, -56244, -281930, -324611, -131379, 258728, 657729, 873536, 915795, 943111, 1015226, 1018481, 841319, 514903, 166236, -87091, -196952, -205848, -191177, -146622, 17706, 310380, 606562, 836491, 1067947, 1267696, 1172780, 640719, -7314, -282972, -106884, 181099, 316231, 298721, 140233, -185522, -476505, -371114, 154420, 660993, 784040, 611030, 350141, -52281, -668520, -1206973]
37816a206973m0750M58626N25888K44250O77k6915M0584N2038k873k7075P5884
37805I3361K79758M02726K77130m7293l50134m60912l57197j28170M5585r373
37795b54519k23336k71405Q805L25050L00386M698j79242j19361k7268m0121n7468
37784e33781M823J09575K36756L28987J66915l25386p16368m86500J71112M96856
37774e47011K19767q9164O5111L94208L98179J51315L8095P1836O083j16039o2128
37763E30252O7253o4207m26586n82821l19852N6852J70334J6946j56549j82737
37753h91115m8293J84273L89940M13786K05853r5711k61983j68205P9975K23296
37743C1816J26055l3331K1847K60642L58817J77713k4134o114Q3208p663j83137
$$ y = [-1206973, -1247723, -789097, -263209, -18959, -18282, -45197, -4613, 47425, 44552, 17477, 93361, 373119, 775845, 1052975, 1005682, 655548, 194636, -162561, -290731, -245146, -254519, -477855, -749260, -740455, -415405, -115019, -110321, -289563, -408924, -436192, -476313, -533781, -528958, -419383, -182627, 146360, 313275, -12111, -728479, -1214979, -1043867, -547011, -327244, -416408, -351297, 42911, 441090, 592405, 630500, 702336, 708419, 592380, 530252, 597505, 533298, 106712, -476109, -795961, -739109, -568775, -551829, -708378, -891115, -939408, -755135, -365195, 48591, 254444, 158733, -103250, -271455, -191480, 31816, 157871, 124540, 146387, 407029, 765846, 943559, 919425, 913311, 996519, 988856, 805719]
37732H05719j51263Q9434K37470J37090m1506r1751j4638O1260L3421j13187k65180
37721F86869k42189m4414M6970j80121m98384m82639r5414K49659K46096M6769
37711b66798l6746M5267J10364M4471q1173j34871o9160M8899J28839J72935K40005
37700B02032K77177J38043j33575k31609o16K61045J96999o0871j11545N2522
37690E89602O7063j15809r5091K51231M23512L1265n35117o07351j58900K38519
37680H8924K35849K8710j01805j38639j50657j13346k6345M0463J07748K69086
37670B39988M45934M06828J29786j00012r2579k0757j06055k51889k31779q3113
37660C36352k7194q2438o1122O0584Q2013m2140o8391J14424J94049j44163o48577
$$ y = [805719, 654456, 743890, 981360, 1118450, 1076944, 985193, 970555, 1031815, 1065236, 952049, 686869, 444680, 400266, 447236, 267115, -231269, -713908, -809322, -559663, -313567, -266798, -303544, -258277, -147913, -103442, -184615, -319486, -388646, -339747, -210908, -37973, 202032, 479209, 617252, 483677, 252068, 251452, 512497, 709496, 648625, 537080, 589602, 656665, 540856, 445765, 696996, 1120508, 1151773, 616656, 9305, -149595, 88924, 324773, 353483, 251678, 113039, -37618, -150964, -177309, -136846, -29098, 239988, 685922, 1092750, 1222536, 1122524, 1029945, 1009188, 903133, 651244, 419465, 336352, 309158, 226720, 165598, 226182, 308195, 266055, 197664, 312088, 506137, 361974, -286603]
37649b86603p05986j35421N34800P16231M39790J72469J30591Q7010j52211l92853
37639D07817l35062k6660J87276J19439n2740p5751L2734L2621k00274m91481
37629d02081n46574k69113J33459L63784L32406K05773J58197J57427P1972q0642
37619A24608j50777j22174j64912l28424l69312p8075L46708N01181L12233J08331
37609A79387J30061K37027K00381M2847p3304j05995j01606n6830O312l8170k37567
37598A82543m16773l93679k10429J9735L08499N97302N87538J33482l52289l41805
37588A14124K1453Q4095l30082o43952m20139R611J48252J03401K68569N41945
37578a02723M33769j23706n77447m58064N4177L99254K79303p0193j67837J76068
$$ y = [-286603, -992589, -1128010, -593210, 123021, 562811, 735280, 865871, 952881, 800670, 407817, 72755, 46095, 233371, 352810, 300070, 224319, 257053, 289674, 89400, -402081, -948655, -1217768, -1084309, -720525, -388119, -182346, -24149, 133278, 205250, 124608, -26169, -148343, -313255, -641679, -1010991, -1089066, -742358, -241177, 71056, 179387, 309448, 546475, 746856, 789703, 716399, 610404, 508798, 451968, 458280, 420110, 182543, -234230, -627909, -838338, -818603, -510104, 87198, 674736, 808218, 455929, 114124, 135577, 219672, -110410, -754362, -1174501, -1164890, -1016638, -913237, -644668, -102723, 331046, 207340, -370107, -828171, -773994, -374740, -95437, -165630, -333467, -157399]
37568a57399N97153N63238N2957l81922l52739j31566j58830l58825l53933j46010
37558h27876p5842j81675j33580J38462K63859M8711j72535n5420K37323L23140
37548d35433J40935p5390j64833j19384M7851K75176M10580L88813L23196K62522
37538A054033M7200l71595o63300m77195L3377L55362K46095n6688k29557j86308
37528b48576K134K25784L13528J48088j14935j73531j701J08680L0390K0115K49427
37517E59403M17374J76815k54180l43382m7498J04045j75273m76302l14871J43258
37507b10611L52039J79421J3353J14777K55977J10500k71429n37985m46690r4470
37497e35118J82747J14578k05885l57638p0354L80569M72227J07775k73937k95455
$$ y = [-157399, 439754, 1002992, 1055949, 674027, 321288, 189722, 30892, -327933, -681866, -827876, -903718, -1085393, -1218973, -1080511, -816652, -767941, -940476, -995896, -758573, -435433, -294498, -369888, -534721, -654105, -606254, -331078, 79502, 468315, 791511, 1054033, 1101233, 729638, 66338, -410857, -377480, -22118, 223977, 167289, -62268, -248576, -246442, -20658, 292870, 440958, 326023, 152492, 150791, 259471, 289861, 309976, 559403, 976777, 1153592, 899412, 556030, 508532, 612577, 437304, -38998, -353869, -210611, 141428, 320849, 334202, 448979, 704956, 815456, 544027, 6042, -440648, -535118, -352371, -237793, -443678, -801316, -871670, -491101, -18874, 88901, -185036, -480491]
37487d80491n8117J26103J26941j7950k24392k96537k6295M27574N48707J26526
37477B52069l59387l49983L9992K72213J86357P8735Q7973L1294j03947r374M12659
37466E38601P49411N72584P805m17352l73267k4397K00567N1522k93128m34281
37456E78065k50841n0744q7118j43358R1051M11790L26094j50219m29801k01083
37446I3836J37022J14611j47118k33152q4810K1296k9338p3709r418L3978r2445
37435b69247l27676m45461k99128r643J45104Q3630M6737K25736M19554L27619
37425a02775N1859o2948j2726j02618l24680k86846J05376M15653L56133K08971
37415B45399K67330L30103J46275o3226k981J18898o8718m24415m83176j64742
$$ y = [-480491, -538608, -412505, -285564, -303514, -527906, -824443, -850738, -423164, 125543, 252069, -107318, -457301, -417309, -145096, 41261, 119996, 207969, 239263, 135316, 125942, 538601, 1288012, 1860596, 1868401, 1451049, 1077782, 1053385, 1253952, 1305474, 1012346, 578065, 327224, 276480, 189362, 46004, 137055, 548845, 874939, 724720, 294919, 93836, 230858, 345469, 198351, -34801, -119611, -98315, -127653, -201362, -210780, -176802, -269247, -596923, -1042384, -1341512, -1351155, -1206051, -1122421, -1075684, -849948, -430394, -102775, -50916, -113864, -126590, -229208, -553888, -840734, -735358, -319705, 36428, 245399, 512729, 842832, 989107, 925881, 922900, 1041798, 973080, 548665, 65489, -99253]
37405i9253J89565L57649L46081R0927m29343q40891o74718o7803L15797J54353
37395f57636j77990k40178q0409K0070j659k6156J5435J43251L62961N38879M26165
37384C22733J86l95087l96645m0489K88600K82259J8696j33425P8569M70775N92954
37373A089126K67225j93287m14587m13264m13109m12973k58117j9337P2370M2200
37363f53753J55907M42881N73574L26703q5692k91755j79700M2294P3319k10977
37353A92801n84956o18555j66681L76213N28351L06253P7371k2554j26243j93266
37343b31266l7437J89806Q1867l25573m65109p5376L64633L56648R0596J8902
37333c2309R4272n3821l93829m81772j53772K14577K36838r64j18614P1244L76858
$$ y = [-99253, 90312, 447961, 794042, 884969, 455626, -385265, -1059983, -1127786, -811989, -657636, -835626, -1075804, -1156213, -1136143, -1137802, -1163958, -1148523, -1005272, -642311, -103432, 322733, 322919, -72168, -468813, -509302, -220702, 61557, 80253, -53172, 25397, 496172, 1089126, 1356351, 1163064, 748477, 335213, -77896, -490869, -748986, -768323, -695953, -653753, -497846, -54965, 518609, 845312, 759620, 467865, 288165, 330459, 403778, 192801, -392155, -1010710, -1177391, -801178, -272827, 33426, 110797, 88243, -38000, -231266, -268703, -78897, 2970, -322603, -787712, -863088, -498455, -141807, -51211, -32309, 61963, 8142, -385687, -867459, -1021231, -806654, -569816, -570780, -689394, -618150, -241292]
37322b41292M73734K74991J9722m5823J846r1045l32783m60094l50034j63804
37312i14582q207K09526M41560L80591n2604m18019k96323J13007K94798J37404
37302a12849l3973j6360P7075J26591J31911M0604j93325l65852j94137K10711
37292c29604L86180J37409k09254l15310k76696l37426m18710k46978J70202N00172
37282i40015N12315L14740J20744k5387j83317l07034k56707n837K77511L93226
37272i9761K91006O4792j59029k71767j96751L9775K77291L58533K88634J75770
37262G68493N3184j13683k66148k63846r2080Q3869J21575M1275o6215j36535
37252A29889j06104N2077K11889J74238o1553k58085k44677j01588L3835J51949
$$ y = [-241292, 232442, 507433, 527155, 481332, 483178, 392133, 59350, -400744, -750778, -914582, -922789, -713263, -271703, 108888, 56284, -361735, -658058, -545051, -250253, -112849, -146822, -163182, -86107, 40484, 172395, 212999, 19674, -346178, -540315, -329604, 56576, 193985, -15269, -330579, -607275, -944701, -1363411, -1610389, -1440187, -940015, -427700, -112960, 7784, -17603, -200920, -507954, -764661, -770498, -492987, -99761, 191245, 256037, 97008, -174759, -371510, -331735, -54444, 304089, 592723, 768493, 821677, 707994, 441846, 178000, 85920, 169789, 291364, 332639, 266424, 129889, 23785, 75862, 287751, 461989, 400436, 142351, -102326, -203914, -170079, -18130]
37242a8130K47503K10617J1121j62326j25296N8260K05331K53721K15741M6545
37232I43087k35692m22599l38490j12684j5154q5213j37041q1511j4017N551M4884
37221d48879J43268K28919K19180Q4672j64921m23606m62084j46052L12091N03060
37211a54352K75705r5738k55970j62865o1517j38818k95307k75666L16K91437
37201h72775K84845k8903l35621l60121j22405J88236M24186M95850L63281J38317
37191A74890L9139J06668J18356o9150k60696j99149M6210J93099J38222M467
37181B92056j17186k27186k64672j38605Q0816J97927J41714L5143Q886O3179
37171G2072J08159N8864p4799j48567l2988J62664J91246N2302K1334J71434J87242
$$ y = [-18130, 229373, 439990, 451111, 288785, 163489, 221749, 427080, 680801, 896542, 943087, 707395, 284796, -53694, -166378, -181532, -266745, -403786, -485297, -499314, -493763, -448879, -305611, -76692, 142488, 227160, 62239, -361367, -823451, -969503, -657412, -154352, 121353, 25615, -230355, -393220, -454737, -593555, -888862, -1164528, -1164212, -872775, -587930, -616833, -952454, -1312575, -1434980, -1246744, -822558, -326708, 36573, 174890, 214029, 320697, 439053, 369903, 109207, -89942, -43732, 149367, 287589, 292056, 174870, -52316, -316988, -455593, -374777, -176850, -35136, 7, 8893, 72072, 180231, 239095, 164296, 15729, -17259, 145405, 336651, 388953, 410287, 581721, 768963]
37160G68963j07306l68741k38899N6633O3368j64389j96865K4068J26013k0262
37150e7417j13811R528J20267L9645j02990k03030l42459m53423k58070K21587
37140a140173M95833K44225k04593l31830r1388J93172L52230M45646M66668L09012
37130G38802m126k91389m11020l64045k47494j81811k01357j74571L9361L32856
37120g64794M35417K94528J46918J45494J63579O9137o0192j25264j69309k17734
37110h2220j84682o8303j199J2427J38136L60063M03148J83654N541P7069J66802
37099A010436K9600j51324j06916J7879p2639k68690k09883J15698L48781K91667
37089A004609R7216n5903j51779k02478k00668k02900k43633k25514r9395k5565
$$ y = [768963, 661657, 292916, 54017, 110650, 174018, 9629, -187236, -163168, -37155, -57417, -171228, -161700, -41433, -1788, -104778, -307808, -650267, -1103690, -1361760, -1140173, -644340, -400115, -604708, -936538, -1027926, -834754, -482524, -36878, 429790, 738802, 734676, 443287, 32267, -331778, -579272, -761083, -962440, -1137011, -1097650, -764794, -329377, -34849, 112069, 257563, 421142, 490279, 430087, 304823, 135514, -82220, -266902, -335205, -336404, -323977, -185841, 174222, 577370, 761024, 766565, 843634, 1010436, 1040036, 888712, 781796, 799675, 727036, 458346, 248463, 364161, 712942, 1004609, 1101825, 1045922, 894143, 691665, 490997, 288097, 44464, -181050, -280445, -306010]
37079c06010j07307j30809J07225L75078L07374J3798o8367J17482J76889n4187
37069D31166k48684j52538L3157M9172j4575L4795J29856R0654o9799k10848k69286
37058a96930k28606o2268J31616J31074r4897k54526j13119J57462K22564M6394
37048b61236j14557r0318N1549J89117K74888K75480J47461p5215k52158k39109
37038i4098j8588K49186L26470J30967j43765k57617k51167l53431n49222n12895
37028a474160j07785L18971L88180K26029K23550L85539L18004j14695n09137
37019c45504m61756r1620K04426L00492L60853M36532L69261J09369j51212k53258
37009D77583k54400k22210o2271K52278M55439K71551j46388l54594k05790o668
$$ y = [-306010, -413317, -544126, -436901, -61823, 245551, 259349, 190982, 308464, 485353, 431166, 182482, 29944, 63101, 112273, 97698, 132493, 262349, 353003, 283204, 72356, -196930, -425536, -487804, -356188, -225114, -320011, -574537, -687656, -530194, -307630, -261236, -375793, -466111, -414562, -225445, 49443, 324923, 472384, 397169, 145011, -94098, -112686, 136500, 462970, 593937, 450172, 192555, -58612, -412043, -961265, -1474160, -1581945, -1262974, -874794, -648765, -425215, -39676, 278328, 163633, -345504, -807260, -898880, -694454, -393962, -33109, 403423, 772684, 882053, 730841, 477583, 223183, 973, -61298, 190980, 646419, 917970, 771582, 416988, 211198, 204530]
36999B04530j0668o0622P1647K52911J95222n4939j69967m8823M7313p9270k79537
36988F7797l20516k12630j16389p9786m3430q839k7184o1229o535J53498L18178
36977c37065L85522L09619P4955k60505m99895m37495j17703J59496J86173R2668
36967d44230J16759K22242J52480j49250m02363l54738r5937J21480K09357K30400
36957c93800K01551J18043P3258J29969J42292n4639l26377l75751j83147k8125
36947f96726m8746p5986K4231J40234J59692J52683J76991J55631Q3311R8165
36937A69480K10910K35912J31467R2130J33786l3986m64424p03297m28489R749
36927f46762J37409J01473L04466N70197L68451k25354n16057k16270J65833J56221
$$ y = [204530, 193862, 133240, 204887, 457798, 653020, 598081, 428114, 379291, 426604, 347334, 67797, -252719, -465349, -581738, -661524, -704954, -713793, -740977, -802206, -808741, -655243, -337065, 48457, 358076, 433031, 172526, -327369, -764864, -882567, -723071, -536898, -444230, -327471, -105229, 47251, -101999, -504362, -859100, -955037, -833557, -624200, -393800, -192249, -74206, -948, 129021, 271313, 216674, -109703, -485454, -668601, -696726, -745472, -821458, -797227, -656993, -497301, -344618, -167627, -11996, 71315, 169480, 380390, 616302, 747769, 839899, 973685, 939699, 475275, -228022, -656511, -646762, -509353, -407880, -103414, 466783, 835234, 609880, 93823, -122447, 43386, 199607]
36917A99607n4499r2412q152l9010j38360j27039o8101j44121l09704l37887j21741
36906a241419K33635N07691M70852R0644k83479k00503K93523O13171L68047j38594
36896G13568l70342k45150p1159j9696j4393k2975j06499j94421j01621J79599
36886b53089M00245L27897n464l46665m50734k88940o6275J4984J238P6936K20645
36875c69222J88978q4826l12384k23768P0499K64941K45388J09135n3547j96267
36865c61073k43572j75783j11707j47348j94509j29077o928K9821j3900k313J35891
36854a220498L50425N43589O02604M47278J46619j05809k14977k60747k83244
36845E240j80193N7845K13988J32058l5000o7177j1608n0144j66683j92319r3634
$$ y = [199607, 145108, 52696, 44544, 5534, -132826, -259865, -327966, -472087, -781791, -1119678, -1241419, -1007784, -500093, -29241, 61403, -222076, -422579, -129056, 484115, 852162, 713568, 343226, 98076, 26917, 7221, -7172, -30147, -136646, -331067, -432688, -253089, 147156, 475053, 469589, 122924, -327810, -616750, -683025, -668041, -666803, -589867, -369222, -180244, -265070, -577454, -801222, -730723, -465782, -220394, -111259, -164806, -361073, -604645, -780428, -892135, -1039483, -1233992, -1363069, -1369997, -1340176, -1354076, -1356389, -1220498, -870073, -326484, 276120, 723398, 870017, 764208, 549231, 288484, 5240, -174953, -117108, 96880, 228938, 193938, 126761, 115153, 65009, -101674, -293993, -387627]
36834c87627J4055P6623J21960J38396J19506J51824K74589L44800K32475M3912
36824A130513n6033j19271k61256l52048j76923J45991K46161L0604j73986r9932
36814C13820J05001J43822m792j14526p4721m4833k05698m48911m43111o8019
36804h41968L37134L39990k5687l14422k77442j02109J5761J48026L02856K28980
36794a88881j31448l53776j02907K92128K91323n4883k47883j13689Q5684J97048
36784c27284K87409K67633k7841l65368k78485J97941M89213L08748J7639q639
36774E60966J21992J64381J16607J5536k15227m64458m04804l1692J94924L9700
36764I7925j24077K2228J56656j14442m82848l40517K51529O05042L64710j09445
$$ y = [-387627, -373572, -296949, -174989, -36593, 82913, 234737, 509326, 854126, 1086601, 1130513, 1074480, 955209, 693953, 341905, 164982, 310973, 557134, 587738, 413752, 313820, 418821, 562643, 557851, 443325, 368604, 323771, 118073, -330838, -773949, -841968, -504834, -164844, -190531, -504953, -782395, -884504, -868743, -720717, -417861, -188881, -320329, -674105, -777012, -484884, -193561, -248444, -496327, -610016, -524332, -327284, -39875, 227758, 199917, -165451, -443936, -245995, 243218, 551966, 569605, 560966, 682958, 847339, 963946, 979482, 764255, 299797, -105007, -136699, 58225, 97925, -26152, -3924, 152732, 38290, -444558, -785075, -533546, 71496, 436206, 326761]
36754C26761l58679l55420k94572k29102j00226Q9604K75907L79529L07024L4790
36744G5616k80586l99031k31845R3932L83239N11765M65003L19282J52277m4867
36734A044785k79349m06543k64606K5477J58448J06486J53819L36985K53326k85224
36724H43604p84013o74813j24070K37884K06774J17370J71224J84884K9218j52655
36714E5407k42805k67081j65867J50789M63990L92552k3933l18416k87453k21495
36704d64312k81082j76207K23118M68906J89675k40309k33305J01389J88097m7894
36694b71924j17087J32294K31561q8670l89244j91027K88510M94462L25994J17229
36684E32098K5850q0341k06084j76740m0788q0789l00419l18172J7809L00323
$$ y = [326761, -31918, -387338, -681910, -911012, -1011238, -921634, -645727, -266198, 40826, 75616, -204970, -604001, -835846, -741914, -358675, 153090, 618093, 937375, 1089652, 1044785, 765436, 358893, 94287, 119764, 278212, 384698, 538517, 875502, 1128828, 843604, 59591, -615222, -739292, -501408, -294634, -177264, -6040, 178844, 208062, 55407, -187398, -454479, -620346, -469557, -5567, 386985, 363052, 44636, -242817, -464312, -745394, -921601, -698483, -229577, -39902, -280211, -513516, -412127, -224030, -271924, -389011, -256717, -25156, -113826, -503070, -694097, -405587, 88875, 414869, 532098, 557948, 477607, 271523, 94783, 53995, -26794, -327213, -645385, -627576, -327253]
36674c27253J67391r0576M3281M86030O48289K93878j82725l90832l85475l25495
36664f3487j41327J82597L61908J98984n0914o6452K804j95197n45455n39446
36654h55985l4446M90326N63003K66268j0002q6793n9850m0748n6806j13666j84122
36643a22821j83818p7331L6605M1632l2866m9304N2504J68461J44744k5748j45539
36632a93481k8867K00265J73835k23913n77038m07820J51107M82604L08709K5160
36622h9439O3230K75219K59048L5945r688K19102L56929J25566k70138m50641
36612E15133l31939j07449O6948J57619J22331p2939l02830l36299j09104J73616
36602b24913K75625J83535N2628j7311m3255l9804K5782J32303J68772P5804l7745
$$ y = [-327253, -159862, -250438, -207157, 278873, 927162, 1221040, 1038315, 647483, 262008, -63487, -204814, -22217, 339691, 538675, 487761, 421309, 424113, 228916, -316539, -855985, -890431, -400105, 162898, 429166, 419164, 332371, 272521, 231773, 174967, 61301, -122821, -306639, -383970, -347365, -305733, -338599, -387903, -335399, -166938, -22194, -47942, -193481, -222348, -22083, 151752, -72161, -649199, -1057019, -905912, -423308, -114599, -89439, -26209, 249010, 508058, 544003, 534315, 753417, 1110346, 1235912, 965774, 515133, 183194, 75745, 142693, 300312, 422643, 349704, 46874, -289425, -398529, -224913, 50712, 234247, 286875, 269564, 226309, 186505, 212287, 344590, 513362, 589166, 551421]
36591E51421j1541J40767K06095J7191l13010m71545k88937M4862J82148K4955
36581H2406j73643j53661K9935J32680N5898j03521k52221l38570k45317Q6167
36571h79847M12823L79726M5200j08611J33352L52959J17872l31921m37665j70080
36561d86192j8698j78227k78126m9112K20038J60753r1632j24830J48415M28888
36551b68723M60973K64577K653j68668j60295l3056K2468p1745j35267J3681K37331
36540A63929K25157o0050k92785j88684J55682L96048L19945L4368j79631j66137
36530D07842m4969k8273j02282l2347K43290M06155J46346l50696n70395l12519
36520b37848Q3193K03558K2674j91109k14620L049L49754N33698K61711l44363
$$ y = [551421, 539880, 680647, 886742, 903933, 590923, 119378, -169559, -124697, 57451, 82406, -91237, -244898, -214963, -82283, -26385, -129906, -382127, -720697, -966014, -879847, -467024, -87298, -42098, -150709, -17357, 335602, 453474, 121553, -316112, -486192, -504890, -683117, -961243, -1010355, -790317, -629564, -721196, -846026, -697611, -268723, 192250, 456827, 459480, 290812, 130517, 97461, 119929, 48184, -87083, -73402, 163929, 389086, 329036, 36251, -152433, 3249, 399297, 719242, 753610, 573979, 407842, 362873, 334600, 232318, 199971, 443261, 849416, 995762, 645066, 74671, -237848, -154655, 48903, 71577, -119532, -334152, -331103, 18651, 552349, 814060, 469697]
36510D69697o80319l08373M08132O49982J37969n43773p20185m00871p0904K9571
36500a029074Q1291K43480L81311L03679N1788j55497j55131L2781K27400K28424
36490B10452K6274j47544r3178P6188R0219p3902j66703o5494O0440P3701R0563
36479H1016K04081K22169n5919m41469n14187j43114L59652N86911L81116j09999
36469E70257n40681n76131j90006K51752L57611J36551q4268j04157j9903J1487
36459a87488k6262n6515k38J71609L45921L03253J5546k10219j30196K4000j23726
36448A25685m39158m08252M2004L48320J25410k71814l00250J7774K56601K39146
36438b64534J35221P0038P394n4643q1940j38586k58941k71672l3792K40735K05085
$$ y = [469697, -210622, -518995, -110863, 539119, 677088, 133315, -586870, -987741, -1058645, -1029074, -947783, -704303, -322992, -19313, 32475, -123022, -278153, -245372, -17972, 210452, 236726, 89182, -3996, 72192, 162411, 88509, -78194, -143688, -83248, -9547, 81016, 285097, 507266, 451347, 9878, -504309, -647423, -287771, 299140, 680256, 570257, 29576, -546555, -736561, -484809, -127198, 9353, -74915, -179072, -198975, -187488, -213750, -270265, -270503, -98894, 247027, 550280, 565826, 355607, 225411, 249411, 125685, -313473, -721725, -679721, -331401, -205991, -477805, -778055, -760281, -503680, -264534, -129313, -59275, -51881, -106524, -188464, -327050, -585991, -857663, -891455, -650720, -445635]
36427d45635r9507k71404j14547J42153K57953K95569L71609L58454P9814l23133
36417B51326m66071j80736K44351L62860P6580k42422j91980J64571L90895K57183
36407F66557N800n6831J0366k1533j20830o4615J53988L02315K73696J86031J02193
36396A437137n9098k77468l69831k69612j28931m5887P0606K43215K77349M9694
36386I27174k47962l53302k76505k02108j71473q4258M9657Q2425l4799j48294
36376d59445q1889J60463L92652M11519J92229m8654n0993J75808L25695J69979
36366A187364j33306k44592j02032J0342j15671l04382k48153L2429J88233L4744
36356C04976j62924p5098J62447J10243k75385m73310j30361L59064L68498p0685
$$ y = [-445635, -545142, -816546, -931093, -788940, -530987, -235418, 136191, 494645, 574459, 251326, -214745, -395481, -151130, 211730, 288310, 45888, -146092, 18479, 409374, 666557, 672357, 615526, 625892, 604359, 483529, 418914, 572902, 875217, 1148913, 1334944, 1437137, 1378039, 1100571, 730740, 461128, 332197, 286310, 356916, 600131, 877480, 927174, 679212, 325910, 49405, -152703, -324176, -408434, -358777, -276352, -311151, -459445, -541334, -380871, 11781, 423300, 615529, 566875, 515882, 691690, 1017385, 1187364, 1054058, 809466, 707434, 717776, 602105, 297723, 49570, 81999, 270232, 304976, 142052, 66954, 229401, 339644, 64259, -409051, -539412, -180348, 188150, 117465]
36346A17465l52789k04173o09q6172k58514j73708J19218L50053M42536M50877
36336D04184L27125P1943q9491q631R3652l3317k28071j91716k2728k4831j13084
36325A85035N7917M06814M40126M3628l02179k85498j97236l12434l57535k2455
36315c43817M07479M41122J32103o5466n671Q2430J05300J66571J76346p8227
36305A018170m47553n11760k47596j08556k87727m00705j58878J11789O343k69750
36295a296223k10541K01013M71474K89660j38294m27657l88006q0758K31453K34812
36285a113067p7224k62790N5925O07118P56733L65689m8484p5219R4136J11267
36275D14084K017l8002n0164j53105k07080l0606J89755J14420j77254k36474
$$ y = [117465, -235324, -439497, -440106, -526278, -784792, -958500, -839282, -489229, -46693, 404184, 731309, 803252, 713761, 705130, 798782, 765465, 537394, 345678, 322950, 298119, 185035, 242952, 649766, 1089892, 1133520, 831341, 545843, 348607, 36173, -321362, -343817, 63662, 504784, 636887, 571421, 565750, 648180, 753480, 920051, 1096397, 1018170, 570617, 58857, -188739, -297295, -585022, -985727, -1144605, -1032816, -1026473, -1296223, -1506764, -1305751, -834277, -544617, -682911, -1110568, -1498574, -1579332, -1347879, -1113067, -1190291, -1453081, -1397156, -790038, -33305, 332384, 283900, 208681, 302817, 414084, 416101, 378099, 327935, 174830, -32250, -62856, 126899, 241319, 64065, -172409]
36265a72409R4494M51818M97782L49991K61280J74358r0943l87689l56716J2324
36255H34290K64490N1976m03597o05800m02376r2719K9766L123J0601P8615J03834
36244a27797M8505n5444k06893l64518l52236n7552L04245L75380J34756o6919
36234c68473k3563N9440l8831j83798j56444m9617p0920j25324L2763L25102M19754
36223a79911K52918Q4683P247j72498m47108m60088r0427K20992Q9441j90390
36213h85141q3790L38205N06778K37614k6828N1673K12698O3635l20336n58806
36203d64298m93660k62381k807K27832L30519K35108P0141M1667J52286K28204
36193F2611K00456J56619J27502M8310m5251j2573J36690J98391P3191q9681j43242
$$ y = [-172409, -77915, 373903, 871685, 1221676, 1482956, 1657314, 1566371, 1178682, 821966, 834290, 1098780, 1150756, 747159, 141359, -261017, -353736, -323970, -320847, -310246, -231631, -127797, -79292, -134736, -341629, -706147, -1058383, -1115935, -811690, -436310, -301554, -368473, -392036, -332596, -371427, -555225, -711669, -761286, -832206, -957530, -924767, -599665, -179911, 73007, 157690, 164937, -7561, -454669, -914757, -1005184, -784192, -694751, -885141, -968931, -630726, -123948, 113666, 86838, 138511, 351209, 414844, 94508, -464298, -957958, -1220339, -1223146, -995314, -664795, -429687, -359546, -317879, -165593, 62611, 263067, 419686, 547188, 595498, 550247, 537674, 674364, 872755, 945946, 856265, 713023]
36182G13023j27680r1003L4107J97552J24573k86980o53865n26654j6715L37031
36172b96611K75335L7880j18377k25357l26725k69271J1111K64674K41074O1767
36162c44500N2251K97238N41341M85959R0529l62067m82199j83185J40575O2020
36152B97962k65814k83465J20792L71104O0639l86699l30244J37867L82535J83042
36142B87719o4793p0384k4669j45909l06271l00449j51191K7866J99022K85107
36132b63952J56407j09383k01421J5500K75735K68388L6897j43828j30553J2979
36122h3231J70489K42092J57990l5344j69020j33098j0216L0465q2030k55461
36112a67364k89292m4344L24431M02188q29m80685m64284K1260L74882K71939
$$ y = [713023, 585343, 494340, 528447, 725999, 850572, 563592, -90273, -616927, -633642, -296611, -21276, 16604, -101773, -327130, -653855, -923126, -912015, -647341, -406267, -344500, -292249, 4989, 546330, 1032289, 1122818, 760751, 278552, 95367, 235942, 297962, 32148, -251317, -130525, 240579, 301218, -85481, -415725, -277858, 104677, 287719, 222926, 152542, 127873, -18036, -324307, -624756, -775947, -748081, -549059, -263952, -107545, -216928, -418349, -402849, -127114, 141274, 178171, 34343, -96210, -83231, 87258, 329350, 487340, 451996, 282976, 149878, 139662, 170127, 88097, -167364, -456656, -501000, -176569, 225619, 224790, -255895, -720179, -698919, -324037, -52098]
36102e2098O6074J55863L53169K13748k68348o55390o22242k32835K40281N31558
36092b70220M99979K40667K3009j5066m122p2302j25016m8727P0015J21589J63191
36081E82997K15020R1397k86588o10985n46903k23428l0611n2818o6340j0902
36071i39161o1533k30197k71064n6886K44176M35443M83112L98842J88997k2249
36061A69480o4406J5087j8072k18646l42749j89450J19092L03707K49314P8305
36051A01662j9788P408J3633j51987l70099l44014o2240R1792q5818k21910Q5029
36040i56332N55563N68815R0132k99353k93898j99651k68411k74574o604L10776
36030g73537L99132L37400K89334J83756k5248j29427k8527J5052j62636k55180
$$ y = [-52098, 13976, 169839, 523008, 736756, 468408, -186982, -809224, -1042059, -801778, -270220, 229759, 470426, 493435, 478369, 474247, 401945, 276929, 228202, 298217, 419806, 582997, 798017, 889414, 602826, -8159, -555062, -778490, -809101, -861919, -928259, -939161, -1000694, -1230891, -1501955, -1558841, -1314665, -879222, -396110, 2732, 191729, 169480, 105074, 120161, 102089, -116557, -459306, -648756, -529664, -225957, 23357, 101662, 81874, 89282, 102915, -49072, -419171, -763185, -825425, -733633, -819451, -1041361, -956332, -400769, 168046, 258178, -41175, -335073, -534724, -803135, -1077709, -1084313, -773537, -374405, -37005, 252329, 436085, 410837, 281410, 252883, 267935, 105299, -149881]
36020a49881N502K95700J72495j48098q2104L69441N79125K39735k18952l10376
36010G52587j01984P2974J11553P9670l7567k31589l20403j71569N2127Q9569
36000B95368o9418k12099j97601o0697J07492K26987K32390J55126J56972L32454
35990I66974N07453M00536O65l75321m63799l50957k78413k70974j46326J30204
35980A20042L19760K34065J8254n5285K8670N3977o1027j58573j37725j22998
35970B39160k19543k89145j47388J26194K56650J13883j50309k86286j75420R1463
35960d40741K85518K32602K642j51278j02301m721n0103j74757j51745Q7555L66597
35949a00732M72769L44545Q2451j28333j44798n306J03000Q5426N9498J40725
$$ y = [-149881, -144379, 151321, 323816, 175718, 93614, 463055, 1042180, 1281915, 1062963, 752587, 650603, 723577, 835130, 914800, 877233, 645644, 325241, 153672, 205799, 295368, 225950, 13851, -183750, -244447, -136955, 90032, 322422, 477548, 634520, 966974, 1474427, 1874963, 1875628, 1500307, 1036508, 685551, 407138, 136164, -10162, 120042, 439802, 673867, 692121, 636836, 665506, 719483, 658456, 499883, 362158, 239160, 19617, -269528, -416916, -290722, -34072, 79811, -70498, -356784, -532204, -440741, -155223, 77379, 80021, -71257, -173558, -178279, -228382, -403139, -554884, -467329, -100732, 372037, 716582, 799033, 670700, 525902, 520596, 623596, 709022, 768520, 909245]
35939I09245K28739J57358m1332k01926k81220l55319m08411l26619r9618J34792
35929b84311K39855J48743j43229m86028n68603k41460K12735L86135K74320K06858
35919b54985K88293K76169O1804j20180j03200m5394p9851n3586J31433K37555
35909C38058O8500j45645j04233M6315l9352l00140l62799j66172k4203n1586
35899g41257P590K63801M22339K43529q0245k40754k24640j65293m1800J82770
35889c73960L17306J62430j27161k02732l811J87067J64034K1112q1288j50486
35879h7489k68555m09206m49013l10851o2283J11333Q0791l8349J7520K77297
35869a138805M04158J40650k57815l25442m5416J51479O3945p871J79983L69530
$$ y = [909245, 1137984, 1295342, 1254010, 1052084, 770864, 415545, 7134, -319485, -419103, -284311, -44456, 104287, -38942, -524970, -1093573, -1335033, -1122298, -736163, -461843, -254985, 33308, 309477, 371281, 251101, 147901, 102507, 22656, -30930, 100503, 338058, 406558, 260913, 156680, 202995, 163643, -136497, -499296, -665468, -689671, -741257, -733667, -469866, -47527, 196002, 115757, -124997, -349637, -514930, -556730, -373960, -56654, 105776, -21385, -224117, -227928, -40861, 123173, 144285, 62997, -87489, -356044, -765250, -1214263, -1525114, -1587397, -1476064, -1395273, -1433622, -1416102, -1138805, -734647, -593997, -851812, -1177254, -1222670, -1071191, -1007246, -1015117, -835134, -465604]
35859d65604K12313j41424k34943L6337L07422K62351k2624k81328l58292k47858
35849i33650k9060J59063K09493J68914J69277K32078K60567K19862J70754J09088
35839G36386n2497k79300l58813j71749R2077J31688r1954l05499k57842j2670
35829e70173J50106P7658j08472k29313k87124l58837l49793r5315K87799M40404
35819a043060K65943J06811K10674L07737M6860l70957m25295m6487K94417K77511
35809c75846R5532M3615J37038K70234M08280M60189K74246p2558k67976k00740
35799G72014j04777j22634q2877Q2452R6333j72361l45741p6891L43817L93983
35789G83318J07418o3512l1453j39902m48853n38026j89785K14797K46728K1663
$$ y = [-465604, -253291, -394715, -629658, -593321, -285899, -23548, -46172, -327500, -685792, -933650, -962710, -803647, -594154, -425240, -255963, -23885, 236682, 456544, 627298, 736386, 683889, 404589, 45776, -125973, -33896, 97792, 5838, -299661, -557503, -570173, -420067, -342409, -450881, -680194, -967318, -1326155, -1675948, -1771263, -1483464, -1043060, -777117, -670306, -459632, -151895, -105035, -475992, -901287, -947774, -653357, -375846, -280314, -236699, -99661, 170573, 578853, 1039042, 1313288, 1240730, 972754, 772014, 667237, 544603, 461726, 544178, 640511, 468150, 122409, 45518, 389335, 783318, 890736, 827224, 795771, 655869, 207016, -331010, -520795, -305998, -59270, -37607]
35779c7607n3763J13267K49518J46249j04413k66677k03033J7776J76808J20149
35769A58274l8552k2139K48431N02031M14734j2326m56229o09922m50846k00257
35759d66801p2191p6693o8525L0650J27312J08767K1766J2464J31991K82765L25556
35748C57061J81414j10052l62681l58376r5228J51564J33785o8754j73495n9611
35738d04373J28787K02360J17741l0827j09398n3668O1200J17447J45838K78965
35728D54072M59646M11065M0286l44378m21518k62138j15976r842J35478J82957
35718E29652l8402l39193l56957r5715R5089N8068k4996j5964K3603P1122J64245
35707G0552J66669r2846m10851l59432P3548M12120L61100J19355r0113l22649
$$ y = [-37607, -91370, 21897, 271415, 417664, 313251, 46574, -156459, -138683, 38125, 158274, 119722, 97583, 346014, 848045, 1262779, 1250453, 794224, 184302, -266544, -466801, -538992, -615685, -684210, -653560, -526248, -417481, -395715, -383251, -251260, 31505, 357061, 538475, 428423, 65742, -292634, -387862, -236298, -102513, -171267, -344762, -404373, -275586, -73226, 44515, 13688, -95710, -149378, -88178, 29269, 175107, 454072, 913718, 1324783, 1365069, 1020691, 599173, 337035, 221059, 211217, 346695, 529652, 491250, 152057, -204900, -300615, -205526, -147458, -172454, -188418, -164815, -93693, 70552, 237221, 144375, -266476, -625908, -552360, -140240, 220860, 340215, 250102, -72547]
35697g2547n46958m62050J9152N04500O51093N93308N41394L51835j13402n49524
35687I16801n81557l23110j41101q8465Q838J17368J03609R9400K88279M63250
35677H63312K89756q0140j74518L8341Q5875k42529n69243n23794k20494O2139
35667d71295K77907M29437L39222n6819m22022l81309m7134J44507O3533J6095
35657a07878K05110L83750K34590j24126k91656j65071n2294j50259k30860n2384
35647c51078J86780J41617j02246j58345J9164Q8231m3733l4547K62511M61850
35637D70204K39765j38008k44380j05347Q703R8423K90705M26807K85666M0034
35627A372572n194K2656k00155n04447l91394J05568L63314J22234j17888N8971
$$ y = [-72547, -619505, -1081555, -1062403, -557903, 93190, 686498, 1227892, 1579727, 1466325, 916801, 335244, 12134, -128967, -217432, -208594, -91226, 12383, 111783, 400062, 863312, 1153068, 1072928, 898410, 936751, 1022626, 780097, 210854, -312940, -533434, -471295, -193388, 236049, 575271, 518452, 96430, -284879, -332013, -187506, -123973, -107878, 97232, 480982, 715572, 591446, 299790, 134719, 82425, -67834, -298694, -351078, -164298, -22681, -124927, -283272, -264108, -175877, -219610, -254157, 8354, 470204, 709969, 571961, 327581, 222234, 230937, 329360, 620065, 1046872, 1332538, 1372572, 1367378, 1390034, 1189879, 685432, 294038, 399606, 762920, 885154, 767266, 826237]
35617H26237K97752O8281m45211n82688j67283K72489K59986l8979j38446Q7338
35607D39476K79507J21782k11349k86030j2815K24244J17433j36609j63801L3532
35597D05370J44109N1966n4200m3235k023j1553l1537m4458q0939q1687L7356
35586B89169J75826J46127n841k0410K02442M60694M97058K12885l02877p45136
35576I09937p12543j58346L84795L83095P98j87025o3982k4448j96072k32812
35566A03397J2315K21535K11591K07201K77901J22353k56269l02177J94573N51602
35556A344022J59441n05892n60049m1017K34424m4034l55841l09423j61005k04496
35546d43870k83156j85522m6855n8930j27269q0010M7880J55779K71696M08360
$$ y = [826237, 1123989, 1192270, 747059, 164371, -2912, 269577, 529563, 490584, 352138, 439476, 718983, 840765, 629416, 343386, 330571, 554815, 672248, 535639, 371838, 405370, 549479, 601445, 547245, 504010, 501987, 490434, 458897, 414439, 333500, 251813, 289169, 464995, 611122, 605281, 584871, 787313, 1248007, 1745065, 1957950, 1655073, 909937, 197394, 39048, 423843, 806938, 807736, 620711, 556729, 532281, 336209, 103397, 115712, 337247, 548838, 756039, 1033940, 1156293, 900024, 597847, 792420, 1344022, 1503463, 997571, 437522, 396505, 630929, 586895, 231054, -78369, -239374, -443870, -727026, -912548, -959403, -1018333, -1145602, -1225612, -1177732, -1021953, -750257, -341897]
35536c41897M24977K27590l7287j53121r0879K2234Q6901P8133o017j43836k78337
35525b11539l49498l09936j35946J01487K22833J19758p3802j17565M1043K31793
35515d81372L01662K54612J59651N7979k3588p4521j16863j32587k0668K48709
35505A73014M84516M40987J24442k14883l92600m37319m22937l29892j40768N5615
35495f59825J46467J17663L6399m0035q5139n8228R3802L34499M55937K29469
35485E71009k58874n50142l07208J96517L69746Q3847j91326j18233N2816j0434
35475a62282j56538o6874J57018J71718k0382j13976l3786J0057m8236o1400j3851
35464c38532l3709o6051N4644J97889N1667k97743l74495l6404K78373K33369
$$ y = [-341897, 83080, 310670, 273383, 120262, 29383, 51617, 138518, 216651, 210634, 66798, -211539, -561037, -870973, -1006919, -905432, -682599, -562841, -636643, -754208, -713165, -481372, -179710, 74902, 234553, 292532, 268944, 194423, 77560, -55027, -75695, 173014, 657530, 1098517, 1222959, 1008076, 615476, 178157, -244780, -574672, -715440, -659825, -513358, -395695, -359296, -399331, -484470, -542698, -448896, -114397, 341540, 571009, 312135, -238007, -545215, -348698, 21048, 104895, -86431, -204664, -151848, -162282, -318820, -385694, -228676, -56958, -77340, -191316, -225102, -215045, -263281, -324681, -338532, -372241, -438292, -383648, -185759, -134092, -431835, -806330, -842734, -564361, -330992]
$$ [...]
##END NTUPLES=NMR SPECTRUM
##END=
