##TITLE=31Pdec_B4e-F
 aceton-d6, 64 sc
 16.8.2024
##JCAMPDX= 6.0         $$ Bruker NMR JCAMP-DX V2.0
##DATA TYPE= NMR SPECTRUM
##DATA CLASS= NTUPLES
##ORIGIN= UXNMR, Bruker Analytische Messtechnik GmbH
##OWNER= root
$$ XWIN-NMR		Version 3.5
$$ Fri Aug 16 13:48:54 2024 Russian Standard Time (UT+4h)  she@DPX200
##.OBSERVE FREQUENCY= 81.013821
##.OBSERVE NUCLEUS= ^31P
##.ACQUISITION MODE= SIMULTANEOUS
##.ACQUISITION SCHEME= undefined
##.AVERAGES= 64
##.DIGITISER RES= 17
##SPECTROMETER/DATA SYSTEM= spect
##.PULSE SEQUENCE= zgpg30
##.SOLVENT NAME= CDCl3
##.SHIFT REFERENCE= (INTERNAL, CDCl3, 0, 198.062)
##AUDIT TRAIL= $$ (NUMBER, WHEN, WHO, WHERE, WHAT)
$$ ##TITLE= Audit trail, XWIN-NMR		Version 3.5
$$ ##JCAMPDX= 5.01
$$ ##ORIGIN= Bruker BioSpin GmbH
$$ ##OWNER= she
$$ F:/spectra/data/she/nmr/P31/2/pdata/1/auditp.txt
$$ ##AUDIT TRAIL=  $$ (NUMBER, WHEN, WHO, WHERE, WHAT)
(   1,<2024-08-16 13:48:10.37 +0400>,<she>,<DPX200>,
      <continue with go, POWCHK disabled, PULCHK disabled
       configuration hash MD5:
       00 E9 B6 7A A2 85 ED C7 34 08 36 98 17 FE 4E 26
       data hash MD5: 32K
       13 18 1A 07 D0 43 E8 20 5C 12 A3 E0 F3 61 B2 13>)
(   2,<2024-08-16 13:48:11.92 +0400>,<she>,<DPX200>,
      <Start of raw data processing
       efp BC_mod = 2 LB = 1.5 FT_mod = 6 PKNL = 1 PHC0 = 2469.248 PHC1 = 663.2878 SI = 64K 
       data hash MD5: 64K
       0B 80 48 0D 27 11 47 42 5A BB 17 C3 F8 1E 77 54>)
(   3,<2024-08-16 13:48:24.15 +0400>,<she>,<DPX200>,
      <pk PHC0 = -0.2598437 PHC1 = 0 
       data hash MD5: 64K
       46 7D 07 40 1B A4 83 F2 5D 57 E3 6B 2E 7A 1A FA>)
(   4,<2024-08-16 13:48:29.71 +0400>,<she>,<DPX200>,
      <abs ABSG = 5 
       data hash MD5: 64K
       43 1F 3E 29 1E D7 2E FA AE E3 15 C3 14 21 A1 44>)
$$ ##END=
$$ 
$$ hash MD5
$$ FE 90 01 4F C4 E7 8B 1E 31 17 CF C5 60 93 29 55
##$RELAX= 
##$RELAX= 
##$RELAX= 
##$RELAX= 
##$RELAX= 
##$RELAX= 
##$RELAX= 
##$RELAX= 
$$ Bruker specific parameters
$$ --------------------------
##$DU= <F:/spectra>
##$EXPNO= 2
##$NAME= <P31>
##$PROCNO= 1
##$TYPE= <nmr>
##$USER= <she>
##$AMP= (0..31)
100 100 100 100 100 100 100 100 100 100 100 100 100 100 100 100 100 100 
100 100 100 100 100 100 100 100 100 100 100 100 100 100 
##$AQSEQ= 0
##$AQ_mod= 1
##$AUNM= <au_zg>
##$AUTOPOS= <>
##$BF1= 81.014009
##$BF2= 200.13
##$BF3= 200.13
##$BF4= 200.13
##$BF5= 200.13
##$BF6= 200.13
##$BF7= 200.13
##$BF8= 200.13
##$BYTORDA= 1
##$CFDGTYP= 0
##$CFRGTYP= 5
##$CHEMSTR= <none>
##$CNST= (0..31)
1 1 145 1 1 1 1 1 1 1 1 1 1 1 1 1 1 1 1 1 1 1 1 1 1 1 1 1 1 1 1 1 
##$CPDPRG= <waltz16>
##$CPDPRG1= <>
##$CPDPRG2= <waltz16>
##$CPDPRG3= <>
##$CPDPRG4= <mlev>
##$CPDPRG5= <mlev>
##$CPDPRG6= <mlev>
##$CPDPRG7= <mlev>
##$CPDPRG8= <mlev>
##$CPDPRGB= <>
##$CPDPRGT= <>
##$D= (0..31)
0 1 0 0 0 0 0 0 0 0.06 0 0.03 2e-05 3e-06 0 0 0.0002 0 0 0 0 0 0 0 0 0 
0 0 0 0 0 0 
##$DATE= 1723801601
##$DBL= (0..7)
120 120 120 11 120 120 24 19 
##$DBP= (0..7)
150 150 150 150 150 150 150 150 
##$DBP07= 0
##$DBPNAM0= <>
##$DBPNAM1= <>
$$ [...]
##$SUBNAM3= <"">
##$SUBNAM4= <"">
##$SUBNAM5= <"">
##$SUBNAM6= <"">
##$SUBNAM7= <"">
##$SUBNAM8= <"">
##$SUBNAM9= <"">
##$SW= 400.765351723535
##$SWIBOX= (0..15)
0 1 3 0 0 0 0 0 0 0 0 0 0 0 0 0 
##$SW_h= 32467.5324675325
##$TD= 32768
##$TD0= 1
##$TE= 0
##$TE2= 300
##$TE3= 300
##$TEG= 300
##$TL= (0..7)
0 120 53 12 22 120 120 120 
##$TP= (0..7)
150 150 150 150 150 150 150 150 
##$TP07= 0
##$TPNAME0= <>
##$TPNAME1= <>
##$TPNAME2= <>
##$TPNAME3= <>
##$TPNAME4= <>
##$TPNAME5= <>
##$TPNAME6= <>
##$TPNAME7= <>
##$TPOAL= (0..7)
0.5 0.5 0.5 0.5 0.5 0.5 0.5 0.5 
##$TPOFFS= (0..7)
0 0 0 0 0 0 0 0 
##$TUNHIN= 0
##$TUNHOUT= 0
##$TUNXOUT= 0
##$USERA1= <user>
##$USERA2= <user>
##$USERA3= <user>
##$USERA4= <user>
##$USERA5= <user>
##$V9= 5
##$VALIST= <valist>
##$VCLIST= <CCCCCCCCCCCCCCC>
##$VD= 0
##$VDLIST= <DDDDDDDDDDDDDDD>
##$VPLIST= <PPPPPPPPPPPPPPP>
##$VTLIST= <TTTTTTTTTTTTTTT>
##$WBST= 1024
##$WBSW= 4
##$XGAIN= (0..3)
0 0 0 0 
##$XL= 0
##$YL= 0
##$YMAX_a= 11019
##$YMIN_a= -3168
##$ZGOPTNS= <>
##$ZL1= 120
##$ZL2= 120
##$ZL3= 120
##$ZL4= 120
##$ABSF1= 198.0616
##$ABSF2= -202.7028
##$ABSG= 5
##$ABSL= 3
##$ALPHA= 0
##$AQORDER= 0
##$ASSFAC= 0
##$ASSFACI= 0
##$ASSFACX= 0
##$ASSWID= 0
##$AUNMP= <proc_1d>
##$AZFE= 0.1
##$AZFW= 0.5
##$BCFW= 0
##$BC_mod= 2
##$BYTORDP= 0
##$COROFFS= 0
##$CY= -3
##$DATMOD= 1
##$DC= 0
##$DFILT= <>
##$DTYPP= 0
##$F1P= 0
##$F2P= 0
##$FCOR= 1
##$FTSIZE= 65536
##$FT_mod= 6
##$GAMMA= 0
##$GB= 0
##$INTBC= 1
##$INTSCL= 9.790993e-09
##$ISEN= 30
##$LB= 1.5
##$LEV0= 0
##$LPBIN= 0
##$MAXI= 10000
##$MC2= 0
##$MEAN= 0
##$ME_mod= 0
##$MI= 50
##$NCOEF= 0
##$NC_proc= -10
##$NLEV= 6
##$NOISF1= 182.463
##$NOISF2= 159.3651
##$NSP= 0
##$NTH_PI= 0
##$NZP= 0
##$OFFSET= 198.0616
##$PC= 4
##$PHC0= 2468.988
##$PHC1= 663.2878
##$PH_mod= 1
##$PKNL= yes
##$PPARMOD= 0
##$PSCAL= 0
##$PSIGN= 0
##$REVERSE= no
##$SF= 81.0140089999434
##$SI= 65536
##$SIGF1= 159.3651
##$SIGF2= -187.1042
##$SINO= 113.3802
##$SIOLD= 16384
##$SREGLST= <1H.CDCl3>
##$SSB= 0
##$STSI= 65536
##$STSR= 0
##$SW_p= 32467.5324675325
##$SYMM= 0
##$S_DEV= 0
##$TDeff= 32768
##$TDoff= 0
##$TI= <>
##$TILT= no
##$TM1= 0
##$TM2= 0
##$TOPLEV= 0
##$USERP1= <user>
##$USERP2= <user>
##$USERP3= <user>
##$USERP4= <user>
##$USERP5= <user>
##$WDW= 1
##$XDIM= 65536
##$YMAX_p= 464715974
##$YMIN_p= -207984195
$$ End of Bruker specific parameters
$$ ---------------------------------
##NTUPLES= NMR SPECTRUM
##VAR_NAME=  FREQUENCY,     SPECTRUM/REAL,   SPECTRUM/IMAG
##SYMBOL=    X,             R,               I
##VAR_TYPE=  INDEPENDENT,   DEPENDENT,       DEPENDENT
##VAR_FORM=  AFFN,          ASDF,            ASDF
##VAR_DIM=   65536,         65536,           65536
##UNITS=     HZ,            ARBITRARY UNITS, ARBITRARY UNITS
##FACTOR=    0.49542278885378, 1,            1
##FIRST=     16045.7642231865, 0,            0
##LAST=      -16421.768244346, 0,            0
##MIN=       -16421.768244346, -207984195,   0
##MAX=       16045.7642231865, 464715974,    0
$$ Real data points
##PAGE= N=1
##DATA TABLE= (X++(R..R)), XYDATA
$$ [...]
41648c6228633J0453839J4624180J5971151J3266386N566014l696868q030072
$$ -36228633 -25774794 -11150614 4820537 18086923 23652937 19956069 11925997
41641A1925997n900200m036224q572913j5500733j5639090p748582M77272M910605
$$ 11925997 6025797 1989573 -6583340 -22084073 -37723163 -45471745 -44994473 -40083868
41633d0083868R898023J7197756J8740090P869523q188534j6045039j2889618
$$ -40083868 -30185845 -12988089 5752001 13621524 5432990 -10612049 -23501667
41626b3501667o608061j828960L667476R045278Q465034K053001j520060J584337
$$ -23501667 -30109728 -31938688 -28271212 -19225934 -10760900 -8707899 -10227959 -8643622
41618h643622L550953k149894r247792q199633n81630N179148P180144Q920846
$$ -8643622 -5092669 -7242563 -16490355 -24689988 -25271618 -20092470 -12912326 -3991480
41610c991480Q614409J448413q242298q986920J158516J0106177Q022677k31641
$$ -3991480 4622929 6071342 -2170956 -11157876 -9999360 106817 8129494 7897853
41602G897853l794945O9188N899482Q453328N873213q61057o662104n028304K941244
$$ 7897853 4102908 4172096 10071578 18524906 24398119 23537062 16874958 11846654 14787898
41593A4787898O887004L38029r140960j0189836m092678j822873o398894q590256
$$ 14787898 21674902 22012931 12871971 2682135 -1410543 -3233416 -9632310 -18222566
41585a8222566k144749O032426N866889k084551q468494o913033R44271R301868
$$ -18222566 -20367315 -14334889 -8468000 -10552551 -19021045 -25934078 -24989807 -15687939
41577a5687939J2457554P654082j447501n795157n70518P170946O187422l531883
$$ -15687939 -3230385 4423697 2976196 -2818961 -3389479 3781467 9968889 6437006
41569F437006r741400m797066L268239K338782n932521q376542N07166J0518011
$$ 6437006 -3304394 -8101460 -4833221 -2494439 -8426960 -16803502 -16296336 -5778325
41561e778325J0003961J151723m561437k034318K786348K678399k059603n641703
$$ -5778325 4225636 5377359 815922 -1218396 1567952 4246351 2186748 -3454955
41553c454955m298685k91058Q33074k682479m950440Q67962J1205450J3421858
$$ -3454955 -7753640 -8044698 -7211624 -9894103 -14844543 -13976581 -2771131 10650727
41545A0650727K722509q515366o160608N449548R181593n55793j0838601r488156
$$ 10650727 13373236 4857870 -1302738 4146810 13328403 12772610 1934009 -7554147
41537g554147j26053O696102P741123N976020K947889m37753j199719R00684N88094
$$ -7554147 -7680200 -984098 6757025 12733045 15680934 15243181 14043462 14944146 15532240
41528A5532240m888823r956753r034351n289044m288951m324955r40875L789000
$$ 15532240 10643417 686664 -8347687 -13636731 -17925682 -22250637 -23191512 -19402512
41520a9402512N220557N045586O792920O386114j835537j2067900j1974441p22766
$$ -19402512 -14181955 -9136369 -2343449 4042665 2207128 -9860772 -21835213 -22557979
41512b2557979R066934Q653185K128607l379279n721921l448145N378893J5504605
$$ -22557979 -13491045 -4837860 -2709253 -6088532 -11810453 -15258598 -9879705 5624900
41504E624900J5663281L453022r136210j0947654m974900o02721k4223L65941
$$ 5624900 21288181 24741203 15604993 4657339 -317561 -920282 -944505 -578564
41496e78564J024414l77817l118403m214642k502013K010870Q890329J4044700
$$ -578564 445850 68033 -3050370 -7265012 -9767025 -7756155 1134174 15178874
41488A5178874J1434962K218643m289458l732734l089799p251670q157272J890536
$$ 15178874 26613836 28832479 24543021 20810287 17720488 10468818 2311546 4202082
41480D202082J3176030R183403q119676j8211455r300693O845137J2264964N228017
$$ 4202082 17378112 26561515 18441839 230384 -9070309 -2225172 10039792 15267809
41472A5267809j576093N25978O414360M636460q492195k2661370k3264448r466582
$$ 15267809 13691716 14217694 20632054 25268514 16776319 -5885051 -29149499 -38616081
41464c8616081J791403l815795j7549093j7698403J038934K0526344K4042062
$$ -38616081 -36824678 -40640473 -58189566 -75887969 -74849035 -54322691 -30280629
41457c0280629J5464499P434330K642248k382433m379844J229297O505716j724312
$$ -30280629 -14816130 -7381800 -4739552 -7121985 -11501829 -10272532 -3766816 -5491128
41449e491128j9634384k5838816q984265J5087432K2457711J0233570l452892
$$ -5491128 -25125512 -50964328 -59948593 -44861161 -22403450 -12169880 -15622772
41442a5622772m900431P80435K188339j009480K39869R287197J7468727J4302250
$$ -15622772 -20523203 -19742768 -17554429 -18563909 -18324040 -9036843 8431884 22734134
41434B2734134N36217j1659294j1321605p9859J0048260R864924K238050k947817
$$ 22734134 23270351 11611057 289452 209593 10257853 20122777 22360827 19413010
41426A9413010j101342K973859K633525l313989j2076205k0744978k5118054j9112906
$$ 19413010 18311668 21285527 23919052 20605063 8528858 -12216120 -37334174 -56447080
41418e6447080j855023J6213204K1371468J2018395N22375j914498L111390O841691
$$ -56447080 -58302103 -42088899 -20717431 -8699036 -8176661 -10091159 -6979769 -138078
41410a38078M780108j407310q284640j1673387p194549L959813J1975355P659280
$$ -138078 4642030 3234720 -5049920 -16723307 -23917856 -19958043 -7982688 -323408
41402c23408n378212j3149021o789239Q074778J7878395J4026936l64109j3358298
$$ -323408 -5701620 -18850641 -25639880 -17565102 313293 14340229 13976120 617822
41394F17822j4270203m002749N492990N034813q43932j442753M376567P580350
$$ 617822 -13652381 -17655130 -12162140 -7127327 -7971259 -9414012 -5037445 2542905
41386B542905L457255k157104l295347j840998p28190K744847R920323J3457466
$$ 2542905 6000160 3843056 547709 -1293289 -2021479 723368 10643691 24101157
41378B4101157N983202p132209j2747696p120176J26830K66864l877731m508485
$$ 24101157 30084359 22952150 10204454 3084278 3211108 3477972 -399759 -4908244
41370d908244Q0433N475720Q287927Q554798O775606K753247k480860o086159
$$ -4908244 -4827811 647909 8935836 17490634 24266240 27019487 24538627 18452468
41362A8452468n494726n83279N769124R107060O712949J97833o272154j0434711
$$ 18452468 12957742 12374463 18143587 27250647 33963596 34161429 27889275 17454564
41354A7454564j2804663j3155877r564016k686581K384829J882858j215125j159548
$$ 17454564 4649901 -8505976 -18069992 -20756573 -18371744 -16488886 -17704011 -18863559
41346a8863559K831707O750055Q150575P361183L425376m468442j0677423o149098
$$ -18863559 -16031852 -9281797 -1131222 6229961 9655337 5186895 -5490528 -11639626
41338a1639626P999204J6893270Q890787q422581j7342511j2387928m244526j972789
$$ -11639626 -3640422 13252848 22143635 13721054 -3621457 -16009385 -20253911 -22226700
41330b2226700k016326J407871M648283J114676o255647q003129k055481L166380
$$ -22226700 -24243026 -22835155 -18186872 -17072196 -23327843 -31330972 -33386453 -30220073
41322c0220073P01727n647041o649238Q76636J0586289J3660585P925494j09500
$$ -30220073 -29518346 -35165387 -41814625 -40937989 -30351700 -16691115 -8765621 -8875121
41314h875121k217694K890454Q934800R730090N061892j492013p062174r752661
$$ -8875121 -11092815 -8202361 732439 10462529 15524421 14032408 6970234 -2782427
41306b782427p859190k319539K347402L014870J816210J745177J383310j135874
$$ -2782427 -10641617 -12961156 -10613754 -7598884 -5782674 -4037497 -2654187 -3790061
41298c790061j885484L913357J1735029J1067997P05401p639997n356102J032526
$$ -3790061 -5675545 -1762188 9972841 21040838 21746239 14106242 8750140 9782666
41290I782666Q97804l364509m88967J0015305J3760333J272721j6499357k0337168
$$ 9782666 10680470 7315961 6826994 16842299 30602632 31875353 15375996 -4961172
41282d961172o759418Q455814J0835459L412484j323514N31408J571949l467781
$$ -4961172 -11720590 -3264776 7570683 10983167 9659653 10191061 11763010 8295229
41274H295229r454063q670931j470879N316433P644711P079334N466808J761700
$$ 8295229 -1158834 -9829765 -11300644 -5984211 1660500 8739834 14206642 15968342
41266A5968342m507868j0033754j0534910n710552L01150L209285K365947K56320
$$ 15968342 11460474 1426720 -9108190 -14818742 -14517592 -11308307 -8942360 -8686040
41258h686040r40119j281554j381130j98556L683635Q840382J1145713P938966
$$ -8686040 -9626159 -10907713 -12288843 -12487399 -8803764 36618 11182331 19121297
41250A9121297Q94769n589088p824190n157105q13748J32319l631188o559735
$$ 19121297 20016066 14426978 6602788 1445683 631935 764254 -2866934 -9426669
41242i426669k501911N992463R515839M137098l605993o648254o580637q417898
$$ -9426669 -11928580 -5936117 3579722 7716820 4110827 -2537427 -9118064 -17535962
41234a7535962j1165842r724936l277915M037440Q791841R295744L310445q740311
$$ -17535962 -28701804 -38426740 -41704655 -37667215 -28875374 -19579630 -16269185 -25009496
41226b5009496j9003484j7258057k440027J4809773K2347034J7151572O345686
$$ -25009496 -44012980 -61271037 -63711064 -48901291 -26554257 -9402685 -3056999
41219c056999l3107J820833N986996M499607j102968j462430N257504Q188824
$$ -3056999 -3090106 -1269273 4717723 9217330 8114362 6651932 11909436 20098260
41211B0098260K32305q899733o535647K740458M127855l740151p221741J02571
$$ 20098260 20330565 11430832 4895185 7635643 11763498 8023347 801606 904177
41203I04177Q448394Q557583M341719L342465N263306N911963M009426o42729
$$ 904177 9352571 17910154 22251873 25594338 30857644 36769607 40779033 40136304
41195D0136304p700036j1624434n795766N316910Q638929J413232l946119L77316
$$ 40136304 32436268 20811834 15016068 20332978 28971907 30385139 26439020 26816336
41187B6816336N424683J150733p664850j1249516r753641p209939r46569J0084883
$$ 26816336 32241019 33391752 25726902 14477386 4723745 -2486194 -3432763 6652120
41179F652120J5680776P764555l933174n090859K92295k751560j3729507j6466489
$$ 6652120 22332896 30097451 26164277 21073418 21365713 18614153 4884646 -11581843
41171a1581843n709720M461974L460815n40756M085405J3979269J6780157P997099
$$ -11581843 -17291563 -12829589 -9368774 -9909530 -5824125 8155144 24935301 32932400
41163C2932400n862715j6305786j9207983j5286741q337451j834276L310036O182117
$$ 32932400 27069685 10763899 -8444084 -23730825 -32068276 -33902552 -30592516 -24410399
41155b4410399M080646k189093m880271J696384J1327097J3126230O669224J214815
$$ -24410399 -20329753 -22518846 -27399117 -25702733 -14375636 -1249406 5419818 6634633
41147F634633J330996K696017J538786j154567m473670p427805n061907N192537
$$ 6634633 7965629 10661646 12200432 11045865 6572195 -855610 -5917517 -724980
41139g24980J4741504J2828794K947598k468047j985059m211124p802042j960099
$$ -724980 14016524 26845318 29792916 27324869 25339810 21128686 13326644 11366545
41131A1366545J0169484J0337625m627519j3293141k996961Q144124M58164j4341475
$$ 11366545 21536029 31873654 27246135 13952994 10956033 19100157 19558321 5216846
41123E216846j2401699L181808Q571795k019585j0017769m670431K720276J482438
$$ 5216846 -7184853 -4003045 4568750 2549165 -7468604 -12139035 -9418759 -7936321
41115g936321k188675K54964N113710N443088K515477p2808l915395r629883j1242766
$$ -7936321 -10124996 -9870032 -4756322 686766 3202243 3129435 -785960 -10415843 -21658609
41106b1658609m247897O418704J2270266J0592764M160924l233517p750212p119678
$$ -21658609 -25906506 -19487802 -7217536 3375228 7536152 4302635 -3447577 -10567255
41098a0567255m063367l401389m481807k289052L250695O491890N840271N904471
$$ -10567255 -14630622 -18032011 -22513818 -24802870 -21552175 -15060285 -9220014 -3315543
41090c315543P852731O813673J882170j276374j966600p455083j7988496k0641951
$$ -3315543 4537188 11350861 13233031 11956657 9990057 2534974 -15453522 -36095473
41082c6095473q206761O303518P364019J102949N429979J9971935K4294276Q609892
$$ -36095473 -44302234 -37998716 -30634697 -29531748 -24101769 -4129834 20164442 28774334
41074B8774334j0465787j2719922o79963P202438K180439o990484r086206l645050
$$ 28774334 18308547 5588625 4908662 12111100 14291539 7301055 -1785151 -5430201
41066e430201J868850J988353j916665m052397n07888N741082P225371J160827
$$ -5430201 -3561351 -1572998 -3489663 -7542060 -8049948 -2308866 4916505 6077332
41058F077332n732190m899722K887472Q528420O920442L155103L711884N807723
$$ 6077332 345142 -4554580 -1667108 6861312 13781754 16936857 20648741 26456464
41050B6456464J041527j1318195k0529148j6489060k318794Q873515Q835280K427294
$$ 26456464 27497991 16179796 -4349352 -20838412 -23157206 -14283691 -5448411 -3021117
41042c021117M29265O560580J3524783J1469424r20394j4399001j8223560j0742656
$$ -3021117 -2591852 3968728 17493511 28962935 28042541 13643540 -4580020 -15322676
41034a5322676k31137M443262K306885r63546m69100L679294Q103368R640294
$$ -15322676 -15553813 -11110551 -8803666 -9767212 -10236312 -6557018 1546350 11186644
41026A1186644P435585L370199J19437k113741n184292p861228m645684N812337
$$ 11186644 18622229 21992428 22111865 19998124 14813832 6952604 2306920 8119257
41018H119257J4014200Q780355o626264j5603980q753187L933667P062135j03691
$$ 8119257 22133457 30913812 24287548 8683568 -69619 3864048 10926183 10822492
41010A0822492n836193m654989l486771q017001j2472213q672569M60107L959450
$$ 10822492 4986299 331310 -3155461 -11172462 -23644675 -32317244 -31857137 -27897687
41002b7897687j757034p269868k765731P813859J0720524P84820r892842o632431
$$ -27897687 -29654721 -36924589 -39690320 -31876461 -21155937 -20371117 -30263959 -36896390
40994c6896390P671791J5336333P744760l067100k294782O964048J1221323Q657392
$$ -36896390 -29224599 -13888266 -6143506 -9210606 -11505388 -4541340 6679983 15337375
40986A5337375R295880J4336450J1703125k775836j4988082j3313161p198321
$$ 15337375 24633255 38969705 50672830 47896994 32908912 19595751 12397430
40979A2397430j1340739k0868886j9431257p022197m79630n702922q610438M95887
$$ 12397430 1056691 -19812195 -39243452 -46265649 -46745279 -52448201 -61058639 -60562752
40971f0562752J1302471J2325342R930326J4312009J8536656R612683o159881
$$ -60562752 -49260281 -36934939 -27004613 -12692604 5844052 15456735 9296854
40964I296854q584763O120466J8744092J5003972L946736N76619L523168J579322
$$ 9296854 712091 6832557 25576649 40580621 44527357 45103976 48627144 50206466
40956E0206466o081316r182784k966726N157898O040645j285037j0797358j5421167
$$ 50206466 44125150 34942366 31975640 37133538 43174183 41889146 31091788 15670621
40948A5670621j1544222k105340M593305L009928k683185l468209K727300Q284447
$$ 15670621 4126399 2021059 6614364 9624292 6941107 3472898 6200198 14484645
40940A4484645O120918r83765m007724Q36529P091304N725769l237585r640879
$$ 14484645 20605563 19621798 15614074 16450603 23541907 29267676 26030091 16389212
40932A6389212n648515L457874N744310j257156p885317p318201m915616p281084
$$ 16389212 10740697 14198571 19942881 18685725 10800408 3482207 -1433409 -8714493
40924h714493r686002l838077O164148P147066l688636j3160103r213986M634908
$$ -8714493 -18400495 -22238572 -16074424 -8927358 -12615994 -25776097 -34990083 -30355175
40916c0355175J6200853J8853251J3672034L724085o748097j1344004p292047
$$ -30355175 -14154322 4698929 18370963 22095048 15346951 4002947 -3289100
40909c289100q72032n49422n183392n561528J561458P806000M894725l560673
$$ -3289100 -4161132 -4710554 -9893946 -15455474 -13894016 -6088016 -1193291 -4753964
40901d753964p651576n324027l739518o509805p323477m65362Q338081R137843
$$ -4753964 -12405540 -17729567 -21469085 -27978890 -35302367 -35767729 -27429648 -18291805
40893a8291805L208646K035665R482754J4304893N999062r266076j6918876j3442492
$$ -18291805 -15083159 -13047494 -3564740 10740153 16739215 7473139 -9445737 -22888229
40885b2888229p552593m090338J461032J0275546J3625361N845514m563633n894840
$$ -22888229 -30440822 -34531160 -33070128 -22794582 -9169221 -3323707 -7887340 -13782180
40877a3782180k15472P04593n533095p868161P99454J1657930J2056659L640047
$$ -13782180 -13997652 -13293059 -18826154 -26694315 -25894861 -14236931 -2180272 1459775
40869A459775n05162M524015Q218743R34749j0340340j1186107j425956L751080
$$ 1459775 954613 5478628 13697371 14632120 4291780 -6894327 -8320283 -4569203
40861d569203l188399r435148p38035J5459252J8909994N346397q337068r351196
$$ -4569203 -7757602 -17192750 -17930785 -2471533 16438461 21784858 13447790 4096594
40853D096594m717121n384559q227034m911867J501306K675581J162046N148783
$$ 4096594 -620527 -6005086 -14232120 -19143987 -17642681 -14967100 -13805054 -8656271
40845h656271J0346592M029643j1662468j7620976n135882R930532J0411329K398000
$$ -8656271 1690321 5719964 -5942504 -23563480 -28699362 -18768830 -8357501 -5959501
40837e959501K715644J1103626J2254299K504008l603248K890469J0272469L604907
$$ -5959501 -3243857 7859769 20114068 22618076 19014828 21905297 32177766 35782673
40829C5782673j2884824k1459758j3912866O65147R165686P190093j339639r735716
$$ 35782673 22897849 1438091 -12474775 -11809628 -2643942 4546151 3206512 -6529204
40821f529204j1551698l634626J0099068K0230187J9683232R468863l298749j1147804
$$ -6529204 -18080902 -21715528 -11616460 8613727 28296959 37765822 34467073 23319269
40813B3319269j0439957l360663L021737K604769l073019o311489k962301K135613
$$ 23319269 12879312 9518649 12540386 15145155 12072136 5760647 2798346 4933959
40805D933959K034622k470540l879441J659320Q876415R629898K520223n437569
$$ 4933959 6968581 4498041 618600 2277920 11154335 20784233 23304456 17866887
40797A7866887o356769J20291O395865N238000k146231q099852q401112o875850
$$ 17866887 11510118 11630409 18026274 23264274 21118043 13018191 4617079 -2258771
40789b258771q341892j0465849p015888K251945J0048217J0584189N852704J175855
$$ -2258771 -10600663 -21066512 -28082400 -25830455 -15782238 -5198049 654655 1830510
40781A830510j694296m030150n399065l678630M89835K846879O55401l237523
$$ 1830510 136214 -3893936 -9293001 -12971631 -12481796 -9634917 -8979516 -12217039
40773a2217039l584447N67227M671533M954235L480304M304666O173726L742225
$$ -12217039 -15801486 -15234259 -10562726 -5608491 -2128187 2176479 8350205 12092430
40765A2092430l170290o863042j921108O048458P351069J584337k276660J148284
$$ 12092430 8922140 2059098 137990 6186448 13537517 15121854 12845194 13993478
40757A3993478O940917P591968J863963o385020j3242926j5417504j0274996M52390
$$ 13993478 20934395 28526363 30390326 24005306 10762380 -4655124 -14930120 -14477730
40749a4477730R715782J1920394Q780678N136362J456557m894862j2446501j5342659
$$ -14477730 -4761948 7158446 15939124 21075486 22532043 17637181 5190680 -10151979
40741a0151979j1315226n431491l455365m491659l410584J011189M323362L437011
$$ -10151979 -21467205 -26898696 -30354061 -34845720 -38256304 -37245115 -32921753 -29484742
40733b9484742J725371L903604P869327O621633j183440p982912p437350k742860
$$ -29484742 -27759371 -23855767 -15986440 -9364807 -10548247 -18531159 -25968509 -28711369
40725b8711369m0833J755531P174746J3245763J1843662L147033k712232l4268
$$ -28711369 -28752202 -26996671 -19821925 -6576162 5267500 8414533 5702301 5668033
40717E668033M836256L884938k477896r892899j6400713j8738343j0742904O461161
$$ 5668033 10504289 14389227 11911331 2018432 -14382281 -33120624 -43863528 -37402367
40709c7402367J9427963J6699632L322520p323100j0706692j0458092o293304
$$ -37402367 -17974404 -1274772 2047748 -5275352 -15982044 -26440136 -32733440
40702c2733440M434778J5968687J8583703J3451811J0069654Q857687J093681
$$ -32733440 -28298662 -12329975 6253728 19705539 29775193 38632880 39726561
40695C9726561j1679618j4890868m250827M084156k668382j3752171j2424676
$$ 39726561 28046943 13156075 8905248 12989404 10321022 -3431149 -15855825
40688a5855825k458078J11816n191535l098661J0648474K0806745J5382019J956871
$$ -15855825 -18313903 -18202087 -23393622 -26492283 -15843809 4962936 20344955 22301826
40680B2301826n790968o280834o421456q593450j0211947j0420541r031901l331276
$$ 22301826 16510858 10230024 3808568 -4784882 -14996829 -25417370 -34449271 -37780547
40672c7780547O319352J1863669P215846l76204J569009J1969537J5816963M932993
$$ -37780547 -31461195 -19597526 -12381680 -12757884 -11188875 780662 16597625 21530618
40664B1530618j0433167j5670930r585838j468759L141908M996374L453812l258687
$$ 21530618 11097451 -4573479 -14159317 -15628076 -12486168 -7489794 -4035982 -7294669
40656g294669j0247678q313753K928860J2211723J0997386L923115r0131p21604
$$ -7294669 -17542347 -25856100 -22927240 -10715517 281869 4204984 4114853 3393249
40648C393249l290272p743744r129333o908912n318121m588182P2052R004405
$$ 3393249 102977 -7640767 -16770100 -23679012 -28997133 -33585315 -33513263 -24508858
40640b4508858J4745852J1435670K377733n054489p815050p321694n091227k125728
$$ -24508858 -9763006 1672664 4050397 -1004092 -8819142 -16140836 -21232063 -23357791
40632b3357791k55900n64769j503805o41354K737018P713054J2606041J4941327
$$ -23357791 -23613691 -24178460 -25682265 -26323619 -23586601 -15873547 -3267506 11673821
40624A1673821J2761129O972464M58377n551312j1847678j7693965j9558552j4035087
$$ 11673821 24434950 31407414 31865791 26314479 14466801 -3227164 -22785716 -36820803
40616c6820803p01059J6302186K7468079K3157477N604183q404362n791936M873155
$$ -36820803 -37521862 -21219676 6248403 29405880 35010063 26605701 20813765 25686920
40608B5686920N190405n507755j0239365l580750j211123j1702663j8505395o244920
$$ 25686920 30877325 25369570 15130205 11549455 10338332 -1364331 -19869726 -26114646
40600b6114646J0969790R186592p451127j2581475K270161J7455612J6457993
$$ -26114646 -15144856 -5958264 -13409391 -25990866 -23720705 -6265093 10192900
40593A0192900N039235n571390j3610001j7067246q462915R570771J9624798J2499387
$$ 10192900 15232135 9660745 -3949256 -21016502 -29479417 -19908646 -283848 12215539
40585A2215539J006265j168991m65748q885167k0764892k1272912r784268K068409
$$ 12215539 13221804 12052813 11587065 2701898 -18062994 -39335906 -49120174 -47051765
40577d7051765R575011J5650217J7206162Q235739n399653j0597663o127691k202425
$$ -47051765 -37476754 -21826537 -4620375 3615364 -1784289 -12381952 -18509643 -20712068
40569b0712068j580637K793193J0301493R959471m55260q305172n468853J79862
$$ -20712068 -22292705 -19499512 -9198019 761452 306192 -7998980 -13467833 -13287971
40561a3287971j7187j870281J143728N058984L379727p07234p704N128899R212846
$$ -13287971 -13305158 -15175439 -14031711 -8972727 -5593000 -6300234 -6307938 -1179039 8033807
40552H033807R816589O675344p57925q514492q689939j713596R26130n596282
$$ 8033807 17850396 24525740 23767815 15253323 6563384 4849788 5775918 179636
40544A79636r246642K19799J2492497J1286469k63647o219658m775319q471955
$$ 179636 -9067006 -8847207 3645290 14931759 14668112 8448454 3673135 -4798820
40536d798820j7779037j5863944L548371K1353441J7862418K2921r081369n33433
$$ -4798820 -22577857 -38441801 -34893430 -13539989 4322429 4345350 -4736019 -5269452
40528e269452J2972807J6627736R484375L17775m859588p796780j2706960j8302170
$$ -5269452 7703355 24331091 33815466 34133241 29273653 21476873 8769913 -9532257
40520i532257j7523362p307735M257252O169047j175720o704856l820751K913027
$$ -9532257 -27055619 -34363354 -30106102 -23937055 -25112775 -31817631 -35638382 -32725355
40512c2725355P629919J0993068J4336014J3961775P213473j247574m788686k594007
$$ -32725355 -25095436 -14102368 233646 14195421 21408894 20161320 15372634 12778627
40504A2778627J684964M706743L761705k355274r415142j0417526n461556k238690
$$ 12778627 14463591 19170334 22932039 20576765 11161623 744097 -4717459 -6956149
40496f956149l173476q08390Q163243J3783007P034429m572103p021901l57405
$$ -6956149 -10129625 -10938015 -2774772 11008235 18042664 13470561 6448660 6091255
40488F091255K810576l024447r661710q556110j488434L447621M06224r175656
$$ 6091255 8901831 5877384 -3784326 -12340436 -13828870 -10381249 -9975025 -19150681
40480a9150681j5521761q303813Q568986J6156695L663481j4160918j5413100
$$ -19150681 -34672442 -42976255 -34407269 -18250574 -14587093 -28748011 -44161111
40473d4161111j388788P443499L103141j082121M504914J0864539P690113m57499
$$ -44161111 -45549899 -38106400 -35003259 -36085380 -31580466 -20715927 -13025814 -13483313
40465a3483313m884120o654626r497322r715324l724724L236913N721619P195919
$$ -13483313 -18367433 -25022059 -34519381 -44234705 -47959429 -44722516 -39000897 -31804978
40457c1804978J1431926J3433803Q781190L450608L633800M126064j480864p307591
$$ -31804978 -20373052 -6939249 1841941 5292549 8926349 13052413 11571549 4263958
40449D263958n072132L22203K9591j066334O355871J4223955N387752j6669832
$$ 4263958 -808174 -485971 -456380 -1522714 4833157 19057112 24444864 7775032
40441G775032k7795395j6964734k02632O099189O149525Q427169P201996l379366
$$ 7775032 -20020363 -36985097 -37187729 -31088540 -24939015 -16511846 -9309850 -12689216
40433a2689216j1160372j952802J4464359J5040430k236729j4521772p320691
$$ -12689216 -23849588 -25802390 -11338031 3702399 1465670 -13056102 -20376793
40426b0376793O256549P044577l329716q441773j566223Q048322J0505132O128800
$$ -20376793 -14120244 -7075667 -10405383 -18847156 -20413379 -12365057 -1859925 4268875
40418D268875J49363m910197q006954o803852j511195J602281l340357j2080427
$$ 4268875 4418238 -491959 -8498913 -15302765 -16813960 -15211679 -18552036 -30632463
40410c0632463j2864304j258105J2540832J5670749Q555187K903401N242037R754101
$$ -30632463 -43496767 -44754872 -32214040 -16543291 -7988104 -5084703 157334 9911435
40402I911435R030813M741761K843444L238901R09953m468331o616585j461024
$$ 9911435 18942248 23684009 26527453 29766354 30676307 26207976 19591391 18130367
40394A8130367O724848J0249843O607721J28179l734651m055476m368541p619557
$$ 18130367 24855215 35105058 41712779 41840958 38106307 34050831 29682290 22062733
40386B2062733j1880677j2098226o230404K014188P620675R680662J0425404J0500850
$$ 22062733 10182056 -1916170 -8146574 -6132386 1488289 11168951 21594355 32095205
40378C2095205Q437555M486561J398335K28322j618418o080811j0520658j0976931
$$ 32095205 40532760 45019321 46417656 46645978 45027560 38946749 28426091 17449160
40370A7449160p961435n600552n247498l749924N56339L621028O24368o623250
$$ 17449160 9487725 3887173 -1360325 -5110249 -4553910 -932882 -308514 -6931764
40362f931764j0791317p349965R81620Q061866R912144O500918J164621j091222
$$ -6931764 -17723081 -25073046 -24091426 -16029560 -6117416 383502 1548123 456901
40354D56901J988878N995036L714064n426453j3271868j2519170m795774L403967
$$ 456901 2445779 8440815 12154879 6728426 -6543442 -19062612 -23858386 -20454419
40346b0454419Q427474R072239L369013p438799j4702232j0297819J724765Q944931
$$ -20454419 -12026945 -2954706 414307 -7024492 -21726724 -32024543 -30299778 -21354847
40338b1354847O354684Q03845j034543k41784J479804O823664J4890334J6820729
$$ -21354847 -15000163 -14196318 -15230861 -15472645 -13992841 -7169177 7721157 24541886
40330B4541886P981381j969932j425480N084495L004529r300392j6639999r251515
$$ 24541886 32523267 30553335 29127855 34212350 37216879 27916487 11276488 2024973
40322B024973K659135L759175n373512j1234522o827350J407308M957569L039162
$$ 2024973 4684108 8443283 3069771 -8164751 -14992101 -13584793 -8627224 -5588062
40314e588062l85229k682767k765299J22754M654602P413382P056334N946117
$$ -5588062 -5973291 -8656058 -11421357 -11298603 -6644001 769381 7825715 13771832
40306A3771832N782618M724547J268313k260529l253468k750357k128078N92025
$$ 13771832 19554450 24278997 25547310 23286781 20033313 17282956 15154878 15746903
40298A5746903N789094O918907k023272j4821717j7823702p986193K591793L479722
$$ 15746903 21535997 28454904 26431632 11609915 -6213787 -14199980 -11608187 -8128465
40290h128465j498624l741856l189543m036764m295050M4613N060445M155846
$$ -8128465 -9627089 -13368945 -16558488 -20595252 -24890302 -24845689 -19785244 -15629398
40282a5629398N30032K884498R845047J0984930M355841K72928M104684P650787
$$ -15629398 -15099366 -12214868 -2369821 8615109 12970950 13243878 17348562 24999349
40274B4999349L735611j821818j120633K191913p9512o885743j0997673j0750215
$$ 24999349 28734960 26913142 25792509 27984422 27904910 21019167 10021494 -728721
40266g28721r223189o040595K36533M941619K607764k855379l229422O93934J517110
$$ -728721 -9951910 -15992505 -15755972 -10814353 -8206589 -11061968 -14291390 -13597456 -12080346
40257a2080346l07772L211109J1556815J2948719K468779q552745q661542k497569
$$ -12080346 -12388118 -9177009 2379806 15328525 17797304 9244559 583017 -1914552
40249a914552j728511o427410n959870M355174J6842733K1549762J5707287L080029
$$ -1914552 -3643063 -10070473 -16030343 -11675169 5167564 26717326 42424613 45504642
40241D5504642r691806j5242655j0043409O51563O563503L663410j443627r06737
$$ 45504642 35812836 20570181 10526772 11178335 17741838 21405248 19961621 19054884
40233A9054884L675042M068209k216788p445285l970880M356272O105498k322595
$$ 19054884 22729926 26798135 24581347 17136062 13165182 17521454 23626952 21304357
40225B1304357j0635778p791496K538956O320356j234189q070519j731538J2254619
$$ 21304357 10668579 2877083 5416039 11736395 10502206 2431687 700149 12954768
40217A2954768J6494737N191669p395317n983788N197664R178544P08498o871941
$$ 12954768 29449505 34641174 27245857 21262069 26459733 35638277 36346775 29474834
40209B9474834k279802O532834M859529n713982r657192j771657M906519k1909
$$ 29474834 27195032 33727866 38587395 32873413 23216221 21444564 26351083 26329174
40201B6329174q223786o586266K143173M664043k232397q898491q824850n533979
$$ 26329174 18105388 11519122 13662295 18326338 16093941 7195450 -1629400 -7163379
40193g163379l086172n67589J959794J735330L39227L517880J0533320J2096310
$$ -7163379 -10249551 -10817140 -8857346 -7122016 -6782789 -3264909 7268411 19364721
40185A9364721L279615q680158j3642780r167218J169619J2207588J6274356P035466
$$ 19364721 22644336 13964178 321398 -8845820 -7676201 4531387 20805743 27841209
40177B7841209r634846j7101741p774216N927161Q246345J91341o395380p549582
$$ 27841209 18206363 1104622 -6669594 -742433 7503912 7695253 1299873 -6249709
40169f249709p932391p793547k799207M371524N047281j382935n099558J05323
$$ -6249709 -14182100 -21975647 -24774854 -20403330 -15356049 -16738984 -21838542 -21733219
40161b1733219R139412J3890668J1268582J847245j0872993j8209045j2550794
$$ -21733219 -12593807 1296861 12565443 14412688 3539695 -14669350 -27220144
40154b7220144R80323P679799J913956n422721k544510P981502J5331478J4926885
$$ -27220144 -26239821 -18560022 -16646066 -22068787 -24613297 -16631795 -1300317 13626568
40146A3626568J0088135M317382j018338m378809n474240p007986j0369287j1823056
$$ 13626568 23714703 28032085 27013747 22634938 17160698 10152712 -216575 -12039631
40138a2039631p395524M88697N591549N650622L689012K520534J627650k62522
$$ -12039631 -19435155 -18946458 -13354909 -7704287 -4015275 -1494741 132909 -129613
40130a29613j991480p83091L519419O016689J794025n297207m267911P595767
$$ -129613 -2121093 -2904184 615235 6631924 8425949 3128742 -1139169 6456598
40122F456598J6709862R674641o509042j3178321p071295l078476q053124r845256
$$ 6456598 23166460 32841101 26332059 13153738 6082443 3003967 -5049157 -14894413
40114a4894413k37850Q629338M223670m173887l76532J1580923J4318861N480257
$$ -14894413 -15132263 -6502925 -2279255 -6453142 -6829674 4751249 19070110 24550367
40106B4550367l88634L142117O275562J948051l991300n894437o807009q292730
$$ 24550367 24161733 27303850 33579412 35527463 31536163 25641726 18834717 10541987
40098A0541987n055286L465982P765684K454696l779822p82600P957673J1182719
$$ 10541987 5486701 8952683 16718367 19173063 15393241 14610641 22568314 33751033
40090C3751033N569038k108250n178449l116756Q13741L431245L624088K109359
$$ 33751033 39320071 37211821 32033372 28916616 29730357 33161602 36785690 38895049
40082C8895049j183150p583624j5017752j7035686j2013594q150941j0743087
$$ 38895049 37711899 30128275 15110523 -1925163 -13938757 -22089698 -32832785
40075c2832785j0377254L303006K0686668K2117227P569565k799011J81758M022789
$$ -32832785 -43210039 -39907033 -19220365 2896862 10466427 7667416 7849174 11871963
40067A1871963P07052M84668Q309670R190770n715130j8062080q776004J0176230
$$ 11871963 12579015 13063683 21373353 30564123 24848993 6786913 -1989091 8187139
40059H187139J4394051N213598K900446R570487P357296p952736j8740452j4678589
$$ 8187139 22581190 27794788 30695234 40265721 47623017 39670281 20929829 6251240
40051F251240o229917l076228l99890N550700P310795R58610n198825n979046
$$ 6251240 21323 -3054905 -3454795 2095905 9406700 10365310 5166485 -812561
40043h12561q492153j6169751j7660156l674358J5663139K2555887J3988138K422578
$$ -812561 -9304714 -25474465 -43134621 -46808979 -31145840 -8589953 5398185 7820763
40035G820763j363132J682378L238497k526562j1552415j2729985k531079P200720
$$ 7820763 6457631 8140009 11378506 8851944 -2700471 -15430456 -17961535 -10760815
40027a0760815N124831j098839L465944J4718904J4322254P38604o955242r38298
$$ -10760815 -5635984 -6734823 -3268879 11450025 25772279 26510883 19555641 18617343
40019A8617343L278776m083657r696035k960764L161606m174588j2802659o425983
$$ 18617343 21896119 17812462 8116427 5155663 8317269 4142681 -8659978 -15085961
40011a5085961N585938L648266q709301j2125729l806581K227274J817329L167395
$$ -15085961 -9500023 -5851757 -14561058 -26686787 -30493368 -28266094 -26448765 -23281370
40003b3281370N912966J734534n260752k197145Q109035R411870M94357k067212
$$ -23281370 -17368404 -15633870 -20894622 -23091767 -14982732 -5570862 -5076505 -7143717
39995g143717O597865J1130281L657657l115264l09990J566131n575546r989194
$$ -7143717 -545852 10584429 14242086 11126822 10816832 12382963 6807417 -3181777
39987c181777r56753R139989K724167j3735922j7808670l482741J1576509J0722633
$$ -3181777 -4138530 5001459 7725626 -6010296 -23818966 -27301707 -15725198 -5002565
39979e002565k569036j2248260q362834L913462J0555649L915609q129862j1467843
$$ -5002565 -7571601 -19819861 -28182695 -24269233 -13713584 -9797975 -17927837 -29395680
39971b9395680l199559O612963R852923P824947L474115k467095n136738K094865
$$ -29395680 -32595239 -25982276 -16129353 -8304406 -4830291 -7297386 -12434124 -10339259
39963a0339259J4207756J6044525L547339q946089r910623n831061n800646n012990
$$ -10339259 3868497 19913022 23460361 14514272 4603649 -1227412 -7028058 -12041048
39955a2041048K873262R083129K495992q869472p200797P800005J7828873J1909556
$$ -12041048 -9167786 -84657 2411335 -6458137 -13658934 -5858929 11969944 23879500
39947B3879500j250182q418816p051426k657122n06341k475368n410419k460697
$$ 23879500 22629318 14210502 7159076 4501954 3995613 1520245 -3890174 -6350871
39939f350871P669206J4922524R368474l763826r890536m497612L130402M861418
$$ -6350871 1318335 16240859 25609333 21845507 11954971 7457359 10587761 15449179
39931A5449179J824779k865842q491118j1616597p146676J760162M405903k043672
$$ 15449179 17273958 14408116 5916998 -5699599 -12846275 -11086113 -6680210 -8723882
39923h723882o777182j183969P460006O613121k531697o741093l39658O661543
$$ -8723882 -15501064 -16685033 -9225027 -2611906 -5143603 -11884696 -12224354 -5562811
39915e562811L615461m742844m870142N263808J1729498M273932p592601p177107
$$ -5562811 -1947350 -6690194 -11560336 -6296528 5432970 9706902 2114301 -5062806
39907e062806M969086J1490067L828209n737867l411289O336701R784560M251586
$$ -5062806 -93720 11396347 15224556 9486689 6075400 12412101 22196661 26448247
39899B6448247j838096l852162m588859n675288n489150m601108m980341m878959
$$ 26448247 24610151 20757989 16169130 10493842 5004692 403584 -4576757 -9455716
39891i455716j616510K382928K954304Q74350j113589l660488o283387l704369
$$ -9455716 -11072226 -8689298 -5734994 -4860644 -5974233 -9634721 -15918108 -19622477
39883a9622477M191366O127064m428212j4049029o530769R893608J2398594p09221
$$ -19622477 -15431111 -9304047 -13732259 -27781288 -34312057 -24418449 -12019855 -12729076
39875a2729076o649485N050531J5273947N889185j1906044j5763263m711135M272885
$$ -12729076 -19378561 -14328030 945917 6835102 -5070942 -20834205 -25545340 -21272455
39867b1272455L640470J634851M906020J0168297J3007970J2924853Q834407m40157
$$ -21272455 -17631985 -15997134 -11091114 -922817 12085153 25010006 33844413 33404256
39859C3404256r874011j1116407l962155J897258o66803p251298q566115k517283
$$ 33404256 23530245 12413838 8451683 10348941 9682138 2430840 -6135275 -8652558
39851h652558L961275M081837q74950m141325k320260J540384M029612N879260
$$ -8652558 -4691283 -609446 -1484396 -5625721 -7945981 -6405597 -2375985 3503275
39843C503275P419042M602780m423491j2542365j1084865j813045O288844R804406
$$ 3503275 10922317 15525097 11101606 -1440759 -12525624 -14338669 -8049825 1754581
39835A754581J1292417R313436N6304j0961728j1825171j732614O449554M788865
$$ 1754581 13046998 22360434 22416738 11455010 -370161 -2102775 4346779 9135644
39827I135644m99072k539344l624536n784147m509331P10786K029512k514927
$$ 9135644 8636572 6097228 2472692 -3311455 -7820786 -7110000 -5080488 -7595415
39819g595415l131152M364365R021252L636260j194926L998269Q669527J50949
$$ -7595415 -10726567 -6362202 2659050 6295310 5100384 9098653 17768180 17919129
39811A7919129j1688536q916749M018297P524835n10174l800679J783733K025970
$$ 17919129 6230593 -2686156 1332141 8856976 8346802 4546123 6329856 8355826
39803H355826p397192j0659649J374236J4717160J4292926N509341J085428L72014
$$ 8355826 958634 -9701015 -8326779 6390381 20683307 26192648 27278076 27650090
39795B7650090m218108j0668010j1445144p526094n936543p457639o891027k477253
$$ 27650090 23431982 12763972 1318828 -6207266 -12143809 -19601448 -26492475 -28969728
39787b8969728L010563P647275J0376007Q963462L410567k198472n514153q698029
$$ -28969728 -25959165 -18311890 -7935883 1027579 4438146 2239674 -3274479 -11972508
39779a1972508j1501533q447542J425307R011632O568053j181717m677333k510401
$$ -11972508 -23474041 -31921583 -30496276 -21484644 -14916591 -16098308 -20775641 -23286042
39771b3286042R50704M909259R817197J0771432L805059m480306m287240K392534
$$ -23286042 -22335338 -17426079 -7608882 3162550 6967609 2487303 -1799937 592597
39763E92597N037907J799562J598433P632557J0606226L189574q054485j1485881
$$ 592597 5630504 7430066 9028499 16661056 27267282 30456856 22402371 10916490
39755A0916490m950617M126097Q596886O470049m60226q044728j1942484j1630146
$$ 10916490 5965873 10091970 18688856 25158905 24698679 16653951 4711467 -6918679
39747f918679j0281848q997208n032567J682594N257837J930547k525946J10236
$$ -6918679 -17200527 -26197735 -31230302 -29547708 -24289871 -22359324 -24885270 -24775034
39739b4775034Q149716J1698875O364379j886594o854147r611024j2074401j0141213
$$ -24775034 -16625318 -4926443 1437936 -448658 -7302805 -16913829 -28988230 -39129443
39731c9129443n44776R580221R213089n75130n875105J847932J3929728J5797664
$$ -39129443 -39674219 -30093998 -20880909 -21456039 -27331144 -25483212 -11553484 4244180
39723D244180M772531r256064j6916885j6181847q620201K826666J1587406J0448580
$$ 4244180 9016711 -239353 -17156238 -33338085 -41958286 -39131620 -27544214 -17095634
39715a7095634K16404r131786r046245j126521O711648R382067P497004M009507
$$ -17095634 -16879230 -26011016 -35057261 -36183782 -29472134 -20090067 -12593063 -8583556
39707h583556J010847j196613l240485m228701j240987N752827R933023M342061
$$ -8583556 -7572709 -8769322 -12009807 -16238508 -17479495 -11726668 -1793645 2548416
39699B548416p004965j1687544n362235J347016k315028j1488721j2295482q65443
$$ 2548416 -4456549 -16144093 -21506328 -20159312 -22474340 -33963061 -46258543 -47123986
39691d7123986J2179415J5649444R541906K202721Q73704O097503J1884409J1009374
$$ -47123986 -34944571 -19295127 -9753221 -7550500 -6676796 -579293 11305116 22314490
39683B2314490K850108n003987n883612k342895p98125r00502K438345P810924
$$ 22314490 25164598 20160611 14276999 11934104 11135979 10235477 12673822 20484746
39675B0484746P296757o17063o972507n184439p9997J272535L52434J383241J146146
$$ 20484746 27781503 27164440 20191933 15007494 14927497 16200032 16552466 17935707 19081853
39666A9081853n255597j1940541p351987P479747J6880897J0830994j980093p711537
$$ 19081853 13826256 1885715 -5466272 2013475 18894372 29725366 27745273 20033736
39658B0033736o233889p295304j2495209j2479899k887533O958562O300329k385326
$$ 20033736 13799847 6504543 -5990666 -18470565 -21358098 -14399536 -8099207 -10484533
39650a0484533p208109k357509O170443R683681O553108J689481k24147J127885
$$ -10484533 -17692642 -20050151 -13879708 -4196027 2357081 4046562 3822415 4950300
39642D950300K746035J781719j768036n132127n444311k189846K889299P183758
$$ 4950300 7696335 9478054 7710018 2577891 -2866420 -5056266 -2166967 5016791
39634E016791Q010057L793026l749318r673392j0068770n669522L15570O487982
$$ 5016791 13026848 16819874 13070556 3397164 -6671606 -12341128 -12025558 -5537576
39626e537576J2581791J5588256J0772249k026725j5655852k1041698j4959382
$$ -5537576 7044215 22632471 33404720 31377995 15722143 -5319555 -20278937
39619b0278937k897307M881571K106423o152764p425974K693931J2186229P113314
$$ -20278937 -23176244 -18294673 -16188250 -22341014 -29766988 -27073057 -14886828 -7773514
39611g773514p324560j1144952K769161J7658565J6771587O816781N198495J1992429
$$ -7773514 -15098074 -26243026 -23473865 -5815300 10956287 17773068 22971563 34963992
39603C4963992J1133372k746271j5908661j7166847j2498751j1085884j0091774
$$ 34963992 46097364 43351093 27442432 10275585 -2223166 -13309050 -23400824
39596b3400824l473472M269357N090510J354467R47743L302000K273634o18439
$$ -23400824 -26874296 -22604939 -17514429 -16159962 -15212219 -11910219 -9636585 -10255024
39588a0255024J251740N556554L289535m194028m656341M820104J0886219L838922
$$ -10255024 -9003284 -3446730 -157195 -4351223 -9007564 -4187460 6698759 10537681
39580A0537681p735682j0892480o214871j539318K655376R100775J2372290O010635
$$ 10537681 2801999 -8090481 -14305352 -15844670 -13189294 -4088519 8283771 14294406
39572A4294406l241698k986972M906549O711447p81963n840612k666948q69162
$$ 14294406 11052708 8065736 12972285 19683732 18901769 13061157 10394209 9525047
39564I525047p195432j2175539n701568M872695M890771n799388j3369753r149310
$$ 9525047 2329615 -9845924 -15547492 -10674797 -5784026 -11583414 -24953167 -34102477
39556c4102477K159489J1753289J5279257J2666859O637999J334998k259954p417347
$$ -34102477 -31942988 -20189699 -4910442 7756417 14394416 15729414 13469460 6052113
39548F052113j3869421j3741110k286845J1879200J6315551J1250475O608881
$$ 6052113 -7817308 -21558418 -23845263 -11966063 4349488 15599963 22208844
39541B2208844N099880K33848q615289j1852324m373488N655462Q113988L024279
$$ 22208844 27308724 27542572 18927283 7074959 2701471 8356933 16470921 19495200
39533A9495200l723300r212564j2156583r254128o8474Q390821Q412193Q22492
$$ 19495200 15771900 6559336 -5597247 -14851375 -14919849 -6529028 1883165 2705657
39525B705657p074576j0541384j0263285q218588m947216n46525M033642O775974
$$ 2705657 -4368919 -14910303 -25173588 -33392176 -38339392 -38885917 -34852275 -28076301
39517b8076301N855245K621196J816182N211381O904443R11914p786113q077991
$$ -28076301 -22221056 -19599860 -17783678 -12572297 -5667854 -4755940 -12542053 -20620044
39509b0620044O38306O244896J661833n015480m077133J262054K404889J67919
$$ -20620044 -19981738 -13736842 -12075009 -17090489 -21167622 -19905568 -17500679 -17332760
39501a7332760J642385O602587P659447K516077k995750l804714o5965O494687
$$ -17332760 -15690375 -9087788 -1428341 1087736 -1908014 -5712728 -5778693 715994
39493G15994J3191934J3966133M610219q673350j3700520p376410M59251P51881
$$ 715994 13907928 27874061 32484280 23810930 10110410 2734000 3193251 3945132
39485C945132l809463n323418k412075j1691q10430k595729l294888l855558m990470
$$ 3945132 135669 -5187749 -7599824 -7611515 -8421945 -11017674 -14312562 -18168120 -23158590
39476b3158590m436374k35057M394838L084794n009369j1389200p202124M760874
$$ -23158590 -27594964 -27830021 -23435183 -20350389 -25359758 -36748958 -43951082 -39190208
39468c9190208J2019150P347197l160713r017173p125775j112810O072099J3334552
$$ -39190208 -27171058 -19823861 -22984574 -32001747 -39127522 -40240332 -34168233 -20833681
39460b0833681J8230657J8211492J3831038O844778k789264j4136265k2292015
$$ -20833681 -2603024 15608468 29439506 36284284 33495020 19358755 -2933260
39453b933260k2947379j7705272j0360191r84226J0561476J8418658J5914774
$$ -2933260 -25880639 -43585911 -53946102 -54930328 -44368852 -25950194 -10035420
39446a0035420O130260l05064J369676N468710N687188K941040J207512J084955
$$ -10035420 -3905160 -4210224 -2840548 2628162 8315350 11256390 12463902 13548857
39438A3548857O03816r83577k573236k541765m20370J062769k363289r448397
$$ 13548857 14152673 13169096 10595860 8054095 7633725 8696494 6333205 -3115192
39430c115192j1216223j812299J0971882J4043873O992795K423516O953808J1732395
$$ -3115192 -14331415 -16143714 -5171832 8872041 15864836 18288352 25242160 36974555
39422C6974555O425691n749049j3766492j3838117j1127333r288608n692547K271230
$$ 36974555 43400246 37651197 23884705 10046588 -1080745 -10369353 -16061900 -13790670
39414a3790670J0873814J2691322N301263l843941l937925N862457J3182385P512071
$$ -13790670 -2916856 9774466 15075729 11231788 7293863 13156320 26338705 33850776
39406C3850776m542815p245846J985788Q750279K874293p303768q589086j916343
$$ 33850776 29307961 22062115 24047903 32798182 35672475 28368707 19779621 17863278
39398A7863278K049719N10525L65576M162796N211961j009782q968528j0931753
$$ 17863278 19912997 20423522 20789098 24951894 30163855 29154073 20185545 9253792
39390I253792p446508n232903p289936r503618o850436K1730N575912N562343
$$ 9253792 1807284 -3425619 -10715555 -20219173 -27069609 -27047879 -21471967 -15909624
39382a5909624J050924l591733n159741l145693J326100N692559O294769K102715
$$ -15909624 -14858700 -18450433 -23610174 -26755867 -25429767 -19737208 -13442439 -11339724
39374a1339724j838824J348303J1140197J7965199J3310831n17986j2860088j5428759
$$ -11339724 -13178548 -11830245 -690048 17275151 30585982 30067996 17207908 1779149
39366A779149q993963r97263J717613j054287k798602K517808J2274877J6415604
$$ 1779149 -7214814 -8212077 -6494464 -7548751 -10347353 -7829545 4445332 20860936
39358B0860936Q987533l193466o909254J800026J1440997P730352q312163j9580186
$$ 20860936 29848469 26655003 19745749 21545775 32986772 40717124 32404961 12824775
39350A2824775j2966455L940227J2445719O832276l06887J834303P655117O936906
$$ 12824775 -141680 3798547 16244266 23076542 22769655 24603958 32259075 39195981
39342C9195981J660060P06885M093335M350289J76306l260483n659144j0646610
$$ 39195981 40856041 41562926 45656261 50006550 50182856 46922373 41263229 30616619
39334C0616619j4115524p278118O633512J2613293N445644k040157J179049Q676748
$$ 30616619 16501095 9222977 15856489 28469782 33915426 31875269 33054318 41731066
39326D1731066R792029P435906J0835273J8080016J8931169J1747012N927017
$$ 41731066 51523095 58959001 69794274 87874290 106805459 118552471 124479488
39319A24479488P724113J2924276J5158046J4704907J6252325K1265471K5201074
$$ 124479488 132203601 145127877 160285923 174990830 191243155 212508626 237709700
39312B37709700K2836271J6368587J5418428K5250161L7734508M0463580L2602440
$$ 237709700 260545971 276914558 292332986 317583147 355317655 395781235 428383675
39305D28383675K2852235J3480064j115361j8702688k6585973k0119312j0430723
$$ 428383675 451235910 464715974 463600613 444897925 418311952 398192640 387761917
39298C87761917o370751j970287Q852885J8254849J7167166J0436618N684658
$$ 387761917 381391166 379420879 388273764 406528613 423695779 434132397 439817055
39291D39817055k402042k0864806l9957333m3391841l2566504k4371732k7655669
$$ 439817055 437415013 416550207 376592874 333201033 300634529 276262797 248607128
39284B48607128l6348609m2739337m2927902l2409636j1928659M568894L738383
$$ 248607128 212258519 169519182 126591280 94181644 82252985 86821879 90560262
39277I0560262p124500r907150l304006k109941r650057j2269793n025076j376468
$$ 90560262 83435762 73528612 70224606 68114665 58464608 46194815 41169739 39793271
39269C9793271q966238j4966067p127061O294047J0490316N601523J487458Q65766
$$ 39793271 30827033 15860966 8733905 15027952 25518268 31119791 32607249 33473015
39261C3473015R3676o41066P83718J804289m64007l447901m878870p705674j2035528
$$ 33473015 33566691 32925625 33709343 35513632 35049625 31601724 26722854 19017180 6981652
39252F981652j0118410J391876J1297620O969429o952507j3906537p278352L111735
$$ 6981652 -3136758 -1744882 9552738 16522167 9569660 -4336877 -11615229 -8503494
39244h503494O344694L532817K854948O576451P398517j385215j3834310j4769396
$$ -8503494 -2158800 1374017 4228965 10805416 18203933 16818718 2984408 -11784988
39236a1784988R12573J8121152J9209046O969005k067545l744281q815537j8639579
$$ -11784988 -10872415 7248737 26457783 33426788 31359243 27614962 18799425 159846
39228A59846j8249377j280207J6186808J8270303J0723988O795753N506892o82420
$$ 159846 -18089531 -19369738 -3182930 15087373 25811361 32607114 38114006 37431586
39220C7431586q096588q677398o190221r116140j4123538j2540664o882101m527844
$$ 37431586 29334998 20657600 14467379 5351239 -8772299 -21312963 -28195064 -32722908
39212c2722908j259282J0590577K2459150J8442290K118415o443385j656533Q96976
$$ -32722908 -33982190 -23391613 -932463 17509827 19628242 13184857 11528324 12425300
39204A2425300o602457j0001981J846752J5729741J2218630n996071j8348715
$$ 12425300 5822843 -4179138 -2332386 13397355 25615985 19619914 1271199
39197A271199j3450651j40810O542301K082396n211553m974911K408564N030780
$$ 1271199 -12179452 -12320262 -5777961 -3695565 -8907118 -13882029 -11473465 -6442685
39189f442685n053213j8529020j8908279m740799Q205887Q181969O02035l132650
$$ -6442685 -11495898 -30024918 -48933197 -53673996 -45468109 -37286140 -36684105 -39816755
39181c9816755j61330N111236Q446403P014705K23207o722621o915945k217966
$$ -39816755 -39978085 -34866849 -26420446 -19405741 -19182534 -25905155 -32821100 -35039066
39173c5039066j502126n661228m443287O928962J8310101J8641626J0166401J218840
$$ -35039066 -36541192 -42202420 -46645707 -39716745 -21406644 -2765018 7401383 8620223
39165H620223o033354j1937496j2229487n103354J618055J328747M53674P657528
$$ 8620223 2586869 -9350627 -21580114 -26683468 -25065413 -23736666 -23282992 -15625464
39157a5625464J6861202J4876352K806405n102584l701245k740463p440889q321615
$$ -15625464 1235738 16112090 18918495 13815911 10114666 7374203 -66686 -8388301
39149h388301K022466J4046969J3736606K412941o758691p674555n895239n893100
$$ -8388301 -6365835 7681134 21417740 23830681 17071990 9397435 3502196 -2390904
39141b390904m485186Q14835N718829N989436L914804K546167j175435j0261919
$$ -2390904 -6876090 -6061255 -342426 5647010 9561814 12107981 10932546 670627
39133F70627j8207402j4958120k025675P964280Q893430Q139077J1169729J0393093
$$ 670627 -17536775 -32494895 -34520570 -26556290 -17662860 -9523783 1645946 12039039
39125A2039039o99439j1551475p232223P593553J3674993N648851j561908J518729
$$ 12039039 11339600 -211875 -7444098 149455 13824448 19473299 17911391 19430120
39117A9430120M155364m498315j5404131j3378944r19588O707255M805201L012242
$$ 19430120 23585484 19087169 3683038 -9695906 -10615494 -3908239 896962 3909204
39109C909204P273332J1222242P457716k156251j0052396j0594049l282264O447032
$$ 3909204 11182536 22404778 29862494 27706243 17653847 7059798 3777534 10224566
39101A0224566J0176852N327075p65070j022542N12467m292978j3019374j5419066
$$ 10224566 20401418 25728493 24963423 23940881 24453348 20160370 7140996 -8278070
39093h278070r901264n990022q379020r434052k310198P484115J0196186N489255
$$ -8278070 -18179334 -24169356 -32548376 -41982428 -44292626 -36808511 -26612325 -21123070
39085b1123070J525724L862551J0378930J5173891J3884018O558468k510233q675120
$$ -21123070 -19597346 -15734795 -5355865 9818026 23702044 30260512 27750279 19075159
39077A9075159j0708406r176293l360148N738580J1380436O903159m359714j1487525
$$ 19075159 8366753 -809540 -4169688 1568892 12949328 19852487 15492773 4005248
39069D005248q957022j252207N177633P413630M169229k553027l877286O922751
$$ 4005248 -4951774 -6203981 -1026348 6387282 10556511 8003484 4126198 11048949
39061A1048949K0344571J8299302m26390j6168904j6014816j0306514j1705509
$$ 11048949 31393520 49692822 49266432 33097528 17082712 6776198 -4929311
39054d929311j3653944n383968M788307J622576r547387r674238K608181Q764609
$$ -4929311 -18583255 -23967223 -19178916 -17556340 -27103727 -36777965 -34169784 -25405175
39046b5405175Q60545p364440n163259k53034q15567j66967Q484272J6522294
$$ -25405175 -24544630 -31909070 -37072329 -37325363 -38140930 -38307897 -29823625 -13301331
39038a3301331J2796414J329102o504306q262345o789104K83581J3380863K1193012
$$ -13301331 -504917 824185 -5680121 -13942466 -20731570 -20447989 -7067126 14125886
39030A4125886J3786119N71159p17918R744968J4751885O669883l223205m801095
$$ 14125886 27912005 28483164 27765246 37510214 52262099 58931982 55708777 50907682
39022E0907682l070778n860124j0067826q462500j567193M944906Q465882Q527170
$$ 50907682 47836904 41976780 31908954 23446454 21879261 26824167 35290049 43817219
39014D3817219L001535q227939j9086588k2005028j5174656k949474Q067477J2297538
$$ 43817219 46818754 38590815 19504227 -2500801 -17675457 -20624931 -12557454 -259916
39006b59916R080747M752453O040564J0420122Q966467j02839q141560q620563
$$ -259916 8820831 13573284 19613848 30033970 39000437 38897598 30756038 22135475
38998B2135475m924279k136911L16205K637144Q4342p969414j1825209l527529
$$ 22135475 17211196 15074285 15390490 18027634 18111976 10142562 -1682647 -5210176
38990e210176R926898J4569118P112385l712507j0181816j1463448r209594n877084
$$ -5210176 4716722 19285840 26398225 22685718 12503902 1040454 -8169140 -14046224
38982a4046224n542250q389320o733506M838611J7862927J8693627P508078k458445
$$ -14046224 -19588474 -27977794 -34711300 -29872689 -12009762 6683865 14191943 11733498
38974A1733498m728428o400756j2597756j6661480j2082436l881522M1708J188270
$$ 11733498 7005070 604314 -11993442 -28654922 -40737358 -44618880 -44577172 -43388902
38966d3388902N262473J0251833R169343K175384k583501j77548N446994P775470
$$ -43388902 -38126429 -27874596 -18705253 -16529869 -19113370 -19290918 -13843924 -6068454
38958f068454N091223N15876k262598k291111j545313j614466k85906N890129
$$ -6068454 -977231 -461355 -2723953 -5015064 -6560377 -8174843 -8460749 -2570620
38950b570620J4713910J8068451J1531721Q09002n323694n467644m225083l145200
$$ -2570620 12143290 30211741 41743462 42552464 37228770 31761126 27536043 24390843
38942B4390843J47063M172208K557856o088463j3113545r910317K04445O236857
$$ 24390843 24537906 28710114 31267970 25179507 12065962 2155645 2360090 8596947
38934H596947M522248K762461P261009J2526016Q935782k914605j2382077j2545465
$$ 8596947 13119195 15881656 23142665 35668681 44604463 41689858 29307781 16762316
38926A6762316p082759k244936J308031N214707P613819N887872J878440n56642
$$ 16762316 9679557 7434621 8742652 13957359 21571178 27459050 29337490 28780848
38918B8780848r92932j325645j519050o38026L238j203004l036424l779843l943658
$$ 28780848 27787916 26462271 24943221 24305195 24308433 23105429 20069005 16289162 12345504
38909A2345504l314588N48156O505196P802899J957161l041519m54824L125406
$$ 12345504 9030916 9579072 16084268 23887167 25844328 22802809 22347985 25473391
38901B5473391j983369j1306177j2548688o242321m705293j0411784j1715194
$$ 25473391 23490022 12183845 -364843 -6607164 -11312457 -21724241 -33439435
38894c3439435l274033N389255P327819Q365428J1934234R264752m116965j5699240
$$ -33439435 -36713468 -31324213 -23996394 -15630966 -3696732 5568020 1451055 -14248185
38886a4248185j3115873k923540J487649O34829K579498N225793K562590J357019
$$ -14248185 -27364058 -30287598 -28799949 -28165120 -25585622 -20359829 -17797239 -16440220
38878a6440220J1395555K2549371J3762843j2760279k7624959j2535579J4619455
$$ -16440220 -5044665 17504706 31267549 18507270 -9117689 -21653268 -7033813
38871g033813K3887704R605150r354712j6344846j1039055j656302M902121N759389
$$ -7033813 16853891 26459041 17104329 759483 -10279572 -11935874 -7033753 -1274364
38863a274364L324198M228155J1295003J7109637J1434314m531982j6956849j4848387
$$ -1274364 2049834 6277989 17572992 34682629 46116943 41584961 24628112 9779725
38855I779725k745238N599060L809496j762171l329869k208096l810702o870678
$$ 9779725 7034487 12633547 16443043 14680872 11351003 9142907 5332205 -1538473
38847a538473n493915n66832J93742m437241n135865L779039J4210038J5123091
$$ -1538473 -7032388 -7599220 -7405478 -11842719 -16978584 -13199545 1010493 16133584
38839A6133584P085883j213668n240649n875927l919136j403067l041130p949459
$$ 16133584 23219467 22005799 16765150 10889223 6970087 5567020 2525890 -5423569
38831e423569o088494P017102J8621107J4512593Q15748n001424p76831L89189
$$ -5423569 -11512063 -4494961 14126146 28638739 29454487 24453063 23676232 24065421
38823B4065421m585128l825336N468786Q299292l825853j7152038j6272896o425257
$$ 24065421 19480293 15654957 21123743 29423035 25597182 8445144 -7827752 -14253009
38815a4253009j453290q10303N404920J5116595J4533641p85295j7738064k0990394
$$ -14253009 -15706299 -16516602 -11111682 4004913 18538554 17753259 15195 -20975199
38807b0975199r041500O563427J3282879Q183082p14437l791232n64412J927499
$$ -20975199 -30016699 -23453272 -10170393 -1987311 -2701748 -6492980 -7057392 -5129893
38799e129893N48470n44165J474580L842410M305737L241304j745324j2979969
$$ -5129893 -4581423 -5125588 -3651008 191402 4497139 7738443 5993119 -6986850
38791f986850k2292701j6605733J102191J1111053N285912J94626R552755J9547283
$$ -6986850 -29279551 -45885284 -44783093 -33672040 -28386128 -28191502 -18638747 908536
38783I08536J0119453j1226893j9279483q435495K834847L191698J345901M687695
$$ 908536 11027989 -198904 -19478387 -27913882 -25079035 -21887337 -20541436 -15853741
38775a5853741N997463q49323q529539q730865m400269j321566J786015O843007
$$ -15853741 -9856278 -10705601 -19235140 -27966005 -32366274 -33687840 -31901825 -25058818
38767b5058818R432266O245428K255200L394850P608810Q395413K481584q653869
$$ -25058818 -15626552 -9381124 -7125924 -3731074 3877736 12273149 14754733 6100864
38759F100864j8943608j8722540m511636J1026247J0414885m363507j2214185
$$ 6100864 -12842744 -31565284 -36076920 -25050673 -14635788 -18999295 -31213480
38752c1213480l071755P255171K532122p927559m484217J1258125J8680681Q735796
$$ -31213480 -34285235 -27030064 -24497942 -32425501 -36909718 -25651593 -6970912 1764884
38744A764884n055832p608483J91412Q775253J2811149J1218378L477939p026868
$$ 1764884 -3290948 -10899431 -10708019 -1932766 10878383 22096761 25574700 18547832
38736A8547832j1555477m633615Q131818J5482169J2597042M551877j319151l003043
$$ 18547832 6992355 2358740 10490558 25972727 38569769 43121646 41802495 38799452
38728C8799452k830067j863035Q78391L421846J09504j0036286j8135069j5541011
$$ 38799452 35969385 34106350 34984741 38406587 38516091 28479805 10344736 -5196275
38720e196275o992702m750239r774615r809755O91497J0731491R761109L262124
$$ -5196275 -12188977 -16939216 -26713831 -36523586 -35832089 -25100598 -15339489 -12077365
38712a2077365J212495Q60494n538165j2849462q874807M627129J2468990Q260957
$$ -12077365 -10864870 -10004376 -15542541 -28392003 -37266810 -32639681 -20170691 -11909734
38704a1909734J739547J448480L715270L203214J911420J711711j117722p159675
$$ -11909734 -10170187 -8721707 -5006437 -1803223 108197 1819908 702186 -6457489
38696f457489r322449m140636J219034P48111r4316N413804J2097769R879427
$$ -6457489 -15779938 -19920574 -18701540 -17953429 -18047745 -12633941 -536172 9343255
38688I343255j016519j1059155j3823404r303089R36766J3123255J9253950J4701392
$$ 9343255 8326736 -2732419 -16555823 -25858912 -24922146 -11798891 7455059 22156451
38680B2156451N528670M68414r51682l810447n834939j377782N364173M071302
$$ 22156451 27685121 28153535 27201853 23391406 17556467 16178685 21542858 25614160
38672B5614160m665594q840598l693733J441098j156348o563408p330932m342751
$$ 25614160 20948566 12107968 8414235 9855333 8698985 2135577 -5195355 -9538106
38664i538106j270684K566511O935711O759022Q50106l139571r7431L871617K357209
$$ -9538106 -10808790 -8242279 -1306568 5452454 6302560 3162989 3065558 6937175 9294384
38655I294384J42723L487883O302371r73010j3257505j5720383n470964N102253
$$ 9294384 9437107 12924990 19227361 18254351 4996846 -10723537 -16194501 -11092248
38647a1092248P436752O266967P142421O780531J493679m496454n838198m137574
$$ -11092248 -3655496 2611471 9753892 16534423 18028102 13531648 7693450 3555876
38639C555876l346087k935298j153327J92386l05766M51085M630030P840348M816108
$$ 3555876 209789 -2725509 -3878836 -3686450 -3992216 -3541131 1088899 8929247 13745355
38630A3745355j931623m751153q67215M734588N874421J464709m216496n473795
$$ 13745355 11813732 7062579 6195364 10929952 16804373 18269082 14052586 8578791
38622H578791k63184P560686J2264647J2186447Q937583K034855r646446k0535125
$$ 8578791 8315607 15876293 28140940 40327387 49264970 51299825 41653379 21118254
38614B1118254k0416587p867844N084773P313046K003808o22725J211159J067241
$$ 21118254 701667 -7166177 -2081404 5231642 7235450 6612725 7823884 8891125
38606H891125k903184m721098p94923M126084L871804q19575l549126K143O650367
$$ 8891125 5987941 1266843 471920 4598004 8469808 7650233 4101107 4103250 10753617
38597A0753617Q027883K90321q289405m695234J0754922K0227598R368272j2416796
$$ 10753617 18781500 19071821 10782416 6087182 16842104 37069702 46437974 34021178
38589C4021178k2416750j3326826o42673j92929r118802j4084010r688076j329837
$$ 34021178 11604428 -1722398 -2365071 -2558000 -11676802 -25760812 -35448888 -36778725
38581c6778725M895415P217943N410044K46112m026959k393072M044879Q014788
$$ -36778725 -31883310 -24665367 -19255323 -19009211 -23036170 -25429242 -21384363 -13369575
38573a3369575N403798J433991L559385R748244R588442r01207j1159252q701284
$$ -13369575 -7965777 -6531786 -2972401 6775843 16364285 15463078 4303826 -4397458
38565d397458L235443Q942251J417890q695460q990666j697501K428538P0767
$$ -4397458 -1162015 7780236 9198126 502666 -8488000 -10185501 -7756963 -7686196
38557g686196l339737m238944l841080k297780J593809N416971N451839L589827
$$ -7686196 -11025933 -15264877 -19105957 -21403737 -19809928 -14392957 -8941118 -5351291
38549e351291M499777O332635K695994n329796q258913k296925L930933J707982
$$ -5351291 -851514 5481121 8177115 2847319 -5411594 -7708519 -3777586 -2069604
38541b069604n239098o831177j356694K586368j521899q735955q233876K748128
$$ -2069604 -7308702 -14139879 -15496573 -12910205 -14432104 -23168059 -31401935 -28653807
38533b8653807J3816136J3408670M032998j135260K352253L953070l394784r477684
$$ -28653807 -14837671 -1429001 2603997 1468737 3820990 7774060 4379276 -5098408
38525e098408k653510R318981R706298j178412q044327o632234p779639j3503567
$$ -5098408 -7751918 1567063 11273361 10094949 2050622 -4581612 -12361251 -25864818
38517b5864818j0614847L913069J1871184J725488r599209p74411K0075386K5750083
$$ -25864818 -36479665 -32566596 -20695412 -18969924 -28569133 -29343544 -9268158 16481925
38509A6481925Q608152j0491321j1935157j46227P158135J533505r429403j2516768
$$ 16481925 25090077 14598756 2663599 2517372 9675507 11209012 1779609 -10737159
38501a0737159k927419J0811033J6733158J3608551R657578P316693j32997j3238358
$$ -10737159 -13664578 -2853545 13879613 27488164 37145742 44462435 44329438 31091080
38493C1091080k0633785j6491454j0905020j2079025j1117655J019923J3444978
$$ 31091080 10457295 -6034159 -16939179 -29018204 -40135859 -39115936 -25670958
38486b5670958J0577086j546818m579943K609085N318463M32124l32036N690709
$$ -25670958 -15093872 -16640690 -21220633 -18611548 -13293085 -12860961 -13192997 -7502288
38478g502288P885087M446206N992110J2456995R352447n380043j3523978o117438
$$ -7502288 382799 4829005 10821115 23278110 32630557 27250514 13726536 7609098
38470G609098J203124m047131r422683j321503Q310577J263373j4526308j5944067
$$ 7609098 8812222 4765091 -4657592 -5979095 2331482 3594855 -10931453 -26875520
38462b6875520n32423J1623802Q736698p31795o740314r561997j0466052o214789
$$ -26875520 -27407943 -15784141 -7047443 -7779238 -14519552 -24081549 -34547601 -40762390
38454d0762390K705286R688099J1151644R596760O877272K821751l1137J045373
$$ -40762390 -38057104 -28369005 -17217361 -7620601 -743329 2078422 2047285 3092658
38446C092658K993561J994177J539763N597963P644984o74602j2510639j2277252
$$ 3092658 6086219 8080396 9620159 15218122 22863106 22188504 9677865 -2599387
38438b599387O68232R795311N257742m288384p554135m676329l09624M510147
$$ -2599387 -1931155 7864156 13121898 8833514 1279379 -3396950 -3706574 803573
38430H03573P381977L061869o393470j0587950o061545j813695l495088m271809
$$ 803573 8185550 11247419 4853949 -5734001 -11795546 -13609241 -17104329 -21376138
38422b1376138P58342L999415j82411k726470M890775J3059014P648701n960777
$$ -21376138 -20617796 -16618381 -16800792 -19527262 -14636487 -1577473 6071228 110451
38414A10451r598723N63416J0327563J0090682N314264K897902J673840j4779
$$ 110451 -9488272 -8924856 1402707 11493389 16807653 19705555 21379395 21364616
38406B1364616J36614J040364k542739r281182j0451048m343521o88714m833746
$$ 21364616 21501230 22541594 19998855 10717673 266625 -4076896 -4765610 -9599356
38398i599356q083027j851996P530420P979483m32773o498541l389950N073494
$$ -9599356 -17682383 -19534379 -12003959 -4024476 -4457249 -10955790 -14345740 -9272246
38390i272246J1195284R594214n69836j2823675j5715240n109680Q258921J0941090
$$ -9272246 1923038 11517252 10947416 -1876259 -17591499 -22701179 -14442258 -3501168
38382c501168M144507L70672M099388O231297l17104r453787j1508422o570230
$$ -3501168 643339 1014011 5113399 11344696 11027592 1573805 -9934617 -16504847
38374a6504847j618312Q17212L793949P817493Q774285N097244J490228K066638
$$ -16504847 -18123159 -17305947 -13511998 -5694505 3079780 8177024 9667252 11733890
38366A1733890K776857m066953j6742848k0897101n417630J9972675L1471296
$$ 11733890 14510747 10443794 -6299054 -27196155 -32613785 -12641110 18830186
38359A8830186J9009350o31062n666527K776089O194558j919814q187462l306334
$$ 18830186 37839536 37208474 31541947 34318036 40512594 38592780 30405318 27098984
38351B7098984K507518k613676j2022444j1947005m211474j433020m064670j05451
$$ 27098984 29606502 26992826 14970382 3023377 -1188097 -2621117 -6685787 -6791238
38343f791238J1632475J5911893M834525q410355r544513m081193n086009r910168
$$ -6791238 4841237 20753130 25587655 17177300 7632787 3551594 -1534415 -11444583
38335a1444583n729268O270493J0113891j53863j0992335j0171012l193240m38419
$$ -11444583 -17173851 -10903358 -789467 -943330 -11935665 -22106677 -25299917 -25738336
38327b5738336L04333O433595J3724260J1398364J261453k430141N931170J4522345
$$ -25738336 -25434003 -19000408 -5276148 6122216 7383669 4953528 10884698 25407043
38319B5407043J1375811Q36292m454257j664604L21805n332475j4569287j7710358
$$ 25407043 36782854 37619146 33164889 31500285 31822090 26489615 11920328 -5790030
38311e790030j0045211L010823J0063531M579622p608114j4418001j1594414n931035
$$ -5790030 -15835241 -12824418 -2760887 1818735 -5789379 -20207380 -31801794 -37732829
38303c7732829l403060j478364K666378M518669O73174k059767L301718R710019
$$ -37732829 -41135889 -42614253 -39947875 -35429206 -34756032 -36815799 -33514081 -23804062
38295b3804062N132161o271037p344190N273702J3249444L096823j2728407j3087248
$$ -23804062 -18671901 -24942938 -32287128 -27013426 -13763982 -10667159 -23395566 -36482814
38287c6482814K442112J4995600J3029223M274199J148737N394972J0233618J0034506
$$ -36482814 -34040702 -19045102 -6015879 -1741680 -592943 4802029 15035647 25070153
38279B5070153M018467m904435j1701644j2247272p023333q59879J489663p88964
$$ 25070153 29088620 24184185 12482541 235269 -6788064 -7647943 -6158280 -6947244
38271f947244l933727k562042M158994R087145M401668o567191j1254274m623597
$$ -6947244 -10880971 -13443013 -9284019 -196874 4204794 -2362397 -13616671 -18240268
38263a8240268L624111L982600Q29400K442109N215094M45778q194139r047262
$$ -18240268 -14616157 -10633557 -9804157 -7362048 -2146954 -1701176 -9895315 -18942577
38255a8942577k962896l178889j1881082j3044016L449656K3849422K7991561
$$ -18942577 -21905473 -25084362 -36965444 -50009460 -46559804 -22710382 5281179
38248E281179J5721495L488895j76330k583187j0502948j7478657j2610336L606644
$$ 5281179 21002674 24491569 24315239 21732052 11229104 -6249553 -18859889 -15253245
38240a5253245J7819557J7814569N318319o472928p383375J09638O465170O464351
$$ -15253245 2566312 20380881 25699200 19226272 11842897 11952535 18417705 24882056
38232B4882056J481615n877216j3104901j5650427j0747279l240522o38998k213139
$$ 24882056 26363671 20486455 7381554 -8268873 -19016152 -22256674 -22895672 -25108811
38224b5108811l45106O860059J2406458J1007487M623102l751309j2611296j6722478
$$ -25108811 -25453917 -18593858 -6187400 4820087 9443189 5691880 -6919416 -23641894
38216b3641894j0067902K980554J0514506J0437511J2052695J5907964Q606343
$$ -23641894 -33709796 -30729242 -20214736 -9777225 2275470 18183434 26789777
38209B6789777j2568467k6834242j7548563J001280L925639p145633r691059K256367
$$ 26789777 14221310 -12612932 -30161495 -29160215 -25234576 -32380209 -42071268 -39814901
38201c9814901J0719787M997121k966738j245469L779088K368558o65780M224838
$$ -39814901 -29095114 -24097993 -27064731 -28310200 -24531112 -22162554 -22828334 -18603496
38193a8603496J3542427J5111376N264046p457030j3007268q582988O57930O314010
$$ -18603496 -5061069 10050307 15314353 7857323 -5149945 -13732933 -13075003 -6760993
38185f760993N061586K800924N791768R372746M409239n692272o796246M230548
$$ -6760993 -1699407 1101517 6893285 16266031 20675270 14982998 8186752 12417300
38177A2417300J2685839P248036m027775p528467l215758M73827J877435M217981
$$ 12417300 25103139 32351175 28323400 20794933 17579175 18053002 19930437 24148418
38169B4148418M864554r30452q974274j0189238m056564J499202K022827k82152
$$ 24148418 29012972 28082520 19108246 8919008 4862444 6361646 8384473 8102321
38161H102321l144508n184100k421473O663361J3992273R760769k891177j0980148
$$ 8102321 4957813 -226287 -2647760 4015601 18007874 27768643 24877466 13897318
38153A3897318r717262o958532q113656p942462j815517N105825O728571N995296
$$ 13897318 4180056 -2778476 -10892132 -18834594 -20650111 -15544286 -8815715 -2820419
38145b820419Q012011R267965K973912p846890j1958048n036667M269339N742337
$$ -2820419 5191592 14459557 17433469 9586579 -2371469 -7408136 -3138797 2603540
38137B603540m47738o553038q000686o495539l874875J461896R724627J5323696
$$ 2603540 2155802 -4397236 -12397922 -18893461 -22768336 -21306440 -11581813 3741883
38129C741883J2097233K141788n352752n214125j928363j872649m130070l258767
$$ 3741883 15839116 17980904 12628152 7414027 5485664 3613015 -517055 -3775822
38121c775822J566512N417052M895772J853019o54067k166779l270755l090717
$$ -3775822 -2209310 3207742 8103514 9956533 9302466 7135687 3864932 774215
38113G74215j28411N460711J1109344J3087954R542470L272934k77213M64685
$$ 774215 645804 6106515 17215859 30303813 39846283 43119217 42842004 43306689
38105D3306689R50740k554067o463282m850149N43289J027207p371906j7738708
$$ 43306689 44257429 41703362 35240080 30389931 30933220 31960427 24588521 6849813
38097F849813j9994094j1833002j45952O335117M679175J9136P32607R164985
$$ 6849813 -13144281 -24977283 -25123235 -18788118 -14108943 -14089807 -13357200 -4192215
38089d192215J7062854J3386886k466683j8403947k2151124j3516599k709034
$$ -4192215 12870639 26257525 23790842 5386895 -16764229 -30280828 -32989862
38082c2989862R99667k977065p948537o874845Q59550Q161447P255361p75391
$$ -32989862 -31990195 -34967260 -42915797 -49790642 -48931092 -40769645 -33514284 -34289675
38074c4289675n827365n55246R757094J2956607N317131l293198j790557P728903
$$ -34289675 -40117040 -40672286 -30915192 -17958585 -12641454 -15934652 -17725209 -9996306
38066i996306J2407573N114945o414995r725113l221346L413233K814204k216403
$$ -9996306 2411267 7526212 1111217 -8613896 -11835242 -8422009 -5607805 -7824208
38058g824208n164783l723098J441584R543238J6533342J4772333K764756q869205
$$ -7824208 -12988991 -16712089 -15270505 -5727267 10806075 25578408 28343164 19473959
38050A9473959r439917l650263n243044j5507695j9420264p212575J0327797J5876320
$$ 19473959 10034042 6383779 1140735 -14366960 -33787224 -40999799 -30672002 -14795682
38042a4795682Q174965J217528L889911J0135506J0369298M528616n67906k109346
$$ -14795682 -6620717 -5403189 -1513278 8622228 18991526 23520142 22952236 20842890
38034B0842890l781079q118769j1423775r083287l577953k695580q803527j4013911
$$ 20842890 17061811 8943042 -2480733 -11564020 -15141973 -17837553 -26641080 -40654991
38026d0654991r602106K186423J0463986R167365L301074R97452M018065Q178395
$$ -40654991 -50257097 -48070674 -37606688 -28439323 -25138249 -24140797 -20122732 -11944337
38018a1944337R383891O459465O89631m492393m903314O22571Q033112J0923607
$$ -11944337 -2560446 3899019 4588650 96257 -4807057 -4184486 3848626 14772233
38010A4772233O098512k924501p765760l096722N599726O101530m799821j4448494
$$ 14772233 20870745 17946244 10180484 7083762 12683488 18785018 13985197 -463297
38002d63297j0460019O74205K249714p279858j2119601m992104J019386m730445
$$ -463297 -10923316 -10249111 -7999397 -15279255 -27398856 -32390960 -31371574 -36102019
37994c6102019j0587446j56210K0196213K8691138J8608109M582099q02805o24428
$$ -36102019 -46689465 -46845675 -26649462 2041676 20649785 25231884 24429079 23804651
37986B3804651j286967j332261J303085J889074l985403j2702454j7191265j4306490
$$ 23804651 22517684 21185423 22488508 24377582 20392179 7689725 -9501540 -23808030
37978b3808030n491880M220130P550191K777620m17317P190535J7533199J3864662
$$ -23808030 -29299910 -25079780 -17529589 -14751969 -15169286 -7978751 9554448 23419110
37970B3419110k635466j1865655n592801j49851p746470j4587035m956898R622369
$$ 23419110 20783644 8917989 3325188 3175337 -4571133 -19158168 -24115066 -14492697
37962a4492697Q507248k368651J35606J6495936K2530607Q692186o480974r109085
$$ -14492697 -5985449 -8354100 -8218494 8277442 30808049 39500235 33019261 23910176
37954B3910176r590318j7146883j9225254m841997J0704374O815599r281325j3264180
$$ 23910176 14319858 -2827025 -22052279 -26894276 -16189902 -9374303 -18655628 -31919808
37946c1919808l67125J0847247Q640689J462045N2147L885472Q672584J2640904
$$ -31919808 -32286933 -21439686 -12798997 -11336952 -11284805 -7399333 1273251 13914155
37938A3914155J1812459K162720r811131j0954157j42790Q093094L142496q763465
$$ 13914155 25726614 27889334 18078203 7124046 6981256 15074350 18216846 9453381
37930I453381j5529882j3133119m292212O674234J2894152Q855258L27122K67072
$$ 9453381 -6076501 -19209620 -23501832 -16827598 -3933446 4921812 5248934 5516006
37922E516006R771901J4502056O396057l833139m905688k495883n830342q625263
$$ 5516006 15287907 29789963 36186020 32352881 27447193 24951310 19120968 10495705
37914A0495705j08009J2825786J2888819j520959j4875379j8016928j6143808
$$ 10495705 10387696 23213482 36102301 34581342 19705963 1689035 -14454773
37907a4454773j2689051l071093J0816026J6256378Q044668j706468j254343L666718
$$ -14454773 -27143824 -30214917 -19398891 -3142513 4902155 3195687 1941344 5608062
37899E608062L15321j1375405j9823210j7634145p531784M261997J2822849J4606304
$$ 5608062 5923383 -5452022 -25275232 -42909377 -50441161 -46179164 -33356315 -18750011
37891a8750011R094631j6980q316175j3475052j3368621o410349L582895Q752740
$$ -18750011 -9655380 -9672360 -17988535 -31463587 -44832208 -51242557 -47659662 -38906922
37883c8906922P345797O545742J0663217J3269214P504810k120706o424223n128430
$$ -38906922 -31561125 -25015383 -14352166 -1082952 6421858 4301152 -2123071 -7251501
37875g251501m683571o002689m188119Q90285L219411L23502l613269n090769
$$ -7251501 -11935072 -17937761 -22125880 -21235595 -18016184 -17692682 -21305951 -26396720
37867b6396720m720407k760722J623764N615057M323024j196268m114523j909375
$$ -26396720 -31117127 -33877849 -32254085 -26639028 -22316004 -23512272 -27626795 -29536170
37859b9536170M11172l58763k4264N074672J0304655Q403301l68400q389892r152356
$$ -29536170 -29124998 -29483761 -29508025 -24433353 -14128698 -5725397 -6093797 -14483689 -23636045
37850b3636045k475929O751667J2401398J1347977N848925M26271l702428q194419
$$ -23636045 -26111974 -19360307 -6958909 4389068 10237993 10664264 6961836 -1232583
37842a232583j2118150j2207072r400155q464447q407451j044683J4896154K5304389
$$ -1232583 -13350733 -25557805 -34957960 -43422407 -51829858 -52874541 -37978387 -12673998
37834a2673998J6000929o726702k1288257j6591103l118196L876711K834929K344064
$$ -12673998 3326931 -3399771 -24688028 -41279131 -44397327 -40520616 -37685687 -35341623
37826c5341623O697349J2828285J7623704K0131149J7726595P859607n224247
$$ -35341623 -28644274 -15815989 1807715 21938864 39665459 47525066 42300819
37819D2300819j2176354r806899n388768o069903q703688n551394L093958Q699724
$$ 42300819 30124465 20317566 14928798 8858895 155207 -5396187 -2302229 6397495
37811F397495O202522o28482o520559j0924302j4008020j2332258l786029O609221
$$ 6397495 12600017 11971535 5450976 -5473326 -19481346 -31813604 -35599633 -28990412
37803b8990412J1321900R128554M850126K024820P35207J194965L418375L420803
$$ -28990412 -17668512 -8539958 -3689832 -1665012 -929805 265160 3683535 7104338
37795G104338l615878j4408773j7754177p408877R214410J9007738J6850440P938839
$$ 7104338 3488460 -10920313 -28674490 -36083367 -26868957 -7861219 8989221 16928060
37787A6928060l66378m355901l494112N43676L833763L036243n33498k126284
$$ 16928060 16561682 12205781 8711669 9255345 13089108 16125351 15591853 13465569
37779A3465569L53413L703758L727321J10249m163366o524673o495308m996820
$$ 13465569 13818982 17522740 21250061 21360310 17196944 10672271 4176963 -819857
37771h19857l616715l572985l739234q64723N666963J0133238N650116n833826
$$ -819857 -4436572 -8009557 -11748791 -12613514 -6946551 3186687 8836803 3002977
37763C002977j3180489q884659J618792Q005794Q459645P886596N868777k585933
$$ 3002977 -10177512 -19062171 -17443379 -9437585 -977940 6908656 12777433 10191500
37755A0191500j3266241j2505765K670832J5172370R177722p175219j3220877
$$ 10191500 -3074741 -15580506 -12909674 2262696 11440418 4265199 -8955678
37748h955678m685085L450647J309484m162823m338124j390571R9698J952693
$$ -8955678 -13640763 -10190116 -8880632 -13043455 -17381579 -18772150 -18672452 -16719759
37740a6719759N365614M919497k172667q507627o181304K041932Q062537Q924548
$$ -16719759 -11354145 -6434648 -8607315 -17114942 -23296246 -21254314 -13191777 -4267229
37732d267229N903017J01808m595905k062795N244834N006986o178286j2761397
$$ -4267229 1635788 1737596 -2858309 -4921104 323730 5330716 -847570 -13608967
37724a3608967j817265J4514644J4895389R39774n981423J773791Q577449K737866
$$ -13608967 -15426232 -911588 13983801 14923575 8942152 10715943 19293392 22031258
37716B2031258o551733p480652m081619n319948q428763n403123K308408O666784
$$ 22031258 15479525 7998873 3917254 -1402694 -9831457 -15234580 -12926172 -6259388
37708f259388M949295K94315m337876o021282k010938L681080J552756q457805
$$ -6259388 -1310093 -1015778 -5353654 -11374936 -13385874 -9704794 -8152038 -16609843
37700a6609843j2272784j330675J1874792J0154213l343517j0565346m887226
$$ -16609843 -28882627 -30213302 -18338510 -8184297 -11527814 -22093160 -26980386
37693b6980386L004544M629749M275368P400576J1138628J1291892R414385Q013286
$$ -26980386 -23975842 -19346093 -15070725 -7670149 3468479 14760371 24174756 32188042
37685C2188042N893638K452075N37952J353397J548746j608666o392531r882657
$$ 32188042 38081680 40533755 41071707 42425104 43973850 42365184 35972653 26089996
37677B6089996j1154076j0322133q336876p434751p502309m041245M078079Q061809
$$ 26089996 14935920 4613787 -3723089 -11157840 -18660149 -22701394 -18623315 -10561506
37669a0561506J32511j0852755p665609R592462J9902288R332460r887363j6990542
$$ -10561506 -10428995 -21281750 -28947359 -19354897 547391 9879851 -7512 -16998054
37661a6998054q895324J612291N475719L375304j930946p052873n131885O912076
$$ -16998054 -25893378 -24281087 -18805368 -15430064 -17361010 -24413883 -29545768 -22633692
37653b2633692J9965400K1826855J3286918N154284J149449m379868j1892895
$$ -22633692 -2668292 19158563 32445481 37599765 38749214 34369346 22476451
37646B2476451j3329025o984522l263075q880651j5445391j2140749j918479M495937
$$ 22476451 9147426 2162904 -1100171 -9980822 -25426213 -37566962 -39485441 -34989504
37638c4989504N209909P242250J2429443J3693773O544693l817866r668010r281700
$$ -34989504 -29779595 -22537345 -10107902 3585871 10130564 6312698 -3355312 -12637012
37630a2637012n403613J89769O840139J2233475J2934498P444240k178212j0804734
$$ -12637012 -18040625 -17850856 -11010717 1222758 14157256 21601496 19423284 8618550
37622H618550j2768568o894547L53297M80042o308533r860032k963570Q272106
$$ 8618550 -4150018 -11044565 -10691268 -10211226 -16519759 -26379791 -29343361 -21071255
37614b1071255J2243177P274469J970684J090624K10293l109384k644511N177747
$$ -21071255 -8828078 -1553609 417075 1507699 1717992 -1391392 -4035903 1141844
37606A141844J1319174N915594m577452m514657P114934J3006883J803634j5292253
$$ 1141844 12461018 18376612 13799160 9284503 16399437 29406320 31209954 15917701
37598A5917701j9778756r467309K423566O402572M698454K214783m77045l646787
$$ 15917701 -3861055 -13328364 -10904798 -4502226 196228 2411011 1933966 -1712821
37590a712821n414300n056562m465546m219943k275133J627151M212607L687833
$$ -1712821 -7127121 -12183683 -16649229 -20869172 -23144305 -21517154 -17304547 -13616714
37582a3616714L077197N526118Q771956Q018496L324650O7309R90656J510426
$$ -13616714 -10539517 -5013399 3758557 11777053 15101703 15169012 16159668 17670094
37574A7670094l441870r855224p794143M348730J4865617J2905086K757167l214141
$$ 17670094 14228224 4373000 -3421143 927587 15793204 28698290 31455457 28241316
37566B8241316k145277j302393k814935m45275N842750N380033o018229j5777848
$$ 28241316 26096039 24793646 21978711 21533436 27376186 32756219 26737990 10960142
37558A0960142j1514412N40560N277538M8612n610038o303370m396359j123131
$$ 10960142 -554270 -13710 5263828 5312440 -297598 -6600968 -10997327 -12120458
37550a2120458L382953M083875k157331o311841K338475J6991902J9856002Q108091
$$ -12120458 -8737505 -4653630 -6810961 -13122802 -10784327 6207575 26063577 34171668
37542C4171668k827415m060376m013516r215863j1603079m128224N505428P316970
$$ 34171668 31344253 27283877 23270361 14054498 2451419 -1676805 3828623 11145593
37534A1145593L323450o65264n872861j2586245j3021598m443945J230963n366117
$$ 11145593 14469043 13803779 7930918 -4655327 -17676925 -22120870 -20889907 -26256024
37526b6256024j3652220p955044P797935J6256564J2055065M862737Q21526k577746
$$ -26256024 -39908244 -47863288 -40065353 -23808789 -11753724 -6890987 -6069461 -8647207
37518h647207m831792j925127K158910j477792j0625964j3022570n048851M421771
$$ -8647207 -13478999 -15404126 -13245216 -14723008 -25348972 -38371542 -43420393 -38998622
37510c8998622J0555534J7830250K5060500K0930784K136553j6962938k1759417
$$ -38998622 -28443088 -10612838 14447662 35378446 37514999 20552061 -1207356
37503a207356j4298546m701567M046793J2879294J6879539J0628643j056373p964231
$$ -1207356 -15505902 -20207469 -16160676 -3281382 13598157 24226800 23170427 15206196
37495A5206196p719543n882697n030929k211021K969021N368626J688693m018669
$$ 15206196 7486653 1603956 -3426973 -5637994 -2668973 2699653 4388346 369677
37487C69677n290741j726109M56174k893781o935880l732064M767451O356229
$$ 369677 -4921064 -6647173 -6190999 -9084780 -16020660 -19752724 -14985273 -8629044
37479h629044m252549j4700673j0278198M769209J2831085P899647J663125L333249
$$ -8629044 -12881593 -27582266 -37860464 -33091255 -20260170 -12360523 -10697398 -7364149
37471g364149P339705O360317M001767O103611Q928784N504069k456177p384053
$$ -7364149 -24444 6335873 10337640 16441251 25370035 30874104 28417927 21033874
37463B1033874o480900l153648j552211m111086j0021928j2999561o725974M628931
$$ 21033874 14552974 11399326 9847115 5736029 -4285899 -17285460 -24011434 -19382503
37455a9382503R377783N200004K961830Q524399J2467376O243143l042682n242226
$$ -19382503 -10004720 -4804716 -1842886 6681513 19148889 25392032 22349350 17107124
37447A7107124m264888q990712j5231139j1936491l36473P864276Q235459O005909
$$ 17107124 12842236 3851524 -11379615 -23316106 -23652579 -15788303 -7552844 -1546935
37439a546935L734000K44770p40099N025837J1244395Q543897J110627O67167
$$ -1546935 2187065 2431835 1691736 6717573 17961968 26505865 27616492 28283659
37431B8283659N480733K649969q568258j4774256j2548297j4313109k3701853
$$ 28283659 33764392 36414361 27846103 13071847 523550 -13789559 -37491412
37424c7491412k5531287j1132875N039428Q254129O442778J3181009K1676246
$$ -37491412 -63022699 -74155574 -69116146 -60862017 -54419239 -41238230 -19561984
37417a9561984J6422229J725149l723548K855619N299079l157693r121623k557990
$$ -19561984 -3139755 -1414606 -5138154 -2282535 3016544 -141149 -9262772 -11820762
37409a1820762O662626N730789q91789n76344O461570Q294985M00732p895520
$$ -11820762 -5158136 572653 -319136 -895480 5566090 13861075 14261807 6366287
37401F366287p309254m84572L545369J518992k064296k925524k199582k774113
$$ 6366287 -942967 -1427539 2117830 3636822 1572526 -1352998 -3552580 -6326693
37393f326693l958479k827749M31532K036122K500k808561k307348K228925Q127883
$$ -6326693 -10285172 -13112921 -12681389 -10645267 -10642767 -13451328 -15758676 -13529751 -5401868
37384e401868J1590456R051609n24281j2310634j7191982j0190789L386765J2788103
$$ -5401868 6188588 15240197 14715916 2405282 -14786700 -24977489 -21590724 -8802621
37376h802621J2584193O897033L276322M190985N361092K181996l352585m443329
$$ -8802621 3781572 10678605 13954927 18145912 23507004 25689000 22336415 17893086
37368A7893086Q57867N215223J090755q294157j2802616q951119k691234J382254
$$ 17893086 18750953 23966176 25056931 16762774 3960158 -4990961 -7682195 -6299941
37360f299941N145905Q875563P128545j673684r045470p210464m99785J876537
$$ -6299941 -1154036 7721527 14850072 13176388 4130918 -3079546 -3579331 -1702794
37352a702794j92818J01357L532184M122988Q08782j1854M383453P549454L270001
$$ -1702794 -1895612 -1794255 1737929 5860917 6669699 6657845 11041298 18590752 21860753
37343B1860753n211601r203772m510373M927738J0714522O583277n352941j4520935
$$ 21860753 16649152 7445380 2935007 7862745 18577267 25160544 19807603 5286668
37335E286668j1990736j183272N880667L692834p92957M13596M408566J868968
$$ 5286668 -6704068 -7887340 -2006673 1686161 893204 1306800 5715366 7584334
37327G584334q898854j7494334j2323252N767940K2516984K4267838J2728172
$$ 7584334 -1314520 -18808854 -31132106 -25364166 -2847182 21420656 34148828
37320C4148828K676839L472052P583055K571038r746343j5070677p146609L327496
$$ 34148828 36825667 40297719 47880774 50451812 40705469 25634792 18488183 21815679
37312B1815679L878354l858862r264156p611694k734990J281395L407354K068727
$$ 21815679 25694033 21835171 12571015 4959321 2224331 3505726 6913080 8981807
37304H981807m513205j3276017j6810266j0906009J246692J3008782J9279375
$$ 8981807 4468602 -8807415 -25617681 -36523690 -35276998 -22268216 -2988841
37297b988841J7133716O169800q355633j5655168q279424P878004J6729301R025504
$$ -2988841 14144875 20314675 11959042 -3696126 -11975550 -4097546 12631755 21657259
37289B1657259n793920r910696P88651J1416312P865561m824755j0731418m959605
$$ 21657259 15863339 5952643 6741294 18157606 26023167 21198412 10466994 5507389
37281E507389K356066K659884r76162k545784j981411p06858L083986Q451953
$$ 5507389 7863455 10523339 9547177 7001393 5019982 4313124 7397110 15849063
37273A5849063Q439927M06497o507354l077716N497938O628563j090332o950340
$$ 15849063 24288990 24695487 18188133 15110417 20608355 27236918 26146586 19196246
37265A9196246m942686n69386P62466J720707N252599P489505M304496j224979
$$ 19196246 14253560 13684174 14446640 16167347 21419946 28909451 33213947 31988968
37257C1988968l918239m607163p213317j0544171q728383O61269J2416888J7756768
$$ 31988968 28070729 23463566 16250249 5706078 -3022305 -2361036 10055852 27812620
37249B7812620J1884807p98230r139801o410956Q62042J92409j0231716j8989225
$$ 27812620 39697427 38899197 29759396 23348440 24210482 24402891 14171175 -4818050
37241d818050j7467095j0152217m570854k24943M723595M746079l257545q035927
$$ -4818050 -22285145 -32437362 -37008216 -37233159 -32509564 -27763485 -31021030 -39056957
37233c9056957L001415K1331126K4680949Q975718m240639N73746J0176632M245123
$$ -39056957 -36055542 -14724416 9956533 18932251 14691612 15265358 25441990 29687113
37225B9687113j2738819j9055275r180091k52661l888045r298077k161929J2929708
$$ 29687113 16948294 -2106981 -11287072 -11539733 -15427778 -24725855 -26887784 -13958076
37217a3958076K0312570J5944213R854196Q262453N076503n777859j7973172j9073811
$$ -13958076 6354494 22298707 32152903 40415356 45491859 39714000 21740828 2667017
37209B667017o256416R585606J5528959R075931j968452r366113j1572748j1590647
$$ 2667017 -3589399 5996207 21525166 30601097 28632645 19266532 7693784 -3896863
37201c896863j0784460p169223O53737J0044424J5992482J5651703J0417297L828718
$$ -3896863 -14681323 -21850546 -21196809 -11152385 4840097 20491800 30909097 34737815
37193C4737815j548706m790789n320612k821083J115292L191857K098922O66600
$$ 34737815 33189109 28398320 23077708 20256625 21371917 24563774 26662696 27329296
37185B7329296J590798J858540m227020j5229444k0553772j2405650K931077J1022921
$$ 27329296 28920094 30778634 26551614 11322170 -9231602 -21637252 -18706175 -7683254
37177g683254O085540l062575m986369Q69263N641588L274109k698554m545366
$$ -7683254 -1597714 -4660289 -9646658 -8777395 -3135807 138302 -2560252 -7105618
37169g105618L86668P366680J0169327P301425J809021l175635o195499n630060
$$ -7105618 -6718950 647730 10817057 18118482 19927503 16751868 10556369 4926309
37161D926309l07106O307164O633191k074610j1585571j0679918R70187J1632351
$$ 4926309 4619203 10926367 17559558 15484948 3899377 -6780541 -5810354 5821997
37153E821997J1020556P88988r719998j3988968j2150806p679359l622019q11055
$$ 5821997 16842553 17631541 7911543 -6077425 -18228231 -25907590 -29529609 -30340664
37145c0340664K204961O442617R181468O078991k096659q196101o805420p64386
$$ -30340664 -28135703 -21693086 -12511618 -6432627 -8529286 -16725387 -23530807 -24295193
37137b4295193L711136N602998Q015686J0238291P275424j277883p502713m272927
$$ -24295193 -20584057 -14981059 -6965373 3272918 10548342 9270459 1767746 -2505181
37129b505181N056655J0641556Q476177L915613K555221K681165l56494o100778
$$ -2505181 2551474 13193030 21669207 25584820 28140041 30821206 30464712 24363934
37121B4363934r844809r630278p639525n552349l728153m647820j0549926j6230261
$$ 24363934 14519125 4888847 -2750678 -8303027 -12031180 -16679000 -27228926 -43459187
37113d3459187j1818718L010807J4560018J1271276j182506q595072p297853n156774
$$ -43459187 -55277905 -52267098 -37707080 -26435804 -27618310 -36213382 -43511235 -48668009
37105d8668009o464646o673095k408163L118661O646194Q734038R418241P413677
$$ -48668009 -55132655 -61805750 -64213913 -61095252 -54449058 -45715020 -36296779 -28883102
37097b8883102M604160L742576J886557m668693r854571m654099N319720M982463
$$ -28883102 -24278942 -20536366 -18649809 -23318502 -33173073 -37827172 -32507452 -27524989
37089b7524989m182116k237004J6396204K8430867J5549507n476480q269612J720471
$$ -27524989 -31707105 -33944109 -17547905 10882962 26432469 20955989 12686377 14406848
37081A4406848j318413j8130497k1732190k534042J3952618N918116j2679547
$$ 14406848 13088435 -5042062 -26774252 -29308294 -15355676 -9437560 -22117107
37074b2117107j5539552j792316Q684618O780907K041072L481246Q412948J0438257
$$ -22117107 -37656659 -39448975 -30764357 -23983450 -21942378 -18461132 -10048184 390073
37066C90073P678604K073667k741931l168399J63288J747365j841650p649396
$$ 390073 8068677 10142344 7400413 4232014 4395302 6142667 4301017 -3348379
37058c348379j1597132j2726475r477437N37299J2358940J4119406K891130q114133
$$ -3348379 -14945511 -27671986 -37149423 -36612124 -24253184 -10133778 -7242648 -15356781
37050a5356781o750584J650692M937409K859953K529211K521310k713636p056796
$$ -15356781 -22107365 -20456673 -15519264 -12659311 -10130100 -7608790 -10322426 -17379222
37042a7379222Q20734J5729465J8809670N267622q023750q661629n716522j0902450
$$ -17379222 -16558488 -829023 17980647 23248269 15224519 6562890 846368 -10056082
37034a0056082j7677728j2995271K81033P724633M558579j058906k674173r25849
$$ -10056082 -27733810 -40729081 -40448048 -32723415 -28164836 -29223742 -31897915 -32823764
37026c2823764L798778J1781273J7088788J1973126j07544o495311l172578m13088
$$ -32823764 -29024986 -17243713 -154925 11818201 11710657 5215346 2042768 1629680
37018A629680o198360j3593384j1573705j206556P122777Q232854N935223M492197
$$ 1629680 -4568680 -18162064 -29735769 -30942325 -23819548 -15586694 -9651471 -5159274
37010e159274L537598J423810j726221m910150o886402o289973l684917k019165
$$ -5159274 -1621676 -197866 -1924087 -6834237 -13720639 -20010612 -23695529 -25714694
37002b5714694k352479j664411J587255L115350p58072n473693l966134K145643
$$ -25714694 -28067173 -29731584 -28144329 -25028979 -25787051 -31260744 -35226878 -33081235
36994c3081235N223032M270686N255176Q202502N267151m397719r032904r83851
$$ -33081235 -27858203 -23587517 -18332341 -10129839 -4862688 -9260407 -18293311 -19277162
36986a9277162J0045942R807777j070329j0280923j1225093o870141l95090O624798
$$ -19277162 -9231220 576557 -493772 -10774695 -21999788 -28869929 -29265019 -22640221
36978b2640221R032103K904976m884426l335215O000822J0612138O526184L299794
$$ -22640221 -13608118 -10703142 -15587568 -18922783 -12921961 -2309823 4216361 7516155
36970G516155N964012N704812l928476j3532098j1131256l35440O045811M467315
$$ 7516155 13480167 19184979 15256503 1724405 -9406851 -9742291 -3696480 770835
36962G70835J466564M28634o54240l42993N372329J2707131J1527772L38329q970531
$$ 770835 2237399 2666033 2011793 1668800 7041129 19748260 31276032 31614361 22643830
36953B2643830n959854N116389J1769843Q472162L79603n502207p840066r548840
$$ 22643830 16683976 21800365 33570208 42042370 42421973 36919766 29079700 19530860
36945A9530860j1978517j2254827o597227L893550J1970349J0572525O35159r072055
$$ 19530860 7552343 -4702484 -11299711 -7406161 4564188 15136713 15771872 6699817
36937F699817j1143411p857610q166832j5091152j8679992o962413J5273394K6420813
$$ 6699817 -4443594 -12301204 -20468036 -35559188 -54239180 -61201593 -45928199 -19507386
36929a9507386J3390848q930220j4309193J266944J5923298J3266938K451952
$$ -19507386 -6116538 -15046758 -29355951 -28089007 -12165709 1101229 3553181
36922C553181j49168M675023N458912J041226l22757K055468O62211m835740n740275
$$ 3553181 3404013 8079036 13537948 14579174 14256417 16311885 16974096 12138356 6398081
$$ [...]
##END NTUPLES=NMR SPECTRUM
##END=
