##TITLE=31Pdec_B450306
 CDCl3
 24 sc
 4.6.2024
##JCAMPDX= 6.0         $$ Bruker NMR JCAMP-DX V2.0
##DATA TYPE= NMR SPECTRUM
##DATA CLASS= NTUPLES
##ORIGIN= UXNMR, Bruker Analytische Messtechnik GmbH
##OWNER= root
$$ XWIN-NMR		Version 3.5
$$ Tue Jun  4 14:15:12 2024 Russian Standard Time (UT+4h)  she@DPX200
##.OBSERVE FREQUENCY= 81.013821
##.OBSERVE NUCLEUS= ^31P
##.ACQUISITION MODE= SIMULTANEOUS
##.ACQUISITION SCHEME= undefined
##.AVERAGES= 24
##.DIGITISER RES= 16
##SPECTROMETER/DATA SYSTEM= spect
##.PULSE SEQUENCE= zgpg30
##.SOLVENT NAME= CDCl3
##.SHIFT REFERENCE= (INTERNAL, CDCl3, 0, 248.564)
##AUDIT TRAIL= $$ (NUMBER, WHEN, WHO, WHERE, WHAT)
$$ ##TITLE= Audit trail, XWIN-NMR		Version 3.5
$$ ##JCAMPDX= 5.01
$$ ##ORIGIN= Bruker BioSpin GmbH
$$ ##OWNER= she
$$ F:/spectra/data/she/nmr/P31/1/pdata/1/auditp.txt
$$ ##AUDIT TRAIL=  $$ (NUMBER, WHEN, WHO, WHERE, WHAT)
(   1,<2024-06-04 14:14:13.32 +0400>,<she>,<DPX200>,
      <created by zg, POWCHK disabled, PULCHK disabled
       configuration hash MD5:
       00 E9 B6 7A A2 85 ED C7 34 08 36 98 17 FE 4E 26
       data hash MD5: 32K
       7B 69 FA 73 42 B1 81 9F F9 D1 44 00 38 BA 39 4E>)
(   2,<2024-06-04 14:14:24.25 +0400>,<she>,<DPX200>,
      <Start of raw data processing
       efp BC_mod = 2 LB = 10 FT_mod = 6 PKNL = 1 PHC0 = -172.5509 PHC1 = 0 SI = 64K 
       data hash MD5: 64K
       9B 7A 5B 02 14 5D 89 13 44 7D E3 C0 28 5F B5 68>)
(   3,<2024-06-04 14:14:41.50 +0400>,<she>,<DPX200>,
      <pk PHC0 = 0.6168756 PHC1 = 0 
       data hash MD5: 64K
       95 F1 C7 E4 0C 79 88 33 65 B5 A3 AB 04 54 F5 00>)
$$ ##END=
$$ 
$$ hash MD5
$$ A2 94 F2 96 72 31 E1 B5 C2 6B DB 6F 60 21 9E 9A
##$RELAX= 
##$RELAX= 
##$RELAX= 
##$RELAX= 
##$RELAX= 
##$RELAX= 
##$RELAX= 
##$RELAX= 
##$RELAX= 
$$ Bruker specific parameters
$$ --------------------------
##$DU= <F:/spectra>
##$EXPNO= 1
##$NAME= <P31>
##$PROCNO= 1
##$TYPE= <nmr>
##$USER= <she>
##$AMP= (0..31)
100 100 100 100 100 100 100 100 100 100 100 100 100 100 100 100 100 100 
100 100 100 100 100 100 100 100 100 100 100 100 100 100 
##$AQSEQ= 0
##$AQ_mod= 1
##$AUNM= <au_zg>
##$AUTOPOS= <>
##$BF1= 81.014009
##$BF2= 200.13
##$BF3= 200.13
##$BF4= 200.13
##$BF5= 200.13
##$BF6= 200.13
##$BF7= 200.13
##$BF8= 200.13
##$BYTORDA= 1
##$CFDGTYP= 0
##$CFRGTYP= 5
##$CHEMSTR= <none>
##$CNST= (0..31)
1 1 145 1 1 1 1 1 1 1 1 1 1 1 1 1 1 1 1 1 1 1 1 1 1 1 1 1 1 1 1 1 
##$CPDPRG= <waltz16>
##$CPDPRG1= <>
##$CPDPRG2= <waltz16>
##$CPDPRG3= <>
##$CPDPRG4= <mlev>
##$CPDPRG5= <mlev>
##$CPDPRG6= <mlev>
##$CPDPRG7= <mlev>
##$CPDPRG8= <mlev>
##$CPDPRGB= <>
##$CPDPRGT= <>
##$D= (0..31)
0 1 0 0 0 0 0 0 0 0 0 0.03 2e-05 3e-06 0 0 0 0 0 0 0 0 0 0 0 0 0 0 0 0 
0 0 
##$DATE= 1717496052
##$DBL= (0..7)
120 120 120 11 120 120 24 19 
##$DBP= (0..7)
150 150 150 150 150 150 150 150 
##$DBP07= 0
##$DBPNAM0= <>
##$DBPNAM1= <>
##$DBPNAM2= <>
##$DBPNAM3= <>
##$DBPNAM4= <>
##$DBPNAM5= <>
##$DBPNAM6= <>
##$DBPNAM7= <>
##$DBPOAL= (0..7)
0.5 0.5 0.5 0.5 0.5 0.5 0.5 0.5 
##$DBPOFFS= (0..7)
$$ [...]
##$SUBNAM2= <"">
##$SUBNAM3= <"">
##$SUBNAM4= <"">
##$SUBNAM5= <"">
##$SUBNAM6= <"">
##$SUBNAM7= <"">
##$SUBNAM8= <"">
##$SUBNAM9= <"">
##$SW= 501.771253377433
##$SWIBOX= (0..15)
0 1 3 0 0 0 0 0 0 0 0 0 0 0 0 0 
##$SW_h= 40650.406504065
##$TD= 32768
##$TD0= 1
##$TE= 0
##$TE2= 300
##$TE3= 300
##$TEG= 300
##$TL= (0..7)
0 120 53 12 22 120 120 120 
##$TP= (0..7)
150 150 150 150 150 150 150 150 
##$TP07= 0
##$TPNAME0= <>
##$TPNAME1= <>
##$TPNAME2= <>
##$TPNAME3= <>
##$TPNAME4= <>
##$TPNAME5= <>
##$TPNAME6= <>
##$TPNAME7= <>
##$TPOAL= (0..7)
0.5 0.5 0.5 0.5 0.5 0.5 0.5 0.5 
##$TPOFFS= (0..7)
0 0 0 0 0 0 0 0 
##$TUNHIN= 0
##$TUNHOUT= 0
##$TUNXOUT= 0
##$USERA1= <user>
##$USERA2= <user>
##$USERA3= <user>
##$USERA4= <user>
##$USERA5= <user>
##$V9= 5
##$VALIST= <valist>
##$VCLIST= <CCCCCCCCCCCCCCC>
##$VD= 0
##$VDLIST= <DDDDDDDDDDDDDDD>
##$VPLIST= <PPPPPPPPPPPPPPP>
##$VTLIST= <TTTTTTTTTTTTTTT>
##$WBST= 1024
##$WBSW= 4
##$XGAIN= (0..3)
0 0 0 0 
##$XL= 0
##$YL= 0
##$YMAX_a= 1165
##$YMIN_a= -6646
##$ZGOPTNS= <>
##$ZL1= 120
##$ZL2= 120
##$ZL3= 120
##$ZL4= 120
##$ABSF1= 0
##$ABSF2= 0
##$ABSG= 0
##$ABSL= 0
##$ALPHA= 0
##$AQORDER= 0
##$ASSFAC= 0
##$ASSFACI= 0
##$ASSFACX= 0
##$ASSWID= 0
##$AUNMP= <proc_1d>
##$AZFE= 0.1
##$AZFW= 0.5
##$BCFW= 0
##$BC_mod= 2
##$BYTORDP= 0
##$COROFFS= 0
##$CY= -3
##$DATMOD= 1
##$DC= 0
##$DFILT= <>
##$DTYPP= 0
##$F1P= 0
##$F2P= 0
##$FCOR= 1
##$FTSIZE= 65536
##$FT_mod= 6
##$GAMMA= 0
##$GB= 0
##$INTBC= 1
##$INTSCL= 6.047779e-11
##$ISEN= 30
##$LB= 10
##$LEV0= 0
##$LPBIN= 0
##$MAXI= 10000
##$MC2= 0
##$MEAN= 0
##$ME_mod= 0
##$MI= 50
##$NCOEF= 0
##$NC_proc= -10
##$NLEV= 6
##$NOISF1= 182.463
##$NOISF2= 159.3651
##$NSP= 0
##$NTH_PI= 0
##$NZP= 0
##$OFFSET= 248.5645
##$PC= 4
##$PHC0= -171.934
##$PHC1= 0
##$PH_mod= 1
##$PKNL= yes
##$PPARMOD= 0
##$PSCAL= 0
##$PSIGN= 0
##$REVERSE= no
##$SF= 81.0140089999694
##$SI= 65536
##$SIGF1= 159.3651
##$SIGF2= -187.1042
##$SINO= 113.3802
##$SIOLD= 16384
##$SREGLST= <1H.CDCl3>
##$SSB= 0
##$STSI= 65536
##$STSR= 0
##$SW_p= 40650.406504065
##$SYMM= 0
##$S_DEV= 0
##$TDeff= 32768
##$TDoff= 0
##$TI= <>
##$TILT= no
##$TM1= 0
##$TM2= 0
##$TOPLEV= 0
##$USERP1= <user>
##$USERP2= <user>
##$USERP3= <user>
##$USERP4= <user>
##$USERP5= <user>
##$WDW= 1
##$XDIM= 65536
##$YMAX_p= 351531692
##$YMIN_p= -106854825
$$ End of Bruker specific parameters
$$ ---------------------------------
##NTUPLES= NMR SPECTRUM
##VAR_NAME=  FREQUENCY,     SPECTRUM/REAL,   SPECTRUM/IMAG
##SYMBOL=    X,             R,               I
##VAR_TYPE=  INDEPENDENT,   DEPENDENT,       DEPENDENT
##VAR_FORM=  AFFN,          ASDF,            ASDF
##VAR_DIM=   65536,         65536,           65536
##UNITS=     HZ,            ARBITRARY UNITS, ARBITRARY UNITS
##FACTOR=    0.620285442955139, 1,           1
##FIRST=     20137.2065510682, 0,            0
##LAST=      -20513.1999529968, 0,           0
##MIN=       -20513.1999529968, -106854825,  0
##MAX=       20137.2065510682, 351531692,    0
$$ Real data points
##PAGE= N=1
##DATA TABLE= (X++(R..R)), XYDATA
$$ [...]
39426B162501o02654o90790q01907r30938j065976j189263j280996j323572j305720
39417g029315j227135j101727r54858q12837o89838n81434m70041l39026j85659
39408a3391870k3820J25241K46646L39873M16166M89385N68119O53735P43590
39399i832935Q35469R29513J026144J121815J206260J263709J276942J231680
39391i41403J120317R45241P20620M70522K23229M627j66616k81592l41815l57285
39381A395845l41648l06661k59711k05630j50184j00943o3701l6932j0015L0706
39371d8874R0345J57059K04980K08372J57941O8664k5501q6848r0955l6507N7224
39360F55900J62700K57374L29234L73427L85652L58894K85756J64102J421j85815
$$ plain form
39426 2162501 1559847 869057 67150 -863788 -1929764 -3119027 -4400023 -5723595 -7029315
39417 -7029315 -8256450 -9358177 -10313035 -11125872 -11815710 -12397144 -12867185 -13206211 -13391870
39408 -13391870 -13415690 -13290449 -13043803 -12703930 -12287764 -11798379 -11230260 -10576525 -9832935
39399 -9832935 -8997466 -8067953 -7041809 -5919994 -4713734 -3450025 -2173083 -941403
39391 -941403 178914 1124155 1844775 2315297 2538526 2543153 2376537 2094945 1753130 1395845
39381 1395845 1054197 747536 487825 282195 132011 31068 -32633 -69565 -79580 -48874
39371 -48874 41471 198530 403510 611882 769823 838487 812986 726138 635183 598676 655900
39360 655900 818600 1075974 1405208 1778635 2164287 2523181 2808937 2973039 2974460 2788645
39350B788645l78056n59524p20807q56164r59990j027063j056351j053632j028180
39341d851122r83748r09976p83144n80075k97888L5294L68512O50145Q48586R58660
39331e544756R92825R66317Q87334P58083N84054L82881J84951K4816p0912r2319
39321i26726m7869M1313J51754K66850L79148M84732N75482O36502O51458O11951
39311B824595N24572M11326L03205K29941K09544K40470K99301L47116L44259
39302E734329K66468J12421j00574l45863n93158q10294r67032j043511j037704
39293A215082r65111q51091p22575o04242n17614m78608m93153n55636o53160
39284d626108p71710q97176j011054j088938j108034j058699r48378p93383o06629
$$ plain form
39350 2788645 2410589 1851065 1130258 274094 -685896 -1712959 -2769310 -3822942 -4851122
39341 -4851122 -5834870 -6744846 -7527990 -8108065 -8405953 -8370659 -8002147 -7352002 -6503416 -5544756
39331 -5544756 -4551931 -3585614 -2698280 -1940197 -1356143 -973262 -788311 -763495 -834407 -926726
39321 -926726 -974595 -933282 -781528 -514678 -135530 349202 924684 1561186 2212644 2824595
39311 2824595 3349167 3760493 4063698 4293639 4503183 4743653 5042954 5390070 5734329
39302 5734329 6000797 6113218 6012644 5666781 5073623 4263329 3296297 2252786 1215082
39293 1215082 249971 -601120 -1323695 -1927937 -2445551 -2924159 -3417312 -3972948 -4626108
39284 -4626108 -5397818 -6294994 -7306048 -8394986 -9503020 -10561719 -11510097 -12303480 -12910109
39275a2910109l92840j54333R9749L49587N69000P33886Q29029Q50371Q03420
39266i222240O99761N53081L76201J80719k0766k12773l78667n05133n85038o15967
39256i730822n96469n23774l94362k06026L9184L30724O44570R41269J171767
39247h323939J291994J280399J148100R34293O88802M51949K42386N7414j16528
39238b345130k89468m57043n98974o87496o99922o27694m78324k71955l5519K03680
39228f287845M23515O09731P55224Q57652R17750R38877R27170Q91943Q45610
39219H79627Q01172P66252P36588O94640O16542M84118K94694O2965j85366m23308
39209D727924o29620p89900q93882r33526r04394q08295o53896m54838k27814
$$ plain form
39275 -12910109 -13302949 -13457282 -13357533 -13007946 -12438946 -11705060 -10876031 -10025660 -9222240
39266 -9222240 -8522479 -7969398 -7593197 -7412478 -7433244 -7646017 -8024684 -8529817 -9114855 -9730822
39256 -9730822 -10327291 -10851065 -11245427 -11451453 -11412269 -11081545 -10436975 -9495706 -8323939
39247 -8323939 -7031945 -5751546 -4603446 -3669153 -2980351 -2528402 -2286016 -2228602 -2345130
39238 -2345130 -2634598 -3091641 -3690615 -4378111 -5078033 -5705727 -6184051 -6456006 -6491525 -6287845
39228 -6287845 -5864330 -5254599 -4499375 -3641723 -2723973 -1785096 -857926 34017 879627
39219 879627 1680799 2447051 3183639 3878279 4494821 4978939 5273633 5336598 5151232 4727924
39209 4727924 4098304 3308404 2414522 1480996 576602 -231693 -885589 -1340427 -1568241
39200a568241Q011K31367M20798N57711O28530O25036N44051L88442J69752q9500
39190A915957l57029n97122p79752q87483r16541q73669p73797o40942n08423
39181d418801m11914l74769l94157m39259m65299m35839l40489j98632m8288P3089
39171g454358J45202J70439J67678J61302J73386K21215L16675M64271O57697
39162d976493Q76914J088179J249843J324422J292095J157166R43514O83694M09532
39153D048866J47275q4940k79018m36246n62069o58458p19517p34297o95032o04167
39143e77603m75007l27008j81059n7087K8480O7267O2474K7337k0455o4212r1846
39132a608719r8428q6346o0577k1524L7129J22023K30949L50093M60818N51094
$$ plain form
39200 -1568241 -1560230 -1328863 -908065 -350354 278176 903212 1447263 1835705 2005457 1915957
39190 1915957 1558928 961806 182054 -705429 -1621970 -2495639 -3269436 -3910378 -4418801
39181 -4418801 -4830715 -5205484 -5599641 -6038900 -6504199 -6940038 -7280527 -7479159 -7527447 -7454358
39171 -7454358 -7309156 -7138717 -6971039 -6809737 -6636351 -6415136 -6098461 -5634190 -4976493
39162 -4976493 -4099579 -3011400 -1761557 -437135 854960 2012126 2955640 3639334 4048866
39153 4048866 4196141 4111201 3832183 3395937 2833868 2175410 1455893 721596 26564 -577603
39143 -577603 -1052610 -1379618 -1560677 -1617764 -1589284 -1522017 -1459543 -1432206 -1452661 -1516873 -1608719
39132 -1608719 -1707147 -1793493 -1854070 -1875594 -1838465 -1716442 -1485493 -1135400 -674582 -123488
39122a23488O23846O96239P88552R08415J041075J153662J211053J192746J100753
39113H592853R55579P84234O07726M34920K64871R3301q2815k64063m47571o24017
39103A0315018p75170q75504q98056q22014o40296l65863l3676L05284N97211
39094F806934P98820Q83607Q40478O70610L87722K1018l83644p67433j067665
39085H190447j231286j229436j066740p79530m23531n8046K66259N13821O66423
39076D848381P22476O93929O01295M67241L09513J36321n1361k50629m47718o17782
39066F411666p34206p80211p55156o73246n57286m31398l15759k23778j59994
39057A780632j17823p9828k3486O9006K02356L64831N29529O59734P19112O84780
$$ plain form
39122 -123488 500358 1196597 1985149 2893564 3934639 5088301 6299354 7492100 8592853
39113 8592853 9548432 10332666 10940392 11375312 11640183 11733484 11650669 11386606 10939035 10315018
39103 10315018 9539848 8664344 7766288 6944274 6303978 5938115 5904439 6209723 6806934
39094 6806934 7605754 8489361 9329839 10000449 10388171 10409189 10025545 9258112 8190447
39085 8190447 6959161 5729725 4662985 3883455 3459924 3401878 3668137 4181958 4848381
39076 4848381 5570857 6264786 6866081 7333322 7642835 7779156 7727795 7477166 7029448 6411666
39066 6411666 5677460 4897249 4142093 3468847 2911561 2480163 2164404 1940626 1780632
39057 1780632 1662809 1582981 1559495 1628501 1830857 2195688 2725217 3384951 4104063 4788843
39047D788843N56111L52981J05092j59206m17696o52628q47437r86039j055537
39038A684484j049944r72287q34399o55343m58934k69453j06023K1829J14779
39029b525291J80627K29638K69962L04294L28919L35562L14412K56381J55331
39020a50165J2542j57055l22170m41625m79369m19809k73535p0170J55568L74750
39010a771038N67183P19015Q20644Q67464Q62144Q15895P46781O74395O12359
39001D914842N62792N17035M63123L95171L17838K42502J78341J25920P8288K7366
38991G823218l1144r7528j69381k40714l00617l35900l37897l08354k59695k09525
38981E532463j72485j53399j45585j36099j14864q0978m2024q352J2550J8386
$$ plain form
39047 4788843 5344954 5697935 5803027 5643821 5226125 4573497 3726060 2740021 1684484
39038 1684484 634540 -337747 -1172146 -1827489 -2286423 -2555876 -2661899 -2640070 -2525291
39029 -2525291 -2344664 -2115026 -1845064 -1540770 -1211851 -876289 -561877 -305496 -150165
39020 -150165 -137623 -294678 -616848 -1058473 -1537842 -1957651 -2231186 -2301356 -2145788 -1771038
39010 -1771038 -1203855 -484840 335804 1203268 2065412 2881307 3628088 4302483 4914842
39001 4914842 5477634 5994669 6457792 6852963 7170801 7413303 7591644 7717564 7795852 7823218
38991 7823218 7792074 7694546 7525165 7284451 6983834 6647934 6310037 6001683 5741988 5532463
38981 5532463 5359978 5206579 5060994 4924895 4810031 4729053 4687029 4678677 4691227 4709613
38971D709613J1368l667k0676l3079l4984k3948l169K0776M4652P3312J16350
38960D856548J78441K52129L19301L59455L58201L11793K27989J25090K9524k9062
38950F989409k5426N2993K00668L94165N97774P72340Q84072R10917Q45632O96535
38940A2319079M87031K52703L3025j42150k64886l51430m31569n31469o60274
38931A0710060q06529r43387j038003j061435r97814q51797o51376m42187k73053
38922C644479j78858j69950k32859l39183m55776n52132o05284o03362n47182
38913d0107m49192l30763k19254j43624j26277j72410k63635l62632m28128m31547
38903b967569l66289k47216j03905K8663J20216J54003J30665O5258j9805j00873
$$ plain form
38971 4709613 4720981 4717314 4696638 4663559 4628575 4604627 4601458 4622234 4666886 4740198 4856548
38960 4856548 5034989 5287118 5606419 5965874 6324075 6635868 6863857 6988947 7018471 6989409
38950 6989409 6963983 7016976 7217644 7611809 8209583 8981923 9865995 10776912 11622544 12319079
38940 12319079 12806110 13058813 13091838 12949688 12684802 12333372 11901803 11370334 10710060
38931 10710060 9903531 8960144 7922141 6860706 5862892 5011095 4359719 3917532 3644479
38922 3644479 3465621 3295671 3062812 2723629 2267853 1715721 1110437 507075 -40107
38913 -40107 -489299 -820062 -1039316 -1182940 -1309217 -1481627 -1745262 -2107894 -2536022 -2967569
38903 -2967569 -3333858 -3581074 -3684979 -3656316 -3536100 -3382097 -3251432 -3186174 -3205979 -3306852
38893c306852j56221j68236j26909l3465R9674K55008M19856N93312P83531R95014
38883f45288J214498J407207J528067J540839J433044J219944R39227O40939L75614
38874I654091J82914Q4474Q3772J71312L30220N38787P70230R91896J166251J255740
38864A5229687J231851J085125Q30181N02175J47048j89000m67732o65464p78638
38855A6925233q25062q36324q42352q57079q75570q83950q72505q41213p96241
38846I294937p43962o87733o27201n58859m78972l88711k97373k20204j72996
38837E118926j68219k13726l11400m54948o29326q12999r81149j108087j169910
38828g30838j149180j040977q57542o28021l90968j80746j3857J16862K36432
$$ plain form
38893 -3306852 -3463073 -3631309 -3758218 -3791683 -3692009 -3437001 -3017145 -2423833 -1640302 -645288
38883 -645288 569210 1976417 3504484 5045323 6478367 7698311 8637538 9278477 9654091
38874 9654091 9837005 9921479 10005251 10176563 10506783 11045570 11815800 12807696 13973947 15229687
38864 15229687 16461538 17546663 18376844 18879019 19026067 18837067 18369335 17703871 16925233
38855 16925233 16100171 15263847 14421495 13564416 12688846 11804896 10932391 10091178 9294937
38846 9294937 8550975 7863242 7236041 6677182 6198210 5809499 5512126 5291922 5118926
38837 5118926 4950707 4736981 4425581 3970633 3341307 2528308 1547159 439072 -730838
38828 -730838 -1880018 -2920995 -3778537 -4406558 -4797526 -4978272 -4992129 -4875267 -4638835
38819d638835L73344N43453P39275R30209J075328J142924J125582J042252R28032
38810C261564Q19157P40808P01744O96226P10426P28780P37470P26406O91743
38801I814324O37401N71694M99161M13639K99785J44335m9513k54783m26672n19027
38791A1130344n01539l68990j40835J45287M42408P03699Q90743R78886R59346
38782A4239349Q39189O39304L89650J22682j32381l52908n24509o41598p05894
38773A3872884p22551o96676o33619n43226m44071l62892l27243l53926m39066
38764I349614n56142o64763p27281p25383o67887n85038n12232m72476m67259
38755C971153m80063m89142m81406m59011m34825m20814m19220m23865m29155
$$ plain form
38819 -4638835 -4265491 -3722038 -2982763 -2052554 -977226 165698 1291280 2333532 3261564
38810 3261564 4080721 4821529 5523273 6219499 6929925 7658705 8396175 9122581 9814324
38801 9814324 10451725 11023419 11522580 11936219 12236004 12380339 12330826 12076043 11649371 11130344
38791 11130344 10628805 10259815 10118980 10264267 10706675 11410374 12301117 13280003 14239349
38782 14239349 15078538 15717842 16107492 16230174 16097793 15744885 15220376 14578778 13872884
38773 13872884 13150333 12453657 11820038 11276812 10832741 10469849 10142606 9788680 9349614
38764 9349614 8793472 8128709 7401428 6676045 6008158 5423120 4910888 4438412 3971153
38755 3971153 3491090 3001948 2520542 2061531 1626706 1205892 786672 362807 -66348
38746f6348m37114m55586m89898n35480n77274n96492n80739n31092m60729l85701
38736e116453l15234k49620j86626j29567q9371p8996j04988j62523k36573l07304
38726f977255l56158l70903l49080k98484k32808j63761r4924k2233N9538J49881
38716h656187K41199L24745M00021M79717N84051P26463R01512J085233J247617
38707b665629J366546J432688J444053J397487J285847J103823Q57483N68513
38699F790811K68014j5714k65240m72139o29667p29242p65161p43112o83768o16308
38689B138474n64633n35948n20618n03376m76205m42350m10245l85486l68639
38680b069026l58613l55967l62618l79186m02291m22776m25842l94620l16452
$$ plain form
38746 -66348 -503462 -959048 -1448946 -1984426 -2561700 -3158192 -3738931 -4270023 -4730752 -5116453
38736 -5116453 -5431687 -5681307 -5867933 -5997500 -6086871 -6165867 -6270855 -6433378 -6669951 -6977255
38726 -6977255 -7333413 -7704316 -8053396 -8351880 -8584688 -8748449 -8843373 -8865606 -8806068 -8656187
38716 -8656187 -8414988 -8090243 -7690222 -7210505 -6626454 -5899991 -4998479 -3913246 -2665629
38707 -2665629 -1299083 133605 1577658 2975145 4260992 5364815 6222298 6790811
38699 6790811 7058825 7043111 6777871 6305732 5676065 4946823 4181662 3438550 2754782 2138474
38689 2138474 1573841 1037893 517275 13899 -462306 -904656 -1314901 -1700387 -2069026
38680 -2069026 -2427639 -2783606 -3146224 -3525410 -3927701 -4350477 -4776319 -5170939 -5487391
38671e487391j87537j2471J99144M34043O74127Q97871J087329J235941J349453
38662A90509J438072J505698J543715J532778J451328J286216J039908P31218
38654A0719442L90997N6223k36384m58240n96988o60310o72333o64404o64323
38645G213680o86969p28687p68638p78510p36000o34031m81122k95489r8297R1013
38635B096950K57627L93198M96120N69683O18883O47385O55824O41709O00628
38626F978007N28506M24298K92129J41729j2732j54040k62739l18512l04328k13293
38616G099025n4481J47404L60591N58824P29981Q75193J000399J107880J193514
38607A3018330J248921J263826J226671J126204R56746P25223M54292J77688p0453
$$ plain form
38671 -5487391 -5674928 -5687399 -5488255 -5054212 -4380085 -3482214 -2394885 -1158944 190509
38662 190509 1628581 3134279 4677994 6210772 7662100 8948316 9988224 10719442
38654 10719442 11110439 11166662 10930278 10472038 9875050 9214740 8542407 7878003 7213680
38645 7213680 6526711 5798024 5029386 4250876 3514876 2880845 2399723 2104234 2005937 2096950
38635 2096950 2354577 2747775 3243895 3813578 4432461 5079846 5735670 6377379 6978007
38626 6978007 7506513 7930811 8222940 8364669 8351937 8197897 7935158 7616646 7312318 7099025
38616 7099025 7044544 7191948 7552539 8111363 8841344 9716537 10716936 11824816 13018330
38607 13018330 14267251 15531077 16757748 17883952 18840698 19565921 20020213 20197901 20127448
38598B0127448k66380m02005m83088n22664n33783n25019n00068m60105m05995
38589A6028341l38795k60398j77260j05985p4176j11023k30921m21225o43591
38580A3664967q48706r95252j062718j052875r81772q69106p31948n85455m47023
38571F090112l37207k73489k59766k79797l01881k94068k40366j46953l5377P0495
38561C991703J54363K09901K37559K39428K15391J62673P9347l0605j54591k72985
38551D832184l63473m05799l85871k99680j56754J8727J91829L26587L98121M00410
38541D556281L45106K53437J47750M7039l4648q9660j18108j26920j25694j21121
38531D733462j13552r8686p3951m4316k1070j3473k1246l5383m5829m8220m5451
$$ plain form
38598 20127448 19861068 19459063 18975975 18453311 17919528 17394509 16894441 16434336 16028341
38589 16028341 15689546 15429148 15251888 15145903 15071727 14960704 14729783 14308558 13664967
38580 13664967 12816261 11821009 10758291 9705416 8723644 7854538 7122590 6537135 6090112
38571 6090112 5752905 5479416 5219650 4939853 4637972 4343904 4103538 3956585 3921208 3991703
38561 3991703 4146066 4355967 4593526 4832954 5048345 5211018 5290365 5259760 5105169 4832184
38551 4832184 4468711 4062912 3677041 3377361 3220607 3239334 3431163 3757750 4155871 4556281
38541 4556281 4901387 5154824 5302574 5349613 5314965 5225305 5107197 4980277 4854583 4733462
38531 4733462 4619910 4521224 4447273 4402957 4381887 4368414 4347168 4311785 4265956 4217736 4172285
38520D172285m6210o2715j06165j79996k76207l79376m74923n53422o08458o33981
38510H50832o26814n91573n40659m87093m36390l84870l25215k53740j74255r8231
38500c068008m3402l0592p6821j85237l37294m93643o05838o34384n64185m08788
38490f448192k00586K6621K51032M64227O62769Q38886R77214J058422J066837
38481a302770R98442Q65107O91449N04639L23096J51441j5897j86180l60928n32917
38471A135482o87644q07955q80139q99079q69820q04473p16838o18532n18482
38462e667480m24213l42505k78552k34207k05963j83743j52446r7487j1769J00759
38452g497606K27463L52675M62194N45122N94851O10910O00658N78250N59980
$$ plain form
38520 4172285 4126075 4063360 3957195 3777199 3500992 3121616 2646693 2093271 1484813 850832
38510 850832 224018 -367555 -908214 -1395307 -1831697 -2216567 -2541782 -2795522 -2969777 -3068008
38500 -3068008 -3111410 -3142002 -3218823 -3404060 -3741354 -4234997 -4840835 -5475219 -6039404 -6448192
38490 -6448192 -6648778 -6622157 -6371125 -5906898 -5244129 -4405243 -3428029 -2369607 -1302770
38481 -1302770 -304328 560779 1252228 1756867 2079963 2231404 2215507 2029327 1668399 1135482
38471 1135482 447838 -360117 -1240256 -2139335 -3009155 -3813628 -4530466 -5148998 -5667480
38462 -5667480 -6091693 -6434198 -6712750 -6946957 -7152920 -7336663 -7489109 -7586596 -7598365 -7497606
38452 -7497606 -7270143 -6917468 -6455274 -5910152 -5315301 -4704391 -4103733 -3525483 -2965503
38443b965503N57824N74337O00815O18873O05399N41227M21639K62815R7592l9162
38433A275856j26236j61815j56363j20005n4555M4744J80192L41975N04547O32368
38423B360708O92946O70792N75026M36606K96286J88691J29663J12727J15803
38414E579248J13739Q9089L5773m4000j44593k59069l78421m91172n85626o53026
38404C261942o88185o87074o44887n58008m28728k68243r5143O9263K05911L02249
38394D69097L55154L70669L59092L28488K82371K23389J57965R6116M7185J7272
38384B706798J1162L4668R1932J78197K75110L55210L94674L85446L37336K68910
38374E039443J95563J24137N5160j4081r0540j87554l21569n02169p21910r54362
$$ plain form
38443 -2965503 -2407679 -1833342 -1232527 -613654 -8255 532972 954611 1217426 1315018 1275856
38433 1275856 1149620 987805 831442 711437 656882 701626 881818 1223793 1728340 2360708
38423 2360708 3053654 3724446 4299472 4736078 5032364 5221055 5350718 5463445 5579248
38414 5579248 5692987 5782076 5817849 5773849 5629256 5370187 4991766 4500594 3914968 3261942
38404 3261942 2573757 1886683 1241796 683788 255060 -13183 -108326 -39063 166848 469097
38394 469097 824251 1194920 1554012 1882500 2164871 2388260 2546225 2642341 2689526 2706798
38384 2706798 2717960 2752628 2844560 3022757 3297867 3653077 4047751 4433197 4770533 5039443
38374 5039443 5235006 5359143 5414303 5400222 5309682 5122128 4800559 4298390 3576480 2622118
38364B622118j163197j317258j402448j423741j397615j341193j264544j168786
38356g856664j048553q96473p08100m86444k44819n745K05913L73866M98419N94221
38346i574379O77672P53402Q10607Q31498Q04230P30157O20612M86451L29392
38337c530358J43509p2724l03643n14865o66099p29558p02021o04971m74961l49822
38327g805513k56083k01854j77417j62702j37610r0185j8853P1216J73617K83329
38317h322055L95226N01841N94055O64809P12641P42126P60617P73301P79927
38308b397512P75760P55671P16965O58225N76698M69045L36271J88199M3031p7500
38298B044853j53794j72268j27487k2942J29521L11826N02928O82452Q33301R41911
$$ plain form
38364 2622118 1458921 141663 -1260785 -2684526 -4082141 -5423334 -6687878 -7856664
38356 -7856664 -8905217 -9801690 -10509790 -10996234 -11241053 -11246798 -11040885 -10667019 -10168600 -9574379
38346 -9574379 -8896707 -8143305 -7332698 -6501200 -5696970 -4966813 -4346201 -3859750 -3530358
38337 -3530358 -3386849 -3459573 -3763216 -4278081 -4944180 -5673738 -6375759 -6980730 -7455691 -7805513
38327 -7805513 -8061596 -8263450 -8440867 -8603569 -8741179 -8831364 -8850217 -8779001 -8605384 -8322055
38317 -8322055 -7926829 -7424988 -6830933 -6166124 -5453483 -4711357 -3950740 -3177439 -2397512
38308 -2397512 -1621752 -866081 -149116 509109 1085807 1554852 1891123 2079322 2122353 2044853
38298 2044853 1891059 1718791 1591304 1568362 1697883 2009709 2512637 3195089 4028390 4970301
38288D970301R96537R86435R04500P51970N40517K89048J8143k52586n02490p07107
38278G995268q39935q80273q23235o85423n01457l11852j48239k3742O6859J38230
38268C986201K02163K58491K94346K92383K42286J46689J7353j32810k92077m44217
38258D570808n63093o17320n84055m61018k67490l5527K00438M10246N71527O72203
38248C896719P11178O95741O37308N49052M46341L46647K65865K12203J81860
38239G942914J59521J23287N2004o7439k34840m34865o39108q12093r21389r50368
38229D217624r07879q27362p53049p20411p42443q08126q90466r57390r81317
38220c370819r46154q51112p10296n48553l95248k77167k10749j95533k13259
$$ plain form
38288 4970301 5966838 6953273 7857773 8609743 9150260 9439308 9457451 9204865 8702375 7995268
38278 7995268 7155333 6275060 5451825 4766402 4264945 3953093 3804854 3781112 3847971 3986201
38268 3986201 4188364 4446855 4741201 5033584 5275870 5422559 5439912 5307102 5015025 4570808
38258 4570808 4007715 3390395 2806340 2345322 2077832 2042305 2242743 2652989 3224516 3896719
38248 3896719 4607897 5303638 5940946 6489998 6936339 7282986 7548851 7761054 7942914
38239 7942914 8102435 8225722 8277726 8210287 7975447 7540582 6901474 6089381 5167992 4217624
38229 4217624 3309745 2482383 1729334 1008923 266480 -541646 -1432112 -2389502 -3370819
38220 -3370819 -4316973 -5168085 -5878381 -6426934 -6822182 -7099349 -7310098 -7505631 -7718890
38211g718890k35320k35118j97514j20690j2619J12965K39779L53549M47876N27164
38201f838818O02929O85462P76830Q69261R48124R96693J000855R53002Q54035
38192H48373P12690N43138L62540J88921L8160q0161j65620k25539k69373l02939
38182A650190l27047l41193l48257l55145l68437l89226m12068m28542m31104
38173a750829m13772l71217l00307k04334r5280R997R7593J62219K06718K37018
38163b422194K57146K67473K66285K52739K29136K01028J75169J56493J46123
38154d70602J41662J39108J34279J22625R9062O0329R347m3098q2870j00927r9059
38143i0144q8512q3268r3641j24379j77062k52631l49959m61224n69926o56301
$$ plain form
38211 -7718890 -7954210 -8189328 -8386842 -8507532 -8520151 -8407186 -8167407 -7813858 -7365982 -6838818
38201 -6838818 -6235889 -5550427 -4773597 -3904336 -2956212 -1959519 -958664 -5662 848373
38192 848373 1561063 2104201 2466741 2655662 2693822 2613661 2448041 2222502 1953129 1650190
38182 1650190 1323143 981950 633693 278548 -89889 -479115 -891183 -1319725 -1750829
38173 -1750829 -2164601 -2535818 -2836125 -3040459 -3135739 -3125742 -3028149 -2865930 -2659212 -2422194
38163 -2422194 -2165048 -1897575 -1631290 -1378551 -1149415 -948387 -773218 -616725 -470602
38154 -470602 -328940 -189832 -55553 67072 166134 226463 235810 192712 109842 8915 -90144
38143 -90144 -178656 -261924 -355565 -479944 -657006 -909637 -1259596 -1720820 -2290746 -2947047
38133b947047p06661p17899o93479o37093n51931m44908l28226k14220j08421
38124g349885p923R3686J99655L06331M03130M74473N02809M73456L81597K38593
38114d284078P2706p8326j79250k06877j53243k4237J62488L78784N87860P48847
38104b975326Q25137P95417O62376M52623K06281l7134k47397m04207m95067n15580
38094a732877m71861l81516k71485j73074j14642j13194j68901k66667l83728
38085d077945m97331n88076o40477o44902o01106n19198m14786l00537j79978
38076h464336m8243J00378K62970M23284N55814O36613O54198O14292N36855M47972
38066d280203L70290L15560K82895K64182K52954K49029K54225K63146K58753
$$ plain form
38133 -2947047 -3653708 -4371607 -5065086 -5702179 -6254110 -6699018 -7027244 -7241464 -7349885
38124 -7349885 -7357808 -7264122 -7064467 -6758136 -6355006 -5880533 -5377724 -4904268 -4522671 -4284078
38114 -4284078 -4211372 -4289698 -4468948 -4675825 -4829068 -4853305 -4690817 -4312033 -3724173 -2975326
38104 -2975326 -2150189 -1354772 -692396 -239773 -33492 -70626 -318023 -722230 -1217297 -1732877
38094 -1732877 -2204738 -2586254 -2857739 -3030813 -3145455 -3258649 -3427550 -3694217 -4077945
38085 -4077945 -4575276 -5163352 -5803829 -6448731 -7049837 -7569035 -7983821 -8284358 -8464336
38076 -8464336 -8512579 -8412201 -8149231 -7725947 -7170133 -6533520 -5879322 -5265030 -4728175 -4280203
38066 -4280203 -3909913 -3594353 -3311458 -3047276 -2794322 -2545293 -2291068 -2027922 -1769169
38057a769169K18749J29409k938j50679k74642l39160l25015k35126r1498P4567
38047b765502K34650L72023M82579N68193O28253O56713O46779N98021N18709
38038A940418M21203L15315K06112R7856l62p3122j03245p9282j006J19695K61842
38027C105424M00399N11787N78413N90639N45700M45477K95949J08584r8651l02661
38017F181060m78092n99770o45333o00392m65991k63778l3553J77260L27132L90809
38007C989352L63595K60323J11173m4060j63125k10301j66436l6537J49898L47484
37997D601366N08596N95165N84491M70267K62060j5922l29215o42105r28141j175321
37987C931241j381855j546055j659137j706460j674075j553594j342896j046341
$$ plain form
38057 -1769169 -1550420 -1421011 -1423949 -1574628 -1849270 -2188430 -2513445 -2748571 -2840069 -2765502
38047 -2765502 -2530852 -2158829 -1676250 -1108057 -479804 176909 823688 1421709 1940418
38038 1940418 2361621 2676936 2883048 2980904 2980542 2907420 2804175 2724893 2723887 2843582 3105424
38027 3105424 3505823 4017610 4596023 5186662 5732362 6177839 6473788 6582372 6483721 6181060
38017 6181060 5702968 5103198 4457865 3857473 3391482 3127704 3094151 3271411 3598543 3989352
38007 3989352 4352947 4613270 4724443 4680383 4517258 4306957 4140521 4103984 4253882 4601366
37997 4601366 5109962 5705127 6289618 6759885 7021945 7006023 6676808 6034703 5106562 3931241
37987 3931241 2549386 1003331 -655806 -2362266 -4036341 -5589935 -6932831 -7979172
37979g979172o77613k62614J62052N55298Q78740J101898J205854J186300J055205
37970b774052Q39299N74610K98182L9867j81680l56747m78592n39713n34030m62663
37960c575519l37717j80587j5900J35291K60047L54920M24634M78765N27243N76302
37950a352521O27141O77682P24916P65044P91999P97632P74698P20399O38082
37941E165072N37400M33823L46593K94312K89844L36534M25418N32556O19529
37932H981081O41916N65363L81285J13015j90496m69592o71478p64886p47321
37923G838887o42293m88239l25031j84191q5565l8473m3404r1782j65277k38433
37913E536199k86777k97435k75557k41656k21160k32839k82369l62644m57798
$$ plain form
37979 -7979172 -8656785 -8919399 -8757347 -8202049 -7323309 -6221411 -5015557 -3829257 -2774052
37970 -2774052 -1934753 -1360143 -1061961 -1022094 -1203774 -1560521 -2039113 -2578826 -3112856 -3575519
37960 -3575519 -3913236 -4093823 -4109723 -3974432 -3714385 -3359465 -2934831 -2456066 -1928823 -1352521
37950 -1352521 -725380 -47698 677218 1442262 2234261 3031893 3806591 4526990 5165072
37941 5165072 5702472 6136295 6482888 6777200 7067044 7403578 7828996 8361552 8981081
37932 8981081 9622997 10188360 10569645 10682660 10492164 10022572 9351094 8586208 7838887
37923 7838887 7196594 6708355 6383324 6199133 6113568 6075095 6031691 5939909 5774632 5536199
37913 5536199 5249422 4951987 4676430 4434774 4213614 3980775 3698406 3335762 2877964
37904B877964n47543o10590o27485n83197m69196k85288m1659K39391N24283P74396
37894A251076R57356J057763J079513J037357R44916Q09666O37902M42473K44660
37885H462682O8630o7084j56756k10557k50861l01617l76721m75425n86304o93717
37875E412270p81743q37503q56915q49448q34488q28346q30787q22232p74520
37866b003712o67550n00171k89257n9883J65598L74016N62218P33468Q91304J034322
37856B40353J155879J248665J309234J338082J336801J306784J250228J170124
37848A0356150J067484R38850P77772N79945L48269R4676j61696l98636n95857
37839A3006957p39642q25624q58299q47273q02905p34812o53767n73504n08639
$$ plain form
37904 2877964 2330421 1719831 1092346 509149 39953 -245335 -286994 -47603 476680 1251076
37894 1251076 2208432 3266195 4345708 5383065 6327981 7137647 7775549 8218022 8462682
37885 8462682 8531312 8464228 8307472 8096915 7846054 7544437 7167716 6692291 6105987 5412270
37875 5412270 4630527 3793024 2936109 2086661 1252173 423827 -406960 -1229192 -2003712
37866 -2003712 -2671262 -3171433 -3460690 -3520573 -3354975 -2980959 -2418741 -1685273 -793969 240353
37856 240353 1396232 2644897 3954131 5292213 6629014 7935798 9186026 10356150
37848 10356150 11423634 12362484 13140256 13720201 14068470 14163146 14001450 13602814 13006957
37839 13006957 12267315 11441691 10583392 9736119 8933214 8198402 7544635 6971131 6462492
37830F462492m68880m53489m50136m39542m04123l35948k38543j20998J0608J57147
37820C718588L23664N14205P28469R59592J191164J396076J542156J604377J575743
37811A3554034J469017J309317J124660R40030P74450O38013N29164M35317L38005
37802B1112007K20107P2170j03427k91683m69352o13907p12068p62124p69490
37793A7682233p40167o76922n79456m46899k80771q7381J20398L21956M89636
37784A5802627N93376O08911N25017L45206Q4410k34645n82729r25234j225947
37775A4990992j452891j583457j607168j526254j354602j115291q36761n47797
37767D966771k72728k9502J68086L07554L79932L87781L52026L08906K95590L32000
$$ plain form
37830 6462492 5993612 5540123 5089987 4650445 4246322 3910374 3671831 3550833 3561441 3718588
37820 3718588 4042252 4556457 5284926 6244518 7435682 8831758 10373914 11978291 13554034
37811 13554034 15023051 16332368 17457028 18397058 19171508 19809521 20338685 20774002 21112007
37802 21112007 21332114 21404284 21300857 21009174 20539822 19925915 19213847 18451723 17682233
37793 17682233 16942066 16265144 15685688 15238789 14958018 14870637 14991035 15312991 15802627
37784 15802627 16396003 17004914 17529931 17875137 17959547 17724902 17142173 16216939 14990992
37775 14990992 13538101 11954644 10347476 8821222 7466620 6351329 5514568 4966771
37767 4966771 4694043 4664541 4832627 5140181 5520113 5907894 6259920 6568826 6864416 7196416
37757G196416M10378M99945N64835N84243N62069N21530M90823M89810N23415
37748A1843464N82580O50994P13665P62002P93025Q06597Q05685P99347Q03832
37739A8561191Q39876R28807J089507J335304J670948K092548K591790L160870
37731C2270841L793543M482186N214225N970457O725993P454419Q134525Q755140
37723H2801329R312155R797313J0185743J0429782J0460238J0192156R536234
37716A52714950Q421251O826484M808706K503613R6127k224242m299901o022575
37708A62824413p335697q228898q727761q881214q751476q409022p928525p380511
37700I7181309o820026o279153n767924n282169m813903m360164l926754l525010
$$ plain form
37757 7196416 7606794 8106739 8671574 9255817 9817886 10339416 10830239 11320049 11843464
37748 11843464 12426044 13077038 13790703 14552705 15345730 16152327 16958012 17757359 18561191
37739 18561191 19401067 20329874 21419381 22754685 24425633 26518181 29109971 32270841
37731 32270841 36064384 40546570 45760795 51731252 58457245 65911664 74046189 82801329
37723 82801329 92113484 101910797 112096540 122526322 132986560 143178716 152714950
37716 152714950 161136201 167962685 172771391 175275004 175371131 173146889 168846988 162824413
37708 162824413 155488716 147259818 138532057 129650843 120899367 112490345 104561820 97181309
37700 97181309 90361283 84082130 78314206 73032037 68218134 63857970 59931216 56406206
37692E6406206l164383k847135k569131k324354k108362j919451j760118j639564
37684C8073708j573547j577299j652812j778392j909330j991681j981883j860561
37676B3748203j633981j326301r70794o04595k64595J8681K27195L56234M08927
37667A9958974L89868L03337J55693m2039k73071n14131p36042r09018j012902
37658A7320669j046229j026985r84022r44399r22766r16869r11560q90445q48282
37649H829112p94120p41461o93366o35435n42703l94768j88552N8172L12342N35964
37639E745185O96920P77353P78213P18685O29695N42626M77969M40015M20192
37630A1226853M05724L87038L60108L24615K81389K31230J75275J16214N9469
$$ plain form
37692 56406206 53241823 50394688 47825557 45501203 43392841 41473390 39713272 38073708
37684 38073708 36500161 34922862 33270050 31491658 29582328 27590647 25608764 23748203
37676 23748203 22114222 20787921 19817127 19212532 18947937 18966618 19193813 19550047 19958974
37667 19958974 20348842 20652179 20807872 20765833 20492762 19978631 19242589 18333571 17320669
37658 17320669 16274440 15247455 14263433 13319034 12396268 11479399 10567839 9677394 8829112
37649 8829112 8034992 7293531 6600165 5964730 5422027 5027259 4838707 4896879 5209221 5745185
37639 5745185 6442105 7219458 7997671 8716356 9346051 9888677 10366646 10806661 11226853
37630 11226853 11632577 12019615 12379723 12704338 12985727 13216957 13392232 13508446 13567915
37621A3567915J3311j3199j4071J0063N1168R6217J31052J43581J25995P6958
37611A4188990L517p9741j56273k16123k61856l07056l67897m53458n61013o78496
37601A1110594p91416q88909r64820j013505j024485r81877q71253o89931m52563
37592C431835j87148P5358L09900N00006O36388P15851P41797P24517O80063O27727
37582H256294N85727N65272N66511N81265O01725O27156O61750P06527P54341
37573A3906568P92093Q05768P83110P14745N97304M38133K56835Q0831o2866j55301
37563A8157220j89966j73589j23739o3332j2597J9126L7291N7962R6573J56019
37553A7960968K21416K64148K52722J65934L415k11482m39082o37405p74485q33454
$$ plain form
37621 13567915 13581226 13568027 13553956 13564019 13615187 13711404 13842456 13986037 14112032 14188990
37611 14188990 14192507 14112766 13956493 13740370 13478514 13171458 12803561 12350103 11789090 11110594
37601 11110594 10319178 9430269 8465449 7451944 6427459 5445582 4574329 3884398 3431835
37592 3431835 3244687 3320045 3629945 4129951 4766339 5482190 6223987 6948504 7628567 8256294
37582 8256294 8842021 9407293 9973804 10555069 11156794 11783950 12445700 13152227 13906568
37573 13906568 14698661 15504429 16287539 17002284 17599588 18037721 18294556 18375387 18312521 18157220
37563 18157220 17967254 17793665 17669926 17606594 17593997 17613123 17650414 17708376 17804949 17960968
37553 17960968 18182384 18446532 18699254 18865188 18868603 18657121 18218039 17580634 16806149 15972695
37543A5972695q12600p25258n99522m72899l79973l38648l43539l70158l86639
37534A1543459l66501k97483j83961m2754J05989K48684L83403N16539O52876
37525A2560251P86172Q97063R59176R48719Q52908O75670M40006J84566m6810
37516A8257721k18750l13994l34777k97685k26216j43913o9356j4226J5271J5480
37506A6669555j5812p6962j58030k38732k92985k99689k53021j64363n5073N3000
37496A5167888J43009K05925K44264K74144L18872L94244M96285O02141O82941
37487A8529713P17658O98842O30668N25454M02330K85873K00809J63205J73953
37478B2328505K19627K79018L28838L45903L09880K10507N5729j27608l03550
$$ plain form
37543 15972695 15160095 14434837 13835315 13362416 12982443 12643795 12300256 11930098 11543459
37534 11543459 11176958 10879475 10695514 10652760 10758749 11007433 11390836 11907375 12560251
37525 12560251 13346423 14243486 15202662 16151381 17004289 17679959 18119965 18304531 18257721
37516 18257721 18038971 17724977 17390200 17092515 16866299 16722386 16653030 16638804 16654075 16669555
37506 16669555 16653743 16576781 16418751 16180019 15887034 15587345 15334324 15169961 15114888 15167888
37496 15167888 15310897 15516822 15761086 16035230 16354102 16748346 17244631 17846772 18529713
37487 18529713 19247371 19946213 20576881 21102335 21504665 21790538 21991347 22154552 22328505
37478 22328505 22548132 22827150 23155988 23501891 23811771 24022278 24078007 23950399 23646849
37469B3646849m41285n24790n53937n39902m99741m52096m12375l86157l64116
37460A9472450l24620k45820j20579L5573J88100K95971L27620K74627J56661
37451B0059983J3034j15556k03493k45300k50282k34562k14936k03457k02177
37442A8403254k01825j87428j47744q1289N118J02497K04353L06583M04582M91543
37432A9299644N59159N99051O03708N68298M94057L90482K72713J55023M5495
37423B2987630n4412j46940k35283l22542m11307n02861n96133o86814p67018
37414A9264320q25822q51047q32531p66500o59300n26943l88369k55976j31478
37405A4026354j1508J02118J97576K58233K73367K46272J94998J45598J20999
$$ plain form
37469 23646849 23205564 22680774 22126837 21586935 21087194 20635098 20222723 19836566 19472450
37460 19472450 19147830 18902010 18781431 18817004 19005104 19301075 19628695 19903322 20059983
37451 20059983 20073017 19957461 19753968 19508668 19258386 19023824 18808888 18605431 18403254
37442 18403254 18201429 18014001 17866257 17784968 17790086 17892583 18096936 18403519 18808101 19299644
37432 19299644 19858803 20457854 21061562 21629860 22123917 22514399 22787112 22942135 22987630
37423 22987630 22933218 22786278 22550995 22228453 21817146 21314285 20718152 20031338 19264320
37414 19264320 18438498 17587451 16754920 15988420 15329120 14802177 14413808 14157832 14026354
37405 14026354 14014846 14116964 14314540 14572773 14846140 15092412 15287410 15433008 15554007
37396A5554007J31094J70052K22300K71998L08806L27771L26797L05676K67192
37387A7885693K18682J72574J44605J48897J91212K64139L47596M14640M40049
37378B0228087M09077L23681K03108P7259k4289q1792r0006n8964j2337J8122
37368B0991946L238p1560k00036l58546n15927o43909p24001p49867p25523o61294
37358A6344521n70891m71748l86382l40082l53007m30141n55248o93338q02230
37349A1741454q48910q22450p35748o15547m88633l74125k84708k31526k25398
37340G114409k72073l65713m87252o10869p14536p86145q20640q12854p55132
37331A489195o42532m79509k80741o6009J45696L39174N03706O32913P24236P78065
$$ plain form
37396 15554007 15685101 15855153 16077453 16349451 16658257 16986028 17312825 17618501 17885693
37387 17885693 18104375 18276949 18421554 18570451 18761663 19025802 19373398 19788038 20228087
37378 20228087 20637164 20960845 21163953 21241212 21216923 21135131 21045125 20986161 20973824 20991946
37368 20991946 20995184 20923624 20723588 20365042 19849115 19205206 18481205 17731338 17005815 16344521
37358 16344521 15773630 15301882 14915500 14575418 14222411 13792270 13237022 12543684 11741454
37349 11741454 10892544 10070094 9334346 8718799 8230166 7856041 7571333 7339807 7114409
37340 7114409 6842336 6476623 5989371 5378502 4663966 3877821 3057181 2244327 1489195
37331 1489195 846663 367154 86413 20404 166100 505274 1008980 1641893 2366129 3144194
37321C144194P97031P85534P49221O94829O30663N66336N09926M63402M19872
37312H761008L65086K82729J61875M593j70364l32472m52210n13348n15920m69698
37302G121279l85045k66909j13088Q3048L24928O03415Q93001J157412J360166
37293A0778207J472750J479005J379143J193417R60023P23714N19722L62452K44990
37284A9113423J48106N2477n2241j64675k74629l68745m36174m72295m79096m62468
37274A6603683m29255l87183l46718l20725l19892l47351l96921m55297n05737
37265A3094604n32279n24460m80205m04073l02884j84679o2750M1750J05669J16081
37255A0866774P9235J8807l5196n9810m7667p181M4723R2299J26905J46558J51607
$$ plain form
37321 3144194 3941225 4726759 5475980 6170809 6801472 7367808 7877734 8341136 8761008
37312 8761008 9126094 9408823 9570698 9575291 9404927 9072455 8620245 8106897 7590977 7121279
37302 7121279 6736234 6469325 6356237 6439285 6764213 7367628 8260629 9418041 10778207
37293 10778207 12250957 13729962 15109105 16302522 17262545 17986259 18505981 18868433 19113423
37284 19113423 19261529 19314006 19261765 19097090 18822461 18453716 18017542 17545247 17066151 16603683
37274 16603683 16174428 15787245 15440527 15119802 14799910 14452559 14055638 13600341 13094604
37265 13094604 12562325 12037865 11557660 11153587 10850703 10666024 10603274 10645024 10750693 10866774
37255 10866774 10946009 10964816 10929620 10869810 10822143 10814962 10859685 10951984 11078889 11225447 11377054
37244A1377054J41093J12476O3977l096q4494j75442k72175l69869m58640n22797
37234I808087n45511n15350m29635k94176j21875O9070K58764M29918N68593O60266
37224I888151O86825O31379M89991K81237M4425j74028l37639m29733m51550m13086
37214A0215972l25715k01971n9198P9946J92817K63458K85194K59078J92203R7741
37204A0999525o148j01750j79769k43508l04588l72616m46940n16730n67679n87859
37194G671938n67868m98033l68686j75336P5382L63561O58566R24680J128453
37185I212657J246421J270543J209051J082695R18126P40084N64282L94522K26746
37176A6865127N7757j08071k58869l80481m61691m96911m87422m42128l76207
$$ plain form
37244 11377054 11518147 11630623 11694600 11691504 11607010 11431568 11159393 10789524 10330884 9808087
37234 9808087 9262576 8747226 8317591 8023415 7901540 7970610 8229374 8659292 9227885 9888151
37224 9888151 10574976 11206355 11696346 11977583 12022008 11847980 11510341 11080608 10629058 10215972
37214 10215972 9890257 9688286 9629088 9709034 9901851 10165309 10450503 10709581 10901784 10999525
37204 10999525 10993377 10891627 10711858 10468350 10163762 9791146 9344206 8827476 8259797 7671938
37194 7671938 7104070 6606037 6237351 6062015 6137397 6500958 7159524 8084204 9212657
37185 9212657 10459078 11729621 12938672 14021367 14939493 15679577 16243859 16638381 16865127
37176 16865127 16922884 16814813 16555944 16175463 15713772 15216861 14729439 14287311 13911104
37167A3911104l05895k40998j80109j12962k9211P2656J83049K86675L69985M24496
37157A4378790M45587M30942L81361L02069K01189Q5136m5717j97285l76664n84283
37147A5021125q08287j024947j205016j322736j364144j332490j248421j142853
37139E572231j044784r71441r27246r09986r16082r40068r71957r99227j013981
37130c122541j018328j021508j030071j038759j028709r73800q51334o52641l90223
37121a1127914r8336J75089L83758M99041N18607M63640L67461K62598J72283
37112h383773J08161P2262O0381O5021P7493Q9437R3900Q6305O5426L3933k608
37101g634062l8692p2100j04337j36901j65978j80894j69433j27029o2032Q114
$$ plain form
37167 13911104 13605209 13364211 13184102 13071140 13041929 13114585 13297634 13584309 13954294 14378790
37157 14378790 14824377 15255319 15636680 15938749 16139938 16225074 16179357 15982072 15605408 15021125
37147 15021125 14212838 13187891 11982875 10660139 9295995 7963505 6715084 5572231
37139 5572231 4527447 3556006 2628760 1718774 802692 -137376 -1109333 -2108560 -3122541
37130 -3122541 -4140869 -5162377 -6192448 -7231207 -8259916 -9233716 -10085050 -10737691 -11127914
37121 -11127914 -11226250 -11051161 -10667403 -10168362 -9649755 -9186115 -8818654 -8556056 -8383773
37112 -8383773 -8275612 -8203350 -8142969 -8077948 -8000455 -7911018 -7817118 -7730813 -7665387 -7631454 -7634062
37101 -7634062 -7672754 -7744854 -7849191 -7986092 -8152070 -8332964 -8502397 -8629426 -8691458 -8683344
37091h683344O7362J10229J44040J84484K48119L44995M74021O23840P79085R27249
37081d779920J060926J175472J266558J329988J361874J357686J312460J224241
37073E309285J098725R50758Q00996O69512N69238N01931M58764M24918L84537
37064A1168664L22983K27785R1377q4818k88715m99834o93317q44056r31784r47054
37054G521231q94506p90286o55472n10200l70889k49509j53240q4274m0031j4359
37044C758465l11N890K095j8754o3705j33351k17047k93176l36901l33337k87649
37033B082219k23023j66489j32825j17724j02507o4604J2868J35152K93301M64492
37023B180860O15504P10476P22854O47365N04322L31371J66372L1906p0204j53628
$$ plain form
37091 -8683344 -8615982 -8505753 -8361713 -8177229 -7929110 -7584115 -7110094 -6486254 -5707169 -4779920
37081 -4779920 -3718994 -2543522 -1276964 53024 1414898 2772584 4085044 5309285
37073 5309285 6408010 7358768 8159764 8829276 9398514 9900445 10359209 10784127 11168664
37064 11168664 11491647 11719432 11810809 11725991 11437276 10937442 10244125 9400069 8468285 7521231
37054 7521231 6626725 5836439 5180967 4670767 4299878 4050369 3897129 3812855 3772824 3758465
37044 3758465 3758154 3764044 3766139 3747385 3683680 3550329 3333282 3040106 2703205 2369868 2082219
37033 2082219 1859196 1692707 1559882 1442158 1339651 1275047 1287915 1423067 1716368 2180860
37023 2180860 2796364 3506840 4229694 4877059 5381381 5712752 5879124 5911030 5840826 5687198
37013E687198k36443l30214m33896n35402o19881o79167p15564p37544p51132
37004F47955p53704p34460o81064n88446m64651l30609k13498j36205j07278j16157
36994c478117j36384j35501q6529K3685J90634L91595N88397P35523P94102P47094
36984c65501O07772M15943K23247P4673n368j7272J9075P4926J23456J47682J44762
36973A443395J26097J12148J22572J66250K37394L19814L94960M47390M65650
36964C835670M41693L72094K60306J16993m2607k02436l48454m69743n57971o05550
36954B799995o04585n49668m44933l10253j79648r0113o6969j14588k17040l46907
36944a24709m76704n87056o68078p14938p23194o89021o13530n05320l77710k43608
$$ plain form
37013 5687198 5450755 5120541 4686645 4151243 3531362 2852195 2136631 1399087 647955
37004 647955 -105749 -840209 -1521273 -2109719 -2574370 -2904979 -3118477 -3254682 -3361960 -3478117
36994 -3478117 -3614501 -3750002 -3836531 -3812846 -3622212 -3230617 -2642220 -1906697 -1112595 -365501
36984 -365501 242271 658214 881461 956134 950766 933494 952569 1027495 1150951 1298633 1443395
36973 1443395 1569492 1681640 1804212 1970462 2207856 2527670 2922630 3370020 3835670
36964 3835670 4277363 4649457 4909763 5026756 4984149 4781713 4433259 3963516 3405545 2799995
36954 2799995 2195410 1645742 1200809 890556 710908 620795 553826 439238 222198 -124709
36944 -124709 -601413 -1188469 -1856547 -2571485 -3294679 -3983700 -4597230 -5102550 -5480260 -5723868
36934e723868j13470K507R1705J39733J35085P5896k4816j39988k37956k96460
36924f091632l11885k97009k69759k42362k18319j96584j76236j55860j28918
36915h088564q2163k119J14317K54892L97778N23086O21204O94047P51227Q03818
36905d012477Q57270R06526R37716R36858R00100Q38266P72852P25560P06256
36896C568927P05425O96111O45787N32442L56442J43098o3914k14870k67630j98690
36886E903128r053K75513O08915R33033J189012J329805J330977J196685R58725
36877A3716740O68057L80522J40869k9085j32966j91464k27497k54255k74024
36868A3796897k86754k98554l20977l61664m15560m64871m87957m71142m16890
$$ plain form
36934 -5723868 -5837338 -5834831 -5743126 -5603393 -5468308 -5392412 -5417228 -5557216 -5795172 -6091632
36924 -6091632 -6403517 -6700526 -6970285 -7212647 -7430966 -7627550 -7803786 -7959646 -8088564
36915 -8088564 -8170727 -8172846 -8058529 -7803637 -7405859 -6882773 -6261569 -5567522 -4816295 -4012477
36905 -4012477 -3155207 -2248681 -1310965 -374107 525993 1364259 2137111 2862671 3568927
36896 3568927 4274352 4970463 5616250 6148692 6505134 6648232 6584318 6369448 6101818 5903128
36886 5903128 5894075 6169588 6778503 7711536 8900548 10230353 11561330 12758015 13716740
36877 13716740 14384797 14765319 14906188 14877103 14744137 14552673 14325176 14070921 13796897
36868 13796897 13510143 13211589 12890612 12528948 12113388 11648517 11160560 10689418 10272528
36859A0272528l44341k81713k54025k73057l35394m28010n34423o35074p03575
36850F482916p07122o16735m22842j45056J71366M69480O96234Q13063Q00934
36841G542238O62281M21025J19592j88603m50930o28022p01870o76524n72638
36832E526549m19788k49374q8775M2911J36450J91027K11191K04170J77977J39455
36822E871793R2392L7222k6820r8940j75989k53768l27554l90250m30568m34825
36812C862693l92304l00477j67273j0543J44645K71291L47463L61792L15177K19925
36802D652389R7863k3875j20608j77959j93968j74376j25902n2370M5667J69225
36792D096086L18193M89228O76672Q76069J085815J303740J521777J725282J898373
$$ plain form
36859 10272528 9928187 9646474 9392449 9119392 8783998 8355988 7821565 7186491 6482916
36850 6482916 5775794 5159059 4736217 4591161 4762527 5232007 5928241 6741304 7542238
36841 7542238 8204519 8625544 8745136 8556533 8105603 7477581 6775711 6099187 5526549
36832 5526549 5106761 4857387 4768612 4811523 4947973 5139000 5350191 5554361 5732338 5871793
36822 5871793 5964185 6001407 5974587 5875647 5699658 5445890 5118336 4728086 4297518 3862693
36812 3862693 3470389 3169912 3002639 2992096 3136741 3408032 3755495 4117287 4432464 4652389
36802 4652389 4750252 4726377 4605769 4427810 4233842 4059466 3933564 3881194 3926861 4096086
36792 4096086 4414279 4903507 5580179 6456248 7542063 8845803 10367580 12092862 13991235
36783A3991235K029741K113486K146616K129595K072127J998221J942591J937717
36775C0361329J999815K123284K286675K465664K645560K827555L027290L268940
36767E1006112L579427L984356M504283N151627N931070O843012P884649R045950
36759I7930486J0306521J1640322J3025450J4449830J5909186J7399826J8904968
36752A99566589K0368764K1659345K2535200K2637076K1531780J8831514J4378406
36745C41508674Q413995J609023n113240j0885499j5162370j7809744j9018453
36738B83542386j9142139j8555840j7572842j6414293j5215512j4051339j2961552
36731A69628869j1964323j1059577j0231445r455345q708462p979436p273128
$$ plain form
36783 13991235 16020976 18134462 20281078 22410673 24482800 26481021 28423612 30361329
36775 30361329 32361144 34484428 36771103 39236767 41882327 44709882 47737172 51006112
36767 51006112 54585539 58569895 63074178 68225805 74156875 80999887 88884536 97930486
36759 97930486 108237007 119877329 132902779 147352609 163261795 180661621 199566589
36752 199566589 219935353 241594698 264129898 286766974 308298754 327130268 341508674
36745 341508674 349922669 351531692 346418452 335532953 320370583 302560839 283542386
36738 283542386 264400247 245844407 228271565 211857272 196641760 182590421 169628869
36731 169628869 157664546 146604969 136373524 126918179 118209717 110230281 102957153
36724A02957153o607808o005750n481858n036030m652785m308434l982622l668164
36716F3213702l373378l115877k912219k769362k681424k631707k597941k558290
36708D0573504k496297k403802k280691k130646j954648j747841j504426j228291
36700B4826862r40235o73930m62061l22042k50673k29652k36270k51746k63903
36691B1196350k66442k58606k45988k40134k55082l02164l85714n00921o33298
36682A8108001p59914q53760q91739q63043p72771o38076m79773l15201j56448
36673A2377276j3427J01792J73792J88213J39952L8724r4214k37324l79151n18764
36663A1776869o56345p83527q83423r41100r55065r38456r08052q71129q22706
$$ plain form
36724 102957153 96349345 90343595 84861737 79825707 75172922 70864488 66881866 63213702
36716 63213702 59840324 56724447 53812228 51042866 48361442 45729735 43131794 40573504
36708 40573504 38077207 35673405 33392714 31262068 29307420 27559579 26055153 24826862
36700 24826862 23886627 23212697 22750636 22428594 22177921 21948269 21711999 21460253 21196350
36691 21196350 20929908 20671302 20425314 20185180 19930098 19627934 19242220 18741299 18108001
36682 18108001 17348087 16494327 15602588 14739545 13966774 13328698 12848925 12533724 12377276
36673 12377276 12363849 12465641 12639433 12827646 12967598 13006322 12912108 12674784 12295633 11776869
36663 11776869 11120524 10336997 9453574 8512474 7557409 6618953 5710901 4839772 4017066
36654D017066p55295o70555n81073n01215m35952l76399l03937j99174n1056J37680
36644B80090L50580N62295P45424Q77138R44531R47633Q98453Q15977P19349O21997
36634G763467N28158M32492L23493J90189K9296j51088l32876m92937o08505o61023
36624G020666o38880n40477l77453j75197L2278K12007L40759M07970M13532L65069
36614G060274K77574J73247P7612J1714j5291q498J6015L7190L5155l336q0985
36603G580671j89421l12780m32926n32827n97404o14134n75206m80792l41708
36594C503473j79998k5606R1784J53263J57493J19034N9732r79n2323r4339j36115
36583C595419j89487k59599l38252m06555m46549m53196m37358m18503m14022
$$ plain form
36654 4017066 3261771 2591216 2010143 1508928 1072976 696577 392640 193466 142410 280090
36644 280090 630670 1192965 1938389 2815527 3760058 4707691 5606144 6422121 7141470 7763467
36634 7763467 8291625 8724117 9047610 9237799 9267095 9116007 8783131 8290194 7681689 7020666
36624 7020666 6381786 5841309 5463856 5288659 5320937 5532944 5873703 6281673 6695205 7060274
36614 7060274 7337848 7511095 7588707 7600421 7585130 7576632 7592647 7629837 7664992 7661656 7580671
36603 7580671 7391250 7078470 6645544 6112717 5515313 4901179 4325973 3845181 3503473
36594 3503473 3323475 3297869 3389653 3542916 3700409 3819443 3879175 3878196 3825873 3731534 3595419
36583 3595419 3405932 3146333 2808081 2401526 1954977 1501781 1064423 645920 231898
36574B31898m32678m73672n28389n82822o21845o35884o26608o06524n91400n91262
36564e459186o07199o35169o70477p07026p33354p32964o91776o06315m84368
36555a1327834l37735j74233M510J98973M04977O08355P84815R06960R55588R27891
36545g047733Q36777P02942N46625L84171K28560R0070k4924j15243j83583k32684
36535d815022k62589k72327k64563k47658k31342k18579k00263j57287o9038P6654
36525f662014K77405N16612P69005J007719J209568J357443J439999J449459J380067
36516B745263J230561J010619P44946M68311K12992j859j71569l00300l96063
36507E542901m69592n33845o00605o75420p54873q28188q81883r04605q89912
$$ plain form
36574 231898 -200780 -674452 -1202841 -1785663 -2407508 -3043392 -3670000 -4276524 -4867924 -5459186
36564 -5459186 -6066385 -6701554 -7372031 -8079057 -8812411 -9545375 -10237151 -10843466 -11327834
36555 -11327834 -11665569 -11839802 -11835292 -11636319 -11231342 -10622987 -9838172 -8931212 -7975624 -7047733
36545 -7047733 -6210956 -5508014 -4961389 -4577218 -4348658 -4258588 -4283512 -4398755 -4582338 -4815022
36535 -4815022 -5077611 -5349938 -5614501 -5862159 -6093501 -6312080 -6512343 -6669630 -6738668 -6662014
36525 -6662014 -6384609 -5867997 -5098992 -4091273 -2881705 -1524262 -84263 1365196 2745263
36516 2745263 3975824 4986443 5731389 6199700 6412692 6410833 6239264 5938964 5542901
36507 5542901 5073309 4539464 3938859 3263439 2508566 1680378 798495 -106110 -996022
36498i96022q36233p45242o20818m69857l03616j36951J5330J42723K40601L08659
36488c401426L48974L66199L68620L66395L66147L66247L58187L34127K94676
36479b31854K50584K17421K07417K23306K56922K93041L17163L23076L14803L00932
36469B472811K86116K67819K41972K12834J98114K23771L10246M58027O41703
36460E313413Q17207R38863R76687R25166Q01745O38882M73913L39099K53795
36451A1478770K21038K28556K51944K59320K19807J16194m4275k29375l93544
36442A2108435m95013n10204m41475l17210j82765q2667m0708m9352p5989q2767
36432I830285m7393K7475J19472J99397K41675K28218J48713J544k04525m50500
$$ plain form
36498 -996022 -1832255 -2577497 -3198315 -3668172 -3971788 -4108739 -4093409 -3950686 -3710085 -3401426
36488 -3401426 -3052452 -2686253 -2317633 -1951238 -1585091 -1218844 -860657 -526530 -231854
36479 -231854 18730 236151 443568 666874 923796 1216837 1534000 1857076 2171879 2472811
36469 2472811 2758927 3026746 3268718 3481552 3679666 3903437 4213683 4671710 5313413
36460 5313413 6130620 7069483 8046170 8971336 9773081 10411963 10885876 11224975 11478770
36451 11478770 11699808 11928364 12180308 12439628 12659435 12775629 12731354 12501979 12108435
36442 12108435 11613422 11103218 10661743 10344533 10161768 10079101 10038393 9989041 9913052 9830285
36432 9830285 9782892 9810367 9929839 10129236 10370911 10599129 10747842 10749386 10544861 10094361
36422A0094361p10298r55498j160406j306725j386436j401283j359501j272751
36414E41463j154620j018985q76413p30539n78237m14901k41724o9903Q1259J91670
36404d270930K49113K54378K20707J69154J22659R9954J09559J46013J91944K26731
36394b480718K37331K25007K04710J98308K24995K92743L94623N12114O23086
36385D32199P08312P51809P37226O47497M72253K19028q1015l78722o21710p70433
36375B116444q08481p43984o03194m20197k27567n1076R2115J93877K54959K83528
36365H6424K92379K95871L06908L33091L72994M16300M50107M67600M71816M71060
36355C964550M70112M64708M43432L95580L19668K26734J35471O2156J2860j6156
$$ plain form
36422 10094361 9384063 8428565 7268159 5961434 4574998 3173715 1814214 541463
36414 541463 -613157 -1632142 -2508555 -3239094 -3817331 -4232232 -4473956 -4543859 -4462600 -4270930
36404 -4270930 -4021817 -3767439 -3546732 -3377578 -3254919 -3154965 -3045406 -2899393 -2707449 -2480718
36394 -2480718 -2243387 -2018380 -1813670 -1615362 -1390367 -1097624 -703001 -190887 432199
36385 432199 1140511 1892320 2629546 3277043 3749296 3968324 3887309 3508587 2886877 2116444
36375 2116444 1307963 563979 -39215 -459412 -686979 -738055 -645940 -452063 -197104 86424
36365 86424 378803 674674 981582 1314673 1687667 2103967 2554074 3021674 3493490 3964550
36355 3964550 4434662 4899370 5342802 5738382 6058050 6284784 6420255 6482411 6495271 6479115
36345F479115l1399l5642k7410n662K5488N6516P7903Q8458J00588J36996K18795
36334G083746L52202N22637O99716Q49465R47112R84700R70590R21672Q53076
36325A4184916P71595O75540N59093M17559K51569O9574j12324k73954l97093
36316A6146475m71279m96871m83977m48271m06388l73293l60869l75556m15761
36307A2314210m73506n42147o24385p31905q75468j053877j251212j443272j606666
36298C711772j724437j787412j793730j747937j659014j537040j390515j226786
36290i155099j055021q87574p36614o07916m97393l93692k85098j66433m2677
36281a3827517P2042J60399K10942K25563K20162K17469K36578K85680L61222
$$ plain form
36345 6479115 6447716 6412074 6384664 6379002 6404490 6461006 6538909 6627367 6727955 6864951 7083746
36334 7083746 7435948 7958585 8658301 9507766 10454878 11439578 12410168 13331840 14184916
36325 14184916 14956511 15632051 16191144 16608703 16860272 16929846 16817522 16543568 16146475
36316 16146475 15675196 15178325 14694348 14246077 13839689 13466396 13105527 12729971 12314210
36307 12314210 11840704 11298557 10674172 9942267 9066799 8012922 6761710 5318438 3711772
36298 3711772 1987335 199923 -1593807 -3341744 -5000758 -6537798 -7928313 -9155099
36290 -9155099 -10210120 -11097694 -11834308 -12442224 -12939617 -13333309 -13618407 -13784840 -13827517
36281 -13827517 -13755475 -13595076 -13384134 -13158571 -12938409 -12720940 -12484362 -12198682 -11837460
36272a1837460M51784N42993O21088O75204O98917O91032O54942N96398N20303
36263f384799M28250L19020J92971N7316p2924j80853k56728l03523l35558l71537
36253f908365m24937m95105n63454n99216n73894m76749l22021j44376J3988J18174
36243a0375955J51660J19590M2902n3712j52938k48074l37236m14784m68418m83966
36233a2220931m51803l68265k33547n2773J58279L70156N46444O57754O93893
36224a0900793O67794O10608N60020N45040N73925O32818O96237P41320P55380
36215e117651P33373O71040N62630M07008K17037K2132j41614k48054k92042k87570
36205c473711k56194k14724j68694j13534m2164M5500J38154K18366K74258L08470
$$ plain form
36272 -11837460 -11385676 -10842683 -10221595 -9546391 -8847474 -8156442 -7501500 -6905102 -6384799
36263 -6384799 -5956549 -5637529 -5444558 -5387242 -5460166 -5641019 -5897747 -6201270 -6536828 -6908365
36253 -6908365 -7333302 -7828407 -8391861 -8991077 -9564971 -10041720 -10363741 -10508117 -10494129 -10375955
36243 -10375955 -10224295 -10104705 -10061803 -10115515 -10268453 -10516527 -10853763 -11268547 -11736965 -12220931
36233 -12220931 -12672734 -13040999 -13274546 -13327319 -13169040 -12798884 -12252440 -11594686 -10900793
36224 -10900793 -10232999 -9622391 -9062371 -8517331 -7943406 -7310588 -6614351 -5873031 -5117651
36215 -5117651 -4384278 -3713238 -3150608 -2743600 -2526563 -2504431 -2646045 -2894099 -3186141 -3473711
36205 -3473711 -3729905 -3944629 -4113323 -4226857 -4269021 -4223521 -4085367 -3867001 -3592743 -3284273
36195c284273L37629L83486M62552N79650P25872Q78275J000681J049111R85026
36186C118009P92408M87613J13777k76411o36737r33140j140882j241385j223766
36177i40514j089950q59252n68322k63590J3032K38952M16950N67702P12914Q59373
36167i12705R92839J084560J106457J047186R20388P60345O07143M89891M17478
36158F513582L80989L64266L54557L46798L41468L41205L50627L77803M32177
36149I803472N17238O22901P24336P88521P84083O89213M95623K09177j50878
36140A4483686n52272r49802j288956j516674j596541j519517j303798r86822
36132D769304o16999k47489P1865L06040M43982M98429M96621M68661M39231M23034
$$ plain form
36195 -3284273 -2946644 -2563158 -2100606 -1520956 -795084 83191 1083872 2132983 3118009
36186 3118009 3910417 4398030 4511807 4235396 3598659 2665519 1524637 283252 -940514
36177 -940514 -2030464 -2889716 -3458038 -3721628 -3708596 -3469644 -3052694 -2484992 -1772078 -912705
36167 -912705 80134 1164694 2271151 3318337 4238725 4999070 5606213 6096104 6513582
36158 6513582 6894571 7258837 7613394 7960192 8301660 8642865 8993492 9371295 9803472
36149 9803472 10320710 10943611 11667947 12456468 13240551 13929764 14425387 14634564 14483686
36140 14483686 13931414 12981612 11692656 10175982 8579441 7059924 5756126 4769304
36132 4769304 4152305 3904816 3976681 4282721 4726703 5225132 5721753 6190414 6629645 7052679
36122G052679M22212M25936M14248L66778K73595J42784l32j23171j99997k21908
36112H552824j97406j45172q5550l6157j1790k4657q1743j80716l08709m46282
36102G034642n73637o74576p37300p55178p29008o67944n85798m94509m00078
36093A416614l04126k08928j21640n4948k3598l8191r9133j94015k99828l88987
36083c16780m37615m34216l85247l12735k42858j91279j54405j11970l8867Q0501
36073b545471K42386M22725N84956O92269P18493O54033N06821K99815O5987j58622
36063A483392l42306m63122n10344m82576l85640k32721m5271J49853L28358M76578
36053b3799N93041O82695P49139P90571Q00419P70847O97043N80646M30678K62243
$$ plain form
36122 7052679 7474891 7900827 8315075 8681853 8955448 9098232 9097900 8974729 8774732 8552824
36112 8552824 8355418 8210246 8124696 8088539 8076749 8052092 7970349 7789633 7480924 7034642
36102 7034642 6461005 5786429 5049129 4293951 3564943 2896999 2311201 1816692 1416614
36093 1416614 1112488 903560 781920 726972 703374 665183 566050 372035 72207 -316780
36083 -316780 -754395 -1188611 -1573858 -1886593 -2129451 -2320730 -2475135 -2587105 -2625972 -2545471
36073 -2545471 -2303085 -1880360 -1295404 -603135 115358 769391 1276212 1576027 1642014 1483392
36063 1483392 1141086 677964 167620 -314956 -700596 -933317 -978588 -828735 -500377 -23799
36053 -23799 569242 1251937 2001076 2791647 3592066 4362913 5059956 5640602 6071280 6333523
36043F333523R4924m8223j43465j73134j33588l8048Q9297K24371L51952M67346
36033G024955N72065O67804P51901Q15190Q42657Q17770P29744N80134L84629
36024A3186849J69244l6391k05646l19924l71164l61041k98033j95557p2864M3943
36014A1539416J25277J46687R8054j2847j64629l30723m85632o06247o71570o66027
36004H971759n87199m52386k97958j70007j09935j40951k61410m48477o69384
35995E834052q92119j088831j233617j302230j278142j161216r71286p42539n11222
35986c347150l03592j30458J0561J28973K36293L43039M56447N78748P07383Q36820
35976d82936R59917J068280J153788J212053J244351J254227J240016J189113
$$ plain form
36043 6333523 6428447 6380224 6236759 6063625 5930037 5891989 5981286 6205657 6557609 7024955
36033 7024955 7597020 8264824 9016725 9831915 10674572 11492342 12222086 12802220 13186849
36024 13186849 13356093 13319702 13114056 12794132 12422968 12061927 11763894 11568337 11495473 11539416
36014 11539416 11664693 11811380 11909434 11896587 11731958 11401235 10915603 10309356 9637786 8971759
36004 8971759 8384560 7932174 7634216 7464209 7354274 7213323 6951913 6503436 5834052
35995 5834052 4941933 3853102 2619485 1317255 39113 -1122103 -2093389 -2835928 -3347150
35986 -3347150 -3650742 -3781200 -3770639 -3641666 -3405373 -3062334 -2605887 -2027139 -1319756 -482936
35976 -482936 476981 1545261 2699049 3911102 5155453 6409680 7649696 8838809
35968H838809J079126Q86539N99131K25926k01063o34927j027172j339203j547984
35959F879182j646755j643003j554136j400967j201290r66880p05346m24723j37067
35950b800985J41133L91270N95512P38627Q08885P99429P11008N55188L55639
35941B295706J44683m5626j94931l02099l83626m63769n62990o90615q42102r98578
35931b043947j129641j202681j196785j111798r64391p74616n55246l12207n2656
35922i343968K08357M47822O39847P62470Q03519P63446O54114M95071L10070
35913d259252J24589l7300j57429k27186k47988k28704j81975j20374n2556J9417
35903e368758R9420J92752L00701M17966N33975O35715P09901P45138P35386O83084
$$ plain form
35968 8838809 9917935 10804474 11403605 11629531 11428468 10793541 9766369 8427166 6879182
35959 6879182 5232427 3589424 2035288 634321 -566969 -1533849 -2239195 -2663918 -2800985
35950 -2800985 -2659852 -2268582 -1673070 -934443 -125558 673871 1384879 1940067 2295706
35941 2295706 2440389 2394763 2199832 1897733 1514107 1050338 487348 -203267 -1045369 -2043947
35931 -2043947 -3173588 -4376269 -5573054 -6684852 -7649243 -8423859 -8979105 -9291312 -9343968
35922 -9343968 -9135611 -8687789 -8047942 -7285472 -6481953 -5718507 -5064393 -4569322 -4259252
35913 -4259252 -4134663 -4171963 -4329392 -4556578 -4804566 -5033270 -5215245 -5335619 -5388175 -5368758
35903 -5368758 -5269338 -5076586 -4775885 -4357919 -3823944 -3188229 -2478328 -1733190 -997804 -314720
35893c14720N98139M92287L73528K45431J10259k8452j65731k95374m09541m99441
35883A06385n58028n82227n72355n30186m58647l63430k54052j42694m1706L8412
35873c358528Q9375J04019P5675L63j18666k68232m28023n76976o97656p76033
35863e954682q00060p61475o60595n09472l29520j44671K5212J66677K71280L34498
35853h362808L57306L47801L18554K79833K34147J77024J02966J1400r1160j92351
35843f817288k76260l25460l23092k55745j17120Q7932L40014O04417Q36583R95606
35833e250413J061147J042635R72391Q86884Q10502P52458P14055O95799O98760
35824B384218P22649P64482Q17831Q71345R07777R05914Q45269P11657N02335
$$ plain form
35893 -314720 283419 775706 1149234 1394665 1504924 1476472 1310741 1015367 605826 106385
35883 106385 -451643 -1033870 -1606225 -2136411 -2595058 -2958488 -3212540 -3355234 -3396940 -3358528
35873 -3358528 -3269153 -3165134 -3089459 -3089096 -3207762 -3475994 -3904017 -4480993 -5178649 -5954682
35863 -5954682 -6754742 -7516217 -8176812 -8686284 -9015804 -9160475 -9135263 -8968586 -8697306 -8362808
35853 -8362808 -8005502 -7657701 -7339147 -7059314 -6825167 -6648143 -6545177 -6533777 -6624937 -6817288
35843 -6817288 -7093548 -7419008 -7742100 -7997845 -8114965 -8027033 -7687019 -7082602 -6246019 -5250413
35833 -5250413 -4189266 -3146631 -2174240 -1287356 -476854 275604 989659 1685458 2384218
35824 2384218 3106867 3871349 4689180 5560525 6468302 7374216 8219485 8931142 9433477
35815I433477K30105p5823l75373o29546q13717r24920r79093j000334j008464
35806C856312j011093j002668r69199q95878p75410o14768m37178k76350j63889
35797b290121j15824j25684j67768k08310k18803j86043j15792k9039M7788R4424
35787c315172J04331Q4462M8557Q804k9582o9533j19372j86770k71028l57680
35777d102983m19874m27227l57791k07294P477K51276M78615O46792P29877P26572
35767b674560O56678N48344M24807K98539J74192N6125m4705j08254j09458k8513
35757h06805J37472L68704O27167Q68890J057405J172656J212712J188633J115661
35748F942495J006352Q69976P17082N63283M27283L24052K58260K22753K03062
$$ plain form
35815 9433477 9663582 9587759 9212386 8582840 7769123 6844203 5865110 4864776 3856312
35806 3856312 2845219 1842551 873352 -22526 -797936 -1412704 -1849882 -2126232 -2290121
35797 -2290121 -2405945 -2531629 -2699397 -2907707 -3126510 -3312553 -3428345 -3457384 -3409596 -3315172
35787 -3315172 -3210841 -3126379 -3077822 -3069018 -3098600 -3168133 -3287505 -3474275 -3745303 -4102983
35777 -4102983 -4522857 -4950084 -5307875 -5515169 -5507692 -5256416 -4777801 -4131009 -3401132 -2674560
35767 -2674560 -2017882 -1469538 -1044731 -746192 -572000 -515875 -560580 -668834 -778292 -806805
35757 -806805 -669333 -300629 326538 1195428 2252833 3425489 4638201 5826834 6942495
35748 6942495 7948847 8818823 9535905 10099188 10526471 10850523 11108783 11331536 11534598
35739A1534598J84985J60517J28771R2427N2905O730n5975j49315k83749m54539
35729A1217355o35175p83976q62358q52938p65923o31898m87928l65267k83005
35720E548887k47638k55954k98255l60594m26652m79827n05127m90752m30968
35711B053120l30928k09780r5756j2006L8605P7121J35230K33220L64791M99111
35701B752728N97461O32428N98449N10463L94760K78487J82310J17375Q5110P8048
35691F227619Q1526P7791N3008M427n6886j10013j32736j09859l7763P5607K14369
35680F287090L60293M97990O16645P07071P56693P47848O62470M91131K41195
35671A1368426o0167l69899o39550q29602r21810r23091q59065p61513o57000
$$ plain form
35739 11534598 11719583 11880100 12008871 12101298 12154203 12160933 12104958 11955643 11671894 11217355
35729 11217355 10582180 9798204 8935846 8082908 7316985 6685087 6197159 5831892 5548887
35720 5548887 5301249 5045295 4747040 4386446 3959794 3479967 2974840 2484088 2053120
35711 2053120 1722192 1512412 1416656 1404650 1443255 1520376 1655606 1888826 2253617 2752728
35701 2752728 3350189 3982617 4581066 5091529 5486289 5764776 5947086 6064461 6149571 6227619
35691 6227619 6309145 6386936 6439944 6444371 6387485 6277472 6144736 6034877 5997114 6072721 6287090
35680 6287090 6647383 7145373 7762018 8469089 9225782 9973630 10636100 11127231 11368426
35671 11368426 11308259 10938360 10298810 9469208 8547398 7624307 6765242 6003729 5346729
35662E346729n61365m80738m16494l70094l44370l40573l54394l75184l89840
35653A713677l88625l68439l31302k80084k16231j42133o5301J145M3165N1111
35643A6983K0826m8307j52993k81452m09582n04190n34344m85121l66022k09300
35633b953502n8570M7580R0273P6930L6466M846Q203N2380J23768J99201K58308
35622b114117K92266L05831L12394L24654L46057L68272L76219L57354L09413
35613H78343K42250J73233J20041R6025J09761J65550K61511L87150N25304O59002
35603C618170P77693Q77769R58824J020586J062602J084385J083839J054943R87737
35594A2526548Q72027P03107M85236K30088m7878l33673o08764q46944j016556
$$ plain form
35662 5346729 4785364 4304626 3888132 3518038 3173668 2833095 2478701 2103517 1713677
35653 1713677 1325052 956613 625311 345227 128996 -13137 -78438 -77293 -34128 16983
35643 16983 37809 -10498 -163491 -444943 -854525 -1358715 -1893059 -2378180 -2744202 -2953502
35633 -2953502 -3012072 -2964492 -2874219 -2797289 -2760823 -2755977 -2747774 -2695394 -2571626 -2372425 -2114117
35622 -2114117 -1821851 -1516020 -1203626 -878972 -532915 -164643 211576 568930 878343
35613 878343 1120593 1293826 1413867 1509892 1619653 1785203 2046714 2433864 2959168 3618170
35603 3618170 4395863 5273632 6232456 7253042 8315644 9400029 10483868 11538811 12526548
35594 12526548 13398575 14101682 14586918 14817006 14769128 14435455 13826691 12979747 11963191
35585A1963191j091459j064312r52162p89705o15092m58171l37569k64557k46432
35576F143732k84890l71321m84424n93472o66696o81443o31577n28317l94486
35567A507106k56256j36526n0307p75K2416L8860O7154J14673J73637K24466K42835
35556A947283K07479J07668n0873k44338m35637n84686o60412o49366n57153m02461
35546a322496k08056N469K20338M19058N83199O95485P43682P23657O40604N08481
35536C009421L48125J84700M4890m7212p7386n0256P405N6429O5434K7737l7790
35525C531497j00881j35948j28950p5423K3099J59915L22654M93708O51341P71114
35515E512126Q29316Q09987P13019N57706L78217K13000R3372L5035L4020O7871
$$ plain form
35585 11963191 10871732 9807420 8855258 8065553 7450461 6992290 6654721 6390164 6143732
35576 6143732 5858842 5487521 5003097 4409625 3742929 3061486 2429909 1901592 1507106
35567 1507106 1250850 1114324 1064017 1063242 1085658 1124518 1191672 1306345 1479982 1704448 1947283
35556 1947283 2154762 2262430 2211557 1967219 1531582 946896 286484 -362882 -920035 -1322496
35546 -1322496 -1530552 -1525083 -1304745 -885687 -302488 392997 1136679 1860336 2500940 3009421
35536 3009421 3357546 3542246 3587136 3539924 3462538 3412282 3419687 3476116 3541550 3569287 3531497
35525 3531497 3430616 3294668 3165718 3090295 3113394 3273309 3595963 4089671 4741012 5512126
35515 5512126 6341442 7151429 7864448 8422154 8800371 9013371 9106743 9141778 9175798 9243669
35505I243669J02855J05218N1605o5709k38753m46419o58502q42223r71255j034271
35495E246215j038848j008557r74038r61248r80825j022518j057460j049078r70059
35486c816416q17822o18673m15775k47367j29814n6028o977L5307Q2596J42794
35476e848175K22485L24381M41376N53683O33767O57478O14936N15316L83964
35467a500789K54572J60219J25389J59278K51045L70276M76373N35390N35413
35458A367166M90223M29011L79741L56315L54495L56054L38385K85735J97239
35449D554364Q7919j7456r4373j28143j18975p9475k5403L4019R8554J70310K44355
35438D725696L04950L30554L03919K21089R5002m7518j74301k59594k94839k93054
$$ plain form
35505 9243669 9346524 9451742 9503347 9437638 9198885 8752466 8093964 7251741 6280486 5246215
35495 5246215 4207367 3198810 2224772 1263524 282699 -739819 -1797279 -2846357 -3816416
35486 -3816416 -4634238 -5252911 -5668686 -5916053 -6045867 -6101895 -6108872 -6073565 -5990969 -5848175
35476 -5848175 -5625690 -5301309 -4859933 -4306250 -3672483 -3015005 -2400069 -1884753 -1500789
35467 -1500789 -1246217 -1085998 -960609 -801331 -550286 -180010 296363 831753 1367166
35458 1367166 1857389 2286400 2666141 3022456 3376951 3733005 4071390 4357125 4554364
35449 4554364 4642283 4624827 4530454 4402311 4283336 4203861 4178458 4212477 4311031 4481341 4725696
35438 4725696 5030646 5361200 5665119 5886208 5981210 5933692 5759391 5499797 5204958 4911904
35428D911904k82965k94971l47210m39884n59248o85527p98537q79744r13457
35419b89639q89330q05508o70380n01578l22662j58385k8876N6864J05863J40047
35409c363584J86737K64754L74936N01120O19486P08376P52457P41123O65556
35400A450961N18903L00859K3767k84950n87559q46204j032210j129658j134467
35391b720558j054215r10360p38106n78329m63175m03893l88297l87972l70110
35382h015015l08884j93021k7153J73152L88353N98419P82218R18047R89737R95819
35372c698328R54434Q98795Q64618Q75671R33908J017802J089176J106800J042999
35363E085875Q97027O97380M89694L16197J99306J38082J16000J11755J06583
$$ plain form
35428 4911904 4628939 4333968 3986758 3546874 2987626 2302099 1503562 623818 -289639
35419 -289639 -1178969 -1984477 -2654857 -3156435 -3479097 -3637482 -3666358 -3609494 -3503631 -3363584
35409 -3363584 -3176847 -2912093 -2537157 -2036037 -1416551 -708175 44282 785405 1450961
35400 1450961 1969864 2270723 2294490 2009540 1421981 575777 -456433 -1586091 -2720558
35391 -2720558 -3774773 -4685133 -5423239 -6001568 -6464743 -6868636 -7256933 -7644905 -8015015
35382 -8015015 -8323899 -8516920 -8544073 -8370921 -7982568 -7384149 -6601931 -5683884 -4694147 -3698328
35372 -3698328 -2743894 -1845099 -980481 -104810 829098 1846900 2936076 4042876 5085875
35363 5085875 5982902 6680282 7169976 7486173 7685479 7823561 7939561 8051316 8157899
35354H157899Q6623M2053l4176j45037k85185m37757n77671o81565p37881p50112
35344D637191p32159p00020o64304o25619n74330m96100l82051k37653q3144N6345
35334A98156J64311K40189K95243L40753L77246L92495L69961L02486K01823R7063
35324B979726K3132P242O0364J74827L26112M78750N96840O55685O48327N84596
35314F535601M86357L82595L03326K69763K83183L19684L36607K89480J51828
35305I358424p2155l48551o27036q58274j006564j054787j004119q71033o81441
35296B834464m62294k34168q989K06610M06081N79896P15897Q02109Q30440P99452
35286F469498P14386N84031M16600K17970o096k45374m82054o92565q55474r62031
$$ plain form
35354 8157899 8244522 8286575 8252399 8107362 7822177 7384420 6806749 6125184 5387303 4637191
35344 4637191 3905032 3205012 2540708 1915089 1340759 844659 462608 224955 141811 198156
35334 198156 362467 602656 897899 1238652 1615898 2008393 2378354 2680840 2882663 2979726
35324 2979726 3002858 3010100 3070464 3245291 3571403 4050153 4646993 5302678 5951005 6535601
35314 6535601 7021958 7404553 7707879 7977642 8260825 8580509 8917116 9206596 9358424
35305 9358424 9286269 8937718 8310682 7452408 6445844 5391057 4386938 3515905 2834464
35296 2834464 2372170 2138002 2129013 2335623 2741704 3321600 4037497 4839606 5670046 6469498
35286 6469498 7183884 7767915 8184515 8402485 8396389 8151015 7668961 6976396 6120922 5158891
35276E158891j022095j059229j096400j141683j183283j195523j150341j028829
35268c718492q29895n73687k97033m1349J61288K97022L70674L98883M00060L86827
35258c445702L65372L40329L18210L05041L02347L08602L25130L57354M06347
35249d16970M57904M81445M42732L22640J30180r7105l04852m40140m69147l88332
35239b81645k25811l2205J37187K43081K76453K58612K26854K13990K32792K72602
35229A321910L08362L15936K84599K20005J38166N7241o604l9546l1410K0078
35219B588737J06128K09655L13111M04915M79456N32103N54805N36284M66512
35210F191706L42802J74683j4958j94125l30400m00269l94748l19526j90946l0484
$$ plain form
35276 5158891 4136796 3077567 1981167 839484 -343799 -1539322 -2689663 -3718492
35268 -3718492 -4548387 -5122074 -5419107 -5460456 -5299168 -5002146 -4631472 -4232589 -3832529 -3445702
35258 -3445702 -3080330 -2740001 -2421791 -2116750 -1814403 -1505801 -1180671 -823317 -416970
35249 -416970 40934 522379 965111 1287751 1417931 1320826 1015974 575834 106687 -281645
35239 -281645 -507456 -539661 -402474 -159393 117060 375672 602526 816516 1049308 1321910
35229 1321910 1630272 1946208 2230807 2450812 2588978 2646219 2639615 2600069 2568659 2588737
35219 2588737 2694865 2904520 3217631 3622546 4102002 4634105 5188910 5725194 6191706
35210 6191706 6534508 6709191 6694233 6500108 6169708 5769439 5374691 5055165 4864219 4833735
35200D833735J39715K98726M26772N05801N22683M73519L65158K12201L2262j56484
35190G654088l35079m84000n86077o30188o12369n33994m00547k23542k3450J71570
35180C996412L33254M43241M98443N08273M86534M44644L90675L32860K82072
35171G716408K49417K40913K54767K83783L19405L52188L68617L49779K76760
35162A0412037J40842m9197k69389m91952o97611q79632j037105j164170j244770
35153D719053j256383j178380r98736p17196l46885Q4767N37533R64188J319623
35144C127584J569997J698665J707159J611696J437428J213379R69345P33290
35136A4068543N27077L60934K30850J22826K2578p6264j71617k59222l39044m16176
$$ plain form
35200 4833735 4973450 5272176 5698948 6204749 6727432 7200951 7566109 7778310 7810572 7654088
35190 7654088 7319009 6835009 6248932 5618744 5006375 4472381 4071834 3848292 3824842 3996412
35180 3996412 4329666 4772907 5271350 5779623 6266157 6710801 7101476 7434336 7716408
35171 7716408 7965825 8206738 8461505 8745288 9064693 9416881 9785498 10135277 10412037
35162 10412037 10552879 10503682 10234293 9742341 9044730 8165098 7127993 5963823 4719053
35153 4719053 3462670 2284290 1285554 568358 221473 306240 843773 1807961 3127584
35144 3127584 4697581 6396246 8103405 9715101 11152529 12365908 13335253 14068543
35136 14068543 14595620 14956554 15187404 15310230 15332808 15256544 15084927 14825705 14486661 14070485
35126A4070485m96648n82342o68345p43245p91575p97950p52402o55526n20885
35117H061567l72157k35094j28307n8143j9433Q28J9937N5654J20376K14866L25788
35106G985882M29576N01179N24082M97667M37788L68509L09160K65850K33409
35097A1553102K04345J75301J45044J07098M5643n9160k18404m23129o43415q39140
35087A0047285r75193j032185j009010r19431p86108o33861m83503l48071k32880
35078C627043j38875o6709j8580L256n09k5106o3233j06728j46501j72988j80137
35067B710933j70446j54335j41996j34795j24801j02440o4601j7277K6125M7580
35057A873947K8541m2646j62416l09527m52954n66197o38304o74531o87636o87093
$$ plain form
35126 14070485 13573837 12991495 12323150 11579905 10788330 9990380 9237978 8582452 8061567
35117 8061567 7689410 7454316 7326009 7267866 7248433 7249261 7269198 7324852 7445228 7660094 7985882
35106 7985882 8415458 8916637 9440719 9938386 10376174 10744683 11053843 11319693 11553102
35097 11553102 11757447 11932748 12077792 12184890 12230533 12171373 11952969 11529840 10886425 10047285
35087 10047285 9072092 8039907 7030897 6111466 5325358 4691497 4207994 3859923 3627043
35078 3627043 3488168 3421459 3402879 3406135 3405626 3380520 3317287 3210559 3064058 2891070 2710933
35067 2710933 2540487 2386152 2244156 2109361 1984560 1882120 1817519 1800242 1826367 1873947
35057 1873947 1902488 1859842 1697426 1387899 934945 368748 -269556 -944087 -1631723 -2318816
35047b318816o72972o36784n67433m58855l15856j55044K66J28944K19626K72792
35037d504132K97182L04090L03014K99558K94949K87379K76014K65841K68698
35028a907407K97269L55107M30330M98416N32602N15376M44703L32453J96789
35019A695638N3999q4532k08658l04159l52847l40414k66758j50729k4746P8669
35009I5463J41566J68480J82680K12285K73988L63903M60426N36446N73047N66701
34999C574985N26521M64491L86195K89174J70264L5860r3331j87327k18918j76032
34989D771882o8582P3091K08156L00183L30292L01504K32489J45813N8205k3021
34979F330012r8152j70226k39106k96946l28789l20057k67237j83885r6176k9759
$$ plain form
35047 -2318816 -2991788 -3628572 -4196005 -4654860 -4970716 -5125760 -5125494 -4996550 -4776924 -4504132
35037 -4504132 -4206950 -3902860 -3599846 -3300288 -3005339 -2717960 -2441946 -2176105 -1907407
35028 -1907407 -1610138 -1255031 -824701 -326285 206317 721693 1166396 1498849 1695638
35019 1695638 1749637 1665105 1456447 1152288 799441 459027 192269 41540 16794 95463
35009 95463 237029 405509 588189 800474 1074462 1438365 1898791 2435237 3008284 3574985
34999 3574985 4101506 4565997 4952192 5241366 5411630 5447490 5354159 5166832 4947914 4771882
34989 4771882 4703300 4776391 4984547 5284730 5615022 5916526 6149015 6294828 6353033 6330012
34979 6330012 6231860 6061634 5822528 5525582 5196793 4876736 4609499 4425614 4329438 4299679
34969D299679L676J1355J2809K6015N4970Q6599R9206P6721J8283o3952j55754
34958D469607k49596l43329m32044n03517n42751n40327m95469m11409k89248
34949F61917j27533P1234K92279N05357O70787P53554P38947O41137M99419L63297
34939E070395K73357K46724K74083L29486L86852M32694M67808M99023N28598
34930H509020N48438N41769M90412L83219K20895J5270k14491m44824o49739q04850
34920H595119q94173r15350q78842q01936p02088n92636m81289l71356k65313
34911B692136j68162q7493l0578j575J70j7376l6292l1265J9605J22170K62767
34900B724107M17432N65252O94636P99675Q73014R02900Q76411P85883O34476
$$ plain form
34969 4299679 4303355 4314710 4327519 4353534 4408504 4495103 4594309 4671030 4689313 4625361 4469607
34958 4469607 4220011 3876682 3444638 2941121 2398370 1858043 1362574 951165 661917
34949 661917 534384 605618 897897 1403254 2074041 2827595 3566542 4207679 4707098 5070395
34939 5070395 5343752 5590476 5864559 6194045 6580897 7013591 7481399 7980422 8509020
34930 8509020 9057458 9599227 10089639 10472858 10693753 10709023 10494532 10049708 9399969 8595119
34920 8595119 7700946 6785596 5906754 5104818 4402730 3810094 3328805 2957449 2692136
34911 2692136 2523974 2436481 2405903 2404328 2404498 2387122 2350830 2319565 2339170 2461340 2724107
34900 2724107 3141539 3706791 4401427 5201102 6074116 6977016 7853427 8639310 9273786
34891I273786M38310K24097K2931j37073k35831k62816k17199j09187L8331J91615
34881I226964L13531L73869L57458K66809J19409n8579k39801m01446n27216o06113
34871H824885o30719n96570n01913l47058j35285J22212L98937O50701Q25831
34862H611021Q86740Q30206O91111N25563L85305L01026K82000L24501M16952
34853A3254425N38789O60319P50356P88499P72015P11597O20635N07340L73911
34844A8977886K19634M3568j53588l66994n85277p90634r61917j079096j127984
34835A4175598j104830j018790q89524p40835n95473m74490l98226l83715m38319
34826H131396n54547p09957q71576j002701j071304j058866r65908q10973o24202
$$ plain form
34891 9273786 9712096 9936193 9959124 9822051 9586220 9323404 9106205 8997018 9035349 9226964
34881 9226964 9540495 9914364 10271822 10538631 10658040 10599461 10359660 9958214 9430998 8824885
34871 8824885 8194166 7597596 7095683 6748625 6613340 6735552 7134489 7785190 8611021
34862 8611021 9497761 10327967 11019078 11544641 11929946 12230972 12512972 12837473 13254425
34853 13254425 13793214 14453533 15203889 15992388 16764403 17476000 18096635 18603975 18977886
34844 18977886 19197520 19241088 19087500 18720506 18135229 17344595 16382678 15303582 14175598
34835 14175598 13070768 12051978 11162454 10421619 9826146 9351656 8953430 8569715 8131396
34826 8131396 7576849 6866892 5995316 4992615 3921311 2862445 1896537 1085564 461362
34817D61362m39747k89119j94143j59823j72064k05308k37293k60396k80635l06173
34807b083339l35612l54824l42302k77389j47395M6657K85827N33807P45353Q81020
34797a048197R21352Q72966P63888O31716N11636M29538M00456M28535N05421
34788D417311O08471P03156P51996P27023O19727M43789K29811J4785j68870k99954
34778H047245l69395l78134l35854k61147j80157j21379j07581j47877k33038
34769E912683l36944m25809m72198m65747m13875l33636k42320j52591p1980l772
34759B993811N2153R8809J42037J90163K51519L29878M21285N15490O00345O64817
34749F260307O99394O96810O54649N76925M71492L45262K02491M7983j09152k56512
$$ plain form
34817 461362 21615 -267504 -461647 -621470 -793534 -998842 -1236135 -1496531 -1777166 -2083339
34807 -2083339 -2418951 -2773775 -3116077 -3393466 -3540861 -3494204 -3208377 -2674570 -1929217 -1048197
34797 -1048197 -126845 746121 1510009 2141725 2653361 3082899 3483355 3911890 4417311
34788 4417311 5025782 5728938 6480934 7207957 7827684 8271473 8501284 8516069 8347199 8047245
34778 8047245 7677850 7299716 6963862 6702715 6522558 6401179 6293598 6145721 5912683
34769 5912683 5575739 5149930 4677732 4211985 3798110 3464474 3222154 3069563 2997583 2993811
34759 2993811 3045964 3144773 3286810 3476973 3728492 4058370 4479655 4995145 5595490 6260307
34749 6260307 6959701 7656511 8311160 8888085 9359577 9704839 9907330 9955313 9846161 9589649
34739I589649l83783m86347n62159o04611n99910n34677m09636k47712q7458L5616
34729E708972J06531J33681J35148J20424Q3359J1964r4629k18142l29975m09597
34719E247736m56901m88114n18656n46759n50406m99183l72138j70480Q0611L40607
34709B066317N68679P39021Q48847R14092R55857R87838J013324J030906J040526
34700A0165407J043503J038351J018900R77674R10518Q16746O94740N39386L46490
34691A7551715J21184j18200l45001n32888o60693p12268o76917n54091l58822
34682A3714019j21596J18913L26124M74114N52309N65541N28457M55671L53381
34673A6966933K19279N1609j39883l30678m89223n90314o25268o03649n47236
$$ plain form
34739 9589649 9205866 8719519 8157360 7552749 6952839 6418162 6008526 5760814 5673356 5708972
34729 5708972 5815503 5949184 6084332 6204756 6288115 6300079 6205450 5987308 5657333 5247736
34719 5247736 4790835 4302721 3784065 3237306 2686900 2187717 1815579 1645099 1725710 2066317
34709 2066317 2634996 3374017 4222864 5136956 6092813 7080651 8093975 9124881 10165407
34700 10165407 11208910 12247261 13266161 14243835 15154353 15971099 16665839 17205225 17551715
34691 17551715 17672899 17554699 17209698 16676810 16016117 15303849 14626932 14072841 13714019
34682 13714019 13592423 13711336 14037460 14511574 15063883 15629424 16157881 16613552 16966933
34673 16966933 17186212 17237821 17097938 16767260 16278037 15687723 15062455 14458806 13911570
34664A3911570m80328m20398l72032l26577k68318j84531p3410N5057J84912L01554
34654A2327499L95760M63928N06906N29019N36988N37951N36116N27895M97217
34645A6859279M15766K52585r475l61310p69089j188625j580724j917081k177277
34636I524049k345333k411128k373862k241702k026758j740303j392998r99643
34628f007678n83602j76422J87900M80901O86001Q01095Q37960Q19856P77204
34619b176785P39749P25563P32211P37302P10335O28876M88448L01307Q8142j29930
34609B845218l35313n14416o56175p49347p80145p33279n98376l79676j03113
34600b004622J84996M29431N83843O26794N68036M42270K94279J63533P4739L6181
$$ plain form
34664 13911570 13431242 13010844 12638812 12312235 12043917 11859386 11785976 11841033 12025945 12327499
34654 12327499 12723259 13187187 13694093 14223112 14760100 15298051 15834167 16362062 16859279
34645 16859279 17275045 17527630 17518155 17156845 16387756 15199131 13618407 11701326 9524049
34636 9524049 7178716 4767588 2393726 152024 -1874734 -3615037 -5008035 -6007678
34628 -6007678 -6591280 -6767702 -6579802 -6098901 -5412900 -4611805 -3773845 -2953989 -2176785
34619 -2176785 -1437036 -711473 20738 758040 1468375 2097251 2585699 2887006 2975148 2845218
34609 2845218 2509905 1995489 1339314 589967 -190178 -923457 -1521833 -1901509 -2004622
34600 -2004622 -1819626 -1390195 -806352 -179558 388478 830748 1125027 1288560 1363299 1399480
34590A399480M3208Q2985J38307J90821K24804K30774K06788J57083R0692K1883
34580B786825l0132m6244j5720N9185J66429K90753M16383N25238N96733O12460
34570E361910N61613M41687K55388R512k81937n94377q94019j143966j311427
34561B404384j373738j324023j176536r67790p48548n67290m53335m08957m13122
34552e028955m32223m32352l90715l03869j88356p1093K5290R2203J34344J62300
34542f433426J86011K12504K46076K88187L36288L82175M11370M05695L50158
34533c614962K41603R4037o3127j93732k67385k71329k16025j30096m6395J1947
34523d455464L6595K9676k528n1602j05822j50527j71529j58710j07631k0394
$$ plain form
34590 1399480 1442688 1525673 1663980 1854801 2079605 2310379 2517167 2674250 2764942 2786825
34580 2786825 2756693 2710449 2694729 2753914 2920343 3211096 3627479 4152717 4749450 5361910
34570 5361910 5923523 6365210 6620598 6630110 6348173 5753796 4859777 3715811 2404384
34561 2404384 1030646 -293377 -1469913 -2437703 -3186251 -3753541 -4206876 -4615833 -5028955
34552 -5028955 -5461178 -5893530 -6284245 -6588114 -6776470 -6847563 -6822273 -6730070 -6595726 -6433426
34542 -6433426 -6247415 -6034911 -5788835 -5500648 -5164360 -4782185 -4370815 -3965120 -3614962
34533 -3614962 -3373359 -3279322 -3342449 -3536181 -3803566 -4074895 -4290920 -4421016 -4467411 -4455464
34523 -4455464 -4418869 -4389193 -4391721 -4443323 -4549145 -4699672 -4871201 -5029911 -5137542 -5157936
34513e157936R2936K14398L23348M05983M62398N03971N41813N75343N90420N67917
34503h79409M95606L75456K23644O4454p9349j95317k83738l51288m01050m27517
34493a458508m20239l71980k85167j73930o1494K7448P7812R2380Q9720R0931
34483b393027J03527J13742R2504J1433j40235l46310n65743p44611q32958q00535
34473e502213o46000l96096r5801K04747M59998O33689P01987O57794N13738K99020
34463c169137M9586k02971m37426o41905q08703r29485r94297r95623r35251q28725
34453i893937p02066n80744m77695l89085l00567j98205p5642O6004K22102L87095
34443a1942740N53792P11337Q44844R38213R79535R66245R06539Q15218P06248
$$ plain form
34513 -5157936 -5065000 -4850602 -4527254 -4121271 -3658873 -3154902 -2613089 -2037746 -1447326 -879409
34503 -879409 -383803 -8347 215297 279751 200402 5085 -278653 -629941 -1030991 -1458508
34493 -1458508 -1878747 -2250727 -2535894 -2709824 -2771318 -2743870 -2666058 -2573678 -2483958 -2393027
34483 -2393027 -2289500 -2175758 -2083254 -2071821 -2212056 -2558366 -3124109 -3868720 -4701678 -5502213
34473 -5502213 -6148213 -6544309 -6640110 -6435363 -5975365 -5341676 -4639689 -3981895 -3468157 -3169137
34463 -3169137 -3119551 -3322522 -3759948 -4401853 -5210556 -6140041 -7134338 -8129961 -9065212 -9893937
34453 -9893937 -10596003 -11176747 -11654442 -12043527 -12344094 -12542299 -12617941 -12551937 -12329835 -11942740
34443 -11942740 -11388948 -10677611 -9832767 -8894554 -7915019 -6948774 -6042235 -5227017 -4520769
34434d520769N87415M61280L31205K06293R9493J9984l2187o2504p2124n2453
34424c034367Q404J11829K39746L58287M30822M31076L50028J96160q545k35238
34414a151798m56506o54273q23433r67972j090621j182893j223894j190385j071394
34405i813169q76814o34421l78588j38459O8536K36944L69882M75260N63541O46707
34395i480581P36821Q42752R65468J094082J205687J271075J265475J179672J025232
34386A05683Q30372O28724M47644L02128J95927J26301Q7380O9865N9553L8649
34376B892226r270r4040k16753l69677n35063o83667p78990p91008p13262n70198
34366a869702m07540k71906j93274j78310k12574k66532l04279k95395k26320
$$ plain form
34434 -4520769 -3933354 -3472074 -3140869 -2934576 -2835083 -2815099 -2847286 -2909790 -2981914 -3034367
34424 -3034367 -3025963 -2914134 -2674388 -2316101 -1885279 -1454203 -1104175 -908015 -916560 -1151798
34414 -1151798 -1608304 -2262577 -3086010 -4053982 -5144603 -6327496 -7551390 -8741775 -9813169
34405 -9813169 -10689983 -11324404 -11702992 -11841451 -11772915 -11535971 -11166089 -10690829 -10127288 -9480581
34395 -9480581 -8743760 -7901008 -6935540 -5841458 -4635771 -3364696 -2099221 -919549 105683
34386 105683 936055 1564779 2012423 2314551 2510478 2636779 2724159 2794024 2853577 2892226
34376 2892226 2882956 2788916 2572163 2202486 1667423 983756 204766 -586242 -1299504 -1869702
34366 -1869702 -2277242 -2549148 -2742422 -2920732 -3133306 -3399838 -3704117 -3999512 -4225832
34357d225832j04387M8357K07168L55132M87588O09981P31251Q56540R83656J105306
34347A054760J214541J308460J387273J450100J491283J500316J465506J378462
34339A2250701J235948J038362P87920M89965J57192j87494n13921p94239j014797
34330A3449637j182713j321325j455952j599282j745892j877601j973189k015719
34322B77964j995732j911769j769017j576379j344045j084108q13774n57275l43185
34313a1117320j97518j35980j58839k50349l82694n22994o40477p11197p19386
34304a4836754o56950n23604l28347r0401J63119M03469O07838P64015Q69538
34295a3628077R26544R36784R00975Q22070P07882N69432M17148K60112J09967
$$ plain form
34357 -4225832 -4330219 -4281862 -4074694 -3719562 -3231974 -2621993 -1890742 -1034202 -50546 1054760
34347 1054760 2269301 3577761 4965034 6415134 7906417 9406733 10872239 12250701
34339 12250701 13486649 14525011 15312931 15802896 15960088 15772594 15258673 14464434 13449637
34330 13449637 12266924 10945599 9489647 7890365 6144473 4266872 2293683 277964
34322 277964 -1717768 -3629537 -5398554 -6974933 -8318978 -9403086 -10216860 -10774135 -11117320
34313 -11117320 -11314838 -11450818 -11609657 -11860006 -12242700 -12765694 -13406171 -14117368 -14836754
34304 -14836754 -15493704 -16017308 -16345655 -16436056 -16272937 -15869468 -15261630 -14497615 -13628077
34295 -13628077 -12701533 -11764749 -10863774 -10041704 -9333822 -8764390 -8347242 -8087130 -7977163
34286g977163j4822q9950r2414j0079J51543L68759O05819Q24223R90154J077822
34276d166108J071317R67894P80982N38212K73473J8122k02914l69660m64941
34267a553623m76124m01145k54741o9333J12285K49849L17573L09739K39462J33752
34257a392306K7110m6442o2577j3824Q9529K25219L67292M92109N80911O20571
34247H87592O03642N27977L96918K21133K0206j80271l56771m95770n95565o62301
34237C66790p05169p33396p53543p66608p67676p49663p07795o40333n46143m23876
34227f427412k75293j09698N5485J99557L05673L65721L80534L56646L02863K29167
34217d616757J47670P3176K0659l88Q611L4707N9291O6880N1448J8337j7018l3121
$$ plain form
34286 -7977163 -7991985 -8081935 -8174349 -8184428 -8032885 -7664126 -7058307 -6234084 -5243930 -4166108
34276 -4166108 -3094791 -2126897 -1345915 -807703 -534230 -516108 -719022 -1088682 -1553623
34267 -1553623 -2029747 -2430892 -2685633 -2754966 -2642681 -2392832 -2075259 -1765520 -1526058 -1392306
34257 -1392306 -1365196 -1411638 -1474215 -1488039 -1398510 -1173291 -805999 -313890 267021 887592
34247 887592 1491234 2019211 2416129 2637262 2657468 2477197 2120426 1624656 1029091 366790
34237 366790 -338379 -1071775 -1825318 -2591926 -3359602 -4109265 -4817060 -5457393 -6003536 -6427412
34227 -6427412 -6702705 -6812403 -6756918 -6557361 -6251688 -5885967 -5505433 -5148787 -4845924 -4616757
34217 -4616757 -4469087 -4395911 -4375252 -4375640 -4367029 -4332322 -4273031 -4206151 -4154703 -4136366 -4153384 -4186505
34205d186505j0690N6526J56199K64047L59312M36719N05439N77647O57095P35061
34195d49150P93342Q09995P65350O47871M59131K15907n2197l09223n21467o65835
34185A693724p35768p42554p10495o66723o29478o00426n64958n00594l89242
34176c846514k27060k7138J85444L82667N41829O49869P02784P01308O45953N35672
34166B44814L72154J66496n8423k73734m55035n89742o76489p18658p18162o74061
34156c380840n86143m60415l13208j71709o9894l9881j00892k50374m62342o94998
34146f530696r04541j058928j145730j171560j154261j111980j054849r83257
34138a5115802q92030p75800o31579m59388k63942n7050J43597L21316M68273
$$ plain form
34205 -4186505 -4197195 -4140669 -3984470 -3720423 -3361111 -2924392 -2418953 -1841306 -1184211 -449150
34195 -449150 344192 1154187 1919537 2567408 3026539 3242446 3190249 2881026 2359559 1693724
34185 1693724 957956 215402 -495093 -1161816 -1791294 -2391720 -2956678 -3457272 -3846514
34176 -3846514 -4073574 -4100712 -3915268 -3532601 -2990772 -2340903 -1638119 -936811 -290858 244814
34166 244814 616968 783464 725041 451307 -3728 -593470 -1269959 -1988617 -2706779 -3380840
34156 -3380840 -3966983 -4427398 -4740606 -4912315 -4982209 -5022090 -5122982 -5373356 -5835698 -6530696
34146 -6530696 -7435237 -8494165 -9639895 -10811455 -11965716 -13077696 -14132545 -15115802
34138 -15115802 -16007832 -16783632 -17415211 -17874599 -18138541 -18195591 -18051994 -17730678 -17262405
34129a7262405N86919O83256P58131Q04222Q10948P73102O96917N99050M98406
34120a1051454M05778L19091K28723J29095K6887o1225j19065j40676j31615j01742
34110a0496203n5937R880J04453K31886L84491N43656O88294Q04004Q85465R31100
34100e968911R36192Q91809P91161O38683M54983K73230J27352L7946M619R950
34090a802986L1454N1977O1805N4388K2277m2528j44340k78409m27732n65092
34080c039186o61190o94952o59792n63226m22948k63071j10501J0581Q5147J11219
34070f207919R9622P1178N2044O5839J23005K13416L09271L78304L98957L67990
34060d128293K97627K06590J11503K3079n2354j08796j38040j30937q1527Q472
$$ plain form
34129 -17262405 -16675486 -15992230 -15234099 -14429877 -13618929 -12845827 -12148910 -11549860 -11051454
34120 -11051454 -10645676 -10326585 -10097862 -9968767 -9941880 -10003105 -10122170 -10262846 -10394461 -10496203
34110 -10496203 -10552140 -10542260 -10437807 -10205921 -9821430 -9277774 -8589480 -7785476 -6900011 -5968911
34100 -5968911 -5032719 -4140910 -3349749 -2711066 -2256083 -1982853 -1855501 -1817555 -1812936 -1802986
34090 -1802986 -1771532 -1719555 -1657750 -1603362 -1581085 -1623613 -1767953 -2046362 -2474094 -3039186
34080 -3039186 -3700376 -4395328 -5055120 -5618346 -6041294 -6304365 -6414866 -6404285 -6319138 -6207919
34070 -6207919 -6108297 -6037119 -5985075 -5919236 -5796231 -5582815 -5273544 -4895240 -4496283 -4128293
34060 -4128293 -3830666 -3624076 -3512573 -3489494 -3541848 -3650644 -3788684 -3919621 -4001148 -3992676
34050c992676J27071K53176L62722M38086M75456M85344M86685M99314N38243
34041c26579O10262P13116Q38213R75462J115533J247039J352068J406000J383317
34032I314431J266050J050253P47590L81583j8651m21955p93851j095371j289439
34023I140640j354996j299763j161694r97158q61525p90330p87954q28461q68464
$$ plain form
34050 -3992676 -3865605 -3612429 -3249707 -2811621 -2336165 -1850821 -1364136 -864822 -326579
34041 -326579 283683 996799 1835012 2810474 3926007 5173046 6525114 7931114 9314431
34032 9314431 10580481 11630734 12378324 12759907 12741256 12319301 11525450 10430079 9140640
34023 9140640 7785644 6485881 5324187 4327029 3465504 2675174 1887220 1058759 190295
$$ [...]
##END NTUPLES=NMR SPECTRUM
##END=
