##TITLE=31Pdec_B3f2301
 CDCl3, 24 sc
 24.1.2025
##JCAMPDX= 6.0         $$ Bruker NMR JCAMP-DX V2.0
##DATA TYPE= NMR SPECTRUM
##DATA CLASS= NTUPLES
##ORIGIN= UXNMR, Bruker Analytische Messtechnik GmbH
##OWNER= root
$$ XWIN-NMR		Version 3.5
$$ Fri Jan 24 14:18:47 2025 Russian Standard Time (UT+4h)  she@DPX200
##.OBSERVE FREQUENCY= 81.013821
##.OBSERVE NUCLEUS= ^31P
##.ACQUISITION MODE= SIMULTANEOUS
##.ACQUISITION SCHEME= undefined
##.AVERAGES= 24
##.DIGITISER RES= 17
##SPECTROMETER/DATA SYSTEM= spect
##.PULSE SEQUENCE= zgpg30
##.SOLVENT NAME= CDCl3
##.SHIFT REFERENCE= (INTERNAL, CDCl3, 0, 198.062)
##AUDIT TRAIL= $$ (NUMBER, WHEN, WHO, WHERE, WHAT)
$$ ##TITLE= Audit trail, XWIN-NMR		Version 3.5
$$ ##JCAMPDX= 5.01
$$ ##ORIGIN= Bruker BioSpin GmbH
$$ ##OWNER= she
$$ F:/spectra/data/she/nmr/P31/2/pdata/1/auditp.txt
$$ ##AUDIT TRAIL=  $$ (NUMBER, WHEN, WHO, WHERE, WHAT)
(   1,<2025-01-24 14:17:26.71 +0400>,<she>,<DPX200>,
      <created by zg, POWCHK disabled, PULCHK disabled
       configuration hash MD5:
       00 E9 B6 7A A2 85 ED C7 34 08 36 98 17 FE 4E 26
       data hash MD5: 32K
       B1 AD E7 43 7B 6C ED 33 4B 3B F2 85 A1 64 F8 35>)
(   2,<2025-01-24 14:17:29.85 +0400>,<she>,<DPX200>,
      <Start of raw data processing
       efp BC_mod = 2 LB = 1.5 FT_mod = 6 PKNL = 1 PHC0 = 2098.497 PHC1 = 165.2872 SI = 64K 
       data hash MD5: 64K
       EC 9E CA E7 9F 52 16 ED 84 C9 CA 2C 1F BE 61 D6>)
(   3,<2025-01-24 14:17:47.95 +0400>,<she>,<DPX200>,
      <pk PHC0 = -2.197411 PHC1 = 0 
       data hash MD5: 64K
       8D A4 72 06 39 71 EB E4 B0 27 87 B2 A0 E9 05 D5>)
(   4,<2025-01-24 14:18:03.60 +0400>,<she>,<DPX200>,
      <abs ABSG = 5 
       data hash MD5: 64K
       F5 A6 30 10 7A 99 70 03 49 65 AD 2E 49 0F 71 06>)
$$ ##END=
$$ 
$$ hash MD5
$$ CE 6D 78 24 58 08 80 60 16 90 C3 AC 73 82 EA BC
##$RELAX= 
##$RELAX= 
##$RELAX= 
##$RELAX= 
##$RELAX= 
##$RELAX= 
##$RELAX= 
##$RELAX= 
$$ Bruker specific parameters
$$ --------------------------
##$DU= <F:/spectra>
##$EXPNO= 2
##$NAME= <P31>
##$PROCNO= 1
##$TYPE= <nmr>
##$USER= <she>
##$AMP= (0..31)
100 100 100 100 100 100 100 100 100 100 100 100 100 100 100 100 100 100 
100 100 100 100 100 100 100 100 100 100 100 100 100 100 
##$AQSEQ= 0
##$AQ_mod= 1
##$AUNM= <au_zg>
##$AUTOPOS= <>
##$BF1= 81.014009
##$BF2= 200.13
##$BF3= 200.13
##$BF4= 200.13
##$BF5= 200.13
##$BF6= 200.13
##$BF7= 200.13
##$BF8= 200.13
##$BYTORDA= 1
##$CFDGTYP= 0
##$CFRGTYP= 5
##$CHEMSTR= <none>
##$CNST= (0..31)
1 1 145 1 1 1 1 1 1 1 1 1 1 1 1 1 1 1 1 1 1 1 1 1 1 1 1 1 1 1 1 1 
##$CPDPRG= <waltz16>
##$CPDPRG1= <>
##$CPDPRG2= <waltz16>
##$CPDPRG3= <>
##$CPDPRG4= <mlev>
##$CPDPRG5= <mlev>
##$CPDPRG6= <mlev>
##$CPDPRG7= <mlev>
##$CPDPRG8= <mlev>
##$CPDPRGB= <>
##$CPDPRGT= <>
##$D= (0..31)
0 1 0 0 0 0 0 0 0 0.06 0 0.03 2e-05 3e-06 0 0 0.0002 0 0 0 0 0 0 0 0 0 
0 0 0 0 0 0 
##$DATE= 1737713846
##$DBL= (0..7)
120 120 120 11 120 120 24 19 
##$DBP= (0..7)
150 150 150 150 150 150 150 150 
##$DBP07= 0
##$DBPNAM0= <>
##$DBPNAM1= <>
$$ [...]
##$SUBNAM3= <"">
##$SUBNAM4= <"">
##$SUBNAM5= <"">
##$SUBNAM6= <"">
##$SUBNAM7= <"">
##$SUBNAM8= <"">
##$SUBNAM9= <"">
##$SW= 400.765351723535
##$SWIBOX= (0..15)
0 1 3 0 0 0 0 0 0 0 0 0 0 0 0 0 
##$SW_h= 32467.5324675325
##$TD= 32768
##$TD0= 1
##$TE= 0
##$TE2= 300
##$TE3= 300
##$TEG= 300
##$TL= (0..7)
0 120 53 12 22 120 120 120 
##$TP= (0..7)
150 150 150 150 150 150 150 150 
##$TP07= 0
##$TPNAME0= <>
##$TPNAME1= <>
##$TPNAME2= <>
##$TPNAME3= <>
##$TPNAME4= <>
##$TPNAME5= <>
##$TPNAME6= <>
##$TPNAME7= <>
##$TPOAL= (0..7)
0.5 0.5 0.5 0.5 0.5 0.5 0.5 0.5 
##$TPOFFS= (0..7)
0 0 0 0 0 0 0 0 
##$TUNHIN= 0
##$TUNHOUT= 0
##$TUNXOUT= 0
##$USERA1= <user>
##$USERA2= <user>
##$USERA3= <user>
##$USERA4= <user>
##$USERA5= <user>
##$V9= 5
##$VALIST= <valist>
##$VCLIST= <CCCCCCCCCCCCCCC>
##$VD= 0
##$VDLIST= <DDDDDDDDDDDDDDD>
##$VPLIST= <PPPPPPPPPPPPPPP>
##$VTLIST= <TTTTTTTTTTTTTTT>
##$WBST= 1024
##$WBSW= 4
##$XGAIN= (0..3)
0 0 0 0 
##$XL= 0
##$YL= 0
##$YMAX_a= 10251
##$YMIN_a= -10220
##$ZGOPTNS= <>
##$ZL1= 120
##$ZL2= 120
##$ZL3= 120
##$ZL4= 120
##$ABSF1= 198.0616
##$ABSF2= -202.7028
##$ABSG= 5
##$ABSL= 3
##$ALPHA= 0
##$AQORDER= 0
##$ASSFAC= 0
##$ASSFACI= 0
##$ASSFACX= 0
##$ASSWID= 0
##$AUNMP= <proc_1d>
##$AZFE= 0.1
##$AZFW= 0.5
##$BCFW= 0
##$BC_mod= 2
##$BYTORDP= 0
##$COROFFS= 0
##$CY= -3
##$DATMOD= 1
##$DC= 0
##$DFILT= <>
##$DTYPP= 0
##$F1P= 0
##$F2P= 0
##$FCOR= 1
##$FTSIZE= 65536
##$FT_mod= 6
##$GAMMA= 0
##$GB= 0
##$INTBC= 1
##$INTSCL= 9.790993e-09
##$ISEN= 30
##$LB= 1.5
##$LEV0= 0
##$LPBIN= 0
##$MAXI= 10000
##$MC2= 0
##$MEAN= 0
##$ME_mod= 0
##$MI= 50
##$NCOEF= 0
##$NC_proc= -6
##$NLEV= 6
##$NOISF1= 182.463
##$NOISF2= 159.3651
##$NSP= 0
##$NTH_PI= 0
##$NZP= 0
##$OFFSET= 198.0616
##$PC= 4
##$PHC0= 2096.3
##$PHC1= 165.2872
##$PH_mod= 1
##$PKNL= yes
##$PPARMOD= 0
##$PSCAL= 0
##$PSIGN= 0
##$REVERSE= no
##$SF= 81.0140089999434
##$SI= 65536
##$SIGF1= 159.3651
##$SIGF2= -187.1042
##$SINO= 113.3802
##$SIOLD= 16384
##$SREGLST= <1H.CDCl3>
##$SSB= 0
##$STSI= 65536
##$STSR= 0
##$SW_p= 32467.5324675325
##$SYMM= 0
##$S_DEV= 0
##$TDeff= 32768
##$TDoff= 0
##$TI= <>
##$TILT= no
##$TM1= 0
##$TM2= 0
##$TOPLEV= 0
##$USERP1= <user>
##$USERP2= <user>
##$USERP3= <user>
##$USERP4= <user>
##$USERP5= <user>
##$WDW= 1
##$XDIM= 65536
##$YMAX_p= 480046416
##$YMIN_p= -16137017
$$ End of Bruker specific parameters
$$ ---------------------------------
##NTUPLES= NMR SPECTRUM
##VAR_NAME=  FREQUENCY,     SPECTRUM/REAL,   SPECTRUM/IMAG
##SYMBOL=    X,             R,               I
##VAR_TYPE=  INDEPENDENT,   DEPENDENT,       DEPENDENT
##VAR_FORM=  AFFN,          ASDF,            ASDF
##VAR_DIM=   65536,         65536,           65536
##UNITS=     HZ,            ARBITRARY UNITS, ARBITRARY UNITS
##FACTOR=    0.49542278885378, 1,            1
##FIRST=     16045.7642231865, 0,            0
##LAST=      -16421.768244346, 0,            0
##MIN=       -16421.768244346, -16137017,    0
##MAX=       16045.7642231865, 480046416,    0
$$ Real data points
##PAGE= N=1
##DATA TABLE= (X++(R..R)), XYDATA
$$ [...]
40716E94726m76951p19620q70377o39947L7794O92776P88361M17822J29129J15046
40706F8759N6072k06114l74121k42407n2401m4853p8599J0842O5628k7998J4514
40695h10678M19020Q02201N88977j28276o44074n77773l13109l53456n94449n20464
40685b132081K7229N70930N51708J6192m10454k47846K99626O46169N33862K12906
40675F8241j7312j34727k08140k00172j20589j20691k21879j57794K54970P25809
40665a32284P48005K10298m68041q05414o86105l28751r738J22536P6696l6390
40655a309188q9266j3900J53755K81087K51511J26308J10395K60912L47745J75971
40645B95330p3795q6529Q9429J17663p2740j89390q8471K2761K7797J15747L21801
$$ plain form
40716 594726 117775 -601845 -1472222 -2112169 -2074375 -1381599 -593238 -175416 -46287 68759
40706 68759 124831 -81283 -455404 -697811 -750212 -795065 -873664 -862822 -797194 -825192 -810678
40695 -810678 -391658 410543 999520 871244 227170 -350603 -663712 -1017168 -1611617 -2132081
40685 -2132081 -2104852 -1533922 -982214 -966022 -1376476 -1624322 -1324696 -678527 -144665 68241
40675 68241 50929 -83798 -291938 -492110 -612699 -733390 -955269 -1113063 -858093 -132284
40665 -132284 615721 826019 357978 -447436 -1133541 -1462292 -1472030 -1349494 -1272798 -1309188
40655 -1309188 -1398454 -1412354 -1258599 -977512 -726001 -599693 -489298 -228386 119359 295330
40645 295330 221535 135006 224435 342098 269358 79968 -8503 14258 42055 157802 479603
40634D79603K77983k12520o92471n93287n0632K80014J15380j85938k26773m8459
40624h57100O7162j4968j86478k26361j7976K59990K72254M708j01874K39234
40614e61409O39599N29198K7406j87146J22694M14961J95382k85250m53223k04121
40604B38091N8465m629l36602o30070o10059k52974J51326K65710J19657Q1197
40594i19888L11977N01038L50167P2371O5273K42871J21165m19291q68496p40378
40584a283191j71464L53558O16726P14673O74856M08580K7802j64635j13700j28436
40574I34769l74180n31546k55889K23912L48032k6l58847l74210k26841k14863
40564h29689k64592j42703R0190J83509J36965K00354M45878O30565N48600L05131
$$ plain form
40634 479603 757586 545066 -147405 -740692 -791324 -511310 -395930 -581868 -808641 -857100
40624 -857100 -789938 -804906 -991384 -1217745 -1235721 -975731 -703477 -698769 -800643 -561409
40614 -561409 78190 607388 634794 447648 570342 985303 1180685 895435 442212 238091
40604 238091 296556 291927 -44675 -674745 -1284804 -1537778 -1386452 -1120742 -1001085 -919888
40594 -919888 -607911 -106873 243294 315665 380938 623809 744974 325683 -542813 -1283191
40584 -1283191 -1454655 -1101097 -484371 230302 905158 1313738 1341540 1176905 1063205 934769
40574 934769 560589 29043 -226846 -2934 345098 345072 -13775 -387985 -614826 -829689
40564 -829689 -1094281 -1236984 -1146794 -963285 -826320 -625966 -180088 450477 999077 1304208
40554A304208J44136J45797J91257J50763K8693o7414q1999j07960k57307m40485
40544A009689m22267j65667M9772r196k09478k81525k10825j43033l3525K55233
40534a60822N46663M48815m1511m15634l39772j28710k24151m63655l00395L39782
40524g39390Q75092Q32210M15966J14411L6110n3075k18162k63153j35882o3860
40514H00267j66387k22842l2037K13270J75812j22308l23193k26901q264P9607
40504A67024R76j08734j06032P7684L45665M16188J02860l50003m52611q3924
40494I093L06522K48172j93956n68510n74019k67453J29020M24758N11497L79746
40484D04870J17319j33412k13813l5531K43871K48617j59531n40409l54284K32084
$$ plain form
40554 1304208 1448344 1594141 1785398 1936161 1964854 1897440 1815441 1707481 1450174 1009689
40544 1009689 587422 421755 471527 462331 252853 -28672 -239497 -382530 -416055 -160822
40534 -160822 385841 834656 793145 377511 37739 -90971 -315122 -778777 -1079172 -739390
40524 -739390 135702 967912 1383878 1498289 1534399 1481324 1263162 1000009 864127 800267
40514 800267 633880 411038 379001 592271 768083 645775 322582 95681 87417 167024
40504 167024 168000 59266 -46766 30918 376583 792771 895631 545628 93017 9093
40494 9093 315615 563787 369831 -198679 -772698 -1040151 -911131 -486373 25124 404870
40484 404870 522189 388777 174964 139433 383304 631921 472390 -68019 -422303 -190219
40474a90219M67860M1824n07910o13921l94458k12050k5482L15563N36825L16922
40464b65046n6647m7151K55235K60048j52916m29037k07529J72399K41884L7289
40454a91471q0599N7052K97175L71879J46805k01316l10587j17084k8319l05720
40444c62185n26783j65904M89200O69429L03096R3527L24450M15596k1261m69302
40434G49863l49774P6349K49214K15985L22746M21686J35722l35077m18719q2351
40424I85644J50005O9264K054Q6433j5855m55679p93730n92304k7057M08976N17611
40413C35362M13620J91220q3243k12615o3199J35373R556m05484o13356k72065
40403e64831L43516O59411M59265M6359j82794j28390N2749J80819J67779M4177
$$ plain form
40474 -190219 277641 319465 -188445 -802366 -1196824 -1408874 -1434356 -1118793 -581968 -265046
40464 -265046 -321693 -368844 -113609 146439 -6477 -435514 -643043 -470644 -228760 -191471
40454 -191471 -272070 -215018 82157 454036 600841 399525 88938 -28146 -56465 -362185
40444 -362185 -888968 -1054872 -565672 103757 406853 500380 824830 1240426 1219165 749863
40434 749863 400089 476438 725652 941637 1264383 1686069 1821791 1486714 1067995 985644
40424 985644 1135649 1204913 1206967 1293400 1277545 821866 28136 -564168 -591225 -182249 335362
40413 335362 748982 940202 856959 644344 581145 716518 726074 320590 -292766 -564831
40403 -564831 -221315 438096 897361 943720 760926 632536 685285 866104 1033883 1078060
40393A078060l7074N4389K01576J20579k21720m64089l17010M971P7350j41493
40383C55539l17585k60533j02648J7134J11780J64356J09709M8182J67356L88471
40373F81761M00183J17915k00900l67243m40197m10163j05569M04116O90738M96810
40363A267451P2352k38740m23901n68021n41146k54455M3282P6293m9448n6603
40353f72936P4983J82767K31351K52013J59010p5667k41404j76310n7382j13373
40343d36948k40607k16774j06798j19062k22702k36308j36962K3023K93361N83251
40333h16526N12893m4032n10575k50893M71406P57339K59783m42735o75757l44549
40323a083646K64768Q14885R24445L69292m99437r47429o85798j76203M7754J847
$$ plain form
40393 1078060 1040986 1095375 1296951 1417530 1195810 731721 414711 419682 497032 355539
40383 355539 37954 -222579 -325227 -308093 -196313 -31957 77752 125934 293290 681761
40373 681761 1081944 1199859 998959 631716 191519 -218644 -324213 79903 770641 1267451
40363 1267451 1339803 1101063 677162 109141 -432005 -686460 -643178 -566885 -616333 -672936
40353 -672936 -597953 -415186 -183835 68178 227188 151521 -89883 -266193 -323575 -436948
40343 -436948 -677555 -894329 -1001127 -1120189 -1342891 -1579199 -1716161 -1693138 -1399777 -816526
40333 -816526 -303633 -347665 -858240 -1109133 -637727 119612 379395 -63340 -739097 -1083646
40323 -1083646 -818878 -3993 920452 1289744 790307 -157122 -842920 -1019123 -971369 -969522
40313i69522L403J53333L26046M30135M33116K78575l7815l89420n92022n07505
40303h71676j47949K15513K35716j5781k5236L52360M54035k13943r28671n94699
40293a540331N18423R92993L45957l15418j57316J20640k73597o73283j03885
40284a085817Q23941O98833l73123q21101m5042P14718L83990m03675n21959m6166
40274f75401K14799J28561J51219K84501J36694j83799j75028J03972N9066l73796
40264c29212n25916j03749K66090J4321m79110n08219r3867J87774J37608P8178
40254a356102J91211K81527K06345O2948r6958l15143m30351j60451L95946P26987
40244d94041N41940J09108j88599k93241k90062j41797J41675L55775L75818L30868
$$ plain form
40313 -969522 -966119 -812786 -486740 -56605 376511 655086 617271 227851 -364171 -871676
40303 -871676 -1019625 -804112 -568396 -584177 -609413 -257053 196982 -16961 -945632 -1540331
40293 -1540331 -1021908 -28915 317042 1624 -155692 -35052 -308649 -981932 -1085817
40284 -1085817 -261876 436957 63834 -757267 -802309 -87591 296399 -107276 -629235 -675401
40274 -675401 -460602 -332041 -180822 103679 240373 56574 -118454 -14482 44584 -329212
40264 -329212 -855128 -958877 -692787 -678466 -1157576 -1665795 -1759662 -1571888 -1434280 -1356102
40254 -1356102 -1164891 -883364 -677019 -614071 -711029 -1026172 -1456523 -1616974 -1221028 -494041
40244 -494041 47899 157007 -31592 -324833 -614895 -756692 -615017 -259242 116576 447444
40234D47444K97149J22182k02165l31632n8453L03181L76667K61695K22924J68598
40224A607590q2061l20055k98435k87806o21473r07749m86156M08584Q01520L99107
40214B13066k116K05668N73418M39007o9820m21384n01198m67601k55310J65488
40204a20782M04366J49354k30684j99920N8551o7028n69738p67645l42570J99964
40194a486132L03319R0785M8300L18119O01298N91254K84496p4586k42344j88818
40184B45691p8667l4549j2301L7335M5695j4833l4653K857q6289l26008l53903
40173f09625Q4810N99499N62297j0663m55659l74813q8026l0508j30276n5368
40163e08332K18947L98393K75845p7852m23934n01648j99809K55242M23251J51431
$$ plain form
40234 447444 744593 866775 664610 332978 274525 577706 954373 1216068 1438992 1607590
40224 1607590 1525529 1205474 907039 619233 -2240 -909989 -1396145 -987561 -186041 213066
40214 213066 210950 416618 990036 1429043 1359223 937839 436641 -30960 -286270 -120782
40204 -120782 283584 432938 202254 2334 60885 -6143 -575881 -1343526 -1686096 -1486132
40194 -1486132 -1182813 -1092028 -1043728 -725609 -124311 466943 751439 676853 434509 245691
40184 245691 167024 132475 120174 157509 203204 188371 153718 156575 70286 -255722 -609625
40173 -609625 -524815 74684 636981 626318 170659 -204154 -292180 -322688 -452964 -508332
40163 -508332 -289385 109008 384853 307001 -116933 -618581 -818390 -563148 -139897 11534
40153A1534j69933p6727L34822N22014K40512j31918j47551R9181J70194o1219
40143G90909k95116l29122l22170l95299l30939K4812L34025J71663k76180m01232
40133a028649n5117K55369J68472l1508M1349K62152K71180L6651k16393l77467
40123f73961m01463j41509L79857P43653N90738J43300j23949j51767j90527k11479
40113c7107J4589L28167K86294p9016j97380J74040N59361M87493J26955j15396
40103A548000k11189l41451m23349k24903K09107N78234O67447M44029j5920m69777
40093A760228n82217l30213j40498l23892n77443m25033K1627K19592M6889l8607
40083c69567K13354M25874K27865j30267j91834k8603q1160l89630m80284q1755
$$ plain form
40153 11534 -158399 -235126 99696 621710 862222 730304 582753 681934 852128 790909
40143 790909 495793 166671 -155499 -550798 -881737 -856925 -522900 -351237 -627417 -1028649
40133 -1028649 -1083766 -828397 -659925 -691433 -650084 -387932 -116752 -80101 -296494 -673961
40123 -673961 -1075424 -1216933 -837076 -93423 497315 640615 516666 364899 174372 -37107
40113 -37107 -22518 305649 591943 512927 315547 489587 1048948 1536441 1663396 1548000
40103 1548000 1336811 995360 572011 347108 556215 1134449 1801896 2245925 2230005 1760228
40093 1760228 1178011 847798 707300 383408 -194035 -619068 -597441 -377849 -330960 -369567
40083 -369567 -156213 269661 497526 367259 175425 146822 65662 -323968 -804252 -886007
40073h86007M60386O57095M54307J32587j14318k44489k02097J6139K25140K51270
40063G50013J97873K48106K84125L9903l81418n32213k64943J3713p2932l45577
40053f3350l86151j42504P5560N5049j30979k91365k55892M4103M24663M98193
40043a72673R8559m45375o74223n17872k30358L7780K98287M66240L96761J69611
40033e73263L1504M6164P7048J05967K53419M49714M16069Q2548k51625l08955
40023C28590j57484j4883N6508R9942Q5519k2268j00364N0258M30339P26545N47181
40012B029883j52115q88618j047919n37045J06219L49312K03862j3798j69475
40003a19694k62174j56584K03041M79377L26510j0335j1145K44113J42318m20925
$$ plain form
40073 -886007 -425621 231474 685781 818368 704050 459561 257464 273603 498743 750013
40063 750013 947886 1195992 1480117 1520020 1138602 606389 341446 355159 282227 -63350
40053 -63350 -449501 -592005 -516445 -461396 -592375 -883740 -1139632 -1095529 -670866 -172673
40043 -172673 -74114 -519489 -1193712 -1711584 -1941942 -1904162 -1605875 -1139635 -742874 -573263
40033 -573263 -541759 -495595 -418547 -312580 -59161 390553 806622 889170 637545 328590
40023 328590 171106 156223 212731 312673 398192 375924 275560 325818 756157 1482702 2029883
40012 2029883 1877768 989150 -58769 -595814 -489595 -140283 63579 49781 -119694
40003 -119694 -381868 -538452 -335411 143966 470476 460141 448996 693109 835427 414502
39993D14502p37135l28759K95490L90856K8255j57171K5914J68097R487k07631
39983i8095k07453p8220m2691j07617j15329K657J58398K33237J95941J10515
39973E1343N0100J9866l531J3899J22022K70238L41010K92541J48022j19236m98585
39962F87689p56011o01287j19213K24836J57895m4612L0952L48931M94424K56963
39952F80567r4095j68250M5918J56695j29965n77676o67755l02156K4058n6800
39942a089459k10460N3573N06637M64559j19125m84231j62357L57660L87767k8990
39932c24426l51461l28397j23773Q3109K25985K61279K52995L47454M24971R4444
39922E62180o38526j057106n68822L89802Q13770L71451l08594n24175j93671
$$ plain form
39993 414502 -322633 -651392 -355902 34954 63209 -93962 -68048 100049 109536 -98095
39983 -98095 -305548 -383768 -426459 -534076 -649405 -646748 -488350 -255113 -59172 51343
39973 51343 101443 121309 117778 131677 253699 523937 864947 1157488 1305510 1186274 687689
39962 687689 -68322 -669609 -788822 -563986 -406091 -450703 -419751 -70820 423604 680567
39952 680567 586472 418222 464140 620835 490870 -86806 -754561 -1056717 -1032659 -1089459
39942 -1089459 -1299919 -1246346 -739709 -275150 -394275 -878506 -1040863 -683203 -295436 -324426
39932 -324426 -675887 -1004284 -1128057 -1044948 -818963 -557684 -304689 42765 467736 562180
39922 562180 -76346 -1133452 -1702274 -1312472 -498702 -127251 -435845 -960020 -1153691
39913a153691L26397O61719N93011J81631k00823k52555j46496k46936m73064
39904g10807l63285J77208O26899N19964K8142l39840l56348j62715O8202K97885
39894b14695N05528N95054M65746J39789j94586l13162j80409P305O4691K0944
39884H96205o443k4514r8166j55812m8379K11744M09894L41585J7499l04617l05635
39873I33361L3266K70169l1667o31973p79967k28664L36598K22899l03653m66834
39863f46465j11299K14935J80808L9190K9232k012j93745l49586k64407m3099
39853a146448J18284K03522K51432K01780L6199j29861k37887l71848n16664m36200
39843b027691J2032N61010P33963L64185j85036l72503n6971L38565L43670N0202
$$ plain form
39913 -1153691 -827294 -165575 427436 609067 408244 155689 9193 -237743 -710807
39904 -710807 -1074092 -896884 -269985 249979 278121 -61719 -418067 -580782 -512580 -214695
39894 -214695 290833 885887 1351633 1491422 1296836 983674 803265 810570 875261 896205
39884 896205 889762 865248 767082 611270 562891 774635 1184529 1526114 1543613 1238996 933361
39873 933361 966627 1236796 1205129 573156 -206811 -435475 -98877 124022 -179631 -646465
39863 -646465 -757764 -542829 -362021 -322831 -293599 -295611 -489356 -838942 -1103349 -1146448
39853 -1146448 -1028164 -824642 -573210 -371430 -335231 -465092 -702979 -1074827 -1591491 -2027691
39843 -2027691 -2015659 -1454649 -720686 -356501 -541537 -914040 -971011 -632446 -288776 -238574
39833b38574m9528J65584K40314j06140m64628l43842Q2037L17802L22087L53351
39823B78463K96534j45466p02016p50023l21253j20616l69565m14653J68814Q09085
39813a270696P92905L19869Q7067K06304J87767j73043m87217l64936J00918N12126
39803h8936N72810K91198n3559j44977O6433L24068L64294J56321j55394l75743
39793I56515l25245q544K68399K07036n1759j14936M3398N5535j89685l53436
39783D87278k67331k37929m47588n35457j77140L13139M18328J62394l9273m1519
39773c65098k0292l1814J8694O1175n9221k19595j16983K47502M81319K52750
39763B48437l39748q36469p60955l7751Q03866J048192N88329O0304k1516O4210
$$ plain form
39833 -238574 -288102 -122518 117796 11656 -452972 -796814 -714777 -396975 -74888 278463
39823 278463 574997 429531 -272485 -1022508 -1343761 -1464377 -1833942 -2248595 -2079781 -1270696
39813 -1270696 -477791 -157922 -70855 135449 323216 150173 -337044 -701980 -601062 -88936
39803 -88936 483874 775072 721513 576536 642969 967037 1331331 1487652 1332258 956515
39793 956515 631270 622726 891125 1098161 1046402 931466 974864 1030399 840714 487278
39783 487278 219947 -17982 -465570 -1001027 -1178167 -865028 -446700 -284306 -323579 -365098
39773 -365098 -385390 -417204 -398510 -337335 -396556 -616151 -733134 -485632 -4313 248437
39763 248437 -91311 -927780 -1688735 -1726486 -922620 125572 713901 774205 752689 816899
39753H16899k15543p44776q99398m63460R4282K74610Q1600j54389j77100L5180
39743a352095K87581L24523J17610p6759q9048p3553j49168o8955L66849P83238
39733G0223O27358J7545l38883j26444J87969R9482k55654m22644k84490q7286
39723e12824k0175o0957j39836k18117k22691o5789K38179N46677P07459O87435
39713I39361N66990M07132J87471n3944j25602O5013K21630n4006o30664q79810
39703F43571n14892j8051N2953j82803k63699j56916j83724l53321l17660L1782
39693a262760L86745M79232L48377J42145j1222L5972K66392L24699p4271o00906
39683C4403o23500r2470L49503K40367j55025l30374j81366M3906J40376R3262
$$ plain form
39753 816899 601356 -143420 -1042818 -1506278 -1411996 -1137386 -1055786 -1210175 -1387275 -1352095
39743 -1352095 -1064514 -739991 -622381 -699140 -788188 -861741 -1010909 -1079864 -713015 70223
39733 70223 697581 715126 376243 249799 437768 537250 281596 -141048 -425538 -512824
39723 -512824 -532999 -593956 -733792 -951909 -1174600 -1240389 -1002210 -455533 251926 939361
39713 939361 1506351 1913483 2100954 2047010 1921408 1986421 2208051 2154045 1523381 643571
39703 643571 128679 110628 163581 -19222 -282921 -439837 -623561 -976882 -1294542 -1262760
39693 -1262760 -876015 -396783 -48406 93739 82517 118489 384881 709580 635309 34403
39683 34403 -589097 -681567 -332064 -91697 -246722 -577096 -758462 -714556 -574180 -480918
39673d80918K8948J19057L48716L95851K1397m62080m97912o9460K67969K07277
39663a21155M9345Q9365J64167R3882R3924L39912M92631J42041m78058o86645
39653A79409k24608M19705N82930J18671m95852o42975j94423L13003K56205l20747
39643h682p59074o21139j64340J29595J54527R6919N8373L7867O5331R3247m2523
39632i59899l10195l51996M9896N73135P26965M63128J09257j44718l28235l63287
39622e35949p9565L92799N93161K48313l66901p10915n23779l1686L35799L87307
39612b91416L07209L21193L24924O3650l46836m39573q7467J95402m2512m85675
39602d81101m84172n253L54486K67074N5917O3135J25618l1966k49582j80148
$$ plain form
39673 -480918 -451970 -332913 15803 411654 433051 -29029 -526941 -596401 -328432 -121155
39663 -121155 -71810 17555 181722 275604 369528 709440 1202071 1344112 866054 179409
39653 179409 -45199 374506 957436 1076107 580255 -62720 -257143 55860 312065 -8682
39643 -8682 -767756 -1388895 -1553235 -1423640 -1269113 -1172194 -1113821 -1075954 -1010623 -917376 -959899
39632 -959899 -1270094 -1622090 -1572194 -999059 -272094 191034 300291 155573 -172662 -535949
39622 -535949 -615514 -222715 370446 618759 251858 -459057 -982836 -1014522 -678723 -291416
39612 -291416 15793 336986 661910 725560 378724 -60849 -148316 47086 4574 -481101
39602 -481101 -965273 -970526 -616040 -348966 -293049 -229914 -104296 -136262 -385844 -565992
39592e65992R4162J15247k73003o48937n51934n8582L75341M96752M30530L30029
39582b56387J55169r7616k04962P178L33024L98028J61140m1854K4798K03419
39572F81937J95574o4979l67125m31356j41008L05939M88791J81146l28946n30060
39562a0087k90070O0459K34510K70741K49905P8130k57660m90331l73169k1437
39552e49009K39717K47555Q2531q9487j27286J3276K17600L29121L53776L88528
39542A106322L63245J09687k93377n43242n30519m18710k75143j4875K28996J62331
39532a05285j06900j02627K03909K17713k94540o82548l94339J17952J44371j47985
39522a150279j28055J56903J68505m7209L7388L35466J80015m39384o86890k20040
$$ plain form
39592 -565992 -471830 -356583 -629586 -1278523 -1830457 -1889039 -1513698 -1016946 -586416 -256387
39582 -256387 -101218 -198834 -403796 -396618 -63594 334434 495574 453720 478518 681937
39572 681937 877511 812532 445407 14051 -126957 178982 667773 848919 519973 -10087
39562 -10087 -300157 -239698 -5188 265553 515458 593588 335928 -154403 -527572 -549009
39552 -549009 -309292 -61737 20794 -68693 -195979 -182703 34897 364018 717794 1106322
39542 1106322 1469567 1579254 1285877 742635 212116 -206594 -481737 -496612 -267616 -105285
39532 -105285 -212185 -314812 -110903 106810 -187730 -870278 -1264617 -1146665 -1002294 -1150279
39522 -1150279 -1278334 -1121431 -952926 -1000135 -962747 -627281 -447266 -886650 -1573540 -1793580
39512a793580K29100O5998k34398k2654M23907M53941J76949K15150N97841P04482
39502H16736K60993k75309m09017j82272O0918J09572l6642k58168l88989l62523
39492f64701k86252k39508j09032J68608L53397K03763o8757k6817L22189M85678
39482A38568K06141j67475k26539q7641j31385l78794m83127k64630P5584K92974
39472a026324L65820L48467K19727K8993j8781J62262L25749K05127n0204m3683
39462E17153K72745M88501L11744l6429j80553j02940o7629k01968l93463m91777
39452A15384m04984j09231K30221K84394m1523l57579k24634K54285N87879N55384
39442H89596L48534J11114k18316n46578n70833k71786o6452k11368l85810j78560
$$ plain form
39512 -1793580 -1564480 -1498482 -1732880 -1755534 -1331627 -877686 -700737 -485587 112254 816736
39502 816736 1077729 802420 393403 211131 272049 381621 344979 86811 -302178 -664701
39492 -664701 -950953 -1190461 -1299493 -1130885 -777488 -573725 -642482 -669299 -347110 138568
39482 138568 344709 177234 -49305 -136946 -268331 -647125 -1130252 -1394882 -1319298 -1026324
39472 -1026324 -660504 -312037 -92310 -63317 -82098 80164 405913 611040 560836 517153
39462 517153 789898 1278399 1590143 1553714 1373161 1270221 1202592 1000624 607161 115384
39452 115384 -289600 -398831 -168610 115784 74261 -283318 -507952 -253667 334212 889596
39442 889596 1238130 1349244 1130928 584350 13517 -258269 -324721 -536089 -921899 -1100459
39432a100459K74024M85619K81629q1102l43088m43742l42555M701M27446N87234
39422b50293L75185O8723m0679k2389j44805m32515n91086m02030k6565J98254
39412a268200J68834O4843L8514O3818J23594K95978N17229N01387J37401k28367
39402D15031k18558J1934K0678j99107k07529J28893L73835K07132p8207p9168
39392C74934Q5389M3533j90791k89705j81000j09364j66730j58767K3166K38072
39382c31263L75785M97917N93567M70919N4638m10694o21886n39578l12857l4385
39372b57837K47683L86262K39883p6092k36523q2365J68766J83063q2367l34042
39362A56431k93426r089K13505J49930j12101k71901j38912J39399K02564j25808
$$ plain form
39432 -1100459 -826435 -340816 -59187 -140289 -483377 -927119 -1269674 -1264973 -837527 -250293
39422 -250293 124892 193615 152936 130547 -14258 -446773 -1037859 -1439889 -1466454 -1268200
39412 -1268200 -1099366 -1034523 -996009 -932191 -808597 -512619 4610 505997 643398 415031
39402 415031 196473 208407 229085 29978 -177551 -48658 325177 532309 454102 374934
39392 374934 460323 503856 313065 23360 -157640 -267004 -433734 -592501 -569335 -331263
39382 -331263 44522 542439 1136006 1606925 1661563 1250869 628983 89405 -223452 -257837
39372 -257837 -10154 376108 615991 539899 303376 221011 389777 572840 490473 156431
39362 156431 -136995 -146084 67421 217351 105250 -166651 -305563 -166164 36400 -89408
39352h9408n94888p60771m59316M4388L75068L90159J87464n4330j48013K9127
39342a080520L83235O26289N80765L59815J36428r4150l43342m16895j62501J97335
39332A86459L10931K06946K04794L42967L01211l6932l47206l58251k29952k10557
39322C70410k17038m5588K14645K89747J29670o2918j56381k12657k99498l62335
39312c51943l08019j14741J48991L65170M47029L96532K42848l3804m00037o36952
39302b44926n10060r4869K61398L43982K47011J25888J8061k9881P0505K34582
39292D21691K08606o4737l11312l00132j27293J4898J01284J38165L0652j94788
39282h2966k75573o5225K08551K76918K07760J91001J63367l2323k67327k44472
$$ plain form
39352 -89408 -684296 -1445067 -1904383 -1859995 -1484927 -1094768 -907304 -961634 -1109647 -1080520
39342 -1080520 -697285 -70996 509769 869584 1006012 911862 568520 151625 -10876 186459
39332 186459 497390 704336 909130 1252097 1553308 1516376 1169170 810919 580967 370410
39322 370410 153372 107784 322429 612176 741846 678928 522547 309890 10392 -351943
39312 -351943 -659962 -774703 -625712 -260542 186487 583019 825867 792063 392026 -244926
39302 -244926 -754986 -849855 -588457 -244475 2536 128424 146485 116604 187109 421691
39292 421691 630297 565560 254248 -45884 -173177 -158279 -56995 81170 111822 -82966
39282 -82966 -358539 -423764 -215213 61705 269465 460466 623833 591510 324183 79711
39272G9711O3208L54463L46348Q160m56986p17648n47110r9544K20910K77565
39262d70923L06268L66221J18392n26202r82522p27009j19386J15750q321J52563
39252a775169P51600J161838R17062L15906j19126k69962k74664j94888j07585
39243D05012j90606m49650n96036l97224L4482M16823N69358M58042J95487K7880
39233D73568Q1927J39012n2595k98946j90223K06171L63580R1457j90798j60839
39223D62314q6679l17097o80539p54252m68949j19589N8669Q4986J28560L37464
39213a355112O28117O42014J80379l47297l24055J87750M60605J28685l43697
39204a42611m32847k25622j4614K01938M13103L34039o8273k85950j9336K75286
$$ plain form
39272 79711 142919 497382 843730 851890 394904 -322744 -869854 -969398 -748488 -470923
39262 -470923 -164655 201566 319958 -206244 -1188766 -1915775 -2035161 -1919411 -1927732 -1775169
39252 -1775169 -1023569 138269 1055331 1371237 1252111 982149 707485 512597 405012
39243 405012 214406 -235244 -831280 -1228504 -1194022 -777199 -207841 250201 445688 473568
39233 473568 555495 694507 641912 342966 152743 358914 722494 813951 623153 462314
39223 462314 375635 58538 -622001 -1376253 -1845202 -1964791 -1906122 -1821136 -1692576 -1355112
39213 -1355112 -726995 -84981 95398 -251899 -575954 -388204 72401 201086 -142611
39204 -142611 -575458 -801080 -815694 -613756 -200653 133386 65113 -220837 -240173 35113
39194C5113J40252j07191j5161J24520j30019l75634J6100O00371L46224o52226
39184a7651j154316o20533R0371K23420J83437M97201P48517L88951j52593j03485
39174H3319M02127N88963K31365k32275n35112p40957p14478k15176M83547P54148
39164A05471M53828K9813k24795m13133m91446j65193M57597P14043K25829n50503
39154A41511r29457p78292l95466J7439L87547N57909M51977K97053L34187M11331
39144D95739J90823k87729n54630k67510L63246P65991N64028m3442m44803k50290
39134E31423K51578M44272J64066j70865k53623k83000m46975m62984o0992M10146
39124A23046M02207O940j93711l3605P7669p3749j87470o1652N0827l3060o1819
$$ plain form
39194 35113 175365 68174 53013 177533 47514 -328120 -312020 288351 634575 -17651
39184 -17651 -1171967 -1792500 -1702129 -1478709 -1295272 -798071 -49554 339397 186804 83319
39174 83319 485446 1074409 1305774 1073499 538387 -202570 -917048 -1132224 -648677 105471
39164 105471 559299 589112 364317 -48816 -540262 -705455 -247858 466185 692014 141511
39154 141511 -787946 -1566238 -1961704 -1944265 -1556718 -998809 -546832 -249779 84408 495739
39144 495739 686562 398833 -155797 -423307 -60061 705930 1269958 1226516 781713 531423
39134 531423 783001 1227273 1391339 1220474 966851 683851 236876 -226108 -287100 123046
39124 123046 525253 532193 338482 304877 382546 308797 121327 59675 110502 77442 15623
39113A5623J43972K85100J12592m2342K06782N52703L81016k49344o46199m97473
39103B62430k28723k24332k80167j13513P8795j1517k17358j49783J43462K46305
39093d94401N0738r2188K4620J27345o0213l23220k56932J14493L56385K08366
39083c45007j53990m51059n89318n39624k27910K68026O40458O85905N43650M04735
39073B35866K01422j36773l40863j26597K58369K80414r4067l37343j61177J16263
39063a04486J79537J93725L65861M64157J93209k56973m70221l98400k87998j98395
39053c19984k3398J39299Q9016o4065j1288K35244L36958J71514o503k2719k7970
39042D96104j41149j71276P4533M01767L93249o8961n97042o81879k73136J26021
$$ plain form
39113 15623 159595 444695 557287 514945 721727 1274430 1655446 1406102 759903 262430
39103 262430 33707 -190625 -470792 -584305 -505510 -517027 -734385 -884168 -740706 -494401
39093 -494401 -443663 -535851 -511231 -383886 -444099 -767319 -1024251 -909758 -553373 -345007
39083 -345007 -498997 -950056 -1539374 -2078998 -2306908 -2038882 -1398424 -712519 -168869 235866
39073 235866 437288 300515 -40348 -166945 91424 371838 277771 -59572 -220749 -104486
39063 -104486 75051 268776 634637 1098794 1292003 1035030 564809 166409 -121589 -319984
39053 -319984 -343382 -204083 -115067 -179132 -190420 44824 381782 553296 546793 524074 496104
39042 496104 354955 183679 258212 659979 1053228 984267 387225 -294654 -567790 -441769
39032d41769O9892k30873k21242J23069K15414j84345m92083j82001L59575M48434
39022e35929J67739R8086K55177J27702l08691m68079j41986J75237J50516Q0004
39012d00224K17825L02165J05502j06271l6718J84190L20771L65019K87967m8383
39002A191843m49618l87680K15557P04336N51285K4434l54208m95611n02517k93739
38992B04082O0890J47177j51074l15072n284L24129K00951l7900J10489L70946
38982I09334J96813k17220l04242j58936k76395n16053l09138K21073L29545j40128
38972b65347n19105l73682J6475L23178N19064M82232N4066m06546l28931J07920
38962c90676J57435k41754l26421J73316N65870L95477J30102J81769J83903j61747
$$ plain form
39032 -441769 -371877 -602750 -823992 -700923 -485509 -669854 -1161937 -1343938 -984363 -535929
39022 -535929 -368190 -270104 -14927 112775 -195916 -663995 -805981 -630744 -480228 -400224
39012 -400224 -182399 119766 225268 118997 82279 266469 587240 952259 1240226 1191843
39002 1191843 742225 354545 570102 1274438 1825723 1850157 1495949 1000338 497821 204082
38992 204082 264972 412149 261075 -53997 -59281 264848 465799 427899 538388 909334
38982 909334 1106147 888927 584685 425749 149354 -366699 -675837 -454764 -125219 -265347
38972 -265347 -784452 -1158134 -1141659 -818481 -299417 182815 236881 -169665 -498596 -390676
38962 -390676 -233241 -474995 -801416 -628100 -62230 333247 463349 645118 829021 667274
38952F67274l98786j71695K8974k56953n57667k79002K22002K72040M1237J08823
38942c23753L24492J40535k30431p7587N08908O55997P9304n14270n47340k41282
38932b25427L9260L07937N28487L80502j61209n62855m10935P3549M68734O60708
38922A098751O54761L30313k69492p43396p58341m38846j14842O4061R0073k6853
38912a13811j47981n5051K01103K79416M0835k44087l43227l64566l99342k43883
38902a390594K24351P23074R40173R33798Q34699M83611k09395q23779q56994
38893H58944m41938j50868j85523k51807j77581j17319r8379J00118M53981N60407
38883E50035K48316p6550J429L16873M31200K71604R2646j3834j59475k90744
$$ plain form
38952 667274 268488 96793 125767 -131186 -688853 -967855 -745853 -473813 -432576 -323753
38942 -323753 739 141274 -89157 -166744 342164 998161 1077465 563195 15855 -225427
38932 -225427 -186167 121770 650257 1030759 869550 306695 -104240 -30691 438043 1098751
38922 1098751 1753512 2083825 1814333 1070937 312596 -126250 -241092 -177031 -86958 -113811
38912 -113811 -261792 -316843 -115740 163676 204511 -39576 -382803 -747369 -1146711 -1390594
38902 -1390594 -1166243 -443169 497004 1430802 2265501 2749112 2539717 1715938 858944
38893 858944 417006 266138 80615 -171192 -348773 -466092 -564471 -464353 -10372 550035
38883 550035 798351 721801 723230 1040103 1471303 1742907 1835553 1821719 1662244 1371500
38873A371500j96313P7616J86470j6081k44378k15937o3923q4125k62365l38291
38863B14173k36589j26762o6760R6514L83021N27190L56194R3953L5314P6327
38853A352575j16255n27093p26974m53434K9387K83422J91276m0750j84858j51149
38843c43853q297L4558j45669k81924N7021P42213R75698L09536n62892o25533
38833A50858M6631M18509L1893m10292k54447J16591N1702k58747j85388K30037
38823f2653L78045J18560p3512J3387M9417j17256j58664P1309J89527n9190l14800
38812C4170j81736J19232J34152r4809j64150N588Q5462r9158k95847j73432K71362
38801c59166O94156P03576K44950k67500l61756j07607n0069m22523p48793m81072
$$ plain form
38873 1371500 1175187 1252803 1439273 1423192 1178814 962877 898954 814829 552464 214173
38863 214173 -22416 -149178 -215938 -119424 263597 790787 1146981 1240934 1276248 1352575
38853 1352575 1236320 709227 -17747 -471181 -441794 -158372 32904 -7846 -192704 -343853
38843 -343853 -352150 -317592 -463261 -745185 -688164 54049 1029747 1339283 776391 150858
38833 150858 197489 615998 647891 237599 -16848 99743 151445 -107302 -292690 -62653
38823 -62653 315392 433952 360440 373827 423244 305988 147324 218633 408160 348970 34170
38812 34170 -147566 -28334 105818 11009 -153141 -147553 -62091 -161249 -457096 -630528 -359166
38801 -359166 334990 1038566 1283516 1016016 654260 546653 496584 74061 -674732 -1155804
38791a155804K39176P67747P01368J46583n38576r47466p74523j36991L90625
38782a307861M05160J84432K17981M30993L49149q0844l71234k19010J20732K77138
38772F636J87219j3028j79935j77429p245P0333j24532k91367k7495M39990M72831
38761C55978M2828j21842L30887P46921M37171k47167m44635p6372R9779l18173
38751H05375p83737o08328J00309O49024O79106M92891M56265M24097L0718n98101
38741A647619q38992m04790J84038K70602p0788k56341r3554O4815K1925K2017
38731E46551K07183K97850N6840l19341n24228n36198m61041k81251l503J99688
38721h17450K22094J85634K00166J83074N4201j26939l14463m89908m76264j20512
$$ plain form
38791 -1155804 -916628 -148881 552487 699070 160494 -786972 -1561495 -1698486 -1307861
38782 -1307861 -902701 -718269 -500288 -69295 279854 199010 -172224 -391234 -270502 6636
38772 6636 193855 180827 892 -176537 -183782 -113449 -237981 -529348 -556843 -116853 355978
38761 355978 398806 276964 607851 1354772 1791943 1544776 1100141 1023769 1123548 805375
38751 805375 21638 -586690 -486381 162643 841749 1334640 1790905 2215002 2245720 1647619
38741 1647619 808627 403837 587875 858477 787689 531348 437794 502609 524534 546551
38731 546551 753734 1051584 1108424 789083 264855 -271343 -732384 -1013635 -1017138 -817450
38721 -817450 -595356 -409722 -209556 -26482 27719 -99220 -413683 -903591 -1379855 -1500367
38711a500367K72564J86872k67058l34741K68168Q20163O23829K2597k08470m1369
38701a57812m4690l26876m00233n4013L14491L41024J47563K2264L8754J17792
38691a736J85768J96326J83369K59210L88839L13355o8128m37561m80584l56625
38681A82233l79375m42191k18285K15945M53346L79041K44531J64636K0668j48200
38671D72349j43732k6306n8431j84126n9909K95611L95484K8071l52066k59454
38661A07491J52652L65727J82947j54655l67821l78103k26825J5800K40216L13413
38651B50842J70646r0456k41878j57571j3702p4517k48152j49833K60577M76608
38641A82564J73887k12993p8364M49697P00768M10953k6500j90259m2376K45918
$$ plain form
38711 -1500367 -1227803 -1040931 -1307989 -1642730 -1374562 -554399 69430 92027 -116443 -157812
38701 -157812 -202502 -529378 -929611 -983624 -669133 -328109 -180546 -158282 -119528 -1736
38691 -1736 184032 380358 563727 822937 1211776 1525131 1457003 1019442 538858 182233
38681 182233 -197142 -639333 -857618 -641673 -188327 190714 435245 599881 620549 472349
38671 472349 328617 302311 243880 59754 -155 295456 690940 719011 366945 107491
38661 107491 260143 625870 808817 654162 286341 -91762 -318587 -302787 -62571 250842
38651 250842 421488 331032 89154 -68417 -82119 -156636 -404788 -554621 -294044 182564
38641 182564 356451 143458 65094 514791 1215559 1626512 1600012 1409753 1367377 1613295
38631A613295M43748K87972k10111n61773l57079P6768R1327k98349m50696j10596
38621E24506K64474K92961J55012J01106M9655p6399j04128M0748J52009J14827
38611A514771O6642L3834j60709m63486n07374j56179K67606M56741M29885K73274
38601A755005J8431j41836m413K29353K54659L71114J104941K004154J785610
38592G377018J31416j556005j852734j040105m02833m38885o32425n69990l67234
38583F48223j59881O3164J78532O2005q9481n0966r592k27719m80486l56593O4470
38572c58324L58423M07301L92707L21152R5210r5431J083K02963J42983j14274
38562A353793k23774j89385k84016m55095l98875j63873q6222j45025J4756L74500
$$ plain form
38631 1613295 2057043 2345015 2134904 1573131 1216052 1292820 1384147 1085798 635102 524506
38621 524506 788980 1081941 1236953 1338059 1387714 1311315 1207187 1247935 1399944 1514771
38611 1514771 1581413 1615247 1454538 991052 483678 327499 595105 1051846 1481731 1755005
38601 1755005 1773436 1631600 1627187 1856540 2111199 2482313 3587254 5591408 7377018
38592 7377018 7508434 5952429 4099695 3059590 2656757 2217872 1585447 1015457 648223
38583 648223 488342 551506 730038 792043 702562 651596 642004 414285 -66201 -422794 -358324
38572 -358324 99 407400 800107 1121259 1216469 1121038 1122121 1325084 1468067 1353793
38562 1353793 1130019 940634 656618 201523 -197352 -361225 -447447 -592472 -577716 -203216
38552b03216M47904K4613m92603o42815l92934K5340L76081M47171J95143p8730
38542b94046l9839J92871K36142P0042K9840J78591J78889j23311m22945l88215
38532c81981l5678L81137N62862L02200k15773l80331J18790O79126M83092l00977
38522A212467p22331m38090q7361j32154j92907R4658L61594J91399j20357j10049
38512E6869O2283J6350o8550K08603O16317N10417j59533p09049o40259j80258
38502b86810K04968L79368M36811L78321J47020j61485l20563k05727M5218J37663
38492G54784m9627k53770r9521L78829O89518M65343j11738o13817q64605r08218
38482f12822p00228j77288M44115P80174P22434N06338L04603L2093l34814n20305
$$ plain form
38552 -203216 244688 269301 -223302 -866117 -1259051 -1233711 -857630 -410459 -215316 -294046
38542 -294046 -333885 -141014 95128 165170 195010 373601 552490 429179 6234 -381981
38532 -381981 -417659 -36522 526340 828540 612767 232436 351226 1030352 1513444 1212467
38522 1212467 490136 52046 -35315 -167469 -360376 -265718 95876 287275 166918 56869
38512 56869 119152 135502 66952 275555 891872 1402289 1242756 533707 -106552 -286810
38502 -286810 -81842 297526 734337 1112658 1259678 1098193 777630 571903 617121 754784
38492 754784 705157 451387 351866 730695 1420213 1885556 1773818 1160001 295396 -612822
38482 -612822 -1313050 -1490338 -1046223 -266049 456385 962723 1267326 1299419 964605 444300
38472D44300k85382J33056K25209j22210m33199k72123J50510K74631j5667k52072
38462a52947q3411K39422K69276k7242l20025l70224j72623J77712M82273M66420
38452E08631J15759j58415j5930K88881K49921j39458l96025k49203R5749L76363
38442F76273N10390L99246l4113n19690n96417k31111J03818Q0036j53700l77016
38432a42284n77172o73399m39008P4456M60953N26103M95493M57879J44823m10221
38422h2377n80514l8481N42148L35638l98004o39204m5806O34205O49791J55279
38412E32675j70203M136M12996N91043L32189j46267m26172l22598n3493P2384
38402H26690p276j78391l42533l68381r7171L51182N15971J56760l37646m57682
$$ plain form
38472 444300 158918 291974 517183 394973 -38226 -310349 -159839 114792 99125 -152947
38462 -152947 -236358 3064 272340 245098 -74927 -445151 -617774 -440062 42211 508631
38452 508631 624390 465975 450045 738926 988847 849389 453364 204161 299910 676273
38442 676273 1186663 1585909 1551796 1032106 435689 204578 308396 388432 234732 -142284
38432 -142284 -719456 -1392855 -1831863 -1757407 -1296454 -770351 -274858 183021 327844 -82377
38422 -82377 -662891 -701372 -159224 176414 -221590 -860794 -906600 -272395 377396 532675
38412 532675 362472 366608 779604 1370647 1702836 1556569 1130397 807799 754306 826690
38402 826690 819414 641023 298490 -69891 -167062 184120 700091 856851 519205 61523
38392F1523k72123j82756j82719O8839N03600O12328K57419q2974r9899j14398
38382E68840m09353o12990k58513L82225O06381K76068m9896K3302K51378K66935
38372A044377J23413O6537P6574m5977k99385m62560l87781j20678J90256L55309
38362E40085K71375J84146N85161J479831J963749J114231o77402j901716j690991
38353A868469p84921l57596m82864m15742L2738K68563j9107l71973l11853M1480
38343e32806L35409M82531N46395N05012L46677J24612j81199n56681p14949l96337
38333d1336Q3424J27040k21632k72047K10242N78277L22668j48834k33798m6788
38323C57216k9268j49126j26957m6323q0845O786L81638N13244j19115r36773
$$ plain form
38392 61523 -210600 -393356 -576075 -507236 -3636 608692 866111 783137 683238 568840
38382 568840 159487 -453503 -712016 -329791 276590 552658 502762 526064 777442 1044377
38372 1044377 1167790 1234327 1310901 1264924 965539 502979 115198 -5480 184776 540085
38362 540085 811460 995606 1580767 3060598 5024347 6138578 5461176 3559460 1868469
38353 1868469 1083548 725952 243088 -172654 -139916 128647 109540 -262433 -574286 -532806
38343 -532806 -197397 285134 831529 1336541 1683218 1807830 1626631 1069950 355001 -41336
38333 -41336 42088 169128 -52504 -324551 -114309 463968 786636 637802 404004 357216
38323 357216 327948 178822 51865 5542 -75303 -68517 313121 826365 707250 -229523
38313b29523q35784J72467Q54624M71850k87397m42035L688M23599N74361O04680
38303A310530M76097M6995m26950m55235K992M19168L34931j37681n16025m67212
38293E87610p8326K76473K96427K5629k38999l05309k61010k62691k88004k16367
38283d64567p2168k9617j62481l04340k31968N1742L02120L19776J74092P3517
38273c43894R1892J51877K22775L41728M35951L43143P1923j63247k44944k75923
38263F31281l16224k60941j16562j01147k48404k08774K37260P12389O79841J92047
38253A200766k08631k53032j82092k20843k43041q4080J47152K49825K05971J17513
38243G29508K7431n6067o2942Q1397L29417N10566M75480K45229j4405k15991
$$ plain form
38313 -229523 -1065307 -892840 -38216 433634 146237 -295798 -292110 131489 705850 1310530
38303 1310530 1786627 1833622 1406672 951437 954429 1373597 1708528 1570847 1054822 587610
38293 587610 509284 785757 1082184 1107813 868814 563505 302495 39804 -248200 -464567
38283 -464567 -536735 -566352 -728833 -1033173 -1265141 -1213399 -911279 -591503 -417411 -343894
38273 -343894 -252002 -100125 122650 464378 900329 1243472 1315395 1152148 907204 631281
38263 631281 315057 54116 -62446 -163593 -411997 -620771 -383511 328878 1008719 1200766
38253 1200766 992135 739103 557011 336168 93127 9047 156199 406024 611995 729508
38243 729508 756939 700872 637930 719327 1048744 1559310 2034790 2280019 2265614 2049623
38233B049623m61096p67256p97179k22086O15131Q62436K17191n92549p24966
38224A79249k47523J82422L03598L45986L78522K28094m389J2456K12198J27703
38214A718316l42555o97997n64391j78156Q9915K37788L67457L41551Q5871r1401
38204I66398Q9899L68250K72008j48134l47128m9105L97221N26969L18869Q0237
38194B475484k404K4754R2667J81412K02998M5818k01317k60935n588L66605N86430
38183C505924N74129L71245Q0664P099M62470J133095J109918Q8152r04716p51014
38173E676966J55500N81856M84376R49292J934238J731261m47778k773865l023231
38164E268615j504926k82283j82532k68085L1924O8066n12391r40750o02699l399
$$ plain form
38233 2049623 1588527 821271 24092 -197994 417137 1279573 1496764 904215 179249
38224 179249 -68274 114148 417746 763732 1142254 1370348 1365959 1378415 1590613 1718316
38214 1718316 1375761 677764 113373 -64783 25132 262920 630377 971928 1057799 966398
38204 966398 1056297 1424547 1696555 1548421 1201293 1152188 1549409 2076378 2395247 2475484
38194 2475484 2473080 2497834 2590501 2771913 2974911 3020729 2819412 2558477 2552889 2919494 3505924
38183 3505924 4080053 4451298 4531962 4539061 5001531 6134626 7244544 7332696 6427980 5676966
38173 5676966 5832466 6414322 6898698 7847990 9782228 11513489 11065711 8291846 5268615
38164 5268615 3763689 3481406 3298874 3030789 3062713 3130779 2618388 1677638 1074939 1071540
38154A071540J51509l7917j31543q3668K209K28931N52500O07228K73723n7264
38144B577248q2815L8925J32022K65331L59519J38431k83686l86869o7432J75487
38134B866161J26400J88000M94966M97719o8373n55543l77365L9887j9746m31184
38124B760922n68964l56816k09399k05755n6639K42134L59910J90568k4469r6398
38114B035094n7087j0535p4221l03718m80340k59053K63022N08688K17192j58620
38104A680422j74220k0986k2704l1538J32783J37012l02635p09367m51619K01520
38094D38668M07656P178l03083m7743M72187P92960Q33415O55730K22433l41570
38084C137831o32384m11697L0897J82646j02608m43574l63569J37204N13619L07521
$$ plain form
38154 1071540 1223049 1185132 1053589 969921 972130 1201061 1753561 2360789 2634512 2577248
38144 2577248 2494433 2533358 2665380 2930711 3290230 3428661 3144975 2758106 2690674 2866161
38134 2866161 2992561 3180561 3675527 4173246 4104873 3549330 3171965 3211852 3192106 2760922
38124 2760922 2191958 1835142 1625743 1419988 1363349 1605483 1965393 2155961 2131492 2035094
38114 2035094 1978007 1967472 1893251 1589533 1109193 850140 1113162 1621850 1839042 1680422
38104 1680422 1506202 1485216 1462512 1430974 1563757 1700769 1398134 688767 237148 438668
38094 438668 846324 853502 550419 502676 974863 1767823 2601238 3256968 3479401 3137831
38084 3137831 2505447 2093750 2124647 2307293 2204685 1761111 1397542 1534746 2048365 2355886
38074B355886k24863l90708L3911N34385N81945K36572j34499l40779l51708j80823
38064B119319l3345k01860n80145o76166l42348l5852p7065j65542M294J81257
38054A92547P3817p0533O7391K72444K12414O1752J41256L09348K86569K17620
38044A764625L17331L33228o74l42361k63351l7591j51788l51594m1830N69323
38034A795318O53088N2919m78388m17928o6108J38515J80735J44501m7183l25395
38024A630074m01958k05731Q593J02472K11288L87962M83394M43098L54307J81446
38014C194945j61936m81222m53410j35994O9839k970j16020o6506M9446P2851
38004A969023O25q1615r9507l9590j400o3928n1286K50891N63277L11706m04937
$$ plain form
38074 2355886 2131023 1740315 1774226 2308611 2890556 3127128 2992629 2651850 2300142 2119319
38064 2119319 2085974 1884114 1303969 627803 285455 249603 172538 6996 11290 192547
38054 192547 266364 195831 263222 535666 748080 809832 951088 1260436 1547005 1764625
38044 1764625 2081956 2415184 2414510 2072149 1808798 1771207 1619419 1267825 1225995 1795318
38034 1795318 2448406 2501325 2022937 1605009 1538901 1677416 1858151 2002652 1955469 1630074
38024 1630074 1228116 1022385 1030978 1133450 1344738 1732700 2216094 2659192 3013499 3194945
38014 3194945 3033009 2551787 2098377 1962383 2032222 2029252 1913232 1846726 1896172 1969023
38004 1969023 1969648 1888033 1788526 1748936 1747536 1683608 1632322 1883213 2446490 2758196 2353259
37993B353259o71139k0674P77806Q04210K69624k7405m84j35367m25935m20161
37983B503734j48817r8517l26207m08313k24421n3579M2115K23635L63387K27906
37973B100923M8598K01419M65335L38782o1941j96360m4536n8555k97059m05488
37963B091118l24697k21349J00221Q45603J483496J303674N74925J67056J66384
37954F186431p1179n97376p61020m27871j54042o5995K72811P56532O97187J14451
37944E949929j07254L48872P65495O83400N38315O07206M15163k88114r07969
37935H005043q87603m38105m221K64815K68976l8171k44921R5820N99043N37897
37925H158573J52126L42637J095124J499224J372449J472003K043916K694967
$$ plain form
37993 2353259 1682120 1661446 2439252 3243462 3513086 3485681 3485197 3349830 2923895 2503734
37983 2503734 2354917 2256400 1930193 1521880 1297459 1243880 1285995 1509630 1873017 2100923
37973 2100923 2149521 2350940 2816275 3155057 3093116 2896756 2852220 2793665 2496606 2091118
37963 2091118 1766421 1545072 1645293 2490896 3974392 5278066 5852991 6020047 6186431
37954 6186431 6115252 5517876 4756856 4328985 4174943 4108948 4381759 5138291 5835478 5949929
37944 5949929 5842675 6191547 6957042 7640442 8178757 8785963 9201126 8913012 8005043
37935 8005043 7117440 6679335 6675114 6939929 7208905 7170734 6925813 7021633 7620676 8158573
37925 8158573 8310699 8653336 9748460 11247684 12620133 14092136 16136052 18831019
37917A8831019L687875N419169O406412M190505q59363m910371n166391k996054
37909B4602801j104837K53001K067094L354006K039080j524205m452764m860679
37901B0373497l625745k488216k013106j809927j523348j083707o35275m42265
37893F751908n01173m16746l8111J88180m0932l10205j83480Q7229J13555L5535
37883E685760N9700l2621l27043l90081l1567K37665Q3068n9878J71045M35420
37873E831468M62588N68268Q25583O87989N4040l15517o9028J56821M9344K28647
37863H480203Q17368Q41633K013m34799L42544J212453R54633J98417J47265O37029
37853A3198759R04255J064790J356465J094080j29945j327159j589444j472161
$$ plain form
37917 18831019 22518894 27938063 34344475 38534980 37675617 32765246 27598855 24602801
37909 24602801 23497964 23750965 25818059 29172065 31211145 29686940 25234176 20373497
37901 20373497 16747752 14259536 12246430 10436503 8913155 7829448 7194173 6751908
37893 6751908 6250735 5833989 5795878 5984058 5943126 5632921 5449441 5536670 5650225 5685760
37883 5685760 5745460 5712839 5385796 4995715 4964148 5201813 5284881 5225003 5396048 5831468
37873 5831468 6294056 6862324 7687907 8375896 8429936 8114419 8045391 8202212 8251556 8480203
37863 8480203 9297571 10139204 10141217 9706418 10048962 11261415 12216048 12414465 12561730 13198759
37853 13198759 14103014 15167804 16524269 17618349 17488404 16161245 14571801 13099640
37845A3099640j575512j216921m7002N94993k66785j348459j150424l77468l19733
37836G392329m08888L62767J098613N17408n22397m84893J31318J5635l35741
37827G766151J99712Q85615N03261p7431N53385J540244J316039N87485Q83430
37818A4157891J602102J495286J455475K681773L908659L772454L782223N371840
37810C8227703O641890O114696O556684J0213833J3959757J5055503J7326186
37803A14096252K4228219L1247721L5548775M6837734P1819944Q9876357O6391414
37796D80046416j299843o9588684r3835028p5134220m8123056l4659156k8825404
37789A28581025k0965652j3890206j1974326j1331450p982627m939511n142152
$$ plain form
37845 13099640 11524128 10307207 10260205 10855198 10588413 9239954 8089530 7712062 7392329
37836 7392329 6983441 7346208 8444821 8962229 8439832 7954939 8086257 8101892 7766151
37827 7766151 7965863 8851478 9354739 9277308 9830693 11370937 12686976 13274461 14157891
37818 14157891 15759993 17255279 18710754 21392527 25301186 29073640 32855863 38227703
37810 38227703 44869593 50984289 57540973 67754806 81714563 96770066 114096252
37803 114096252 138324471 169572192 205120967 251958701 323778645 413655002 480046416
37796 480046416 478746573 409157889 315322861 240188641 192065585 157406429 128581025
37789 128581025 107615373 93725167 81750841 70419391 62436764 57497253 52355101
37782E2355101n589507l525253j544872k081553k791949j445526p4359n75455
37774C4726627j020718K49773J329182O99579K77294J520846K501651J711441
37766D1995675R36686J591558J953688P24389l79128j28881J4134k63391J511077
37757D7955807N200777N560339n71329q299959j0631913p542569m381377l629876
37749B3659900l312587k170110j398080j487468j391413r52170j021986j296997
37741A0629089p62472O2718j15865q85493q82653l91343o65172j309842r36485
37732D742482J29923L87081p6362P0796O99365M96978l19413k28902P03847P61646
37722G367441m35442j322221j083424o69087p07909n58310L5277K99785J3802
$$ plain form
37782 52355101 46765594 43240341 41695469 39613916 36821967 35376441 35302082 34726627
37774 34726627 33705909 33955682 35284864 35984443 36261737 37782583 40284234 41995675
37766 41995675 42932361 44523919 46477607 47201996 46822868 46693987 46708121 46444730 47955807
37757 47955807 53156584 58716923 58145594 49845635 39213722 31671153 27289776 23659900
37749 23659900 20347313 18177203 16779123 15291655 13900242 12948072 11926086 10629089
37741 10629089 9866617 9929335 9813470 8927977 8045324 7653981 6988809 5678967 4742482
37732 4742482 4872405 5259486 5183124 5253920 5953285 6450263 6130850 5901948 6605795 7367441
37722 7367441 6931999 5609778 4526354 3857267 3149358 2591048 2626325 2926110 2939912
37713B939912k5714L80894M16494j03033l02198N7287Q0255n09806p05392J4164
37703B242863O86183M14429l14194o20203m70985k22279J24088N18038N30246
37694B888186N1342l41759k13775J28548K33859J27212L8968M5228J71918L59599
37684C489326K86674k11059o22879l57918K42612L03231k28958n25071k07600
37675B168358J93190K62210K65114M32886M99995K78520K2607n4434m8785K3309
37665D042970K98558O08718N41919J16416j42719Q3335N94909J074738J268903
37656H487747Q30722l51370j620114j986818j253484k22703K62603N7546m42200
37647C761929p10077m10363K36921N49046K59141R07L74484R15509P34337j28067
$$ plain form
37713 2939912 2914198 3295092 3711586 3608553 3306355 3363642 3443897 2934091 2228699 2242863
37703 2242863 2929046 3343475 3029281 2409078 1938093 1715814 1839902 2357940 2888186
37694 2888186 2939528 2597769 2383994 2512542 2746401 2873613 2912581 2957809 3129727 3489326
37684 3489326 3776000 3564941 2942062 2584144 2826756 3129987 2901029 2375958 2168358
37675 2168358 2361548 2623758 2888872 3321758 3821753 4100273 4122880 4068446 4019661 4042970
37665 4042970 4341528 4950246 5492165 5608581 5465862 5549197 6144106 7218844 8487747
37656 8487747 9318469 8967099 7346985 5360167 4106683 3883980 4146583 4204129 3761929
37647 3761929 3051852 2641489 2878410 3427456 3686597 3687504 4061988 4977497 5711834 5583767
37637E583767q15678r11635p26948n00903j90266K9206j00989l21777j60414K55289
37627B139652M34279L88815M36055L65682k22603r13391q66540j66916K64475
37618A859508J05634p8547q794l8316k04917m4580M33012O24323M08975L24660
37608C380958M56989K30946m11170p14112l60978J9307l577k5764K43437L89145
37598C205181J30027j71121k85041m82545p11105m10372L71278P17781K61707
37589B625790j86269l4371J67381o1033j37875M00232P79173K09439o29354n90384
37579B542729J02157L21310j07233l40053q1146O5998j74645l04938k3222K81392
37569B282349K64599J18702O2926m6419l04877m36763k03372J64103K29529p1196
$$ plain form
37637 5583767 4768089 3856454 3129506 2628603 2438337 2467543 2366554 2044777 1884363 2139652
37627 2139652 2573931 2962746 3398801 3764483 3541880 2628489 1761949 1595033 1859508
37618 1859508 1965142 1886595 1877801 1839485 1634568 1589988 2023000 2647323 3056298 3380958
37608 3380958 3837947 4068893 3657723 2943611 2582633 2601940 2598363 2572599 2816036 3205181
37598 3205181 3335208 3164087 2879046 2396501 1685396 1275024 1646302 2364083 2625790
37589 2625790 2439521 2405150 2572531 2511498 2373623 2773855 3553028 3762467 3133113 2542729
37579 2542729 2644886 2966196 2858963 2518910 2437764 2503762 2329117 2024179 2000957 2282349
37569 2282349 2546948 2665650 2728576 2682157 2377280 1940517 1737145 1901248 2130777 2059581
37559B059581l26524j64934K06720J76641m26316r27041o38211J11169L93925
37550D65010N2974j24956K75759O62554M64527N052j61462r7629j01730r5004
37540A345095J0684q7469m72908n53455O8644P67553P20898J56403o2403K16386
37530B109428L82763J93257O2791K05959K63432m7114m80651o46434m58367j16727
37520A468337Q6189k2905k48364j49192L33184O47408L74595j34131l13147k35368
37510A806606l32788n40228m07072N6821L40515K58867J92459L81330N20437K68439
37500B545386k31169n54590m91290k02703l1797j78090m51999m35081j4413M01619
37490C55873L79807j1542l83024n26171m84360l07574m652L75002P70133J055552
$$ plain form
37559 2059581 1733057 1568123 1774843 1951484 1525168 598127 -40084 71085 465010
37550 465010 517984 393028 668787 1331341 1795868 1800920 1639458 1541829 1440099 1345095
37540 1345095 1355779 1268310 795402 241947 310591 1078144 1799042 1955445 1893042 2109428
37530 2109428 2492191 2685448 2748239 2954198 3217630 3170516 2689865 2043431 1585064 1468337
37520 1468337 1554526 1531621 1283257 1134065 1467249 2114657 2489252 2355121 2041974 1806606
37510 1806606 1473818 933590 526518 583339 923854 1182721 1375180 1756510 2276947 2545386
37500 2545386 2314217 1759627 1268337 1065634 1033837 855747 403748 -31333 -45746 355873
37490 355873 735680 724138 341114 -185057 -669417 -976991 -981643 -606641 163492 1219044
37480A219044R24529J94979o59533q01194j19930M96301L54592j29665k07328
37471A271795N8653Q4124k06045l66899k13295M5308K64442L79227J83343l20666
37461A179987o01935k62966K33543J90013k19093k57645J20708K17931k00778
37452C99765n11211k24772L50270O81272O49525M04814J06107j5793J82124M02785
37442B424886J95129l13363m89180j17470K78917K13772j73521m96890o14925
37433I07355n25757k10810J71719L04955J43703Q432Q9470J93481J38455N0786
37423A271789P8575J20747M7282n9302o8657k3878o1996k38739m74700n68388
37413B2733l39334Q1910K70035O1703j09136K10875P77921R62549O34259K33787
$$ plain form
37480 1219044 2143573 2338552 1679019 877825 757895 1254196 1608788 1479123 1271795
37471 1271795 1330448 1414572 1208527 841628 628333 673641 938083 1317310 1500653 1179987
37461 1179987 578052 315086 548629 738642 519549 261904 382612 600543 399765
37452 399765 -111446 -336218 14052 695324 1344849 1749663 1855770 1839977 2022101 2424886
37442 2424886 2620015 2306652 1817472 1700002 1978919 2192691 2019170 1522280 907355
37433 907355 381598 170788 342507 647462 791165 799597 889067 1082548 1221003 1271789
37423 1271789 1350364 1471111 1518393 1459091 1390434 1366556 1304560 1065821 591121 22733
37413 22733 -316601 -234691 35344 97047 -12089 198786 976707 1939256 2573515 2807302
37403B807302N2233k6629r4015p5843o5606k78899n94374o12394k59460R3337
37393I45652J69828L4605j97414m36290m16772N2791O09902O43156J46057k54691
37383A296824j86081R2053K50904K50737M0656m76295j001431r60173k96521L73572
37373f15755N99349N63565N41496M66827K70820J03912l1832l42959p03102o11487
37363B40834K5567O04402O09146J97473k30529n04546m97906q7503M13738M24110
37353A194786J1461m6810M98231Q37374L53145l53008m00073M2294J92887n2290
37343B277997j58155J5868Q0362j05243k57130k35385j86658j56526o7452j0802
37333A196876j03347j68656k296K01900J42632n3102o2826N4646L5210j7571J90030
$$ plain form
37403 2807302 2859535 2832906 2738891 2663048 2597442 2318543 1724169 1111775 852315 945652
37393 945652 1115480 1150085 952671 516381 99609 152400 762302 1405458 1551515 1296824
37383 1296824 1110743 1202796 1453700 1704437 1745093 1268798 267367 -692806 -989327 -615755
37373 -615755 -16406 547159 1088655 1555482 1826302 1930214 1898382 1555423 852321 240834
37363 240834 266401 870803 1479949 1677422 1446893 942347 444441 356938 770676 1194786
37353 1194786 1206247 1159437 1657668 2495042 2848187 2495179 2095106 2137400 2330287 2277997
37343 2277997 2119842 2135710 2216072 2110829 1853699 1618314 1431656 1275130 1207678 1196876
37333 1196876 1093529 924873 922577 1124477 1267109 1214007 1151181 1205827 1241037 1223466 1413496
37322A413496N15285N34113K75935K01398M14994M84390J73757j60518j19312
37313C733538J89198L83716L26966K00283K13529L86345N66316O22232O06203
37304G228326O31644O13678L62725l9398k94665m05245o91485j107225j079030
37295E219325m01873K31801J29789m12648o31811m21450k48110k43953j59062
37286C062008m4904j89798m29370k94498J31111K54116m7883k38613o4699P1326
37276B208796p2388j34806R1654J52849k84601o95241l93070L67916O67195J82454
37266B090758m25315m70824j00660N9071j84531l93300j88240J98042K81664M9757
37256I16422m7324J84770L96937K76536m977j83546l21648m69069l27706K27588
$$ plain form
37322 1413496 1928781 2462894 2738829 2940227 3355221 3839611 4013368 3852850 3733538
37313 3733538 3922736 4306452 4633418 4833701 5047230 5433575 5999891 6622123 7228326
37304 7228326 7859970 8473648 8836373 8796975 8502310 8097065 7405580 6298355 5219325
37295 5219325 4817452 5049253 5179042 4766394 4134583 3713133 3465023 3221070 3062008
37286 3062008 3017104 2827306 2397936 2103438 2234549 2488665 2440782 2202169 2137470 2208796
37276 2208796 2136408 2001602 2093256 2246105 1961504 1266263 873193 1241109 1908304 2090758
37266 2090758 1665443 1194619 1093959 1153030 968499 575199 386959 585001 866665 916422
37256 916422 869098 1053868 1450805 1727341 1722364 1538818 1217170 748101 420395 647983
37246F47983O45280L49852l31424n67698k05976J51536J75945J55315K61729K42574
37236A525116K8255m6578J22312J76359m3540j99581r8907m2070k16927l25186
37226H79253j69735n0337j73103k09163J10705M72040N22502M47004M89896M07938
37216B727000l587l14242q9410K72730J09248l96659n10458j71860k7898k63543
37206A331321l22172L1645K43506p2003m48979l42998K750M0139j64502j20030
37196A78677K25305M20732K40527n6676k25072l23625l94100k53441J58372M98556
37186D69255L82367r1358m31196l48090m4504J28311J00736M0690K1282m5245
37176A82248j55584j32924Q7922K69520J65390q3980q7252K56699N86007N35896
$$ plain form
37246 647983 1293263 1643115 1311691 743993 538017 689553 865498 1020813 1282542 1525116
37236 1525116 1553371 1506793 1629105 1805464 1761924 1562343 1463436 1421366 1204439 879253
37226 879253 709518 659181 486078 276915 387620 859660 1382162 1829166 2319062 2727000
37216 2727000 2723413 2409171 2319761 2592491 2701739 2305080 1794622 1622762 1594864 1331321
37206 1331321 1009149 1040794 1284300 1212297 763318 420320 423070 463209 298707 178677
37196 178677 403982 824714 1065241 1008565 783493 459868 65768 -187673 -29301 469255
37186 469255 851622 760264 329068 -19022 -63526 64785 165521 206211 227493 182248
37176 182248 26664 -106260 -18338 251182 416572 332592 245340 502039 1088046 1623942
37166A623942J77813j44951k60593k52214k09188j38328r2020j40474j87646m5797
37156C30544K45175M07473L28946K21820K29347J58303j39856l84603k41516Q4252
37146A239885P3861l33384o40942n09353j43269J30199K48657K32234L6479j95676
37136A38691j32755K24982L95341R1958l11662l62037k12863k66599m23253k56236
37126a114433K05676M49746K36262j13070k56202k37197k34751k45431j61106
37117a470506N7094L58014N98300N93403L47750J34008J27482J22616r4984k91884
37107D81293j15717K63327L32932Q919k80596k88689k07553j69462l5770J56871
37097A45555P6908l02594m53477j1900N94927O55035J18781l42629j89822L55833
$$ plain form
37166 1623942 1801755 1656804 1396211 1143997 934809 796481 704461 563987 376341 330544
37156 330544 575719 983192 1312138 1533958 1763305 1921608 1781752 1397149 1155633 1239885
37146 1239885 1313746 980362 339420 -169933 -313202 -183003 65654 297888 334367 138691
37136 138691 5936 230918 626259 718217 406555 44518 -168345 -434944 -858197 -1114433
37126 -1114433 -908757 -459011 -222749 -335819 -592021 -829218 -1063969 -1309400 -1470506
37117 -1470506 -1413412 -1055398 -457098 136305 484055 618063 745545 868161 773177 481293
37107 481293 365576 628903 961835 970754 690158 401469 193916 24454 -11316 145555
37097 145555 222463 -80131 -533608 -545508 49419 704454 823235 480606 290784 646617
37087F46617O17277K78775k32323k65610K38232P30733Q81782R60113J120552
37078D976148Q63165j82041j327973j509118p35244l6142P868j94782k48512l55365
37068A258004o10577o17965k64371r4779l92465n87859j60085N03550P63848O74661
37058D71962O18870N13289R2854m01954n21198l05080r2245O2672K15799J46216
37048H01185k33682m40647p4857M16070L51216j03111k50770k3144L1267k13119
37038B60408k93363l4400K04938K24630K00497J50801j07433m01823l15158N4286
37028e6617J53020r7073j66833J24261K92720Q1222j01855J9908Q4995j71835
37018A61913l47735o6185L22402L11307M1225o3771p0660k97310n65453l74695
$$ plain form
37087 646617 1263894 1542669 1310346 1044736 1282968 2013701 2895483 3855596 4976148
37078 4976148 5839313 5657272 4329299 2820181 2084937 2048795 2056663 1861881 1613369 1258004
37068 1258004 647427 29462 -234909 -329688 -722153 -1310012 -1470097 -966547 -202699 471962
37058 471962 1090832 1604121 1696975 1295021 773823 468743 376498 439170 654969 801185
37048 801185 567503 126856 51999 468069 819285 716174 465404 442260 473527 260408
37038 260408 -32955 -67355 137583 362213 562710 713511 606078 204255 -110903 -56617
37028 -56617 96403 -670 -167503 -43242 249478 330700 228845 248753 333748 161913
37018 161913 -185822 -252007 70395 381702 422927 359156 288496 -8814 -574267 -948962
37008i48962K51479O85294N23007N4341j96465p5134J75793K80571J95030Q3301
36998A028255Q9924J62381J54902N3281n3420j71749l44873m29406k33679J07971
36988C63587K40212J12111J7876M4930n7049l03921l00505O3680K51813j41500
36978B91234o68980o29856q8099K94577K53415J34960J79271J94559L5076j15679
36968a19522j17179j23391k60323l66628k60916l3147J10756J15358N0056j5546
36958a020482K205J68013L68602L58926R1322j66788j78925l7966L8950M2401
36948c33742Q0570R9753j9347j53893n6819J89006J84694j67415l91130o2931
36938f31254N35240P62738M77130J15405l7729j68814m11424n02275k52587L7415
$$ plain form
37008 -948962 -697483 -12189 510818 565159 368694 293560 469353 749924 944954 1028255
36998 1028255 1118179 1280560 1435462 1488743 1435323 1263574 918701 489295 255616 363587
36988 363587 603799 715910 733786 778716 721667 417746 117241 180921 432734 291234
36978 291234 -377746 -1007602 -1095701 -801124 -547709 -412749 -233478 -38919 -3843 -119522
36968 -119522 -236701 -360092 -620415 -987043 -1247959 -1281106 -1170350 -1054992 -1004936 -1020482
36958 -1020482 -1018277 -850264 -481662 -122736 -31414 -198202 -377127 -415093 -376143 -333742
36948 -333742 -253172 -153419 -172766 -326659 -383478 -194472 -9778 -177193 -568323 -631254
36938 -631254 -96014 666724 1143854 1259259 1221530 1052716 641292 139017 -113570 -76155
36928g6155K6176r8419O2728M24064N11372J74557k41958m30245m07471k56615
36918c11966L325K10872J26831j55443k15904J11988M83575N48964M17397L80533
36908A600172M11628K25924k63597p72668r16600n74382k2976K96296K38926J21351
36898C44074K62580M86519L91468L6661q2205J91175L91187J36146k98570m32799
36888A426236k86950k51209m43172n82758m43152j06981K34938M91772O17066
36879F55790N14478J28840l76929o34239m03221P7466K77358L9832j91744n8054
36869B9577J15439j50152o05306n59609K1571M12630K17313j28551j54742J4286
36859g87544J36295L17432O03286O77477M02456J35287Q1510r7497n51866p36959
$$ plain form
36928 -76155 -49979 -148398 -85670 338394 849766 1024323 782365 352120 -55351 -311966
36918 -311966 -308641 -97769 29062 -126381 -342285 -230297 253278 802242 1219639 1600172
36908 1600172 2011800 2237724 1974127 1201459 284859 -289523 -312499 -16203 222723 344074
36898 344074 606654 1093173 1484641 1521302 1439097 1630272 2021459 2157605 1859035 1426236
36888 1426236 1139286 888077 444905 -137853 -581005 -687986 -453048 38724 655790
36879 655790 1170268 1299108 922179 287940 -115281 -37815 239543 279375 87631 29577
36869 29577 145016 -5136 -610442 -1170051 -1148480 -735850 -518537 -647088 -801830 -787544
36859 -787544 -651249 -333817 269469 946946 1349402 1484689 1566199 1468702 916836 179877
36849A79877k64129L12877K96559o4147r4599J24393J4746l60641l97082m6651
36839b98797J36330J3478K969J64237N6886l52593n13713k22499Q0222J52464
36829g81016K86098N57606N76151K96799K51839N70867N98201j1718o17193o11246
36819A116388l65510m35135n14208o1628N55452N16628j38204n68837l81984O812
36809b70226K07399K77017K75495J02286j22625j15472M9912L2779j24200m4038
36799B68327K18974J51731k88000m28267O0330N13926K28149m33505n55405j4373
36789b78113M07569K17420j53043j10483K15160K34915k04699o06419m96123l253
36779g77069L69453L79786K37685J97221J89624j999l36914n06772l44503n7407
$$ plain form
36849 179877 -84252 228625 525184 461037 366438 490831 505577 144936 -252146 -298797
36839 -298797 -162467 -148989 -146020 18217 75103 -277490 -791203 -1013702 -933480 -781016
36829 -781016 -494918 62688 638839 935638 1187477 1758344 2356545 2344827 1727634 1116388
36819 1116388 750878 315743 -198465 -260093 295359 811987 673783 104946 -277038 -270226
36809 -270226 -62827 214190 489685 591971 469346 353874 403786 436565 312365 268327
36799 268327 487301 639032 351032 -77235 -16905 497021 725170 291665 -263740 -278113
36789 -278113 129456 346876 193833 83350 298510 533425 328726 -277693 -773816 -777069
36779 -777069 -407616 -27830 209855 407076 596700 594701 257787 -248985 -593488 -650895
36769f50895M8360m3236q8974L9161J77604J28234l4535n8829J12099K30326P6055
36758f4630k35171m09360l48840k07682j26753j04885j20295j67846j43582Q6709
36748a842335M27966N83378M50182K65009K09124J16189j88534m72369l55759
36739h07149J08910M62223M35780K12044M2959p8945k33291l14613j87219K7708
36729c31593M1535k22760m78318l67997J12478N39089M75303k7528m47855l77529
36719a085175K8319L01709K35188J2433j39878j72116r9780O0850J93192J52567
36709e12691P745j5159R9739J06370p5589j73095J051J98553J14114j06568r5792
36698d51322J35183K24185N1579r8736l3657P3226M8071K6764J75181L52561L14711
$$ plain form
36769 -650895 -602535 -645771 -734745 -695584 -517980 -389746 -424281 -483110 -371011 -140685 -64630
36758 -64630 -299801 -709161 -1058001 -1265683 -1392436 -1497321 -1617616 -1785462 -1929044 -1842335
36748 -1842335 -1414369 -830991 -380809 -115800 93324 209513 20979 -451390 -807149
36739 -807149 -698239 -236016 199764 411808 454767 375822 142531 -172082 -359301 -331593
36729 -331593 -290058 -512818 -991136 -1359133 -1246655 -707566 -232263 -259791 -707646 -1085175
36719 -1085175 -1056856 -755147 -519959 -507526 -647404 -819520 -919300 -858450 -665258 -512691
36709 -512691 -504946 -520105 -420366 -313996 -389585 -562680 -561629 -363076 -248962 -355530 -451322
36698 -451322 -316139 -91954 -40375 -139111 -172768 -99542 -51471 -24707 150474 503035 817746
36687H17746Q7967j07415j89977k38541k71019k41105k08149k81095m01626l84805
36677a418019j86302M1441J62367J68403R7385J7433O8325L01818M83957L11122
36667D7930j32212m06749l11079j54008k50855m19441k73447J51767M13589K71424
36657a063081k1086r0455J16891L63694M34361L12505J31228L1955M6934Q8878
36647C51824O2532l4902j43038k15794k32674j98988j76681k22018k38902l5417
36637a084058L61621O07005M43605Q1627q0019k9489j19586m50960o26056k92908
36627a189218L17776O43325M43682k4495m07904n79414n54233l36947O002K65112
36617a416314K63949Q3802l7008k1527r630o8384n4894J07061K13296O7540j54333
$$ plain form
36687 817746 905713 798298 608321 369780 98761 -142344 -350493 -631588 -1033214 -1418019
36677 -1418019 -1604321 -1562880 -1400513 -1232110 -1134725 -1117292 -1048967 -747149 -263192 47930
36667 47930 -84282 -491031 -802110 -956118 -1206973 -1626414 -1899861 -1748094 -1334505 -1063081
36657 -1063081 -1084167 -1174622 -1057731 -694037 -259676 52829 184057 216012 262946 351824
36647 351824 414356 379454 236416 20622 -212052 -411040 -587721 -809739 -1048641 -1084058
36637 -1084058 -722437 -115432 328173 409800 329781 300292 180706 -270254 -896310 -1189218
36627 -1189218 -871442 -228117 215565 191070 -216834 -796248 -1350481 -1687428 -1681426 -1416314
36617 -1416314 -1152365 -1068563 -1105571 -1127098 -1136728 -1205112 -1260006 -1152945 -939649 -872109 -1026442
36606a026442j07250K31736N69734P34528P59439N82193J15123l44117l15752
36597A199192O9580O6114n64025j018868n80350K51608M61541j7592l74173k52823
36587g59796j07335j97129j41156K68744N91117M60102J60483O2901K8432j71874
36577A94489l17942j31271J52391J18283j55142k26499N9833M42266O31007N11005
36567A278420J04091l75423n74984l82873r9655o098J9818J96130M01209L75114
36557I35749J53105l5415j30036j95474j98134j28876j48676l03623l21905l0078
36547d03363K78778K67924P7143n552q3043l16799l54179J96567Q76940P81290
36537A315706j03559p63144n67919o3976L077k43203k55056l6520k322j52609
$$ plain form
36606 -1026442 -1133692 -901956 -332222 402306 1161745 1743938 1859061 1514944 1199192
36597 1199192 1268772 1334886 770861 -248007 -828357 -576749 -115208 -132800 -506973 -759796
36587 -759796 -867131 -1064260 -1205416 -936672 -345555 114547 275030 337931 366363 194489
36577 194489 -123453 -254724 -102333 15950 -139192 -365691 -305858 136408 767415 1278420
36567 1278420 1382511 1007088 432104 49231 -50424 -56522 -36704 159426 560635 935749
36557 935749 1088854 1053439 923403 727929 529795 400919 252243 -51380 -373285 -403363
36547 -403363 -124585 143339 220482 214930 131887 -184912 -539091 -342524 534416 1315706
36537 1315706 1212147 449003 -118916 -182892 -179815 -423018 -678074 -714594 -716916 -869525
36527h69525p3449K88136M45371J07305l46319l76445n349K69456J76615k4394
36517d08598n077J42376J13322q1889j48265j9453P2101R6987L07331O10256M28780
36506A107871l78258r83759o31658J81966L65378j66282m62468p6944L51906K82089
36496d10159Q4337K23453M25698K61488o9644j78152j95160l69490l86498J54066
36486d60061Q57696R13914K54735l74645m93718l66910l25107k46819M9747L90868
36476A99700N18307M51469L34864J64449j33649n23067q80779j050826q46129
36467a765661k33630M32215O47613L52235K2284L2270K04554K02280Q8088J48407
36457A30655L24889K37903j99587n56551m30503L2904L73852L97261K69263J38391
$$ plain form
36527 -869525 -942974 -654838 -209467 -102162 -448481 -824926 -830275 -560819 -384204 -408598
36517 -408598 -413675 -271299 -157977 -239866 -388131 -407584 -335483 -238496 68835 679091 1107871
36506 1107871 729613 -254146 -885804 -703838 -338460 -504742 -967210 -1044154 -692248 -410159
36496 -410159 -325822 -102369 323329 584817 515173 337021 141861 -227629 -614127 -460061
36486 -460061 397635 1311549 1566284 1191639 697921 331011 5904 -240915 -191168 199700
36476 199700 718007 1169476 1504340 1668789 1535140 1012073 131294 -919532 -1765661
36467 -1765661 -1999291 -1567076 -919463 -567228 -544944 -512674 -308120 -105840 -17752 130655
36457 130655 455544 693447 493860 -62691 -493194 -460290 -86438 310823 580086 718477
36447G18477l2284k27232k65810p3199J44702J70493N5038m8979j55651l08903
36437b3348l35995n6503L43687M87792L34679J85741J63719P8563j10566j26968
36427I40801J32910L21552J34566k18501l50610k65516k52304l79491m37047l04370
36417f78010q9334O2791R1081J1757m5283Q9774L42693L52089n8225n28681n69397
36406a018745j87321J93561L25700L09476K43677R4382n6968P98K59395M14051
36396E78006K74471K6207o4259k3167q2572l23831n55421n29837k22517J03756
36386h19164J33632j58604m40824l58449J05983O54402R59144Q54800L86603j73987
36376A143536m56258l10001L7775K59961K80219K25290J55568M0893p0667o9150
$$ plain form
36447 718477 686193 458961 193151 119952 264654 435147 490185 441206 285555 -23348
36437 -23348 -359343 -415846 -72159 415633 750312 936053 1099772 1178335 1067769 940801
36427 940801 1073711 1395263 1529829 1311328 960718 695202 442898 63407 -373640 -678010
36417 -678010 -767344 -704553 -613472 -601715 -646998 -557224 -214531 137558 79333 -449348 -1018745
36406 -1018745 -1206066 -1012505 -686805 -377329 -133652 -39270 -96238 -95440 163955 578006
36396 578006 852477 878684 814425 791258 708686 384855 -170566 -700403 -922920 -819164
36386 -819164 -685532 -844136 -1284960 -1643409 -1537426 -883024 76120 930920 1317523 1143536
36376 1143536 687278 377277 415052 675013 955232 1180522 1336090 1376983 1306316 1237166
36366A237166L6561Q7296q3761n13134r98833j108679n48157L53151Q16184N00643
36356b21563o4177k15319m661Q3900l8263o7182M0256K8198p4085O9035M54864
36345h997O27974L63771k4376k39679l91433n98138o37453l03059J99488M93886
36335e18016M51390J98737m5954l5970K88400N38741K21945n02978q56733m62427
36325g22865J28253K56140L6949k2327J16377J07356r4926k18757k06923k21935
36315h42658j89909J26271N85282P03054L30954j24121k78365j88319m9289J45604
36305B18504M14964N51950L64361o283k47823k65266k03717j55115n8230J02232
36295G15577J91034J10837k6707n5109j7271r3329k49978j95486J65558M47814
$$ plain form
36366 1237166 1273727 1361023 1277262 764128 -234705 -1343384 -1891541 -1538390 -722206 -221563
36356 -221563 -285740 -501059 -505720 -421820 -460083 -527265 -487009 -458811 -532896 -463861 -8997
36345 -8997 618977 982748 958372 718693 327260 -270878 -908331 -1211390 -1011902 -518016
36335 -518016 -66626 132111 86157 50187 338587 877328 1099273 596295 -260438 -722865
36325 -722865 -594612 -338472 -301523 -323850 -207473 -100117 -195043 -413800 -620723 -842658
36315 -842658 -1032567 -906296 -321014 382040 712994 588873 310508 122189 72900 218504
36305 218504 633468 1185418 1549779 1543496 1295673 1030407 826690 671575 613345 715577
36295 715577 906611 1017448 990741 935632 918361 825032 575054 379568 545126 992940
36285I92940K40929k69322m92264k34225P0008J6751k46931l46324k01588R300
36275d60726J52194J57591l6549l19153l90346j57563N2501o7145l46896l89879
36265a805971r6644L21866O59326P65959N12340L4726k01935L0002K93438O1625
36255E74732m61348o17898k92427l9940j82793l59873j61097K68958N17729M39308
36245c14649J56504j93379m82247n58236l76376m9131K83263M82490L71096m9682
36235g30347l76237j78577L59908N91541K90998n3771j9457J47011J7937l05325
36225b56319l90164j53481O2102O095j94600k48295j7098L39973M74661K22304
36215a54822j22912j45698O7101K0656l70280n42982j41440L66617L62605k1402
$$ plain form
36285 992940 1233869 964547 472283 238058 308066 324817 77886 -268438 -470026 -460726
36275 -460726 -308532 -150941 -187490 -506643 -896989 -1054552 -1002051 -1069196 -1416092 -1805971
36265 -1805971 -1902615 -1580749 -921423 -155464 356876 391602 189667 219669 513107 574732
36255 574732 113384 -504514 -796941 -836881 -1019674 -1379547 -1540644 -1271686 -753957 -314649
36245 -314649 -158145 -351524 -833771 -1392007 -1768383 -1817514 -1534251 -1051761 -680665 -730347
36235 -730347 -1106584 -1285161 -925253 -333712 -42714 -96485 -115942 31069 49006 -256319
36225 -256319 -646483 -799964 -737862 -731767 -926367 -1174662 -1191760 -851787 -377126 -154822
36215 -154822 -277734 -423432 -356331 -335675 -705955 -1248937 -1390377 -1023760 -661155 -682557
36205f82557k09638j06634r9197k70973k52064J02894M28624L86172Q7973j41776
36195g57176j16089J73633N54276O69394L08007k33942m65147l80204m06121o19674
36185a273043n44375N4366O70303P23644L57789J45136K54675L63928K62038R6813
36175A111274K7472j0450j31052l33676n55244p02133o33394l06261O2908J78650
36165a291906K3125j39662j13273P1281L45082P00428J009778R77111M61577k59442
36155A784099p20365p18467m23607r9179J39840K95417L55086K69375K2313l10105
36145E94407n59680n47089k40696J39127K58244M228l42484l78310l9396L08690
36135h02959L09102M0606j23803k1288J39165J56346J53897L31732N34436L61032
$$ plain form
36205 -682557 -892195 -998829 -1098026 -1368999 -1621063 -1518169 -1089545 -703373 -615400 -757176
36195 -757176 -873265 -699632 -145356 524038 832045 598103 132956 -247248 -653369 -1273043
36185 -1273043 -1817418 -1763052 -1092749 -369105 -11316 133820 388495 752423 1014461 1111274
36175 1111274 1138746 1128296 997244 663568 108324 -593809 -1227203 -1533464 -1470556 -1291906
36165 -1291906 -1268781 -1408443 -1521716 -1450435 -1105353 -404925 604853 1581964 2043541 1784099
36155 1784099 1063734 345267 -78340 -177519 -37679 257738 612824 882199 904512 594407
36145 594407 34727 -512362 -753058 -613931 -355687 -351459 -693943 -1072253 -1111649 -802959
36135 -802959 -493857 -453251 -577054 -598342 -459177 -302831 -148934 182798 717234 1078266
36125A078266k36515p15783n19846K04905P10091N05370q5784l62073q7601L15867
36115H06897L69188P2406k33489l17597k05985l3919M1477j17970m46388n90719
36105f56099k80656K24080L58781l46l33367j93149J76090K28976q5330k88182
36095h49202n9644L86599O35616M94447N2803m08775n28898j63950L45629M81105
36085C85730K05290J0034J77838L64065J71259k12777l44165k28193k07598k86703
36075C4780j19569L03226M98154J99511k24750l24597j57091j9653O7830K21377
36065D79218K81663J2489l89573m47228r4589J91452P1552j89616j33279K68197
36055E0286O26499O28395L00764j26050m23577m64455k86084q7772o8086k28105
$$ plain form
36125 1078266 841751 125968 -393878 -188973 521118 1026488 940704 578631 491030 806897
36115 806897 1176085 1248491 1015002 697405 491420 457501 498978 381008 -65380 -656099
36105 -656099 -936755 -712675 -353894 -354240 -687607 -880756 -704666 -475690 -561020 -849202
36095 -849202 -908846 -522247 113369 607816 660619 251844 -277054 -441004 -95375 385730
36085 385730 591020 601054 778892 1142957 1314216 1101439 757274 529081 321483 34780
36075 34780 -84789 218437 716591 916102 691352 366755 209664 190011 257841 479218
36065 479218 760881 773370 383797 -63431 -158020 33432 104984 -84632 -217911 50286
36055 50286 676785 1305180 1605944 1479894 1056317 591862 305778 218006 149920 -78185
36045g8185l76300l32867r4445J97467M03167M72139M06340K00978j11229l71218
36035C15847l61319l7141L72991N81824N05044K40017j16001m74867o51126m65678
36025i0409p557L61610L45975j3027m13890n53226l30933O0156K55635R2430j42105
36014d35341l1455L87886O21648L74511o7730k72985k06754r3091K9638K61384
36004E67711M74309L87068J8965k73766l03939k95010m62596o10583l95868J26028
35994g67681M82803L34858j31052m31793l09758O8620L76646M49336L17937Q3103
35984D73019j09632q5581J45928K45639r8896o33973o99789r6380N46687N58945
35974B45967J03343j35517O7364L00279K45231N3914p9880k23391l96415l98251
$$ plain form
36045 -78185 -454485 -787352 -881797 -684330 -281163 190976 597316 798294 687065 315847
36035 315847 -45472 -82613 290378 872202 1377246 1617263 1501262 1026395 375269 -90409
36025 -90409 -97966 263644 609619 596592 182702 -370524 -701457 -641301 -385666 -293236 -435341
36014 -435341 -466796 -78910 542738 917249 849519 576534 369780 276689 306327 567711
36004 567711 1042020 1429088 1448053 1174287 870348 575338 112742 -497841 -893709 -767681
35994 -767681 -284878 49980 -81072 -512865 -822623 -754003 -377357 71979 389916 473019
35984 473019 363387 277806 423734 669373 570477 -63496 -763285 -859665 -312978 245967
35974 245967 349310 213793 281157 581436 826667 880581 800701 577310 180895 -217356
35964b17356j92346q0598k02636k13557J85909O99643Q21713N32884J80599j23367
35954A390888m70112o57484l47515K34794L78746j11577n32271k48140L93506
35945C0835N85645K02643j26664J5670L34582L72083J22373j17280k14335k48095
35935I57457k37570r2431J63237L02632J20201l06517o47857o44477l81087j79207
35925i45619k01655k59371r5622K27177L81135J95096j32112k70412r1194K60243
35915i32334N07096M45605J48509k3509K05109N98505N82271l8724p55018r31175
35905a93665n25400p944K67437L12573K31699N4192j37248k09441j80723j87829
35895e76349k13000j00376J05632J38045n7844j63380N1035L62373M31761K88579
$$ plain form
35964 -217356 -409702 -490300 -692936 -906493 -720584 -20941 800772 1333656 1514255 1390888
35954 1390888 920776 263292 -84223 150571 529317 417740 -114531 -362671 30835
35945 30835 616480 819123 692459 708129 1042711 1414794 1537167 1419887 1205552 957457
35935 957457 719887 627456 790693 1093325 1213526 907009 259152 -385325 -766412 -945619
35925 -945619 -1147274 -1406645 -1502267 -1275090 -893955 -698859 -830971 -1101383 -1192577 -932334
35915 -932334 -425238 20367 168876 145367 350476 948981 1531252 1492528 737510 -193665
35905 -193665 -719065 -727009 -459572 -146999 84700 138892 1644 -207797 -388520 -576349
35895 -576349 -789349 -889725 -784093 -646048 -703892 -867272 -816237 -453864 -22103 266476
35885B66476J97842K03994J26427n6600j31126J1838J91047J63198j04810m40009
35875D28277o42097o23767m23484j00558L35209P91340R58713N72800j38314n78602
35865E79517n11916l40249m25869n13616k23348K19353L02001P4182M5175K96247
35855d98523L66198J02331n1738J49415L01996O3146k32623j41846J28809P7495
35845B64660k56596l69081p4252K85409L88447K86179J77965J39844J09099n3918
35835H97756m32353q14056p49334j00760O22612P78382L11887l10843p01362p28740
35825a226811l17313M26989R70187P74013K6294n15280m77076k04125o2747N1523
35815e54346K89213M36053K80393K0568o1351m4724j29504k00231k8722K46655
$$ plain form
35885 266476 464318 668312 794739 738139 607013 618851 809898 973096 868286 428277
35875 428277 -213820 -837587 -1261071 -1361629 -1026420 -235080 723633 1296433 1158119 579517
35865 579517 67601 -272648 -698517 -1212133 -1435481 -1216128 -914127 -839945 -794770 -498523
35855 -498523 -132325 -29994 -81732 67683 369679 432825 200202 58356 187165 264660
35845 264660 8064 -361017 -435269 -149860 238587 524766 702731 842575 951674 897756
35835 897756 465403 -348653 -1097987 -1198747 -576135 202247 514134 203291 -498071 -1226811
35825 -1226811 -1544124 -1117135 -146948 627065 653359 138079 -338997 -543122 -605869 -554346
35815 -554346 -265133 170920 451313 471881 410530 365806 236302 36071 7349 254004
35805B54004K43096j10685m57494m52149r8113L30817N24958L45166m2893k98408
35795B38299k84058j92746j85966j26272J19828L47530L00573J15563J02777J96323
35785F31851N1165l27815m97139k18384J89177L06098J18439j17107k55128l00505
35775d19348k55695j31526J836R9304J64385J41596j7949j31165Q8245N33838
35765G3521O57026J71186m64239n94149j99631J83850K20300L3275j86628l65897
35755d71386l42088L8902N16919N80786K20483M7093L79610O80460L44948l29168
35745A666559n54185k21558J2739j98195m13948k13545J12453P3892k32281l27152
35735b95221j00291J35674K38274L91905O19916N86417J03319m65146n97185k73183
$$ plain form
35805 254004 497100 386415 -71079 -523228 -621341 -290524 234434 579600 536707 238299
35795 238299 -45759 -238505 -424471 -550743 -430915 -83385 217188 332751 435528 631851
35785 631851 683016 355201 -141938 -360322 -171145 134953 253392 136285 -118843 -419348
35775 -419348 -675043 -806569 -804733 -705429 -541044 -399448 -417397 -548562 -460317 73521
35765 73521 730547 901733 437494 -156655 -356286 -172436 47864 81139 -105489 -471386
35755 -471386 -813474 -774572 -257653 323133 543616 590709 970319 1650779 1995727 1666559
35745 1666559 1112374 890816 903555 705360 291412 77867 190320 264212 31931 -295221
35735 -295221 -395512 -259838 -21564 370341 990257 1576674 1679993 1214847 617662 344479
35725C44479M2605N1630k7431J32492M28739M59339J32844j60073j01234J02216
35715A405606P8744r4335l3358K49014K52995k45421p58902p20571k54258N6977
35705f3509j3921j57431r5134O4228R6494p913r9133p1579O5625K01692J86620
35694A06039r974k17716k47298j04817P1428J81982J54670p1523l67958m13637
35684i18804j18006J60235J28356N5493L17771O64544N33945J4730j91900J45829
35674G92193M38924K34300j47829k92856l75114o47588p79368l59313K77682M22861
35664d36108M4007j87891P7937M05486K77709j71197l77784q5423L54556L96574
35654B97866n0734m72697l65994Q7105K72024M5573r2593J27476K67471o9380
$$ plain form
35725 344479 387084 438714 411283 543775 972514 1431853 1564697 1404624 1303390 1405606
35715 1405606 1484350 1390015 1356657 1605671 1858666 1613245 854343 133772 -120486 -63509
35705 -63509 -77430 -234861 -329995 -265767 -169273 -177186 -276319 -347898 -282273 -80581 106039
35694 106039 96065 -121651 -368949 -473766 -402338 -220356 -65686 -137209 -505167 -918804
35684 -918804 -1036810 -876575 -748219 -692726 -374955 289589 823534 838264 646364 792193
35674 792193 1231117 1465417 1317588 1024732 649618 2030 -777338 -1136651 -858969 -436108
35664 -436108 -392101 -579992 -502055 -96569 181140 9943 -367841 -453264 -98708 297866
35654 297866 247132 -225565 -591559 -504454 -232430 -186857 -279450 -151974 115497 46117
35644D6117n28592n47058j85605J31816L24432M80739L50436k41417p49857n18036
35634a437025J28341K81343j15599k03132L17422O51825K08228m73113o02312
35625a244022k37412O0419J01806N1887m460J4173K92194P14360P77876L26194
35615H53015q5404j3061J68869p5420n37001o48445m06709k25711j40228J33363
35605i76732M98153N24204J50149k44340m30856m78278l80092p0409K43064K87759
35595h77378K13094L42970N24312L22947j66797l72445j62337l2794k17784k96786
35585g22998J3734L07423J59702j38550k7089M53983P32352M94505Q170l02866
35575I78366l21886k59556l49542n37391n01386r8031L07616K38194k00504l92105
$$ plain form
35644 46117 -482475 -1029533 -1215138 -1083322 -758890 -278151 72285 -169132 -918989 -1437025
35634 -1437025 -1308684 -1027341 -1142940 -1346072 -1028650 -376825 -168597 -641710 -1244022
35625 -1244022 -1481434 -1421015 -1319209 -1267322 -1271782 -1257609 -965415 -251055 526821 853015
35615 853015 767611 754550 923419 847999 310998 -337447 -744156 -969867 -1110095 -976732
35605 -976732 -478579 45625 195774 -48566 -479422 -957700 -1337792 -1408201 -1165137 -877378
35595 -877378 -664284 -321314 202998 525945 359148 -13297 -175634 -208428 -426212 -722998
35585 -722998 -709264 -401841 -242139 -380689 -407778 46205 778557 1273062 1281232 978366
35575 978366 656480 396924 47382 -490009 -991395 -1089426 -781810 -543616 -744120 -1136225
35565a136225m7292M21280N17313K80674N9843j1187k9637n9585j16462k32052
35555c53330l25065k00590J32144L61032K91347J33140J45982K35694J69145k4021
35545E65478j50807j70956j28717M4780L43156M68492J71597k93196m24764j42563
35535B82500J51613J56197m1744k70635m82159n60152k97558K29295N55933L69303
35525I2593l3648j06994K30973N34399M56960J49342n3699q3357q6284j12722
35515I87563j22008k02144m61651o97624n30188P543L72261K39474j2732R4458
35505c25048L59207K26715k75274n24512k33238J84327K97054J82669P1093m7219
35495h4226j87365j76041N14K9491k31243m32579k34964J89045M65257M96194
$$ plain form
35565 -1136225 -1183517 -762237 -244924 35750 95593 84406 54769 -4816 -121278 -353330
35555 -353330 -678395 -878985 -746841 -385809 -94462 38678 184660 420354 589499 565478
35545 565478 414671 243715 114998 159778 502934 971426 1143023 849827 425063 282500
35535 282500 434113 590310 548566 277931 -204228 -764380 -1061938 -832643 -276710 92593
35525 92593 58945 -48049 182924 717323 1174283 1323625 1269926 1186569 1100285 987563
35515 987563 865555 663411 201760 -495864 -1026052 -1018509 -646248 -406774 -419506 -325048
35505 -325048 34159 260874 -14400 -538912 -772150 -587823 -290769 -108100 -37007 -84226
35495 -84226 -271591 -447632 -447118 -417627 -648870 -1081449 -1316413 -1127368 -662111 -165917
35485a65917L12685j50792p11306p67703l2064Q53316J013090M46609j39084m01215
35475B57619n90134p98993p22722k72819J99540M69637O82328Q48511O46880J2847
35465G32694n31344m85958j5068L10335J89739j98883m71953l66673K5126K75040
35455e36945Q5585k53842j91014K97023O45398N19436K27569J25839P6466j77896
35445H17619m76676m73186j71065J27132K62182L18774L77852L82460K05149k06536
35435A163705o33576o20271l4874M80405J64030o95472r33847j38841O40385L68219
35425b40137m58392n80199J74416P61128M94939j65197m89775l42631L5139M37299
35415c73410O14311L27152k31804n06073l00287k9862m9828j89251k01014k03147
$$ plain form
35485 -165917 146768 -4024 -715330 -1483033 -1515097 -661781 351309 797918 658834 257619
35475 257619 -332515 -1131508 -1854230 -2127049 -1927509 -1457872 -775544 72967 719847 732694
35465 732694 201350 -284608 -299676 10659 200398 1515 -470438 -837111 -811985 -536945
35455 -536945 -451360 -705202 -896216 -599193 46205 565641 793210 919049 995515 817619
35445 817619 340943 -132243 -303308 -176176 86006 404780 782632 1165092 1370241 1163705
35435 1163705 530129 -90142 -125016 355389 519419 -176053 -1109900 -1248741 -608356 -240137
35425 -240137 -698529 -1278728 -1104312 -343184 151755 -13442 -503217 -845848 -810709 -373410
35415 -373410 240901 568053 336249 -169824 -470111 -499973 -549801 -739052 -940066 -1143213
35405a143213l27008l39369k5977L68982M99881M46027M61688M48427J63818j98330
35395C54926j64197K85568N98505L62251k18186o60331p29920n17130k39800j00019
35385a028333j50598j99089M917M17719O88347N57476J27129l01446m92548l54209
35375g30635K6257L37779K54272j68467m72767l19090J25617M53090M83490K85460
35365B75006p8271n31677q11912o53058j82390J34379L5860k40981k99097n0051
35355b402192K58890L69848K67468J57079K19403L58426K79070p3081l03672o2167
35345i30928L79800M39741Q6102j17282N4440R6791l32283o83363k64575O47448
35335f24109J132481Q75356L85165M3922k87990o05978m92117J25907N76845K89281
$$ plain form
35405 -1143213 -1470221 -1809590 -1835567 -1466585 -966704 -520677 -58989 389438 553256 354926
35395 354926 190729 476297 1074802 1437053 1218867 558536 -171384 -688514 -928314 -1028333
35385 -1028333 -1178931 -1378020 -1373103 -955384 -267037 290439 417568 116122 -376426 -730635
35375 -730635 -704378 -366599 -112327 -280794 -753561 -1072651 -947034 -493944 -10454 275006
35365 275006 196735 -334942 -1146854 -1799912 -1982302 -1847923 -1812063 -2053044 -2352141 -2402192
35355 -2402192 -2143302 -1773454 -1505986 -1348907 -1129504 -771078 -492008 -565089 -868761 -930928
35345 -930928 -551128 -111387 -25285 -142567 -88127 8664 -323619 -1006982 -1271557 -624109
35335 -624109 508372 1383728 1768893 1812815 1524825 918847 426730 552637 1129482 1418763
35325A418763m05679p75025o23504k74033N7901L42644M21468J72153j08765J734
35315B27657L99785N44051K14172k32539m09735l24035j62691n027J20300J51102
35305E23040R1402J8004o0505j75033k36318j23807P9738J81489J79472J98283
35295F75765J63879j07181m74341n23156j66793J64210J07543j70691k96243j81996
35285h09004Q636J37569J17400r0934k81142o2727N95800J107529Q86259Q5673
35275A695059n93014p21223m64266j86068q2875j82696l70285l77202m3460L57097
35265i68933L39248j55570o11936n64006j31787K30689L16451K75931K81375L28074
35255f60464L45198L14715K54541J96225J80778J86259R0951j71927m46928m91203
$$ plain form
35325 1418763 1013084 238059 -385445 -659478 -601577 -258933 162535 334688 225923 227657
35315 227657 627442 1171493 1385665 1153126 743391 419356 256665 251638 371938 523040
35305 523040 614442 632446 571941 396908 160590 36783 116521 298010 477482 675765
35295 675765 839644 732463 258122 -265034 -431827 -267617 -160074 -330765 -627008 -809004
35285 -809004 -800368 -662799 -545399 -636333 -917475 -980202 -384402 723127 1609386 1695059
35275 1695059 1102045 380822 -83444 -269512 -352387 -535083 -905368 -1282570 -1326030 -968933
35265 -968933 -629685 -785255 -1397191 -1961197 -2092984 -1862295 -1545844 -1269913 -988538 -660464
35255 -660464 -315266 -551 253990 450215 630993 817252 908203 736276 289348 -201855
35245b01855k81537k5886J55426L52667N75970N78880K03247k58960l55943p8208
35235F63801J41128M2288j70611k34099j73466p2497J65226N36361O89500L27771
35225A915402k90709o12591m61384j26766J19210K33954K03831L7547m8639J47876
35215A117731L80162J79548l89565o73175l20743K08357L12566L4375j66604j08163
35205E74489L8606J38982J63670J7692l25971o10111n39492j87631J11497K00188
35195d18081J73534J27887J07891J97931L77669L97082J09680j88090j22904J43396
35185I05995J12478k56069m46769j95356R7262Q982k61380k62690j5826O8029
35175b45344j17851j95510J06679N10472N43118J72737j64324j68433o0654j96703
$$ plain form
35245 -201855 -483392 -509278 -353852 -1185 574785 1153665 1356912 1097952 742009 663801
35235 663801 804929 847217 676606 442507 269041 196544 361770 898131 1587631 1915402
35225 1915402 1624693 1012102 550718 423952 543162 777116 980947 1018494 969855 1117731
35215 1117731 1497893 1677441 1287876 614701 293958 502315 814881 849256 682652 574489
35205 574489 613095 752077 915747 933439 607468 -2643 -542135 -729766 -618269 -418081
35195 -418081 -244547 -116660 -8769 189162 566831 963913 1073593 885503 762599 905995
35185 905995 1018473 762404 315635 120279 217541 226523 -34857 -297547 -313373 -245344
35175 -245344 -363195 -558705 -452026 58446 601564 774301 609977 441544 380890 184187
35165A84187m73809m45778k1879L30519K57904M6626J51308M58048M57350M0791
35155I85267l30400k74921P6341L63560L84762J38862k07533l47563j38011J06846
35145G57210j7573l48565l36298N8458K32289p5714k94358N4820N02053L15823
35135H48145l45669o82535m50963j79516k13612k53577n649L05036L53495K12426
35125d12419J37363J67604J98822K01212J36620j21089n57485q76984p88393l21055
35115b235804K49534O43688O86718M05118J08085J18425L09546K12074k62200
35106B35184n70638k98159J83255K25415j77820m60889l30535m4395J02161Q3350
35096a053071p0706l11391l37038J71931R36997J200748O94459J7994k31270k21979
$$ plain form
35165 184187 -289622 -735400 -757279 -426760 -168856 -122230 29078 487126 944476 985267
35155 985267 654867 379946 456287 819847 1204609 1343471 1135938 788375 650364 757210
35145 757210 739637 391072 54774 113232 345521 269807 -24551 30269 532322 848145
35135 848145 502476 -180059 -631022 -810538 -1024150 -1277727 -1283376 -978340 -624845 -412419
35125 -412419 -275056 -107452 91370 292582 429202 308113 -249372 -1126356 -1914749 -2235804
35115 -2235804 -1986270 -1342582 -655864 -250746 -142661 -24236 285310 497384 235184
35106 235184 -335454 -633613 -450358 -224943 -402763 -863652 -1194187 -1238582 -1136421 -1053071
35096 -1053071 -1123777 -1435168 -1772206 -1600275 -663278 537470 1231929 1249923 1018653 796674
35086G96674l80590n94355n02756k50687k65472m35833k22078M01632P94534N89441
35076f9490J74226j264l0185j30937j41685J21458L92061L26190P0703j5417J8552
35065G14212j24763l68260l33647R790K74583K52903J10159p0339m31267q70418
35055h37047r09013l29780L98062O55494M02164Q0309q782P8829K08352L36724
35045G5312M04380K90858m5950m59075o54846l78672L02581Q92535Q61316K50415
35035A538854l32157m38384k38038p6595P5503L60973N08277J30338n12966o58161
35025C57644j09853L65873O0759o72964r15862m46370L8659l6366l89878m03224
35015b151582M974L76620M02501K39862J51789J48788J07191K9385J4722P8300
$$ plain form
35086 796674 416084 -178271 -681027 -931714 -1197186 -1633019 -1855097 -1453465 -658931 -69490
35076 -69490 104736 103472 73287 -57650 -199335 -77877 314184 640374 711077 695660 714212
35065 714212 589449 221189 -112458 -102668 171915 424818 534977 464638 33371 -837047
35055 -837047 -1746060 -2075840 -1677778 -1022284 -620120 -539811 -548593 -469764 -261412 75312
35045 75312 479692 770550 724600 265525 -389321 -767993 -465412 427123 1288439 1538854
35035 1538854 1206697 768313 530275 453680 529183 890156 1398433 1528771 1015805 357644
35025 357644 247791 613664 674423 1459 -914403 -1360773 -1322114 -1358480 -1748358 -2151582
35015 -2151582 -2146608 -1769988 -1367487 -1127625 -975836 -827048 -719857 -690472 -675750 -597450
35005e97450J52284K16289K96646L58098L12065J47304k0787n4325P0515K12339
34995A092978J59019j41852m35703l86542j3952K71149J95564j3926k0317P2505
34985G78923p8652m03196m24654j862L71784K36271k01542l96214j93425Q5820
34975b26747J51960K7695j29400k22332k16693j24655j3121N7110O5968k8973
34965f59188k48415m05228j88161L68763P16017M04100k50605m77330j7694N67101
34955a90640O35829K07697j98168k40943o2211l943k04351m93789o15003m92222
34945a657744k51319r046K28151M13237L84936R8743j99747k25803J058K33733
34935i83801L14406K32012M893k45890k46115R4041M08131L12574K5055Q3732
$$ plain form
35005 -597450 -445166 -228877 67769 425867 737932 885236 864449 810124 880639 1092978
34995 1092978 1251997 1110145 674442 287900 273948 545097 740661 726735 706418 778923
34985 778923 700271 297075 -127579 -129441 242343 478614 277072 -119142 -312567 -226747
34975 -226747 -74787 -47092 -176492 -398824 -615517 -740172 -753293 -696183 -630215 -659188
34965 -659188 -907603 -1312831 -1500992 -1132229 -416212 -12112 -262717 -740047 -757741 -190640
34955 -190640 445189 652886 454718 213775 151564 147621 -56730 -550519 -1165522 -1657744
34945 -1657744 -1909063 -1918109 -1689958 -1276721 -891785 -793042 -992789 -1218592 -1217534 -983801
34935 -983801 -669395 -437383 -432490 -678380 -924495 -830454 -422323 -109749 -84694 -962
34925i62M75047N96964K07581j74635r5239J57353J15870q7316m9511J25201N25
34914A270878l98279n77637l45499m0075O3766O8514O7216o5335l02761l32200
34904e91412n6984J32000r8244m84897n04021n1759M97283P50736N62202K3322
34894A78226n08608n46158J0558N95278N71753L9413l28085j98959R7002J95321
34884A05741J62841J71012J48490L4979J8941K03041L39250K37562J41419K90924
34874A854200L94036N4256m68722n42994j57193K5289k96534o17154m58909m7919
$$ plain form
34925 -962 474085 1071049 1278630 1103995 1008756 1166109 1281979 1194663 1145152 1270353 1270878
34914 1270878 872599 294962 -50537 -90612 -26846 41668 108884 43549 -259212 -591412
34904 -591412 -648396 -516396 -614640 -1099537 -1603558 -1655317 -1158034 -407298 154904 178226
34894 178226 -330382 -876540 -865982 -270704 301049 340462 12377 -186582 -89580 105741
34884 105741 268582 439594 588084 623063 642004 845045 1184295 1421857 1563276 1854200
34874 1854200 2248236 2302492 1833770 1290776 1133583 1158872 862338 245184 -213725 -261644
$$ [...]
##END NTUPLES=NMR SPECTRUM
##END=
