##TITLE=31Pdec_B3f2101
 CDCl3, 24 sc
 21.1.2025
##JCAMPDX= 6.0         $$ Bruker NMR JCAMP-DX V2.0
##DATA TYPE= NMR SPECTRUM
##DATA CLASS= NTUPLES
##ORIGIN= UXNMR, Bruker Analytische Messtechnik GmbH
##OWNER= root
$$ XWIN-NMR		Version 3.5
$$ Tue Jan 21 17:53:49 2025 Russian Standard Time (UT+4h)  she@DPX200
##.OBSERVE FREQUENCY= 81.013821
##.OBSERVE NUCLEUS= ^31P
##.ACQUISITION MODE= SIMULTANEOUS
##.ACQUISITION SCHEME= undefined
##.AVERAGES= 24
##.DIGITISER RES= 17
##SPECTROMETER/DATA SYSTEM= spect
##.PULSE SEQUENCE= zgpg30
##.SOLVENT NAME= CDCl3
##.SHIFT REFERENCE= (INTERNAL, CDCl3, 0, 198.062)
##AUDIT TRAIL= $$ (NUMBER, WHEN, WHO, WHERE, WHAT)
$$ ##TITLE= Audit trail, XWIN-NMR		Version 3.5
$$ ##JCAMPDX= 5.01
$$ ##ORIGIN= Bruker BioSpin GmbH
$$ ##OWNER= she
$$ F:/spectra/data/she/nmr/P31/2/pdata/1/auditp.txt
$$ ##AUDIT TRAIL=  $$ (NUMBER, WHEN, WHO, WHERE, WHAT)
(   1,<2025-01-21 17:52:41.92 +0400>,<she>,<DPX200>,
      <created by zg, POWCHK disabled, PULCHK disabled
       configuration hash MD5:
       00 E9 B6 7A A2 85 ED C7 34 08 36 98 17 FE 4E 26
       data hash MD5: 32K
       87 37 7B A9 1F 43 8B BC 47 53 3A 31 FC 18 C0 6A>)
(   2,<2025-01-21 17:52:44.50 +0400>,<she>,<DPX200>,
      <Start of raw data processing
       efp BC_mod = 2 LB = 1.5 FT_mod = 6 PKNL = 1 PHC0 = 1664.933 PHC1 = 279.8863 SI = 64K 
       data hash MD5: 64K
       A8 8B 3B 0A 1F E2 A2 C0 AF D9 BD 2D AC 56 70 67>)
(   3,<2025-01-21 17:53:09.14 +0400>,<she>,<DPX200>,
      <pk PHC0 = -10.47992 PHC1 = 47.00001 
       data hash MD5: 64K
       90 C0 F8 A1 C3 DA 1A 60 A9 43 9C 15 2B E0 6A C2>)
(   4,<2025-01-21 17:53:14.59 +0400>,<she>,<DPX200>,
      <abs ABSG = 5 
       data hash MD5: 64K
       59 77 99 09 14 1B CD 45 11 F9 94 2D 67 ED DA D0>)
$$ ##END=
$$ 
$$ hash MD5
$$ 93 24 97 1A 92 4A BA C0 EC 5C BD 35 1E CB 00 5A
##$RELAX= 
##$RELAX= 
##$RELAX= 
##$RELAX= 
##$RELAX= 
##$RELAX= 
##$RELAX= 
##$RELAX= 
$$ Bruker specific parameters
$$ --------------------------
##$DU= <F:/spectra>
##$EXPNO= 2
##$NAME= <P31>
##$PROCNO= 1
##$TYPE= <nmr>
##$USER= <she>
##$AMP= (0..31)
100 100 100 100 100 100 100 100 100 100 100 100 100 100 100 100 100 100 
100 100 100 100 100 100 100 100 100 100 100 100 100 100 
##$AQSEQ= 0
##$AQ_mod= 1
##$AUNM= <au_zg>
##$AUTOPOS= <>
##$BF1= 81.014009
##$BF2= 200.13
##$BF3= 200.13
##$BF4= 200.13
##$BF5= 200.13
##$BF6= 200.13
##$BF7= 200.13
##$BF8= 200.13
##$BYTORDA= 1
##$CFDGTYP= 0
##$CFRGTYP= 5
##$CHEMSTR= <none>
##$CNST= (0..31)
1 1 145 1 1 1 1 1 1 1 1 1 1 1 1 1 1 1 1 1 1 1 1 1 1 1 1 1 1 1 1 1 
##$CPDPRG= <waltz16>
##$CPDPRG1= <>
##$CPDPRG2= <waltz16>
##$CPDPRG3= <>
##$CPDPRG4= <mlev>
##$CPDPRG5= <mlev>
##$CPDPRG6= <mlev>
##$CPDPRG7= <mlev>
##$CPDPRG8= <mlev>
##$CPDPRGB= <>
##$CPDPRGT= <>
##$D= (0..31)
0 1 0 0 0 0 0 0 0 0.06 0 0.03 2e-05 3e-06 0 0 0.0002 0 0 0 0 0 0 0 0 0 
0 0 0 0 0 0 
##$DATE= 1737467561
##$DBL= (0..7)
120 120 120 11 120 120 24 19 
##$DBP= (0..7)
150 150 150 150 150 150 150 150 
##$DBP07= 0
##$DBPNAM0= <>
##$DBPNAM1= <>
$$ [...]
##$SUBNAM3= <"">
##$SUBNAM4= <"">
##$SUBNAM5= <"">
##$SUBNAM6= <"">
##$SUBNAM7= <"">
##$SUBNAM8= <"">
##$SUBNAM9= <"">
##$SW= 400.765351723535
##$SWIBOX= (0..15)
0 1 3 0 0 0 0 0 0 0 0 0 0 0 0 0 
##$SW_h= 32467.5324675325
##$TD= 32768
##$TD0= 1
##$TE= 0
##$TE2= 300
##$TE3= 300
##$TEG= 300
##$TL= (0..7)
0 120 53 12 22 120 120 120 
##$TP= (0..7)
150 150 150 150 150 150 150 150 
##$TP07= 0
##$TPNAME0= <>
##$TPNAME1= <>
##$TPNAME2= <>
##$TPNAME3= <>
##$TPNAME4= <>
##$TPNAME5= <>
##$TPNAME6= <>
##$TPNAME7= <>
##$TPOAL= (0..7)
0.5 0.5 0.5 0.5 0.5 0.5 0.5 0.5 
##$TPOFFS= (0..7)
0 0 0 0 0 0 0 0 
##$TUNHIN= 0
##$TUNHOUT= 0
##$TUNXOUT= 0
##$USERA1= <user>
##$USERA2= <user>
##$USERA3= <user>
##$USERA4= <user>
##$USERA5= <user>
##$V9= 5
##$VALIST= <valist>
##$VCLIST= <CCCCCCCCCCCCCCC>
##$VD= 0
##$VDLIST= <DDDDDDDDDDDDDDD>
##$VPLIST= <PPPPPPPPPPPPPPP>
##$VTLIST= <TTTTTTTTTTTTTTT>
##$WBST= 1024
##$WBSW= 4
##$XGAIN= (0..3)
0 0 0 0 
##$XL= 0
##$YL= 0
##$YMAX_a= 3547
##$YMIN_a= -10789
##$ZGOPTNS= <>
##$ZL1= 120
##$ZL2= 120
##$ZL3= 120
##$ZL4= 120
##$ABSF1= 198.0616
##$ABSF2= -202.7028
##$ABSG= 5
##$ABSL= 3
##$ALPHA= 0
##$AQORDER= 0
##$ASSFAC= 0
##$ASSFACI= 0
##$ASSFACX= 0
##$ASSWID= 0
##$AUNMP= <proc_1d>
##$AZFE= 0.1
##$AZFW= 0.5
##$BCFW= 0
##$BC_mod= 2
##$BYTORDP= 0
##$COROFFS= 0
##$CY= -3
##$DATMOD= 1
##$DC= 0
##$DFILT= <>
##$DTYPP= 0
##$F1P= 0
##$F2P= 0
##$FCOR= 1
##$FTSIZE= 65536
##$FT_mod= 6
##$GAMMA= 0
##$GB= 0
##$INTBC= 1
##$INTSCL= 9.790993e-09
##$ISEN= 30
##$LB= 1.5
##$LEV0= 0
##$LPBIN= 0
##$MAXI= 10000
##$MC2= 0
##$MEAN= 0
##$ME_mod= 0
##$MI= 50
##$NCOEF= 0
##$NC_proc= -8
##$NLEV= 6
##$NOISF1= 182.463
##$NOISF2= 159.3651
##$NSP= 0
##$NTH_PI= 0
##$NZP= 0
##$OFFSET= 198.0616
##$PC= 4
##$PHC0= 1654.453
##$PHC1= 326.8863
##$PH_mod= 1
##$PKNL= yes
##$PPARMOD= 0
##$PSCAL= 0
##$PSIGN= 0
##$REVERSE= no
##$SF= 81.0140089999434
##$SI= 65536
##$SIGF1= 159.3651
##$SIGF2= -187.1042
##$SINO= 113.3802
##$SIOLD= 16384
##$SREGLST= <1H.CDCl3>
##$SSB= 0
##$STSI= 65536
##$STSR= 0
##$SW_p= 32467.5324675325
##$SYMM= 0
##$S_DEV= 0
##$TDeff= 32768
##$TDoff= 0
##$TI= <>
##$TILT= no
##$TM1= 0
##$TM2= 0
##$TOPLEV= 0
##$USERP1= <user>
##$USERP2= <user>
##$USERP3= <user>
##$USERP4= <user>
##$USERP5= <user>
##$WDW= 1
##$XDIM= 65536
##$YMAX_p= 316229385
##$YMIN_p= -68049486
$$ End of Bruker specific parameters
$$ ---------------------------------
##NTUPLES= NMR SPECTRUM
##VAR_NAME=  FREQUENCY,     SPECTRUM/REAL,   SPECTRUM/IMAG
##SYMBOL=    X,             R,               I
##VAR_TYPE=  INDEPENDENT,   DEPENDENT,       DEPENDENT
##VAR_FORM=  AFFN,          ASDF,            ASDF
##VAR_DIM=   65536,         65536,           65536
##UNITS=     HZ,            ARBITRARY UNITS, ARBITRARY UNITS
##FACTOR=    0.49542278885378, 1,            1
##FIRST=     16045.7642231865, 0,            0
##LAST=      -16421.768244346, 0,            0
##MIN=       -16421.768244346, -68049486,    0
##MAX=       16045.7642231865, 316229385,    0
$$ Real data points
##PAGE= N=1
##DATA TABLE= (X++(R..R)), XYDATA
$$ [...]
$$ plain form
37776 15300167 13407049 12878278 13196986 13832712 14479280 14801510 14812129 15385887 17505650
37767 17505650 20953106 24520655 27461849 29783365 31098193 30454270 27817848 24660016
37759 24660016 22292543 20409878 18094042 15545356 13754421 12839269 11818582 10039474
37751 10039474 7943183 6290397 5392598 5331167 6228832 7852306 9351591 9829060 9030564
37742 9030564 7321005 5283640 3587959 2906816 3473843 4760361 5946973 6717582 7258865
37733 7258865 7493366 6845433 5091061 3053041 1925390 2013406 2586159 2888834 2791835
37724 2791835 2480774 2158708 2199234 2909487 3834883 3972981 3103964 2221787 2088389 2102880
37714 2102880 1409951 441408 277525 945160 1533291 1683081 1685002 1308793 35929 -1446504
$$ packed form
37776A5300167j893118n28771L18708O35726O46568L22230J0619N73758K119763
37767A7505650L447456L567549K941194K321516J314828o43923k636422l157832
37759B4660016k367473j882665k315836k548686j790935r15152j020687j779108
37751A0039474k096291j652786q97799o1431Q97665J623474J499285M77469p98496
37742I030564j709559k037365j695681o81143N67027J286518J186612P70609N41283
37733G258865K34501o47933j754372k038020j127651Q8016N72753L02675r6999
37724B791835l11061l22066M0526P10253R25396J38098q69017q82177j33398J4491
37714B102880o92929r68543j63883O67635N88131J49790J921l76209j272864j482433
$$ plain form
37704 -1446504 -1545830 -16973 1450686 1455563 417269 -648647 -1425049 -1547217 -105513
37695 -105513 2805437 5249731 5617758 4700340 4176239 3988760 2956918 1265720 325843
37686 325843 410289 454659 333157 1337331 3796389 5955197 6181356 5031459 4151482
37677 4151482 4122246 4419039 4756840 5317860 5868075 5566207 3877062 1421042 -157355
37668 -157355 651745 3771518 7256089 8934505 8355339 6678808 4915861 3153235 1456984
37659 1456984 363490 8995 -287916 -929108 -1223869 -347413 1418196 3066315 4094614
37650 4094614 4712831 5108367 5177929 4979121 4959797 5541141 6566068 7242044 6780339 5227434
37640 5227434 3462587 2164935 1160606 205275 -126555 827399 2548824 3839478 4423479
$$ packed form
37704a446504r9326J528857J467659M877j038294j065916p76402j22168J441704
37695a05513K910950K444294L68027r17418n24101j87479j031842j691198r39877
37686C25843Q4446M4370j21502J004174K459058K158808K26159j149897q79977
37677D151482k9236K96793L37801N61020N50215l01868j689145k456020j578397
37668a57355Q09100L119773L484571J678416n79166j676531j762947j762626j696251
37659A456984j093494l54495k96911o41192k94761Q76456J765609J648119J028299
37650D094614O18217L95536O9562j98808j9324N81344J024927O75976m61705j552905
37640E227434j764847j297652j004329r55331l31830R53954J721425J290654N84001
$$ plain form
37631 4423479 4900405 5165689 4304495 2413958 1148312 1729048 3461957 4890868 5401864
37622 5401864 5019704 3764346 2178647 1542245 2473890 4002752 4945963 5476167 6397684
37613 6397684 7685991 8845721 9968482 11198499 11773261 10933510 9350782 8338511
37605 8338511 7987386 7393591 6460698 6109659 6818325 8245328 10225801 12861607 15673087
37596 15673087 17972053 20088748 22906311 26158601 28650222 30364930 32938782 37854811
37588 37854811 45691580 57153812 72325148 87572251 95406867 90131069 73498054
37581 73498054 53388673 37168917 27285504 22247381 19515284 16984008 13549942 9693239
37573 9693239 7066093 6682032 7667430 8232024 7606855 6507074 5797295 5331255 4416005
$$ packed form
37631D423479M76926K65284q61194j890537j265646N80736J732909J428911N10996
37622E401864l82160j255358j585699o36402R31645J528862R43211N30204R21517
37613F397684J288307J159730J122761J230017N74762q39751j582728j012271
37605H338511l51125n93795r32893l51039P08666J427003J980473K635806K811480
37596A5673087K298966K116695K817563L252290K491621J714708K573852M916029
37588C7854811P836769J1462232J5171336J5247103P834616n275798j6633015
37581G3498054k0109381j6219756r883413n038123k732097k531276l434066l856703
37573I693239k627146l84061R85398N64594o25169j099781p09779m66040r15250
$$ plain form
37564 4416005 3020529 1937134 1731006 2065264 2312290 2383383 2563429 2881825 3112617
37555 3112617 3122908 2779936 1862415 600050 -118671 189866 697889 290583 -819289
37546 -819289 -1500176 -1427545 -1176915 -787120 254231 1476098 1535272 348357 -502839
37537 -502839 -210297 66170 -550975 -907797 195557 1747588 2123162 1792022 2270973
37528 2270973 3136245 2533852 519136 -579883 399242 1852136 2115160 1856902 2517058
37519 2517058 3851581 4516026 4129075 3326063 2374841 1088685 -196756 -764270 -537316
37510 -537316 46317 1129234 3345868 6382105 8532193 8322086 6191337 4032476 3192851
37501 3192851 3383824 3599511 3577196 3827360 4456271 4862196 4963504 5795108 7869374
$$ packed form
37564D416005j395476j083395k06128L34258K47026P1093J80046L18396K30792
37555C112617J0291l42972r17521j262365p18721L08537N08023m07306j109872
37546h19289o80887P2631K50630L89795J041351J221867N9174j186915q51196
37537e02839K92542K76467o17145l56822J103354J552031L75574l31140M78951
37528B270973Q65272o02393k014716j099019R79125J452894K63024k58258O60156
37519B517058J334523O64445l86951q03012r51222j286156j285441n67514K26954
37510e37316N83633J082917K216634L036237K150088k10107k130749k158861q39625
37501C192851J90973K15687k2315K50164O28911M05925J01308Q31604K074266
$$ plain form
37492 7869374 9535242 8467077 4844214 1519135 484322 645022 69061 -992928
37484 -992928 -990661 -47782 68163 -1114226 -1877111 -961285 551381 1004171 542448 457653
37474 457653 1010686 1337527 1135478 1010160 1094156 634275 -599586 -1556851 -1297160 -426906
37464 -426906 -257735 -879847 -1014098 150111 1754166 2282873 1311929 -184962 -1004529
37455 -1004529 -742844 198961 1108730 1377846 933204 584344 1547900 4063566 6602055
37446 6602055 7103235 5231683 2912026 2257492 3353518 4580025 4793521 4417883 4375446
37437 4375446 4829863 5500836 6601449 8606980 11179969 13094419 13543382 13114245 13126441
37428 13126441 14205530 15793561 16915411 17070924 16340911 14963738 13118469 11079868
$$ packed form
37492G869374J665868j068165l622863l325079j034813J60700n75961j061989
37484i92928K267R42879J15945j182389p62885R15826J512666M52790m61723q4795
37474D57653N53033L26841k02049j25318Q3996m59881j233861r57265K59691Q70254
37464d26906J69171o22112j34251J164209J604055N28707r70944j496891q19567
37455a004529K61685R41805R09769K69116m44642l48860R63556K515666K538489
37446F602055N01180j871552k319657o54534J096026J226507K13496l75638m2437
37437D375446M54417O70973J100613K005531K572989J914450M48963m29137J2196
37428A3126441J079089J588031J121850J55513p30013j377173j845269k038601
$$ plain form
37420 11079868 9290757 8076950 7356347 6780987 6131692 5429385 4730769 4084567 3719857
37411 3719857 3945857 4662711 5203659 4900798 3667508 1900055 117216 -1059467 -1022192
37402 -1022192 129963 1275225 1417826 1124728 1921511 3956125 5189408 3719161 390661
37393 390661 -1887210 -1347756 992392 3041189 4068708 4828116 5851777 6616529 6482981
37384 6482981 5678085 4875793 4258966 3616229 3154977 3418586 4204019 4337706 3150204
37375 3150204 1691821 1652306 3228323 4941683 5668636 5899755 6519727 7210923 7000482
37366 7000482 5969134 5334834 5755173 6472040 6548895 6238980 6449706 7261762 7836720
37357 7836720 7797424 7836347 8509608 9103747 8521564 6972313 5726071 5073689 3722310
$$ packed form
37420A1079868j789111j213807p20603n75360o49295p02307o98616o46202l64710
37411C719857K26000P16854N40948l02861j233290j767453j782839j176683L7275
37402a022192J152155J145262J42601k93098P96783K034614J233283j470247l328500
37393C90661k277871N39454K340148K048797J027519P59408J023661P64752j33548
37384F482981q04896q02292o16827o42737m61252K63609P85433J33687j187502
37375C150204j458383l9515J576017J713360P26953K31119O19972O91196k10441
37366G000482j031348o34300M20339P16867P6855l09915K10726Q12056N74958
37357G836720l9296L8923O73261N94139n82183j549251j246242o52382j351379
$$ plain form
37348 3722310 960839 -1530331 -1293689 1836651 5521759 7687400 8200979 7634311 5939170
37339 5939170 3285957 1050176 574341 1356207 1618949 586525 -693723 -783341 593008
37330 593008 2417450 3276307 2536814 1144542 951986 2599605 4419016 4321824 2517291
37321 2517291 1276212 2054170 4044640 5757622 6704182 6922804 6091424 4215052 2431010
37312 2431010 1896468 2159770 1724464 187570 -1195007 -1288331 -524769 -51212 -74905
37303 -74905 126047 708089 686905 -654375 -2306360 -2342287 -234626 2460157 4140814
37294 4140814 5102542 6633689 8784061 10290800 10672570 11144105 13111350 16835993 22027398
37285 22027398 28538228 35527589 40827765 42355383 39845133 34450525 27312076 19605257
$$ packed form
37348C722310k761471k491170K36642L130340L685108K165641N13579n66668j695141
37339E939170k653213k235781m75835P81866K62742j032424j280248q9618J376349
37330E93008J824442Q58857p39493j392272j92556J647619J819411r7192j804533
37321B517291j241079P77958J990470J712982R46560K18622q31380j876372j784042
37312B431010n34542K63302m35306j536894j382577r3324P63562M73557k3693
37303g4905K00952N82042k1184j341280j651985l5927K107661K694783J680657
37294D140814R61728J531147K150372J506739L81770M71535J967245L724643N191405
37285B2027398O510830O989361N300176J527618k510250n394608p138449p706819
$$ plain form
37277 19605257 13281762 9949701 8807722 7192589 3794407 241617 -1137594 -152618
37269 -152618 1416536 2002090 1348402 17823 -1183249 -1527070 -994473 -521393 -943314
37260 -943314 -1809059 -1926928 -999761 10691 156890 -552892 -1508753 -2040840 -1516225
37251 -1516225 229127 2213657 2868851 1795582 333815 -105484 410577 1040168 1607306
37242 1607306 2365737 2916451 2583465 1641021 957269 464010 -723473 -2431684 -3004006
37233 -3004006 -1409710 1219301 2896989 2845371 1574073 -254339 -2084031 -3140415
37225 -3140415 -2835947 -1341595 784259 3118988 5039656 5615359 4704761 3523793 3089366
37216 3089366 2653169 892189 -1754586 -3325782 -2818551 -1170139 195589 556108 -301384
$$ packed form
37277A9605257o323495l332061j141979j615133l398182l552790j379211R84976
37269a52618J569154N85554o53688j330579j201072l43821N32597M73080m21921
37260i43314q65745j17869R27167J010452J46199p09782r55861n32087N24615
37251a516225J745352J984530O55194j073269j461767m39299N16061O29591N67138
37242A607306P58431N50714l32986r42444o83752m93259j187483j708211n72322
37233c004006J594296K629011J677688n1618j271298j828412j829692j056384
37225c140415L04468J494352K125854K334729J920668N75703r10598j180968m34427
37216C089366m36197j760980k646775j571196N07231J648412J365728L60519q57492
$$ plain form
37207 -301384 -2000081 -3120502 -2270902 29912 1844039 2402249 2627105 2785784 1718664
37198 1718664 -588336 -1774193 -253984 1963677 1810502 -433574 -1603375 -199427
37190 -199427 1797491 1988825 562361 -501659 61613 1885201 3799937 4953451 5392661
37181 5392661 5646715 5561746 4123700 1148358 -1573745 -2108465 -953845 -330504 -1125809
37172 -1125809 -2214950 -2827815 -3619293 -4825877 -5296465 -4462527 -3667564 -4155927 -5046525
37163 -5046525 -4879917 -4097143 -4084441 -4413888 -3236341 -526289 1173713 174472 -1694317
37154 -1694317 -1222077 2061195 5272657 5674487 3639708 1580820 695464 -89637 -1822771
37145 -1822771 -3329894 -2431694 930157 4069725 4558025 2965989 1861744 2667541 4427688
$$ packed form
37207c01384j698697j120421Q49600K300814J814127N58210K24856J58679j067120
37198A718664k307000j185857J520209K217661j53175k244076j169801J403948
37190a99427J996918J91334j426464j064020N63272J823588J914736J153514M39210
37181E392661K54054q4969j438046k975342k722103n34720J154620O23341p95305
37172a125809j089141o12865p91478j206584m70588Q33938P94963m88363q90598
37163e046525J66608P82774J2702l29447J177547K710052J700002r99241j868789
37154a694317M72240L283272L211462M01830k034779k058888q85356p85101j733134
37145a822771j507123Q98200L361851L139568M88300j592036j104245Q05797J760147
$$ plain form
37136 4427688 5400739 4851368 3168492 1160535 -261212 -328828 912692 2320843 2635416
37127 2635416 1851199 1183185 1463760 2000640 1488942 -208796 -1883328 -2590551 -2629296
37118 -2629296 -2564373 -2129693 -893470 602586 1420145 1644452 2139509 3002736 3425866
37109 3425866 3169318 2957778 3137235 3196621 3111261 3854049 5734688 7367771 7358294 6140766
37099 6140766 5070231 4500789 3985855 3696757 4217822 5258083 5860332 5698398 5035437
37090 5035437 3739167 1707634 77799 430256 2546318 4311965 4255776 3108528 2603724
37081 2603724 3829468 6861187 10596638 12632352 10949735 6527214 2838933 1813356
37073 1813356 1718657 241652 -1877568 -2182075 -480056 786234 38343 -1604903 -2413978
$$ packed form
37136D427688R73051n49371j682876k007957j421747o7616J241520J408151L14573
37127B635416p84217o68014K80575N36880n11698j697738j674532p07223l8745
37118b629296O4923M34680J236223J496056Q17559K24307M95057Q63227M23130
37109C425866k56548k11540J79457N9386q5360P42788J880639J633083r477j217528
37099F140766j070535n69442n14934k89098N21065J040261O02249j61934o62961
37090E035437j296270k031533j629835L52457K116062J765647n6189j147248n04804
37081B603724J225744L031719L735451K035714j682617m422521l688281j025577
37073A813356r4699j477005k119220l04507J702019J266290p47891j643246q09075
$$ plain form
37064 -2413978 -2294334 -2159194 -2282830 -2270115 -2009597 -1804601 -1834460 -2057834 -2515706 -3351560
37054 -3351560 -4519866 -5566531 -5741835 -4613845 -2793030 -1645345 -1828453 -2538259 -2808100
37045 -2808100 -2959302 -3739056 -4554726 -4109941 -2691136 -2002489 -2312014 -1700860 808775
37036 808775 3201164 3202253 1631183 884618 1001698 -194413 -3111006 -5107435 -4014879
37027 -4014879 -982591 1296270 1743466 1157868 539498 387104 807818 1230058 720380
37018 720380 -522762 -884964 472624 2179559 2654754 2406070 2637079 2593350 644154
37009 644154 -2402140 -3691228 -2376758 -809133 -853155 -1397782 -903435 -250964 -1023499
37000 -1023499 -2513260 -2780896 -1813184 -1301410 -1687718 -1759264 -1286939 -1824348 -4110103
$$ packed form
37064b413978J19644J35140j23636J2715K60518K04996k9859k23374m57872q35854
37054c351560j168306j046665j75304J127990J820815J147685j83108p09806k69841
37045b808100j51202p79754q15670M44785J418805O88647l09525O11154K509635
37036H08775K392389J089j571070p46565J17080j196111k916593j996429J092556
37027d014879L032288K278861M47196n85598o18370j52394M20714M22240n09678
37018G20380j243142l62202J357588J706935M75195k48684K31009m3729j949196
37009F44154l046294j289088J314470J567625m4022n44627M94347O52471p72535
37000a023499j489761k67636R67712N11774l86308p1546M72325n37409k285755
$$ plain form
36991 -4110103 -6376537 -6304145 -3623636 35204 2996475 4458650 4311711 2949948 1078777
36982 1078777 -690023 -1901253 -2089173 -1285779 -631805 -1379233 -3009652 -3534295 -2235195
36973 -2235195 -899430 -1416179 -3236452 -4451328 -4529333 -4439779 -4503277 -3830927 -2071055
36964 -2071055 -290132 367508 -128572 -1226711 -2477972 -3189612 -2492943 -648776 533889
36955 533889 -319002 -2242786 -3184782 -2865509 -2952081 -4158940 -4750869 -3022886 -226558
36946 -226558 586254 -1565607 -4413349 -5463943 -4809183 -4103776 -3925707 -3504520 -2486720
36937 -2486720 -1507955 -1079577 -1181131 -2032739 -3945465 -6080741 -6748166 -5659514 -4641069
36928 -4641069 -5095210 -5895341 -5239527 -3765913 -3915520 -6248214 -8253472 -7511430 -4678939
$$ packed form
36991d110103k266434P2392K680509L658840K961271J462175j46939j361763j871171
36982A078777j768800j211230j87920Q03394O53974p47428j630419n24643J299100
36973b235195J335765n16749j820273j214876p8005Q9554o3498O72350J759872
36964b071055J780923O57640m96080j098139j251261p11640O96669J844167J182665
36955E33889q52891j923784r41996L19273q6572j206859n91929J727983K796328
36946b26558Q12812k151861k847742j050594O54760P05407J78069M21187J017800
36937b486720R78765M28378j01554q51608j912726k135276o67425J088652J018445
36928d641069m54141q00131O55814J473614j49607k332694k005258P42042K832491
$$ plain form
36919 -4678939 -2337599 -1763494 -2000037 -1754525 -1033921 -643511 -823979 -991626 -704160
36910 -704160 -385069 -738775 -1577725 -1793483 -817277 386846 480985 -350653 -614770 273819
36900 273819 1060047 534304 -580642 -700049 164259 326499 -1128129 -3062495 -3986737
36891 -3986737 -4043333 -4411597 -5355923 -5925071 -5378869 -3905637 -1924109 282438 1990712
36882 1990712 2204593 1072325 257600 968172 2201710 1946811 -290473 -3201327 -5540215
36873 -5540215 -7003801 -7398256 -6429095 -4641748 -3228633 -2392770 -1147034 716476 1885556
36864 1885556 1631460 1215472 1947893 3185126 3868954 4809826 7235020 9811354 9735860
36855 9735860 6872119 4278928 3920979 4124592 2494029 -576027 -2924720 -3745308 -3836934
$$ packed form
36919d678939K341340N74105k36543K45512P20604L90410j80468j67647K87466
36910g04160L19091l53706q38950k15758R76206J204123R4139q31638k64117Q88589
36900B73819P86228n25743j114946j19407Q64308J62240j454628j934366r24242
36891c986737n6596l68264r44326n69148N46202J473232J981528K206547J708274
36882A990712K13881j132268q14725P10572J233538k54899k237284k910854k338888
36873e540215j463586l94455R69161J787347J413115Q35863J245736J863510J169080
36864A885556k54096m15988P32421J237233O83828R40872K425194K576334p5494
36855I735860k863741k593191l57949K03613j630563l070056k348693q20588r1626
$$ plain form
36846 -3836934 -3555237 -2362863 -279855 1625638 2345994 1716045 200140 -1390780 -2218171
36837 -2218171 -2157648 -1932832 -1899782 -1261441 627807 2755087 3440145 2509724 1220561
36828 1220561 186499 -1198824 -3128621 -4620876 -4955555 -4723070 -4735033 -4828057 -4550880
36819 -4550880 -4277273 -4673554 -5450092 -5515010 -4285676 -2273720 -437519 635549 1007555
36810 1007555 1185363 1552831 1863842 1562852 699580 -6264 -290332 -854316 -2143840
36801 -2143840 -3229723 -2849577 -1246678 103157 567612 1015199 2103627 3086389 3122354
36792 3122354 2901963 3819494 5862881 7434974 7278468 5610572 3233902 617191 -1627806
36783 -1627806 -2382086 -1176057 761463 1678235 1418420 1399870 2412996 3502521 3524285
$$ packed form
36846c836934K81697J192374K083008J905493P20356o29949j515905j590920q27391
36837b218171O0523K24816L3050O38341J889248K127280O85058r30421j289163
36828A220561j034062j385323j929797j492255l34679K32485j1963r3024K77177
36819d550880K73607l96281p76538o4918J229334K011956J836201J073068L72006
36810A007555J77808L67468L11011l00990q63272p05844k84068n63984j289524
36801b143840j085883L80146J602899J349835M64455M47587J088428R82762L5965
36792C122354k20391R17531K043387J572093j56506j667896k376670k616711k244997
36783a627806p54280J206029J937520R16772k59815j8550J013126J089525K1764
$$ plain form
36774 3524285 2920576 3066517 4299980 5593289 6178031 6542738 7320409 7822082 6591304
36765 6591304 3470580 290635 -1120050 -1177249 -1882549 -3947150 -5706749 -5498753 -4074820
36756 -4074820 -3427783 -3815781 -3559477 -1866848 -250630 -420409 -1949509 -2977760 -2432139
36747 -2432139 -632904 1657732 3766913 5032983 5137058 4498037 3824379 3414111 3179449
36738 3179449 2934785 2344320 1173611 -78945 -599053 -670023 -1524017 -3146040 -3701524
36729 -3701524 -2342044 -1026527 -1703020 -3029416 -2383026 -281554 156636 -1918571 -3759320
36720 -3759320 -3146062 -1075358 653079 1921823 3015692 3258820 2599632 2439936 3098529
36711 3098529 2509830 -482122 -3502189 -3770976 -2145807 -1295545 -1361466 -681802 220352
$$ packed form
36774C524285o03709J45941J233463J293309N84742L64707P77671N01673j230778
36765F591304l120724l179945j410685n7199p05300k064601j759599K07996J423933
36756d074820O47037l87998K56304J692629J616218j69779j529100j028251N45621
36747b432139J799235K290636K109181J266070J04075o39021o73658m10268k34662
36738C179449k44664n90465j170709j252556n20108p0970q53994j622023n55484
36729c701524J359480J315517o76493j326396O46390K101472M38190k075207j840749
36720c759320O13258K070704J728437J268744J093869K43128o59188j59696O58593
36711C098529n88699k991952l020067k68787J625169Q50262o5921O79664R02154
$$ plain form
36702 220352 -869267 -3529616 -4587989 -2945431 -1135358 -1019900 -1140219 86861 1472597
36693 1472597 1454059 973132 1574627 2513184 2238538 1266270 980405 740571 -1034488
36684 -1034488 -3586591 -4505984 -3581690 -3159436 -4228286 -4774379 -3035273 -204103 1471290
36675 1471290 1621091 1336042 1101635 671956 151594 -186025 -544182 -874001 -213073
36666 -213073 1843358 3587400 2811716 -161488 -2786232 -3838205 -4866343 -7354745
36658 -7354745 -10072879 -10624920 -8625484 -5869774 -3954900 -3203284 -3561599 -4862869 -6000586
36649 -6000586 -5386414 -2886363 -239347 1029736 1148424 1027414 798094 289298 -30163
36640 -30163 297678 823847 1018772 1320135 2164423 2614389 1409538 -992837 -2941315
$$ packed form
36702B20352j089619k660349j058373J642558J810073J15458j20319J227080J385736
36693A472597j8538m80927O01495R38557k74646r72268k85865k39834j775059
36684a034488k552103r19393R24294M22254j068850n46093J739106K831170J675393
36675A471290J49801k85049k34407m29679n20362l37619l58157l29819O60928
36666b13073K056431J744042p75684k973204k624744j051973j028138k488402
36658g354745k718134n52041J999436K755710J914874P51616l58315j301270j137717
36649f000586O14172K500051K647016J269083J18688j21010k29320n08796l19461
36640c0163L27841N26169J94925L01363Q44288M49966j204851k402375j948478
$$ plain form
36631 -2941315 -3898612 -4555566 -4757722 -3370881 -697054 1024260 636265 -73652 1062189
36622 1062189 3460924 4819045 4365912 3416200 3185997 3649313 4337679 4806262 4367124
36613 4367124 2773483 1279643 1614401 3494869 4427067 2689972 -429232 -2221038
36605 -2221038 -1731016 -411213 128538 6827 359384 1361387 1726912 311416 -2330192
36596 -2330192 -4466991 -5000927 -4191604 -2836795 -1616203 -1227549 -2040487 -3250216 -3517212
36587 -3517212 -3016149 -3518045 -5432605 -6227207 -3609275 652490 2382946 341602 -2349555
36578 -2349555 -2595344 -1066777 -514794 -2022905 -4390960 -6185021 -6855191 -6283690 -4597593
36569 -4597593 -2483585 -829288 76030 550475 851315 919542 661436 104914 -672807
$$ packed form
36631b941315r57297o56954k02156J386841K673827J721314l87995p09917J135841
36622A062189K398735J358121m53133r49712k30203M63316O88366M68583m39138
36613D367124j593641j493840L34758J880468R32198j737095l119204j791806
36605b221038M90022J319803N39751j21711L52557J002003L65525j415496k641608
36596b330192k136799n33936Q09323J354809J220592L88654q12938j209729k66996
36587c517212N01063n01896j914560p94602K617932M261765J730456k041344k691157
36578b349555k45789J528567N51983j508111k368055j794061o70170N71501J686097
36569d597593K114008J654297R05318M74445L00840O8227k58106n56522p77721
$$ plain form
36560 -672807 -1566429 -2460846 -3250123 -3686100 -3402240 -2480530 -1693263 -1471172 -908088 1131531
36550 1131531 3955187 5428047 4756857 3502677 3127194 2909615 1447542 -857398 -2228485
36541 -2228485 -1799257 -178867 1786397 3539058 4431669 4099737 3112325 2228479 1261554
36532 1261554 -221358 -1438548 -1101340 441489 1318792 776166 306933 1473279 3712407
36523 3712407 5146226 4813587 3339149 1963785 1615827 2519035 4052961 5171881 5345679
36514 5345679 4922891 4445795 4011616 3474193 2787631 1905494 788335 -276106 -824311
36505 -824311 -856276 -794976 -673318 -53072 983026 1525993 990418 -83232 -847919 -1111860
36495 -1111860 -988698 -383110 415388 353595 -1134772 -2939895 -3432227 -2620193 -2088775
$$ packed form
36560f72807q93622q94417p89277m35977K83860R21710P87267K22091N63084K039619
36550A131531K823656J472860o71190j254180l75483k17579j462073k304940j371087
36541b228485M29228J620390J965264J752661Q92611l31932r87412q83846r66925
36532A261554j482912j217190L37208J542829Q77303n42626m69233J166346K239128
36523C712407J433819l32639j474438j375364l47958R03208J533926J118920J73798
36514E345679m22788m77096m34179n37423o86562q82137j117159j064441n48205
36505h24311l1965O1300J21658O20246J036098N42967n35575j073650p64687k63941
36495a111860J23162O05588P98498o1793j488367j805123m92332Q12034N31418
$$ plain form
36486 -2088775 -2760813 -3705051 -3398791 -1393054 1505185 3966054 4749150 3312506 385768
36477 385768 -2367577 -3630653 -3254298 -1848251 -97472 1319231 1740215 1003574 -283575
36468 -283575 -1321518 -1830433 -1993286 -1984054 -1902615 -1974956 -2387822 -2921813 -3074155 -2677276
36458 -2677276 -2265672 -2677841 -4147914 -5694051 -5645627 -3285181 -70617 1362084 -87601
36449 -87601 -2604373 -3425669 -2074386 -875940 -2038974 -4961987 -7101993 -7119351 -6235095
36440 -6235095 -6317754 -7480366 -8271012 -7826873 -6882461 -6473602 -6493379 -6192069 -5620079 -5628759
36430 -5628759 -6397653 -6862846 -6108071 -4701869 -3888731 -3732584 -2992172 -1046809 873111
36421 873111 1055699 -427342 -1568728 -642502 1945247 4268926 4950102 4205437 3055226
$$ packed form
36486b088775o72038r44238L06260K005737K898239K460869P83096j436644k926738
36477C85768k753345j263076L76355J406047J750779J416703M20984p36641j287149
36468b83575j037943n08915j62853R232Q1439p2341m12866n33991j52342L96879
36458b677276M11604m12169j470073j546137M8424K360446L214564J432701j449685
36449h7601k516772q21296J351283J198446j163034k923013k140006j7358Q84256
36440f235095q2659j162612p90646M44139R44412M08859j9777L01310N71990q680
36430e628759p68894m65193P54775J406202Q13138J56147P40412J945363J919920
36421H73111J82588j483041j141386R26226K587749K323679O81176p44665j150211
$$ plain form
36412 3055226 2080864 1170620 83948 -1183172 -2496719 -3611579 -4042405 -3406065 -2244750
36403 -2244750 -2097531 -4042806 -7142760 -9024554 -8367009 -6331666 -5082392 -5311738 -5849772
36394 -5849772 -5380663 -3648689 -989272 2261144 5359077 6985897 6395836 4467544
36386 4467544 2885533 2390214 2452770 2521083 2747593 3305494 3765028 3662794 3232853 2997631
36376 2997631 2840384 2072799 522410 -879803 -964814 233456 1172882 234784 -2454402
36367 -2454402 -4843961 -4830788 -2264321 1020967 2968224 2858945 1426132 20745 -291578
36358 -291578 600449 1740226 1936267 927789 -507715 -1650805 -2540197 -3325001 -3528176
36349 -3528176 -2622019 -1046294 103599 396934 379640 435693 121513 -833222 -1457694
$$ packed form
36412C055226r74362r10244j086672j267120j313547j114860m30826O36340J161315
36403b244750J47219j945275l099954j881794O57545K035343J249274k29346n38034
36394e849772M69109J731974K659417L250416L097933J626820n90061j928292
36386D467544j582011m95319O2556O8313K26510N57901M59534j02234m29941k35222
36376B997631j57247p67585j550389j402213q5011J198270R39426r38098k689186
36367b454402k389559J3173K566467L285288J947257j09279j432813j405387l12323
36358b91578Q92027J139777J96041j008478j435504j143090q89392p84804k03175
36349c528176R06157J575725J149893K93335j7294N6053l14180r54735o24472
$$ plain form
36340 -1457694 -404396 2125799 4149858 3972362 1943387 -294877 -1765890 -2598272
36332 -2598272 -2889033 -2327462 -1213389 -715240 -1339291 -1959468 -1389436 -362402 -693059
36323 -693059 -2653422 -4526653 -4987967 -4640501 -4600897 -4683474 -3932429 -2235994 -403973
36314 -403973 967690 1790260 1876958 975922 -527282 -1666461 -1899387 -1677571 -1888347
36305 -1888347 -2943393 -4364384 -5038639 -4010892 -1304246 2078859 5025755 6928816
36297 6928816 7476616 6545855 4695456 3074172 2153371 1089704 -858751 -2777748 -2998238
36288 -2998238 -1336362 634711 1550198 1459246 930790 48576 -1185201 -2221554 -2374834
36279 -2374834 -1509001 -12728 1489307 2166947 1263743 -1190018 -4137879 -6213093 -6638194
$$ packed form
36340a457694J053298K530195K024059j77496k028975k238264j471013q32382
36332b598272k90761N61571J114073M98149o24051o20177N70032J027034l30657
36323f93059j960363j873231m61314L47466L9604q2577P51045J696435J832021
36314d03973J371663Q22570Q6698r01036j503204j139179k32926K21816k10776
36305a888347j055046j420991o74255J027747K706646L383105K946896J903061
36297F928816N47800r30761j850399j621284r20801j063667j948455j918997k20490
36288b998238J661876J971073R15487r0952n28456q82214j233777j036353j53280
36279b374834Q65833J496273J502035O77640r03204k453761k947861k075214m25101
$$ plain form
36270 -6638194 -5593301 -4104995 -3431255 -3961527 -4706884 -4400802 -3026634 -1635368 -812519
36261 -812519 -218434 342605 435057 -134020 -858344 -1307285 -1575036 -1721066 -1652107 -1754607
36251 -1754607 -2528255 -3278953 -2520610 -268915 1507964 1611469 1289309 1977171 2921548
36242 2921548 2835879 2617053 4077727 6672414 7999027 7430380 6752608 6892697 6542013
36233 6542013 4881901 3244036 2591934 1472445 -1449747 -4358193 -4322198 -1699926 81975
36224 81975 -682332 -1774917 -551674 2296271 4071315 3952986 3527107 3678628 3044371
36215 3044371 427017 -2769634 -4105091 -3452470 -3020116 -3975243 -4844087 -4029642 -2313257
36206 -2313257 -1467651 -1565338 -1463528 -1271459 -2245934 -4285819 -5580859 -5198483 -4176984
$$ packed form
36270f638194J044893J488306O73740n30272p45357L06082J374168J391266Q22849
36261h12519N94085N61039R2452n69077p24324m48941k67751j46030O8959j02500
36251a754607p73648p50698P58343K251695J776879J03505l22160O87862R44377
36242B921548q5669k18826J460674K594687J326613n68647o77772J40089l50684
36233F542013j660112j637865o52102j119489k922192k908446L5995K622272J781901
36224H1975p64307j092585J223243K847945J775044j18329m25879J51521o34257
36215C044371k617354l196651j335457O52621M32354r55127q68844Q14445J716385
36206b313257Q45606r7687J01810J92069r74475k039885j295040L82376J021499
$$ plain form
36197 -4176984 -3380641 -2137233 -100451 1291638 822638 -371359 -510854 -40661 -740426
36188 -740426 -2514441 -3301272 -2273954 -1040455 -1045524 -1555066 -1224260 -321127 -162807
36179 -162807 -1166201 -2641228 -4088422 -5648899 -7346792 -8649929 -8910627 -7934107 -6198050
36170 -6198050 -4687369 -4191054 -4452798 -4316644 -3036693 -1158910 164084 336671 -516792
36161 -516792 -1968464 -3218780 -3110749 -1237599 993586 1409158 -458316 -2678346 -3135945
36152 -3135945 -1757569 70785 1603625 3123122 4408107 4215437 2039252 -437050
36144 -437050 -758267 1519462 4290529 5258732 4133901 2250590 749988 -231393 -977539
36135 -977539 -1576934 -1935455 -1908526 -1326939 -275580 564421 288707 -1205358 -2802463
$$ packed form
36197d176984P96343J243408K036782J392089m69000j193997j39495M70193o99765
36188g40426j774015p86831J027318J233499n069n09542L30806R03133J58320
36179a62807j003394j475027j447194j560477j697893j303137k60698R76520J736057
36170f198050J510681M96315k61744J36154J279951J877783J322994J72587q53463
36161e16792j451672j250316J08031J873150K231185M15572j867474k220030m57599
36152c135945J378376J828354J532840J519497J284985j92670k176185k476302
36144d37050l21217K277729K771067R68203j124831j883311j500602r81381p46146
36135i77539n99395l58521K6929N81587J051359Q40001k75714j494065j597105
$$ plain form
36126 -2802463 -3128812 -1871896 127402 2004838 3597648 4859663 5206548 4269618 3075270
36117 3075270 3278465 4753049 5063326 2389697 -1805322 -4440328 -4685746 -4424547 -4850544
36108 -4850544 -4690442 -2659466 145983 1724334 1707165 939070 -245497 -1546102 -1597580
36099 -1597580 370599 2354645 1567958 -1386104 -2841128 -1041863 1650382 2413247
36091 2413247 1423328 263121 -864556 -2240848 -2642813 -778311 2110823 3433952
36083 3433952 2732023 1904966 2080134 2293564 1547338 313592 -645854 -1505026 -2672237
36074 -2672237 -3898097 -4684955 -4778038 -3895803 -1853935 694746 2525528 3215997 3458554
36065 3458554 3760954 3760936 3116474 2056392 662556 -1312569 -3407238 -4382119 -3920308
$$ packed form
36126b802463l26349J256916J999298J877436J592810J262015L46885r36930j194348
36117C075270K03195J474584L10277k673629m195019k635006k45418K61199m25997
36108d850544J60102K030976K805449J578351j7169p68095j184567j300605n1478
36099a597580J968179J984046p86687k954062j455024J799265K692245P62865
36091B413247r89919j160207j127677j376292m01965J864502K889134J323129
36083C433952p01929q27057J75168K13430p46226j233746r59446q59172j167211
36074b672237j225860p86858r3083Q82235K041868K548681J830782O90469K42557
36065C458554L02400j8o44462j060082j393836j975125k094669r74881M61811
$$ plain form
36056 -3920308 -3312575 -3578084 -3992444 -3615939 -3247005 -4261344 -6063580 -6453018 -4600824
36047 -4600824 -2201024 -1287165 -2041068 -3212722 -3733843 -3331685 -2311345 -1426038 -1500690
36038 -1500690 -2555314 -3575459 -3689475 -3375142 -3903489 -5545229 -6898431 -6411983 -4352031
36029 -4352031 -2691535 -2849407 -4005081 -4171593 -2686552 -914587 -444172 -1363495 -2612066
36020 -2612066 -3303738 -3214657 -2596345 -2090361 -2274391 -2726643 -2248993 -801328 -356221
36011 -356221 -2482062 -5609561 -6470386 -4375676 -2289008 -2899447 -5117875 -5725729 -3572801
36002 -3572801 -687236 504429 -208871 -1164151 -880120 654072 2321648 3118575 3051869
35993 3051869 2861685 2969658 3010060 2483993 1453123 264449 -1060996 -2655685 -4119881
$$ packed form
36056c920308O07733k65509m14360L76505L68934j014339j802236l89438J852194
36047d600824K399800R13859p53903j171654n21121M02158J020340Q85307p4652
36038a500690j054624j020145j14016L14333n28347j641740j353202M86448K059952
36029d352031J660496j57872j155674j66512J485041J771965M70415r19323j248571
36020b612066o91672Q9081O18312N05984j84030m52252M77650J447665M45107
36011c56221k125841l127499q60825K094710K086668o10439k218428o07854K152928
36002c572801K885565J191665p13300r55280K84031J534192J667576P96927o6706
35993C051869j90184J07973M0402n26067j030870j188674j325445j594689j464196
$$ plain form
35984 -4119881 -4506483 -3225233 -857283 1086066 1372124 124656 -1420521 -2346734 -2921524
35975 -2921524 -3698769 -4266924 -3788199 -2608334 -2171209 -3065836 -4279294 -4907504 -5457268
35966 -5457268 -6576213 -7539511 -7273143 -6211919 -5736498 -6066061 -6048521 -4952855 -3213886
35957 -3213886 -1391088 348761 1578474 1716442 1077522 610663 289318 -862257 -2647578
35948 -2647578 -3229149 -1864244 -642165 -1801812 -4204618 -4437406 -1261814 2820943
35940 2820943 4744488 4086990 2491870 1205676 306791 -279073 -205742 716434 1989701
35931 1989701 2784112 2735401 2296972 2210617 2570684 2617456 1695673 202462 -779303 -579560
35921 -579560 761939 2940786 5305282 6487571 5280932 2289828 -254682 -914817
$$ packed form
35984d119881l86602J281250K367950J943349K86058j247468j545177r26213n74790
35975b921524p77245n68155M78725J179865M37125q94627j213458o28210n49764
35966e457268j118945r63298K66368J061224M75421l29563J7540J095666J738969
35957c213886J822798J739849J229713J37968o38920m66859l21345j151575j785321
35948b647578n81571J364905J222079j159647k402806k32788L175592M082757
35940B820943J923545o57498j595120j286194q98885n85864P3331R22176J273267
35931A989701P94411m8711m38429q6355L60067M6772r21783j493211r81765J99743
35921e79560J341499K178847K364496J182289j206639k991104k544510o60135
$$ plain form
35913 -914817 -428928 -26029 559613 2122281 3836701 3922453 2441178 1574516 2467152
35904 2467152 3439361 2544181 613822 50234 1249785 2194869 1689053 1101880 2062092
35895 2062092 3882572 4637511 4005832 3527623 4135086 4759962 3870588 1611879 -178871
35886 -178871 168825 2567461 5248662 6300331 5328923 3690909 3002894 3608357 4745868
35877 4745868 5805373 6686175 7078122 6394475 4739244 3114013 2173491 1466995 432716
35868 432716 -623327 -1283179 -1982219 -3125771 -3807208 -2845870 -984388 -473383 -2035923
35859 -2035923 -3680216 -3402408 -1902079 -1372929 -2348536 -3226429 -2752731 -1595300 -1152931
35850 -1152931 -1867415 -3184680 -4329238 -4511679 -3079643 -309856 2275561 3193091 2555316
$$ packed form
35913i14817M85889M02899N85642J562668J714420Q5752j481275q66662Q92636
35904B467152R72209q95180j930359n63588J199551R45084n05816n87173R60212
35895B062092J820480P54939o31679m78209O07463O24876q89374k258709j790750
35886a78871L47696K398636K681201J051669r71408j638014o88015O05463J137511
35877D745868J059505Q80802L91947o83647j655231j625231r40522p06496j034279
35868D32716j056043o59852o99040j143552o81437R61338J861482N11005j562540
35859b035923j644293K77808J500329N29150r75607q77893M73698J157431M42369
35850a152931p14484j317265j144558j82441J432036K769787K585417R17530o37775
$$ plain form
35841 2555316 1724001 1471241 1249326 462861 -389344 -489537 -59082 -40690 -595166 -884603
35831 -884603 -531165 -312860 -843909 -1441164 -1278896 -1050553 -2100252 -4019233 -4723674
35822 -4723674 -3512040 -2526726 -3847175 -6148048 -6122632 -3071986 -141569 -255181 -2315196
35813 -2315196 -2789985 -300479 2913481 4049538 2867325 1188550 274149 -231504 -972010
35804 -972010 -1543849 -998501 752337 2631724 3518797 3305838 2762979 2693810 3362530
35795 3362530 4359521 4725785 3606505 1334167 -357232 112018 2342939 4254755 4265528
35786 4265528 2605662 501384 -1019293 -1248795 106181 2089626 2666159 967364
35778 967364 -1133409 -1042444 1166735 2849806 2392575 1134194 1060571 2035533 2508154
$$ packed form
35841B555316q31315k52760k21915p86465q52205j00193M30455J8392n54476k89437
35831h84603L53438K18305n31049n97255J62268K28343j049699j918981p04441
35822d723674J211634R85314j320449k300873K5416L050646K930417j13612k060015
35813b315196m74789K489506L213960J136057j182213j678775r14401n05653p40506
35804i72010n71839N45348J750838J879387Q87073k12959n42859o9169O68720
35795C362530R96991L66264j119280k272338j691399M69250K230921J911816J0773
35786D265528j659866k104278j520677k29502J354976J983445N76533j698795
35778I67364k100773R0965K209179J683071m57231j258381p3623R74962M72621
$$ plain form
35769 2508154 1996067 1456119 1633999 2371642 3421964 4704328 5604842 5176126 3519018
35760 3519018 2125503 2227805 3339708 4063380 4031069 4341529 5923797 7903557 8123398
35751 8123398 5555840 1925065 213354 1281181 2717924 1803858 -951775 -2402590
35743 -2402590 -788634 2136285 3434921 2356326 616535 70964 1002704 2344193
35735 2344193 2793574 1814690 57782 -1281718 -1745498 -1900131 -2151283 -2013270 -1161126
35726 -1161126 -446135 -829372 -1769768 -1900822 -1161819 -917637 -1714580 -2236849 -1226425
35717 -1226425 556257 1337852 801120 451052 1493489 3239095 4049640 3396618 2383565
35708 2383565 2240508 2838230 3071764 2394623 1331503 516501 31237 -53725 584832
$$ packed form
35769B508154n12087n39948J77880P37643J050322J282364R00514m28716j657108
35760C519018j393515J02302J111903P23672l2311L10460J582268J979760K19841
35751H123398k567558l630775j711711J067827J436743r14066k755633j450815
35743b402590J613956K924919J298636j078595j739791n45571R31740J341489
35735B344193M49381r78884j756908j339500m63780j54633k51152J38013Q52144
35726a161126P14991l83237r40396j31054P39003K44182p96943n22269J010424
35717a226425J782682P81595n36732l50068J042437J745606Q10545o53022j013053
35708B383565j43057N97722K33534o77141j063120q15002m85264q4962O38557
$$ plain form
35699 584832 1615251 1812232 748390 -111308 543123 1348745 -211164 -3769757 -5777715
35690 -5777715 -4047729 -654297 994950 344703 -704709 -1019240 -908385 -284202 1514231
35681 1514231 3894981 4933625 3725181 1498479 -110537 -753456 -887886 -733350 -345696
35672 -345696 123975 818385 2107432 3698134 4588415 4387788 3905607 3867089 3793123 2844718
35662 2844718 1187946 -202136 -702606 -436609 108289 359927 -40619 -783066 -1175206
35653 -1175206 -1244609 -1876652 -3290026 -4138679 -3070780 -724045 814718 335651 -1520479
35644 -1520479 -3340449 -4047024 -3075305 -537317 2489847 4579329 5201471 4951556 4499850
35635 4499850 3870617 2842699 1473592 16872 -1251366 -1990077 -1961724 -1317962 -390389
$$ packed form
35699E84832J030419J96981j063842q59698O54431Q05622j559909l558593k007958
35690e777715J729986L393432J649247o50247j049412l14531J10855O24183J798433
35681A514231K380750J038644j208444k226702j609016o42919j34430J54536L87654
35672c45696M69671O94410J289047J590702Q90281k00627m82181l8518p3966r48405
35662B844718j656772j390082n00470K65997N44898K51638m00546p42447l92140
35653a175206o9403o32043j413374q48653J067899K346735J538763m79067j856130
35644a520479j819970p06575R71719K537988L027164K089482O22142k49915m51706
35635D499850o29233j027918j369107j456720j268238p38711K8353O43762R27573
$$ plain form
35626 -390389 716690 1893687 2573243 2180687 1007846 -51179 -644208 -1077002 -1252193
35617 -1252193 -491795 1202757 2652049 2913163 2480079 2349859 2501520 2192269 1390294
35608 1390294 923560 1205583 1623106 1396225 504423 -435183 -791811 -253204 1063010
35599 1063010 2522094 3200933 2560982 1018038 -255811 -308464 630752 1242994 460302
35590 460302 -1235721 -2165002 -1245012 867373 2657066 3474733 3986017 4994266 6223754
35581 6223754 6498962 5107158 2843009 1438791 1766383 2828056 2884769 1369505 -854900
35572 -854900 -2905706 -4618972 -5784694 -5786581 -4653174 -3554056 -3335271 -3238067 -2142359
35563 -2142359 -620521 -530907 -2663505 -5855209 -8428219 -9498526 -8933125 -7279794 -5948537
$$ packed form
35626c90389J107079J176997O79556l92556j172841j059025n93029m32794j75191
35617a252193P60398J694552J449292K61114m33084j30220J51661l09251q01975
35608A390294m66734K82023M17523k26881q91802r39606l56628N38607J316214
35599A063010J459084O78839o39951j542944j273849n2653R39216O12242p82692
35590D60302j696023r29281R19990K112385J789693Q17667N11284J008249J229488
35581F223754K75208j391804k264149j404218L27592J061673N6713j515264k224405
35572h54900k050806j713266j165722j887J133407J099118K18785R7204J095708
35563b142359J521838Q9614k132598l191704k573010j070307N65401J653331J331257
$$ plain form
35554 -5948537 -6110035 -6870327 -5845860 -2396924 958188 1595010 225561 -354090 648333
35545 648333 1212287 -45046 -1603643 -1248212 855664 2674939 3096159 2724810 2225853
35536 2225853 1396752 157814 -815845 -1118992 -1388078 -2260893 -3175760 -3077556 -1962572
35527 -1962572 -827581 -224653 238951 895119 1366457 1209236 517402 -453988 -1658806
35518 -1658806 -2873920 -3536244 -3463781 -3262975 -3506121 -3938633 -4043474 -3943357 -4055635
35509 -4055635 -4175807 -3673446 -2492069 -1318359 -828480 -1258462 -2467625 -3792725 -4118380
35500 -4118380 -2925477 -1171112 -324104 -604186 -1003188 -902960 -594172 -179001 747120
35491 747120 1942461 2292982 1396657 298382 -121942 -450085 -1437932 -2344220 -1882119
$$ packed form
35554e948537j61498p60292J024467L448936L355112O36822j369449n79651J002423
35545F48333N63954j257333j558597L55431K103876J819275M21220l71349m98957
35536B225853q29101j238938r73659l03147k69086q72815r14867R8204J114984
35527a962572J134991O02928M63604O56168M71338j57221o91834r71390j204818
35518a658806j215114o62324P2463K00806k43146m32512j04841J00117j12278
35509d055635j20172N02361J181377J173710M89879m29982j209163j325100l25655
35500d118380J192903J754365Q47008k80082l99002J00228L08788M15171R26121
35491G47120J195341L50521q96325j098275m20324l28143r87847r06288M62101
$$ plain form
35482 -1882119 -285895 884763 767448 -173318 -1405153 -2952207 -4566535 -5368601 -4770082
35473 -4770082 -3085667 -979624 1046129 2451669 2736773 2092315 1335464 792398 -184963
35464 -184963 -2123189 -4341036 -5544780 -5252970 -4088420 -2747117 -1189594 967459
35456 967459 3521342 5469843 5892044 4972837 3890623 3614891 4144979 5084774 6377957
35447 6377957 7872672 8643536 7783148 5870498 4615836 4686737 4777691 3404286 848402
35438 848402 -1466284 -2946360 -4169320 -5503677 -6482862 -6754305 -6756827 -6980375 -7164138
35429 -7164138 -6786909 -5939072 -5101955 -4335196 -3383126 -2495478 -2317782 -2724661 -2555037
35420 -2555037 -1119519 566395 867274 -357993 -1515897 -1159292 570920 2396761
$$ packed form
35482a882119J596224J170658j17315r40766j231835j547054j614328q02066N98519
35473d770082J684415K106043K025753J405540K85104o44458p56851n43066r77361
35464a84963j938226k217847j203744K91810J164550J341303J557523K157053
35456I67459K553883J948501M22201r19207j082214k75732N30088R39795J293183
35447F377957J494715P70864q60388j912650j254662P0901R0954j373405k555884
35438H48402k314686j480076j222960j334357r79185k71443k522k23548j83763
35429g164138L77229Q47837Q37117P66759R52070Q87648J77696m06879J69624
35420b555037J435518J685914L00879j225267j157904L56605J730212J825841
$$ plain form
35412 2396761 3045639 1867436 -750683 -3156939 -3425405 -1232668 1698559 3443715
35404 3443715 3648429 3183607 2887465 3215820 4222956 5022104 4096241 1252159 -1372405
35395 -1372405 -1446342 877484 3527524 5116768 5591097 4923316 3060668 1052461 312374
35386 312374 520824 25085 -1394512 -2065304 -1231616 -288026 -307537 -320280 669758 1775062
35376 1775062 1936073 1985711 3171926 4854027 5572151 5371805 5079145 4220814 1981017
35367 1981017 -369417 -581831 1001358 1457261 -567955 -2869026 -2769365 -455641 1878789
35358 1878789 2848665 2598530 1644633 271956 -1190889 -2277776 -2562381 -1841176 -474951
35349 -474951 617173 974462 1367668 2570302 3591786 2590305 -263044 -2422246 -2137534
$$ packed form
35412B396761O48878j178203k618119k406256k68466K192737K931227J745156
35404C443715K04714m64822k96142L28355J007136P99148r25863k844082k624564
35395a372405p3937K323826K650040J589244M74329o67781j862648k008207p40087
35386C12374K08450m95739j419597o70792Q33688R43590j9511j2743R90038J105304
35376A775062J61011M9638J186215J682101P18124k00346k92660q58331k239797
35367A981017k350434k12414J583189M55903k025216k301071R9661K313724K334430
35358A878789R69876k50135r53897j372677j462845j086887k84605P21205J366225
35349d74951J092124L57289L93206J202634J021484j001481k853349k159202K84712
$$ plain form
35340 -2137534 -590195 52712 -548599 -1256320 -1637182 -2264557 -3156826 -3252944 -1674832
35331 -1674832 1193030 4041490 5676904 5719408 4528783 2527870 -200708 -3397395
35323 -3397395 -6162364 -7791146 -8737334 -9631392 -9605120 -7224064 -3279264 -722304 -955338
35314 -955338 -1969712 -1461301 -118027 19574 -847631 -656997 1074517 2497236 2295142
35305 2295142 1422081 1444753 2542470 3755201 4251586 3864583 3022787 2382823 2044703
35296 2044703 1280543 -330620 -1868042 -2070466 -1044412 29332 539806 658868 320721
35287 320721 -597559 -1359772 -1251363 -1240486 -2908048 -5587037 -6628994 -5106848 -3222713
35278 -3222713 -3063947 -3882903 -3912490 -3090966 -2259967 -1157511 683679 2046225 1346893
$$ packed form
35340b137534J547339O42907o01311p07721l80862o27375q92269r6118J578112
35331a674832K867862K848460J635414M2504j190625k000913k728578l196687
35323c397395k764969j628782r46188q94058K6272K381056L944800K556960k33034
35314i55338j014374N08411J343274J37601q67205J90634J731514J422719k02094
35305B295142q73061K2672J097717J212731M96385l87003q41796o39964l38120
35296B044703p64160j611163j537422k02424J026054J073744N10474J19062l38147
35287C20721r18280p62213J08409J0877j667562k678989j041957J522146J884135
35278c222713J58766q18956k9587Q21524Q30999J102456J841190J362546o99332
$$ plain form
35269 1346893 -534875 -936171 992214 3331710 4433893 5056821 6550463 8333357
35261 8333357 8531927 6568484 3969954 2586403 2678016 2990680 2413513 1157959 108599
35252 108599 -624324 -1730375 -3174363 -3649753 -2248942 118827 1921820 2929731 3745411
35243 3745411 4020117 2834670 826608 121278 1521504 3241303 3318620 2060686 1027352
35234 1027352 643652 200372 -411406 -449948 342318 1396273 2311381 3057425 3124832 1766813
35224 1766813 -460673 -1610132 -661902 943467 1169362 200515 101177 1816679 3939940
35215 3939940 4875511 4917712 5178566 5351340 3977379 782198 -2553066 -4237210 -3985955
35206 -3985955 -2453284 -119559 2515149 4472548 5061781 4725971 4292386 3781843 2900299
$$ packed form
35269A346893j881768m01296J928385K339496J102183O22928J493642J782894
35261H333357J98570j963443k598530j383551R1613L12664n77167j255554j049360
35252A08599p32923j106051j443988m75390J400811K367769J802993J007911Q15680
35243C745411K74706j185447k008062p05330J400226J719799P7317j257934j033334
35234A027352l83700m43280o11778l8542P92266J053955R15108P46044O7407j358019
35224A766813k227486j149459R48230J605369K25895r68847r9338J715502K123261
35215C939940R35571M2201K60854J72774j373961l195181l335264j684144K51255
35206c985955J532671K333725K634708J957399N89233l35810m33585n10543q81544
$$ plain form
35197 2900299 2296880 2992303 4504891 4931077 3423269 1450622 838255 1503603 2103683
35188 2103683 2168173 2352198 2930323 3363161 3472287 3899993 4964261 5898856 5781893
35179 5781893 4642072 3135351 1627066 175110 -958933 -1441841 -1328155 -799729 401570
35170 401570 2602070 5240754 6988464 7075265 5970155 4506244 2942723 1324819 171142
35161 171142 42420 670549 1232034 1420659 1647497 2284072 3408090 5229878 7850940
35152 7850940 10383844 11282138 10134351 8421188 7850656 8561511 9655834 10784925 12129171
35143 12129171 13270347 13466291 13147743 13921148 16665546 20623051 24929070 30109857
35135 30109857 37184346 45923217 55148615 64687433 76024071 90795273 109698733 133788468
$$ packed form
35197B900299o03419O95423J512588M26186j507808j972647o12367O65348O00080
35188B103683O4490J84025N78125M32838J09126M27706J064268R34595j16963
35179E781893j139821j506721j508285j451956j134043m82908J13686N28426J201299
35170D01570K200500K638684J747710Q6801j105110j463911j563521j617904j153677
35161A71142j28722O28129N61485J88625K26838O36575J124018J821788K621062
35152G850940K532904Q98294j147787j713163n70532P10855J094323J129091J344246
35143A2129171J141176J95944l18548P73405K744398L957505M306019N180787
35135C0109857P074489Q738871R225398R538818J1336638J4771202J8903460K4089735
$$ plain form
35127 133788468 165955208 208562366 257491714 299098234 316229385 300350814 258539805
35120 258539805 207886438 162893222 128295966 102111301 82096792 67702625 57907696
35113 57907696 50211433 42397328 34145171 26554639 20803403 17417401 16110320 15955626
35105 15955626 16062722 16253415 16807356 17570105 17759561 16780671 14873333 12785701 11065486
35096 11065486 9820732 8941187 8308570 7818592 7351320 6830363 6350137 6177723 6522151
35087 6522151 7321206 8305480 9119097 9260094 8229488 6118016 3755410 1774242 -108567
35078 -108567 -2117924 -3179860 -2013894 510420 1735573 586760 -898878 -439143
35070 -439143 1424020 2481528 1972505 894084 10630 -593720 -437315 931105 2498553
$$ packed form
35127A33788468L2166740M2607158M8929348M1606520J7131151j5878571m1811009
35120B58539805n0653367m4993216l4597256k6184665k0014509j4394167r794929
35113E7907696p696263p814105q252157p590532n751236l386002j307081j54694
35105A5955626J07096J90693N53941P62749J89456r78890j907338k087632j720215
35096A1065486j244754q79545o32617m89978m67272n20957m80226j72414L44428
35087F522151P99055R84274Q13617J40997j030606k111472k362606j981168j882809
35078a08567k009357j061936J165966K524314J225153j148813j485638M59735
35070d39143J863163J057508n09023j078421q83454o04350J56405J368420J567448
$$ plain form
35061 2498553 2615677 1371442 413262 323440 155868 -128243 879171 3148643 4038411
35052 4038411 1697104 -2004684 -3790539 -2953338 -1107888 872456 3294531 5563637
35044 5563637 6238523 5508107 5472884 7179282 9047520 9164217 7703581 5953901 4195328
35035 4195328 2099176 501661 887864 2910781 4023309 2468701 -362134 -1694512
35027 -1694512 -899655 165344 253714 389251 1581609 2465670 1009966 -2148316 -4090241
35018 -4090241 -3330222 -1321900 -18871 157501 -649688 -2635229 -5042676 -5847283 -4457150
35009 -4457150 -3257357 -4472583 -6688097 -6835127 -4874157 -3832392 -5218699 -7022244
35001 -7022244 -6928424 -5276927 -3714569 -2690834 -1705294 -876591 -843412 -1641095 -2674485
$$ packed form
35061B498553J17124j244235r58180q9822j67572k84111J007414K269472Q89768
35052D038411k341307l701788j785855Q37201J845450J980344K422075K269106
35044E563637O74886p30416l5223J706398J868238J16697j460636j749680j758573
35035D195328k096152j597515L86203K022917J112528j554608k830835j332378
35027a694512P94857J064999Q8370J35537J192358Q84061j455704l158282j941925
35018d090241P60019K008322J303029J76372q07189j985541k407447q04607J390133
35009d457150J199793j215226k215514j47030J960970J041765j386307j803545
35001g022244R3820J651497J562358J023735R85540Q28703L3179p97683j033390
$$ plain form
34992 -2674485 -3456369 -3708453 -3100375 -1463699 891030 3229156 4514019 3767621 1150674
34983 1150674 -1414223 -1799500 -99138 1446775 1155761 -466727 -1950868 -2458482 -1758681
34974 -1758681 39620 1945926 2366374 844060 -1174323 -1922987 -972680 981147 2851768
34965 2851768 3231400 1158535 -2260879 -4247261 -3443941 -1532664 -719496 -874684 -552458
34956 -552458 348698 756725 497956 328671 274874 -299005 -1120486 -1198235 -671313 -927634
34946 -927634 -2531153 -4249759 -4565599 -3300642 -1489191 -283366 -33340 36969 965319
34937 965319 2401483 2575011 745434 -1299739 -1546320 -621717 -538366 -1295384 -1093781
34928 -1093781 181348 281646 -1935159 -4636291 -5740401 -5611584 -5622451 -5586075 -4374399
$$ packed form
34992b674485p81884k52084O08078J636676K354729K338126J284863p46398k616947
34983A150674k564897l85277J700362J545913k91014j622488j484141n07614O99801
34974a758681J798301J906306M20448j522314k018383p48664R50307J953827J870621
34965B851768L79632k072865l419414j986382Q03320J911277Q13168j55188L22226
34956e52458R01156M08027k58769j69285n3797n73879q21481p7749N26922k56321
34946i27634j603519j718606l15840J264957J811451J205825K50026P0309R28350
34937I65319J436164J73528j829577k045173k46581R24603Q3351p57018K01603
34928a093781J275129J00298k216805k701132j104110J28817j0867L6376J211676
$$ plain form
34919 -4374399 -2208286 -627691 -426221 -867649 -956739 -633145 -587844 -1332678 -2527433
34910 -2527433 -3221944 -2986904 -2575591 -2826120 -3125489 -2033131 428665 2284485 1960550
34901 1960550 223653 -903607 -536004 401563 560920 -183545 -434275 1180659 3907333
34892 3907333 5045617 3105588 -6666 -1352814 -778596 -431084 -986330 -950579 108751
34883 108751 489358 -512999 -1028195 348151 2249062 3013095 3328511 4321754 4881874
34874 4881874 3348957 554911 -1245786 -1537626 -1402745 -1105686 -132167 990743 1159541
34865 1159541 584439 258609 86650 -487818 -696091 442860 1785363 1321440 -477810
34856 -477810 -1034067 630926 2857318 3975419 3685003 1978262 -705303 -2216203 -418872
$$ packed form
34919d374399K166113J580595K01470m41428q9090L23594M5301p44834j194755
34910b527433o94511K35040M11313k50529k99369J092358K461796J855820l23935
34901A960550j736897j127260L67603R37567J59357p44465k50730J614934K726674
34892C907333J138284j940029l112254j346148N74218L47512n55246L5751J059330
34883A08751L80607j002357n15196J376346J900911P64033L15416R93243N60120
34874D881874j532917k794046j800697k91840J34881K97059R73519J122910J68798
34865A159541n75102l25830j71959n74468k08273J138951J342503m63923j799250
34856d77810n56257J664993K226392J118101k90416j706741k683565j510900J797331
$$ plain form
34847 -418872 3426764 5758221 5597168 5324399 5954838 5179982 1656851 -2105392 -3394862
34838 -3394862 -3019178 -2885241 -2421789 -376523 1871321 2101115 1040215 1148594 2452768
34829 2452768 2724126 1403053 309936 402440 625249 367287 496132 1234831 1243482 -220287
34819 -220287 -2008253 -2905155 -3251015 -3804101 -4291753 -4139763 -3689240 -3682730 -4124247 -4406267
34809 -4406267 -4158578 -3439521 -2400403 -1112876 431482 2129316 3339661 3068349 1241876
34800 1241876 -618245 -979368 -318790 -444189 -1915198 -3447719 -4032579 -4262671 -5031690
34791 -5031690 -6099421 -6645596 -6281220 -4810411 -1947496 1804169 4756028 5645844 5293269
34782 5293269 5594650 6934750 7563420 5821497 2306823 -654364 -1399488 -339912 964285
$$ packed form
34847d18872L845636K331457j61053k72769O30439p74856l523131l762243j289470
34838c394862L75684J33937M63452K045266K247844K29794j060900J08379J304174
34829B452768K71358j321073j093117R2504K22809k57962J28845P38699Q651j463769
34819b20287j787966q96902l45860n53086m87652J51990M50523O510m41517k82020
34809d406267K47689P19057J039118J287527J544358J697834J210345k71312j826473
34800A241876j860121l61123O60578j25399j471009j532521n84860k30092p69019
34791e031690j067731n46175L64376J470809K862915L751665K951859Q89816l52575
34782E293269L01381J340100O28670j741923l514674k961187p45124J059576J304197
$$ plain form
34773 964285 1627975 1936364 2247641 2128106 962492 -1016696 -2865069 -3911487 -4116792
34764 -4116792 -3595326 -2372605 -709597 798690 1686067 1995467 2079379 2066802 1529462
34755 1529462 -204707 -3127634 -6045945 -7540054 -7449510 -6704583 -5645525 -3650477 -897136
34746 -897136 899882 709081 85085 1262874 3932480 5580164 4816829 2744645 1016505
34737 1016505 127920 -180798 -396723 -1480031 -4098878 -7041597 -7858861 -5909682 -3504874
34728 -3504874 -3087645 -4394478 -5480030 -5582886 -5615878 -6258199 -6846954 -6321752 -4618419
34719 -4618419 -2926656 -2639074 -3874555 -5162990 -5079637 -3981293 -3309852 -3430528 -3469211
34710 -3469211 -3314600 -4058367 -5804390 -6735196 -5539715 -3408628 -2207328 -1778153 -680703
$$ packed form
34773I64285O63690L08389L11277j19535j165614j979188j848373j046418k05305
34764d116792N21466J222721J663008J508287Q87377L09400Q3912j2577n37340
34755A529462j734169k922927k918311j494109R0544P44927J059058J995048K753341
34746h97136J797018j90801o23996J177789K669606J647684p63335k072184j728140
34737A016505q88585l08718k15925j083308k618847k942719q17264J949179K404808
34728c504874M17229j306833j085552j02856l2992o42321n88755N25202J703333
34719d618419J691763K87582j235481j288435Q3353J098344O71441j20676l8683
34710c469211J54611p43767j746023r30806J195481K131087J201300M29175J097450
$$ plain form
34701 -680703 1189765 2522938 2803368 2902184 3376677 3580740 2813373 1402836 358032
34692 358032 517589 1999226 3924432 4913065 4452862 3428935 2707500 1865874 257063
34683 257063 -1413119 -1946955 -1598197 -1534418 -1530758 -12334 3241093 6098793 6594838
34674 6594838 5210300 3754310 2935223 2063819 592125 -1061245 -2140736 -2434880 -2496157
34665 -2496157 -3127870 -4486362 -5702741 -5761320 -4764832 -3894643 -4084798 -5160385 -6243084
34656 -6243084 -6491972 -5491284 -3524000 -1538088 -334891 216265 718133 1227809 1338349
34647 1338349 1007175 458854 -518028 -2141793 -3590720 -3570784 -2122605 -797982 -788754
34638 -788754 -1855601 -3241640 -4482713 -5082540 -4672975 -3900083 -3877696 -4352841 -3863299
$$ packed form
34701f80703J870468J333173K80430R8816M74493K04063p67367j410537j044804
34692C58032J59557J481637J925206R88633m60203j023927p21435q41626j608811
34683B57063j670182n33836L48758O3779L660J518424L253427K857700M96045
34674F594838j384538j455990q19087q71404j471694j653370j079491k94144o1277
34665b496157o31713j358492j216379n8579R96488Q70189j90155j075587j082699
34656f243084k48888J000688J967284J985912J203197N51156N01868N09676J10540
34647A338349l31174n48321r76882j623765j448927J9936J448179J324623R228
34638g88754j066847j386039j241073n99827M09565P72892K2387m75145M89542
$$ plain form
34629 -3863299 -2248525 -1280443 -1870606 -2462851 -1609661 -423121 -578900 -1392182 -1277210
34620 -1277210 -1024948 -2718614 -5679961 -6559658 -4128293 -1306317 -1138492 -2897185 -3862141
34611 -3862141 -3334788 -2837163 -3171312 -3308508 -2142283 159729 2730569 4774116 5515715
34602 5515715 4447288 2211691 576031 783986 2101059 2562688 1239858 -693317
34594 -693317 -1433680 -702981 220835 542026 1015356 2356557 3436627 2363896 -745212
34585 -745212 -3388264 -3535966 -1914517 -795720 -1252543 -2427107 -3061946 -2823583 -2113790
34576 -2113790 -1302418 -495729 167853 298199 -442020 -1697854 -2387544 -1811324 -683514
34567 -683514 -398788 -1257849 -2253596 -2775741 -3407300 -4427575 -4723286 -3416563 -1748769
$$ packed form
34629c863299J614774R68082n90163n92245Q53190J186540j55779q13282J14972
34620a277210K52262j693666k961347q79697K431365K821976J67825j758693r64956
34611c862141N27353M97625l34149j37196J166225K302012K570840K043547P41599
34602E515715j068427k235597j635660K07955J317073M61629j322830j933175
34594f93317p40363P30699R23816L21191M73330J341201J080070j072731l109108
34585g45212k643052j47702J621449J118797m56823j174564o34839K38363P09793
34576b113790Q11372Q06689O63582J30346p40219j255834o89690N76220J127810
34567f83514K84726q59061r95747n22145o31559j020275k95711J306723J667794
$$ plain form
34558 -1748769 -1735905 -3223951 -3951679 -2735335 -972578 -347794 -519371 -206905 502431
34549 502431 382076 -869294 -2163277 -2598533 -2391584 -2082742 -1766482 -1410796 -1151759
34540 -1151759 -881067 -175415 962035 1857917 2100700 2164224 2558538 2890385 2526316
34531 2526316 1795756 1514598 1367314 -37465 -2963830 -5396339 -5143990 -2663311 -609682
34522 -609682 -528240 -1155657 -522664 1330348 2828440 3415092 4117526 5448323 6249702
34513 6249702 5488146 4124545 3914926 4859611 5213332 3971286 2031911 632491 -98351
34504 -98351 -440089 -106302 1056694 2221419 2523709 2316876 2418571 2592086 2019589
34495 2019589 973532 570022 848962 628833 -375668 -851985 -83551 568647 -432665
$$ packed form
34558a748769J2864j488046p27728J216344J762757O24784j71577L12466P09336
34549E02431j20355j251370j293983m35256K06949L08842L16260L55686K59037
34540a151759K70692P05652J137450Q95882K42783O3524L94314L31847l64069
34531B526316p30560k81158j47284j404779k926365k432509K52349K480679K053629
34522f09682Q1442o27417O32993J853012J498092N86652P02434J330797Q01379
34513F249702p61556j363601k09619R44685L53721j242046j939375j399420p30842
34504i8351l41738L33787J162996J164725L02290k06833J01695J73515n72497
34495B019589j046057m03510K78940k20129j004501m76317P68434O52198j001312
$$ plain form
34486 -432665 -2477713 -3760395 -3795938 -3497860 -3246201 -2573993 -1742466 -1957555 -3558694
34477 -3558694 -5287106 -5888735 -5342412 -4040269 -2023132 232515 1564721 1789680 2489585
34468 2489585 4667468 6500730 5336454 1592009 -1427849 -1908618 -1671762 -3032454
34460 -3032454 -5376703 -6489653 -6025241 -5619120 -6020152 -6103629 -4898506 -2902912 -917972
34451 -917972 947664 2431938 2636612 1376735 -30324 -384403 -138029 -208606 -153805
34442 -153805 1001627 2737837 3571707 3450226 3872005 5437497 6981757 7632767 8051434
34433 8051434 8751905 8710424 6910529 4172115 2125414 1187411 788787 767352 1100283
34424 1100283 962875 -261727 -1417310 -757356 1417042 3040502 3284721 3426838 4303802
$$ packed form
34486d32665k045048j282682l5543K98078K51659O72208Q31527k15089j601139
34477c558694j728412o01629N46323J302143K017137K255647J332206K24959O99905
34468B489585K177883J833262j164276l744445l019858m80769K36856j360692
34460c032454k344249j112950M64412M06121m01032q3477J205123J995594J984940
34451i17972J865636J484274K04674j259877j407059l54079K46374p0577N4801
34442a53805J155432J736210Q33870j21481M21779J565492J544260O51010M18667
34433H051434P00471m1481j799895k738414k046701r38003l98624k1435L32931
34424A100283j37408j224602j155583O59954K174398J623460K44219J42117Q76964
$$ plain form
34415 4303802 4811872 3887897 2355314 1533140 1270942 714159 -48677 -580038 -1386954
34406 -1386954 -2834688 -3367379 -902949 3918962 7848407 8957993 8708646 9090145 9296551
34397 9296551 7008000 2242349 -2026718 -3306417 -2112691 -451471 894006 2334536
34389 2334536 3533928 3233458 1258778 -725574 -1280182 -1003370 -1239787 -1801265 -1455318
34380 -1455318 -324039 -8555 -984298 -1575987 -462667 1188386 1456469 597944 635212
34371 635212 2398561 4540773 5576651 5566590 5410245 5509277 5608445 5220044 3813878
34362 3813878 1228969 -1718482 -3551516 -3407027 -1706474 421005 1848648 1721914
34354 1721914 4252 -1922454 -2085510 27947 2738249 3932856 3144627 1638863
$$ packed form
34415D303802N08070r23975j532583q22174k62198n56783p62836n31361q06916
34406a386954j447734n32691K464430M821911L929445J109586k49347L81499K06406
34397I296551k288551m765651m269067j279699J193726J661220J345477J440530
34389B334536J199392l00470j974680j984352n54608K76812k36417n61478L45947
34380a455318J131279L15484r75743n91689J113320J651053K68083q58525L7268
34371F35212J763349K142212J035878j0061j56345R9032R9168l88401j406166
34362C813878k584909k947451j833034J44489J700553K127479J427643j26734
34354A721914j717662j926706j63056K113457K710302J194607p88229j505764
$$ plain form
34346 1638863 1046079 2226791 4773134 7099514 7569132 5996196 3564472 1132047
34338 1132047 -1360877 -3416163 -3461997 -1137382 1115100 674731 -1582451 -2328603 -509358
34329 -509358 1161992 129127 -2551008 -3983371 -3232785 -1728449 -716790 -1993 1004988
34320 1004988 2401690 4042569 5592189 6240935 5359006 3600163 2442678 2420054 2704282
34311 2704282 2694761 2956175 3976132 4991357 5072660 4742192 5264002 6488952 6676156
34302 6676156 4819712 2171012 781221 1117734 1835104 1587198 336531 -1096954 -2139014
34293 -2139014 -2840016 -3422542 -3675999 -2875731 -554752 2462560 4218142 3442770 1102033
34284 1102033 -583816 -702866 -403539 -822822 -1286693 -434181 1575437 3200921 3686363
$$ packed form
34346A638863n92784J180712K546343K326380M69618j572936k431724k432425
34338A132047k492924k055286m5834K324615K252482m40369k257182p46152J819245
34329e09358J671350j032865k680135j432363P50586J504336J011659P14797J006981
34320A004988J396702J640879J549620O48746q81929j758843j157485k2624K84228
34311B704282r521K61414J019957J015225Q1303l30468N21810J224950J87204
34302F676156j856444k648700j389791L36513P17370k47906j250667j433485j042060
34293b139014p01002n82526k53457Q00268K320979L017312J755582p75372k340737
34284A102033j685849j19050K99327m19283m63871Q52512K009618J625484M85442
$$ plain form
34275 3686363 3883536 4685297 5701443 6046177 5694060 5417358 5823899 6888760 7927836
34266 7927836 7667606 5149548 1338502 -907609 336299 3579750 5462849 4638163
34258 4638163 2732503 1335469 -211635 -3039224 -6174874 -7404024 -6191413 -4228737
34250 -4228737 -3154191 -3085596 -3557444 -4498753 -5632308 -6012675 -5136171 -3889825 -3473108
34241 -3473108 -3757282 -3616160 -2682257 -1828433 -1808959 -2244317 -2278129 -1643596 -690878 192899
34231 192899 747648 736683 174244 -460416 -685169 -703872 -1214496 -2356548 -3205007 -2722221
34221 -2722221 -1136896 82388 -166941 -1413209 -2407792 -2810508 -3324772 -4138631 -4229835
34212 -4229835 -2854243 -951737 -41276 -119199 127276 1075708 1517351 672064 -461986
$$ packed form
34275C686363J97173Q01761J016146L44734l52117k76702M06541J064861J039076
34266G927836k60230k518058l811046k246111J243908L243451J883099q24686
34258D638163j905660j397034j547104k827589l135650j229150J212611J962676
34250d228737J074546O8595m71848r41309j133555l80367Q76504J246346M16717
34241c473108k84174J41122R33903Q53824J9474m35358l3812O34533R52718Q83777
34231A92899N54749j0965n62439o34660k24753j8703n10624j142052q48459M82786
34221b722221J585325J219284k49329j246268r94583m02716n14264q13859r1204
34212d229835J375592J902506R10461p7923K46475R48432M41643q45287j134050
$$ plain form
34203 -461986 -651062 -245522 -265523 -495105 -47731 535185 -424834 -2975780 -4658728
34194 -4658728 -3368280 -78383 2325224 2267507 522934 -1421727 -2758511 -3146655 -2344644
34185 -2344644 -609774 1178580 2316567 2880167 3221323 3202476 2334936 536896 -1550388
34176 -1550388 -2963645 -3028261 -1795250 -135014 758214 328541 -786612 -1339054 -644982
34167 -644982 931001 2540028 3533592 3530070 2301074 72050 -2256482 -3763675 -4483544
34158 -4483544 -5252708 -6394548 -7061439 -6299718 -4368101 -2424211 -1149704 -345589 249873
34149 249873 562741 716011 1122770 1695467 1736204 1134877 919648 1846277 3093154 3388028
34139 3388028 2955005 2997581 3339682 2170620 -1246875 -4924958 -6284782 -5159754 -3566620
$$ packed form
34203d61986j89076M05540k0001k29582M47374N82916r60019k550946j682948
34194d658728J290448L289897K403607n7717j744573j944661j336784l88144Q02011
34185b344644J734870J788354J137987N63600L41156j8847q67540j798040k087284
34176a550388j413257o4616J233011J660236Q93228m29673j115153n52442O94072
34167f44982J575983J609027R93564l522j228996k229024k328532j507193p19869
34158d483544p69164j141840o66891P61721J931617J943890J274507Q04115N95462
34149B49873L12868J53270M06759N72697M0737o01327k15229R26629J246877K94874
34139C388028m33023M2576L42101j169062l417495l678083j359824J125028J593134
$$ plain form
34130 -3566620 -3024412 -3327903 -3741267 -4049575 -4153319 -3731843 -2862005 -2239480 -2337848 -2998207
34120 -2998207 -4150840 -5982754 -7778294 -7712107 -5035254 -1716711 -334880 -674519 -242201
34111 -242201 1714086 2849860 1431164 -517045 251337 3520077 5691895 4403238
34103 4403238 1024593 -1793871 -3153708 -3558331 -3106090 -1520209 734955 2647712
34095 2647712 3701415 3916138 3319165 2265189 1797701 2553542 3498065 2907529 716257
34086 716257 -1135930 -1012808 543986 1618128 1051112 -505861 -1281282 -55239 2439309
34077 2439309 3918284 2978552 924763 215485 1172629 1575823 -80267 -2373253 -2994219
34068 -2994219 -1874147 -902411 -1187190 -2089612 -2773843 -3263247 -3746029 -4051923 -4273598
$$ packed form
34130c566620N42208l03491m13364l08308j03744M21476Q69838O22525r8368o60359
34120b998207j152633j831914j795540O6187K676853L318543J381831l39639M32318
34111b42201J956287J135774j418696j948209P68382L268740K171818j288657
34103D403238l378645k818464j359837m04623M52241J585881K255164J912757
34095B647712J053703K14723n96973j053976m67488P55841R44523n90536k191272
34086G16257j852187J23122J556794J074142n67016j556973p75421J226043K494548
34077B439309J478975r39732k053789p09278R57144M03194j656090k292986o20966
34068b994219J120072R71736k84779r02422o84231m89404m82782l05894k21675
$$ plain form
34059 -4273598 -4973061 -6239934 -7237365 -7156493 -6034078 -4241068 -1865622 814502 2872485
34050 2872485 3533176 3100442 2393401 1560688 222530 -1429253 -2609156 -3083741 -3435808
34041 -3435808 -3888173 -3719625 -2434018 -847175 -204084 -546885 -785581 -330941 97740
34032 97740 -534969 -2325877 -4373378 -5572867 -5353745 -4051759 -2683193 -1917307 -1170741
34023 -1170741 701198 3577104 5610464 5138690 2581187 -153711 -1774023 -2470908
34015 -2470908 -2994118 -3643092 -4149405 -3966194 -2696048 -712511 812107 1098363 808558
34006 808558 1179174 2205854 2554440 1392187 -512411 -1769599 -1759579 -821409 247526
33997 247526 583810 -220791 -1647604 -2711673 -2941385 -2395354 -993257 1132349 2769071
$$ packed form
34059d273598o99463j266873r97431Q0872J122415J793010K375446K680124K057983
34050B872485O60691m32734p07041q32713j338158j651783j179903m74585l52067
34041c435808m52365J68548J285607J586843O43091l42801k38696M54640M28681
34032I7740o32709j790908k047501j199489K19122J301986J368566P65886P46566
34023a170741J871939K875906K033360m71774k557503k734898j620312o96885
34015b470908n23210o48974n06313J83211J270146J983537J524618K86256k89805
34006H08558L70616J026680L48586j162253j904598j257188J0020R38170J068935
33997B47526L36284q04601j426813j064069k29712N46031J402097K125606J636722
$$ plain form
33988 2769071 2574687 1139999 493214 1016528 731574 -1300169 -2944734 -2290945 -1217323
33979 -1217323 -2869230 -6437932 -7647756 -4714381 -870346 169449 -1177804 -2017578
33971 -2017578 -1462356 -1189148 -2172712 -3004217 -1922695 686157 2574401 2118031 62711
33962 62711 -1394101 -1155192 -371680 -714401 -2109897 -3062713 -2849455 -2209099 -1880839
33953 -1880839 -1708098 -1445747 -1255480 -988540 -138811 965428 1086851 -121424 -1338615
33944 -1338615 -1382817 -733188 -360282 -129906 460916 875076 252473 -1005715 -1656746
33935 -1656746 -1269315 -350624 769112 2012165 2857743 2800896 2331932 2330737 2655316 2452033
33925 2452033 1677803 1083435 775463 105950 -917136 -1379268 -822991 300742 1670273
$$ packed form
33988B769071j94384j434688o46785N23314k84954k031743j644565O53789J073622
33979a217323j651907l568702j209824K933375L844035J039795j347253q39774
33971b017578N55222K73208r83564q31505J081522K608852J888244m56370k055320
33962F2711j456812K38909P83512l42721j395496r52816K13258O40356L28260
33953a880839J72741K62351J90267K66940Q49729J104239J21423j208275j217191
33944a338615m4202O49629L72906K30376N90822M14160o22603j258188o51031
33935a656746L87431R18691J119736J243053Q45578n6847m68964j195L24579k03283
33925B452033p74230n94368l07972o69513j023086m62132N56277J123733J369531
$$ plain form
33916 1670273 3259920 4259116 3433152 1266737 251291 1900321 4580076 5542749 4257428
33907 4257428 2380941 1070897 -75804 -1504508 -2619307 -2672362 -1772615 -494834 903285
33898 903285 2436382 3970439 5176918 5651648 4996219 3234978 1307850 550101 1237775
33889 1237775 2132096 2081922 1674785 2367961 4069980 4797755 3309242 1038988 295552
33880 295552 1107549 1253399 -605565 -3212719 -4543847 -4128289 -2851917 -1481486 -315412
33871 -315412 455046 1007340 1938442 3170944 3447379 1944456 -205689 -1179091 -713216
33862 -713216 200441 1303938 3023896 4661940 4641418 2933675 1408749 1117916 966529
33853 966529 -8618 -786670 -163295 1040962 1303834 950390 1493917 2922449 3517301
$$ packed form
33916A670273J589647R99196q25964k166415j015446J649030K679755R62673j285321
33907D257428j876487j310044j146701j428704j114799n3055Q99747J277781J398119
33898I03285J533097J534057J206479M74730o55429j761241j927128p57749O87674
33889A237775Q94321n0174m07137O93176J702019P27775j488513k270254p43436
33880B95552Q11997J45850j858964k607154j331128M15558J276372J370431J166074
33871c15412P70458N52294R31102J232502K76435j502923k150145r73402M65875
33862g13216R13657J103497J719958J638044k0522j707743j524926k90833j51387
33853I66529r75147p78052O23375J204257K62872l53444N43527J428532N94852
$$ plain form
33844 3517301 2368019 430672 -1143580 -2220783 -2751030 -2061961 -50400 1867200
33836 1867200 2156187 1147015 603074 1339202 2182891 1642497 -104646 -1597040 -2143697
33827 -2143697 -2577170 -3761806 -5230399 -5945461 -5747746 -5133454 -4088629 -2383194 -857820
33818 -857820 -946799 -2570741 -3848031 -3523104 -2459838 -1966551 -1923671 -1682026 -1620640 -2280968
33808 -2280968 -2805602 -2016780 -628315 -543549 -1972323 -3044666 -2620411 -1754484 -1658762
33799 -1658762 -1787754 -1133625 -281887 -683135 -2347365 -3655190 -3521754 -2654300 -2266601
33790 -2266601 -2326998 -1814237 -501698 283908 -869307 -3536246 -5642587 -5681513 -4147453
33781 -4147453 -2466040 -1193412 27604 1268733 2125787 2599555 3116090 3531065 3159126
$$ packed form
33844C517301j149282j937347j574252j077203n30247O89069K011561J917600
33836A867200K88987j009172n43941P36128Q43689n40394j747143j492394n46657
33827b143697m33473j184636j468593p15062J97715O14292J044825J705435J525374
33818h57820q8979j623942j277290L24927J063266M93287M2880K41645O1386o60328
33808b280968n24634P88822J388465Q4766j428774j072343M24255Q65927R5722
33799a658762j28992O54129Q51738m01248j664230j307825J33436Q67454L87699
33790b266601o0397N12761J312539P85606j153215k666939k106341l8926J534060
33781d147453J681413J272628J221016J241129Q57054M73768N16535M14975l71939
$$ plain form
33772 3159126 2213854 2211492 4073815 6401879 6655501 4024228 374698 -1835007 -2017786
33763 -2017786 -1512220 -1633059 -2342487 -2901898 -3122265 -3347925 -3569900 -3470798 -3394137 -4221258
33753 -4221258 -5759153 -6216862 -4312260 -1382440 -230235 -1901614 -4532902 -5517509
33745 -5517509 -4096950 -1677804 -203555 -411443 -1341782 -1524688 -768825 -357330 -1219690
33736 -1219690 -2739674 -4026152 -5266628 -6529894 -6292645 -3237138 925636 2805426
33728 2805426 1694443 228093 158552 81699 -1330831 -2386065 -927204 1896941 3036284
33719 3036284 1829151 425410 336614 908693 1234866 1403197 1438829 881473 41943
33710 41943 127814 1426672 2665407 2823734 2355269 1935869 1289701 228302 -283385
$$ packed form
33772C159126r45272k362J862323K328064K53622k631273l649530k209705j82779
33763b017786N05566j20839p09428n59411k20367k25660k21975R9102P6661q27121
33753d221258j537895m57709J904602K929820J152205j671379k631288r84607
33745e517509J420559K419146J474249k07888r30339j82906P55863M11495q62360
33736a219690j519984j286478j240476j263266K37249L055507M162774J879790
33728B805426j110983j466350o9541p6853j412530j055234J458861K824145J139343
33719C036284j207133j403741q8796N72079L26173J68331L5632n57356q39530
33710D1943Q5871J298858J238735J58327m68465m19400o46168j061399n11687
$$ plain form
33701 -283385 556773 1636505 919918 -1817738 -4345864 -4424727 -2255692 -62701 461473
33692 461473 -187300 -281367 975277 2808868 4320268 5660317 7201326 8347027 8275151
33683 8275151 7458037 7082476 6929520 5303005 1628110 -2150479 -3699724 -2941575 -1581820
33674 -1581820 -728344 -167939 405348 804754 1125315 1960695 3328562 4129720 3367517
33665 3367517 1605326 594728 1402749 3278132 4534602 4306846 3136725 1963913
33657 1963913 1085547 341166 -261651 -759729 -1700384 -3458377 -5113507 -5061012 -3112861
33648 -3112861 -1061819 -560991 -1264599 -1838908 -2022282 -2532894 -3362522 -3492514 -2420382
33639 -2420382 -912658 72956 425779 565721 835323 1563200 3051219 5005500 6459242
$$ packed form
33701b83385Q40158J079732p16587k737656k528126p8863K169035K192991N24174
33692D61473o48773r4067J256644J833591J511400J340049J541009J145701p1876
33683H275151q17114l75561j52956j626515l674895l778589j549245P58149J359755
33674a581820Q53476N60405N73287L99406L20561Q35380J367867Q01158p62203
33665C367517j762191j010598Q08021J875383J256470k27756j170121j172812
33657A963913q78366p44381o02817m98078r40655j757993j655130N2495J948151
33648c112861K051042N00828p03608n74309j83374n10612q29628j29992J072132
33639b420382J507724R85614L52823J39942K69602P27877J488019J954281J453742
$$ plain form
33630 6459242 6740873 6216976 5750104 5732448 5899698 5717420 4715249 2902930 1136182
33621 1136182 524626 1098950 1671388 1507713 1388927 2169192 2951032 1972417 -888058
33612 -888058 -3789660 -5232713 -5441316 -5113051 -4099394 -2141697 65622 1550315 2173625
33603 2173625 2195921 1425899 -69652 -956917 172429 2588555 3825413 2752450 1086227
33594 1086227 1118661 2837850 4274517 4203151 3391185 3088048 3165206 2376295 247906
33585 247906 -1939498 -2522667 -1639190 -1320469 -3009240 -5586255 -6641530 -5361453 -3190152
33576 -3190152 -1755944 -1315700 -1502512 -2382652 -3984178 -5570040 -6233691 -5800995 -4590747
33567 -4590747 -2826231 -871580 539344 1013400 947791 659684 -257602 -1886853 -3016279
$$ packed form
33630F459242K81631n23897m66872j7656J67250j82278j002171j812319j766748
33621A136182o11556N74324N72438j63675j18786P80265P81840r78615k860475
33612h88058k901602j443053k08603L28265J013657J957697K207319J484693O23310
33603B173625K2296p70022j495551q87265J129346K416126J236858j072963j666223
33594A086227L2434J719189J436667p1366q11966l03137P7158p88911k128389
33585B47906k187404n83169Q83477L18721j688771k577015j055275J280077K171301
33576c190152J434208M40244j86812q80140j601526j585862o63651M32696J210248
33567d590747J764516J954651J410924M74056o5609k88107r17286j629251j129426
$$ plain form
33558 -3016279 -2394806 -535996 963299 1650232 2429286 3557183 3817405 2141725 -920713
33549 -920713 -3762868 -5025724 -4243521 -2160129 -639797 -1205216 -3178448 -4159073 -2849524
33540 -2849524 -578424 494426 -171212 -1491526 -2419110 -2771492 -2883692 -3195621 -3949067
33531 -3949067 -4825905 -5166707 -4823555 -4355924 -4177408 -4136592 -4169816 -4548528 -5125218 -5274640
33521 -5274640 -5064923 -5386882 -6182902 -5743566 -2930417 851035 3222004 3643839 3340184
33512 3340184 3139890 2928051 2661015 2232985 749571 -2224882 -4951577 -5082121 -2930811
33503 -2930811 -1009058 -133346 1380531 3858143 4550458 1747781 -1763913 -2105368 293899
33494 293899 1648579 409969 -1238978 -1539608 -1637593 -2792489 -3734107 -2748321 -811842
$$ packed form
33558c016279O21473J858810J499295O86933P79054J127897K60222j675680l062438
33549i20713k842155j262856P82203K083392J520332n65419j973232r80625J309549
33540b849524K271100J072850o65638j320314r27584l52382j12200l11929p53446
33531c949067q76838l40802L43152M67631J78516M0816l3224l78712n76690j49422
33521e274640K09717l21959p96020M39336K813149L781452K370969M21835l03655
33512C340184k00294k11839k67036m28030j483414k974453k726695j30544K151310
33503b930811J921753Q75712J513877K477612O92315k802677l511694l41455K399267
33494B93899J354680j238610j648947l00630r7985j154896r41618R85786J936479
$$ plain form
33485 -811842 -578115 -2931087 -6224137 -8541326 -9171550 -8016373 -5189059 -1703091 607841
33476 607841 677331 -721146 -1897851 -1837577 -619419 1123818 2551695 2785113 1524562
33467 1524562 -380103 -1515124 -1329607 -645702 -463547 -579245 96601 1932216 3928783
33458 3928783 4962093 5138411 5344632 5749283 5519985 4121103 2236480 1106001 1384369
33449 1384369 2844118 4625816 5458500 4357947 1838192 -52883 202514 1723301
33441 1723301 2324645 1346069 321930 704543 2077067 3151922 3525685 3621173 3654476
33432 3654476 3648720 3984967 4904530 5722669 5564001 4785673 4600269 5141657 4983462 3093943
33422 3093943 459240 -953081 -428631 906012 1502190 896136 -87822 -235722 929997
$$ packed form
33485h11842K33727k352972l293050k317189o30224J155177K827314L485968K310932
33476F07841O9490j398477j176705O0274J218158J743237J427877K33418j260551
33467A524562j904665j135021J85517O83905J82155j15698O75846J835615J996567
33458C928783J033310J76318K06221M04651k29298j398882j884623j130479K78368
33449A384369J459749J781698Q32684j100553k519755j891075K55397J520787
33441A723301O01344r78576j024139L82613J372524J074855L73763R5488L3303
33432C654476n756L36247R19563Q18139j58668p78328j85404N41388j58195j889519
33422C093943k634703j412321N24450J334643N96178o06054r83958j47900J165719
$$ plain form
33413 929997 2637725 3479624 2752406 1249321 633129 1943637 4614017 6854916 7077775
33404 7077775 5101855 2028500 -924870 -3137321 -4200081 -3620078 -1529611 816150
33396 816150 2107597 2363303 2506801 2838077 2880803 2545142 2212273 1626338 152398
33387 152398 -1442881 -1029714 2061751 5475363 6343238 4516852 2072428 438985 -443248
33378 -443248 -651795 187134 1737169 2806777 2797657 2212465 1402847 -48378 -2124587
33369 -2124587 -3507860 -2767569 -65671 2850004 4213411 3678357 2497294 2326804 3576707
33360 3576707 5069406 5627028 5485523 5405230 4980674 3189076 480970 -1232562 -1046965
33351 -1046965 -122597 275229 400297 858445 1160474 674521 48468 355953 1513413
$$ packed form
33413I29997J707728Q41899p27218j503085o16192J310508K670380K240899K22859
33404G077775j975920l073355k953370k212451j062760N80003K090467K345761
33396H16150J291447K55706J43498L31276M2726l35661l32869n85935j473940
33387A52398j595279M13167L091465L413612Q67875j826386k444424j633443q82233
33378d43248k08547Q38929J550035J069608r120n85192q09618j451225k076209
33369b124587j383273P40291K701898K915675J363407n35054j181063j70490J249903
33360C576707J492699N57622j41505q0293m24556j791598k708106j713532J85597
33351a046965R24368L97826J25068M58148L02029m85953o26053L07485J157460
$$ plain form
33342 1513413 2798136 4228425 5916105 6566271 4495526 287113 -3230646 -4172179
33334 -4172179 -3435162 -2815509 -2665730 -2389509 -2118543 -2469740 -3088118 -2788233 -1226953
33325 -1226953 570909 1611148 2064674 2619702 3322409 3633207 3337065 2844649 2635910
33316 2635910 2798347 3093086 3086672 2194533 86449 -2672567 -4727704 -5053618 -3829434
33307 -3829434 -2002829 -308566 937120 1489946 1326402 1006962 1176509 1681008 1867355
33298 1867355 1796758 2303541 3569232 4497635 4030858 2388046 450607 -1336489 -2715387
33289 -2715387 -3020811 -1942312 -504970 -144122 -884418 -1470773 -1284282 -978589 -998238
33280 -998238 -723273 183804 565360 -942186 -3741292 -5492523 -4712957 -2445262 -950266
$$ packed form
33342A513413J284723J430289J687680O50166k070745m208413l517759r41533
33334d172179P37017O19653J49779K76221K70966l51197o18378K99885J561280
33325a226953J797862J040239M53526N55028P02707L10798k96142m92416k08739
33316B635910J62437K94739o414q92139k108084k759016k055137l25914J224184
33307c829434J826605J694263J245686N52826j63544l19440J69547N04499J86347
33298A867355p0597N06783J265691R28403m66777j642812j937439j787096j378898
33289b715387l05424J078499J437342L60848p40296n86355J86491L05693j9649
33280i98238K74965R07077L81556j507546k799106j751231P79566K267695J494996
$$ plain form
33271 -950266 -1207996 -2308408 -3169669 -4023901 -5639355 -7586708 -8334735 -7222406 -5324177
33262 -5324177 -3778892 -2180748 361274 3224980 4712038 4343745 3368744 2800356 2278055
33253 2278055 1374392 742426 1019404 1499433 1011841 -354118 -1379688 -1305727 -502899
33244 -502899 199196 166870 -711390 -1593001 -958914 1714748 4788735 6008437 5148328
33235 5148328 4029056 3869925 3882161 2868573 1014106 -599631 -1279846 -763618 1078341
33226 1078341 3571462 4998104 4193910 2012573 245279 -447373 -469698 229087 2024923
33217 2024923 4120898 4908920 4182903 3456507 3567999 3541582 2603083 1681939 1666028 1636767
33207 1636767 485048 -896965 -975970 -260535 -421627 -1226840 -818888 896002 1673806
$$ packed form
33271i50266k57730j100412q61261q54232j615454j947353p48027J112329J898229
33262e324177J545285J598144K542022K863706J487058l68293r75001n68388n22301
33253B278055r03663o31966K76978M80029m87592j365959j025570P3961Q02828
33244e02899P02095l2326q78260q81611O34087K673662L073987J219702q60109
33235E148328j119272j59131J2236j013588j854467j613737o80215N16228J841959
33226A078341K493121J426642q04194k181337j767294o92652k2325O98785J795836
33217B024923K095975P88022p26017p26396J11492k6417r38499r21144j5911k9261
33207A636767j151719j382013p9005P15435j61092q05213M07952J714890P77804
$$ plain form
33198 1673806 348809 -1584457 -2786949 -4064532 -5993162 -6806460 -4931281 -2032216
33190 -2032216 -958402 -1660149 -1828544 -1050344 -1390063 -3558567 -5241446 -4287567 -1530838
33181 -1530838 701402 1236455 95098 -2505996 -5687297 -7579062 -7070360 -5316016
33173 -5316016 -4229301 -3968162 -3118143 -974174 1596958 3448067 4257352 4334184 4151336
33164 4151336 4095976 4053750 3356690 1770032 302000 240666 1477611 2575764 2507666
33155 2507666 1585485 628492 -9016 -385481 -659714 -1177464 -2362569 -4144224 -5748625
33146 -5748625 -6263002 -5259482 -2957472 -158001 2056528 3097510 3420372 3805828 4054095
33137 4054095 3063491 478257 -2388808 -3811935 -3472890 -2544353 -2209136 -2583247 -2982489
$$ packed form
33198A673806j324997j933266j202492j277583j928630q13298J875179K899065
33190b032216J073814p01747j68395P78200l39719k168504j682879R53879K756729
33181a530838K232240N35053j141357k601094l181301j891765N08702J754344
33173e316016J086715K61139Q50019K143969K571132J851109Q09285P6832j82848
33164D151336n5360m2226o97060j586658j468032o1334J236945J098153o8098
33155B507666r22181r56993o37508l76465k74233n17750j185105j781655j604401
33146e748625n14377J003520K302010K799471K214529J040982L22862L85456K48267
33137D054095r90604k585234k867065j423127L39045R28537L35217l74111l99242
$$ plain form
33128 -2982489 -2775354 -1894676 -776716 128026 866182 1890025 3315334 4486149 4582847
33119 4582847 3519803 1875536 62420 -1880946 -3595710 -4177642 -3151434 -1293537
33111 -1293537 111092 644120 761300 565939 -507769 -2473346 -4117175 -4286541 -3356396
33102 -3356396 -2605625 -2444208 -2167852 -1372543 -603803 -357430 -324596 -123668 -132856 -995460
33092 -995460 -2630992 -4165863 -4626029 -3541407 -1310401 823535 1695568 1410900 1082908
33083 1082908 1189514 1024715 215130 -262629 486700 1659441 1786604 861517 122643
33074 122643 30025 -77760 -298740 336035 2216288 4248148 5251308 5305078 5082220
33065 5082220 4763885 4401559 4611581 5980571 8142945 10116672 11189526 10941603 8993469
$$ packed form
33128b982489K07135Q80678J117960R04742P38156J023843J425309J170815R6698
33119D582847j063044j644267j813116j943366j714764n81932J026208J857897
33111a293537J404629N33028J17180j95361j073708j965577j643829j69366R30145
33102c356396P50771J61417K76356P95309P68740K46373L2834K00928r188q62604
33092i95460j635532j534871m60166J084622K231006K133936Q72033k84668l27992
33083A082908J06606j64799q09585m77759P49329J172741J27163r25087p38874
33074A22643r2618j07785k20980O34775J880253K031860J003160N3770k22858
33065E082220l18335l62326K10022J368990K162374J973727J072854k47923j948134
$$ plain form
33056 8993469 5622115 2294688 599854 586437 863778 388829 -550346 -1274155 -1874511
33047 -1874511 -2908068 -4327292 -5384882 -5653232 -5596109 -5727029 -5517466 -3891346 -982222
33038 -982222 1434682 2030666 1903734 3309476 6452678 8805764 8111777 5042652 2154593
33029 2154593 1050906 1489707 2616012 3853343 4722937 4861717 4471179 4145463 4134094
33020 4134094 4203551 4141822 3861797 3067262 1417029 -879147 -3039300 -4316490 -4374102
33011 -4374102 -3331856 -1930702 -1345860 -2084848 -3151233 -3030522 -1498937 259313 1292664
33002 1292664 1749219 1976584 1772698 1047750 428201 479800 796227 536681 -365686 -1069169
32992 -1069169 -804348 316717 1337657 1154550 -530559 -2765721 -4169091 -4335309 -4044690
$$ packed form
33056H993469l371354l327427j694834j3417K77341m74949r39175p23809o00356
33047a874511j033557j419224j057590k68350N7123j30920K09563J626120K909124
33038i82222K416904N95984j26932J405742L143202K353086o93987l069125k888059
33029B154593j103687M38801J126305J237331Q69594J38780l90538l25716j1369
33020D134094O9457o1729k80025p94535j650233k296176k160153j277190n7612
33011d374102J042246J401154N84842p38988j066385J20711J531585J758250J033351
33002A292664M56555K27365k03886p24948o19549N1599L16427k59546r02367p03483
32992a069169K64821J121065J020940j83107j685109k235162j403370j66218K90619
$$ plain form
32983 -4044690 -3998816 -3967843 -3452554 -2498181 -1385028 -149406 1026740 1584752 1416117
32974 1416117 1260168 1457182 1062299 -573795 -1980292 -1097178 1396924 2249715 -136393
32965 -136393 -3328999 -3977612 -2034976 -291151 -526075 -1962772 -3265656 -4118469 -4414166
32956 -4414166 -3614455 -1868294 -501292 -235924 150143 2079855 4713212 5724477 4378955
32947 4378955 2345018 1186579 440592 -1136035 -3534136 -5700614 -7086794 -7951163
32939 -7951163 -8442911 -8309186 -7431168 -5939705 -3859137 -1254003 1336072 3183216 4017217
32930 4017217 3869326 2525840 -46592 -2760776 -3814714 -2437703 227631 2207346
32922 2207346 2385286 1258719 498155 1489756 3611445 4318523 2004289 -1515706 -2841575
$$ packed form
32983d044690M5874L0973N15289R54373J113153J235622J176146N58012j68635
32974A416117j55949J97014l94883j636094j406497Q83114K494102Q52791k386108
32965a36393l192606o48613J942636J743825k34924j436697j302884q52813k95697
32956d414166P99711J746161J367002K65368L86067J929712K633357J011265j345522
32947D378955k033937j158439p45987j576627k398101k166478j386180q64369
32939g951163m91748J33725Q78018J491463K080568K605134K590075J847144Q34001
32930D017217j47891j343486k572432k714184j053938J377011K665334J979715
32922B207346J77940j126567p60564R91601K121689P07078k314234l519995j325869
$$ plain form
32913 -2841575 -1303155 363879 68317 -1041908 -1214267 -1199751 -2571536 -4344146 -3933850
32904 -3933850 -1096392 1506639 1806955 376395 -1204875 -2002757 -1362014 1032152 3900772
32895 3900772 5008073 4072105 3418560 4638343 6229871 5986779 4235598 2870030 2245405
32886 2245405 1123413 -753608 -2043193 -1886479 -1096299 -973809 -1977186 -3640298 -4896183
32877 -4896183 -4593371 -2690287 -811539 -589779 -1617339 -2150504 -1623951 -1092912 -1223126
32868 -1223126 -1432452 -1386342 -1812246 -3106121 -4380458 -4747756 -4555288 -4507577 -4432926 -3797558
32858 -3797558 -2749547 -1846981 -1363055 -1546527 -2812883 -4810544 -6002603 -5243343 -3333264
32849 -3333264 -2004898 -1710866 -1412887 -270207 1553834 3638982 5700104 7050315
$$ packed form
32913b841575J538420J667034k95562j110225j72359J4516j371785j772610M10296
32904c933850K837458K603031L00316j430560j581270p97882O40743K394166K868620
32895C900772J107301r35968o53545J219783J591528k43092j751181j365568o24625
32886B245405j121992j877021j289585J56714P90180J22490j003377j663112j255885
32877d896183L02812J903084J878748K21760j027560n33165N26553N31039j30214
32868a223126k09326M6110m25904j293875j274337l67298J92468M7711P4651O35368
32858c797558J048011R02566M83926j83472j266356j997661j192059P59260J910079
32849c333264J328366K94032K97979J142680J824041K085148K061122J350211
$$ plain form
32841 7050315 6705921 4543438 1811342 138581 313500 1979994 3949079 4772491 3733204
32832 3733204 1594227 -107556 -744720 -1109984 -2039093 -3126891 -3334859 -2531449 -1801561
32823 -1801561 -2173949 -3420687 -4314345 -3975839 -2825428 -2138914 -2712197 -4084241 -5050826
32814 -5050826 -4716083 -3024747 -692239 1097001 1332497 92839 -1297337 -1511335 -556913
32805 -556913 556544 1279230 1917200 2541260 2419818 1093874 -588010 -1279326 -767735
32796 -767735 -90024 -39295 -305143 -376141 -567671 -1416755 -2444720 -2559421 -1800185 -1549115
32786 -1549115 -2334595 -2478268 -266469 3099843 4478685 2829450 482820 -317562 -343724
32777 -343724 -1438891 -3099230 -3136866 -1261033 103863 -1148788 -4486699 -7766450 -9254637
$$ packed form
32841G050315l44394k162483k732096j672761J74919J666494J969085Q23412j039287
32832C733204k138977j701783o37164l65264r29109j087798k07968Q03410P29888
32823a801561l72388j246738q93658L38506J150411O86514n73283j372044r66585
32814e050826L34743J691336K332508J789240K35496j239658j390176k13998R54422
32805e56913J113457P22686O37970O24060j21442j325944j681884o91316N11591
32796g67735O77711N0729k65848p0998j91530q49084j027965j14701P59236K51070
32786a549115p85480j43673K211799L366312J378842j649235k346630q00382k6162
32777c43724j095167j660339l7636J875833J364896j252651l337911l279751j488187
$$ plain form
32768 -9254637 -8329120 -5571728 -2779563 -1766808 -2518149 -3396077 -3476917 -3429326 -3564842
32759 -3564842 -2585824 473026 4133786 5770950 4514564 1731408 -840591 -2233833
32751 -2233833 -2011191 -349534 1569507 2360836 1842672 983026 611299 978199 2267663
32742 2267663 4355596 6047441 5777588 3431163 547260 -1585069 -3094556 -4457703
32734 -4457703 -5337210 -5211435 -4370550 -3444701 -2456125 -1143544 162121 857488 1107297
32725 1107297 1723059 2897013 3744125 3385136 1999552 446787 -821153 -1988651 -3092373
32716 -3092373 -3532892 -2728396 -1085412 139962 131840 -624956 -1058309 -854037 -629377
32707 -629377 -805028 -888888 -208450 1048307 2052911 2444123 2585074 2574297 1700037 -464348
$$ packed form
32768i254637R25517K757392K792165J012755p51341q77928q0840M7591j35516
32759c564842R79018L058850L660760J637164j256386k783156k571999j393242
32751b233833K22642J661657J919041P91329n18164q59646l71727L66900J289464
32742B267663K087933J691845k69853k346425k883903k132329j509487j363147
32734d457703q79507J25775Q40885R25849R88576J312581J305665O95367K49809
32725A107297O15762J173954Q47112l58989j385584j552765j267940j167498j103722
32716c092373m40519Q04496J642984J225374q122p56796m33353K04272K24660
32707f29377j75651q3860O80438J256757J004604L91212J40951j0777q74260k164385
$$ plain form
32697 -464348 -2787557 -3381541 -1884628 -65108 417917 76105 462088 1528385 1535442
32688 1535442 -248107 -2092824 -1818678 522556 2753531 2935681 1078201 -1095894
32680 -1095894 -1609202 93799 2437984 3120599 1651386 -69367 -194158 787579 995662
32671 995662 -245993 -1781947 -2263537 -1463772 -125080 720614 468642 -364665 -517301
32662 -517301 304363 722761 -367143 -1894144 -2010075 -828682 -73439 -196632 287220
32653 287220 2314442 4816917 6305131 6482333 5733621 4383977 3109923 2812999 3375219
32644 3375219 3640733 3169128 2805997 3052039 3317816 3404974 4072335 5221564 5228010 3328235
32634 3328235 1114927 258330 243563 -113346 -526916 -512150 -1181507 -3330117 -4961640
$$ packed form
32697d64348k323209n93984J496913J819520M83025l41812L85983J066297P057
32688A535442j783549j844717K74146K341234K230975J82150j857480k174095
32680a095894n13308J703001K344185O82615j469213j720753j24791R81737K08083
32671I95662j241655j535954m81590P99765J338692Q45694k51972q33307j52636
32662e17301Q21664M18398j089904j527001j15931J181393P55243j23193M83852
32653B87220K027222K502475J488214J77202p48712j349644j274054k96924N62220
32644C375219K65514m71605l63131K46042K65777Q7158O67361J149229O446j899775
32634C328235k213308q56597j4767l56909m13570J4766o69357k148610j631523
$$ plain form
32625 -4961640 -3561221 -179114 1657678 884956 -170561 69722 425050 -174809 -724104
32616 -724104 -416203 -448989 -1851990 -3390866 -3374559 -2077736 -765699 320091 1335046
32607 1335046 1444934 -22432 -1829603 -2045916 -571247 1061458 1937483 2296889 2183682
32598 2183682 1164391 -569780 -2082673 -2748839 -2481623 -1161149 967777 2496367
32590 2496367 1897881 -304700 -1592252 -227800 2769453 4855221 4564725 2522575
32582 2522575 375301 -786555 -1040104 -937137 -505410 610097 2049522 2665732 2049237
32573 2049237 1263912 1225999 1154388 -176317 -2234112 -3255642 -2768038 -2078363 -2131725
32564 -2131725 -2331141 -1882974 -1000498 -145909 821892 1978334 2665259 2326055 1494922
$$ packed form
32625d961640J400419L382107J836792p72722j055517K40283L55328n99859n49295
32616g24104L07901l2786j403001j538876J6307J296823J312037J085790J014955
32607A335046J09888j467366j807171k16313J474669J632705Q76025L59406j13207
32598B183682j019291j734171j512893o66166K67216J320474K128926J528590
32590B496367n98486k202581j287552J364452K997253K085768k90496k042150
32582B522575k147274j161856k53549J02967M31727J115507J439425O16210o16495
32573B049237p85325l7913p1611j330705k057795j021530M87604O89675n3362
32564b131725j99416M48167Q82476Q54589R67801J156442O86925l39204q31133
$$ plain form
32555 1494922 1262595 2022378 3124517 3507554 2557911 786373 -324329 259523 1858306
32546 1858306 2923048 2992223 2782328 2422006 1072208 -1286612 -3182723 -3589849 -3269034
32537 -3269034 -3220066 -2985124 -1688788 198729 1445111 1732658 1621397 1520695 1761581
32528 1761581 2835346 4290052 4288843 1842930 -1249584 -2444156 -1839620 -1608964 -2509267
32519 -2509267 -3215560 -3092700 -3233532 -4223130 -5026040 -4847610 -4153681 -3085977 -940094
32510 -940094 1768203 2898718 1827378 957282 2204518 3794104 2917928 204905 -1184674
32501 -1184674 -183727 1278113 1872630 2592471 4247424 5602779 5231165 3674280 2554468
32492 2554468 2469800 2687524 2309509 1143879 -124075 -405691 616888 1836237 1951398
$$ packed form
32555A494922k32327P59783J102139L83037r49643j771538j110702N83852J598783
32546A858306J064742O9175k09895l60322j349798k358820j896111m07126L20815
32537c269034M8968K34942J296336J887517J246382K87547j11261j00702K40886
32528A761581J073765J454706j209k445913l092514j194572O04536K30656r00303
32519b509267p06293J22860j40832r89598q02910J78430O93929J067704K145883
32510i40094K708297J130515j071340q70096J247236J589586q76176k713023j389579
32501a184674J000947J461840N94517P19841J654953J355355l71614j556885j119812
32492B554468q4668K17724l78015j165630j267954k81616J022579J219349J15161
$$ plain form
32483 1951398 1149298 623379 739487 965457 1345951 2346768 3202176 2387223 232939
32474 232939 -903927 30665 1130627 326570 -1919511 -4063320 -5838020 -7369033 -7524184
32465 -7524184 -5461355 -2811411 -1893966 -2312289 -1741945 159106 1251701 656643 400645
$$ packed form
32483A951398q02100n25919J16108K25970L80494J000817Q55408q14953k154284
32474B32939j136866R34592J099962q04057k246081k143809j774700j531013j55151
32465g524184K062829K649944R17445m18323N70344J901051J092595n95058k55998
$$ [...]
##END NTUPLES=NMR SPECTRUM
##END=
