##TITLE=31Pdec_B3f2001
 CDCl3, 24 sc
 20.1.2025
##JCAMPDX= 6.0         $$ Bruker NMR JCAMP-DX V2.0
##DATA TYPE= NMR SPECTRUM
##DATA CLASS= NTUPLES
##ORIGIN= UXNMR, Bruker Analytische Messtechnik GmbH
##OWNER= root
$$ XWIN-NMR		Version 3.5
$$ Mon Jan 20 16:22:41 2025 Russian Standard Time (UT+4h)  she@DPX200
##.OBSERVE FREQUENCY= 81.013821
##.OBSERVE NUCLEUS= ^31P
##.ACQUISITION MODE= SIMULTANEOUS
##.ACQUISITION SCHEME= undefined
##.AVERAGES= 24
##.DIGITISER RES= 17
##SPECTROMETER/DATA SYSTEM= spect
##.PULSE SEQUENCE= zgpg30
##.SOLVENT NAME= CDCl3
##.SHIFT REFERENCE= (INTERNAL, CDCl3, 0, 198.062)
##AUDIT TRAIL= $$ (NUMBER, WHEN, WHO, WHERE, WHAT)
$$ ##TITLE= Audit trail, XWIN-NMR		Version 3.5
$$ ##JCAMPDX= 5.01
$$ ##ORIGIN= Bruker BioSpin GmbH
$$ ##OWNER= she
$$ F:/spectra/data/she/nmr/P31/2/pdata/1/auditp.txt
$$ ##AUDIT TRAIL=  $$ (NUMBER, WHEN, WHO, WHERE, WHAT)
(   1,<2025-01-20 16:21:44.04 +0400>,<she>,<DPX200>,
      <created by zg, POWCHK disabled, PULCHK disabled
       configuration hash MD5:
       00 E9 B6 7A A2 85 ED C7 34 08 36 98 17 FE 4E 26
       data hash MD5: 32K
       0D C8 5A A6 AC 2A AF E5 5D 75 4A 4D 54 46 E0 1B>)
(   2,<2025-01-20 16:21:46.84 +0400>,<she>,<DPX200>,
      <Start of raw data processing
       efp BC_mod = 2 LB = 1.5 FT_mod = 6 PKNL = 1 PHC0 = 1767.397 PHC1 = 87.4864 SI = 64K 
       data hash MD5: 64K
       32 4F 9F 56 DB C0 8D 00 ED 93 1C 02 FC 4D B6 C9>)
(   3,<2025-01-20 16:22:01.93 +0400>,<she>,<DPX200>,
      <pk PHC0 = -9.236626 PHC1 = 0 
       data hash MD5: 64K
       05 63 87 5B BE 05 28 73 9B 89 FF F3 96 B1 E0 84>)
(   4,<2025-01-20 16:22:05.39 +0400>,<she>,<DPX200>,
      <abs ABSG = 5 
       data hash MD5: 64K
       04 13 87 F3 89 0A A3 79 03 86 E2 FF 33 D5 A4 74>)
$$ ##END=
$$ 
$$ hash MD5
$$ 8C 22 D2 FF D0 0D 9E B4 18 42 CA D6 AD 6C B8 2B
##$RELAX= 
##$RELAX= 
##$RELAX= 
##$RELAX= 
##$RELAX= 
##$RELAX= 
##$RELAX= 
##$RELAX= 
$$ Bruker specific parameters
$$ --------------------------
##$DU= <F:/spectra>
##$EXPNO= 2
##$NAME= <P31>
##$PROCNO= 1
##$TYPE= <nmr>
##$USER= <she>
##$AMP= (0..31)
100 100 100 100 100 100 100 100 100 100 100 100 100 100 100 100 100 100 
100 100 100 100 100 100 100 100 100 100 100 100 100 100 
##$AQSEQ= 0
##$AQ_mod= 1
##$AUNM= <au_zg>
##$AUTOPOS= <>
##$BF1= 81.014009
##$BF2= 200.13
##$BF3= 200.13
##$BF4= 200.13
##$BF5= 200.13
##$BF6= 200.13
##$BF7= 200.13
##$BF8= 200.13
##$BYTORDA= 1
##$CFDGTYP= 0
##$CFRGTYP= 5
##$CHEMSTR= <none>
##$CNST= (0..31)
1 1 145 1 1 1 1 1 1 1 1 1 1 1 1 1 1 1 1 1 1 1 1 1 1 1 1 1 1 1 1 1 
##$CPDPRG= <waltz16>
##$CPDPRG1= <>
##$CPDPRG2= <waltz16>
##$CPDPRG3= <>
##$CPDPRG4= <mlev>
##$CPDPRG5= <mlev>
##$CPDPRG6= <mlev>
##$CPDPRG7= <mlev>
##$CPDPRG8= <mlev>
##$CPDPRGB= <>
##$CPDPRGT= <>
##$D= (0..31)
0 1 0 0 0 0 0 0 0 0.06 0 0.03 2e-05 3e-06 0 0 0.0002 0 0 0 0 0 0 0 0 0 
0 0 0 0 0 0 
##$DATE= 1737375703
##$DBL= (0..7)
120 120 120 11 120 120 24 19 
##$DBP= (0..7)
150 150 150 150 150 150 150 150 
##$DBP07= 0
##$DBPNAM0= <>
##$DBPNAM1= <>
##$DBPNAM2= <>
$$ [...]
##$SUBNAM3= <"">
##$SUBNAM4= <"">
##$SUBNAM5= <"">
##$SUBNAM6= <"">
##$SUBNAM7= <"">
##$SUBNAM8= <"">
##$SUBNAM9= <"">
##$SW= 400.765351723535
##$SWIBOX= (0..15)
0 1 3 0 0 0 0 0 0 0 0 0 0 0 0 0 
##$SW_h= 32467.5324675325
##$TD= 32768
##$TD0= 1
##$TE= 0
##$TE2= 300
##$TE3= 300
##$TEG= 300
##$TL= (0..7)
0 120 53 12 22 120 120 120 
##$TP= (0..7)
150 150 150 150 150 150 150 150 
##$TP07= 0
##$TPNAME0= <>
##$TPNAME1= <>
##$TPNAME2= <>
##$TPNAME3= <>
##$TPNAME4= <>
##$TPNAME5= <>
##$TPNAME6= <>
##$TPNAME7= <>
##$TPOAL= (0..7)
0.5 0.5 0.5 0.5 0.5 0.5 0.5 0.5 
##$TPOFFS= (0..7)
0 0 0 0 0 0 0 0 
##$TUNHIN= 0
##$TUNHOUT= 0
##$TUNXOUT= 0
##$USERA1= <user>
##$USERA2= <user>
##$USERA3= <user>
##$USERA4= <user>
##$USERA5= <user>
##$V9= 5
##$VALIST= <valist>
##$VCLIST= <CCCCCCCCCCCCCCC>
##$VD= 0
##$VDLIST= <DDDDDDDDDDDDDDD>
##$VPLIST= <PPPPPPPPPPPPPPP>
##$VTLIST= <TTTTTTTTTTTTTTT>
##$WBST= 1024
##$WBSW= 4
##$XGAIN= (0..3)
0 0 0 0 
##$XL= 0
##$YL= 0
##$YMAX_a= 3761
##$YMIN_a= -4665
##$ZGOPTNS= <>
##$ZL1= 120
##$ZL2= 120
##$ZL3= 120
##$ZL4= 120
##$ABSF1= 198.0616
##$ABSF2= -202.7028
##$ABSG= 5
##$ABSL= 3
##$ALPHA= 0
##$AQORDER= 0
##$ASSFAC= 0
##$ASSFACI= 0
##$ASSFACX= 0
##$ASSWID= 0
##$AUNMP= <proc_1d>
##$AZFE= 0.1
##$AZFW= 0.5
##$BCFW= 0
##$BC_mod= 2
##$BYTORDP= 0
##$COROFFS= 0
##$CY= -3
##$DATMOD= 1
##$DC= 0
##$DFILT= <>
##$DTYPP= 0
##$F1P= 0
##$F2P= 0
##$FCOR= 1
##$FTSIZE= 65536
##$FT_mod= 6
##$GAMMA= 0
##$GB= 0
##$INTBC= 1
##$INTSCL= 9.790993e-09
##$ISEN= 30
##$LB= 1.5
##$LEV0= 0
##$LPBIN= 0
##$MAXI= 10000
##$MC2= 0
##$MEAN= 0
##$ME_mod= 0
##$MI= 50
##$NCOEF= 0
##$NC_proc= -8
##$NLEV= 6
##$NOISF1= 182.463
##$NOISF2= 159.3651
##$NSP= 0
##$NTH_PI= 0
##$NZP= 0
##$OFFSET= 198.0616
##$PC= 4
##$PHC0= 1758.16
##$PHC1= 87.4864
##$PH_mod= 1
##$PKNL= yes
##$PPARMOD= 0
##$PSCAL= 0
##$PSIGN= 0
##$REVERSE= no
##$SF= 81.0140089999434
##$SI= 65536
##$SIGF1= 159.3651
##$SIGF2= -187.1042
##$SINO= 113.3802
##$SIOLD= 16384
##$SREGLST= <1H.CDCl3>
##$SSB= 0
##$STSI= 65536
##$STSR= 0
##$SW_p= 32467.5324675325
##$SYMM= 0
##$S_DEV= 0
##$TDeff= 32768
##$TDoff= 0
##$TI= <>
##$TILT= no
##$TM1= 0
##$TM2= 0
##$TOPLEV= 0
##$USERP1= <user>
##$USERP2= <user>
##$USERP3= <user>
##$USERP4= <user>
##$USERP5= <user>
##$WDW= 1
##$XDIM= 65536
##$YMAX_p= 419263716
##$YMIN_p= -26665456
$$ End of Bruker specific parameters
$$ ---------------------------------
##NTUPLES= NMR SPECTRUM
##VAR_NAME=  FREQUENCY,     SPECTRUM/REAL,   SPECTRUM/IMAG
##SYMBOL=    X,             R,               I
##VAR_TYPE=  INDEPENDENT,   DEPENDENT,       DEPENDENT
##VAR_FORM=  AFFN,          ASDF,            ASDF
##VAR_DIM=   65536,         65536,           65536
##UNITS=     HZ,            ARBITRARY UNITS, ARBITRARY UNITS
##FACTOR=    0.49542278885378, 1,            1
##FIRST=     16045.7642231865, 0,            0
##LAST=      -16421.768244346, 0,            0
##MIN=       -16421.768244346, -26665456,    0
##MAX=       16045.7642231865, 419263716,    0
$$ Real data points
##PAGE= N=1
##DATA TABLE= (X++(R..R)), XYDATA
$$ [...]
37775A8726148j677631n78891r8856K78784Q84990J112468J042605J699524L097481
37766B4486622L954734L906147M057495M633287M089593J667388j015906k331843
37758D3447517k973649m235440n345492m618692k479631j164795j603360k489546
37750A8536912k522873j870829j179956o87619o64835j341973k038469j718640
37742F511718p26608m78830j054576q77776M57220J017745m44215k119151j739652
37733E45875j20903L13901l80375P2567J945016K591682O95706j271373o45284
37724C746812J342244J399599r78802k974419k540076p52067M08237O90847R46449
37715A288824J232883R36476J40811l65551k50055J10947M00664N81018M70338
$$ y = [18726148, 17048517, 16469626, 16370770, 16649554, 17534544, 18647012, 19689617, 21389141, 24486622, 28441356, 32347503, 36404998, 41038285, 45127878, 46795266, 45779360, 43447517, 40473868, 36238428, 30892936, 26274244, 23794613, 22629818, 21026458, 18536912, 16014039, 14143210, 12963254, 12275635, 11610800, 10268827, 8230358, 6511718, 5785110, 5306280, 4251704, 3373928, 3831148, 4848893, 4404678, 2285527, 545875, 424972, 738873, 358498, 431065, 2376081, 4967763, 5663469, 4392096, 3746812, 5089056, 6488655, 5509853, 2535434, -4642, -756709, -348472, 342375, 1288824, 2521707, 3458183, 3598994, 3233443, 2983388, 3094335, 3494999, 4076017, 4546355]
37706D546355p9562o28587n79108j55600j12630m68104n31550k96907n75819j335626
37696b17138j239859L34421K018511K267649J414474O78277J32984p80929j532099
37687C076291j159212k44100k91380j226746j402241k00436J227303K014470K397387
37678D191336K143209L89106k137798k946970j128403J014166J119597j85750
37670B458493j009074j232138j784442k233947j424945K52887J364794J645282
37662a963090J746064J371276j56457j808259j631413K87165J746556J590268
37654A182110R34670Q26901P07235P570n18365j83460K73624j08350r15980j055038
37644A150917l92889K16433J58717l56083o94202m23467K34893N38055J93327
$$ y = [4546355, 4466793, 3838206, 3259098, 3103498, 2990868, 2522764, 1991214, 1694307, 1118488, -217138, -1456997, -1122576, 895935, 3163584, 4578058, 5256335, 5389319, 4608390, 3076291, 1917079, 1672979, 1381599, 154853, -1247388, -1447824, -220521, 1793949, 4191336, 6334545, 6723651, 4585853, 1638883, 510480, 1524646, 2644243, 2458493, 1449419, 217281, -1567161, -3801108, -5226053, -4973166, -3608372, -1963090, -217026, 1154250, 997793, -810466, -2441879, -2154714, -408158, 1182110, 2116780, 2943681, 3650916, 3658486, 3140121, 2956661, 3230285, 3121935, 2205955, 1150917, 758028, 974461, 1133178, 777095, 82893, -340574, -105681, 432374, 625701]
37635F25701K1582R35894K348381K495509N31312k395871m268094l850787j415887
37626d972260J393320K576765J523993l46638j382926j632407j963287j974853
37618f778293n01709K023625L584159L206827J969991J112417P14259N60788O80990
37609F573054O10277k77551j287955r36385N86345J292870L37731q03072q17408
37600E277906k75172K0621M16537J104454J395226J358227K119133L461984L544600
37591A8423516K274922K166403M204275O217063P650601J1692001J8365908J9577725
37583I0572414P968799j0756261k1840910j8814811j0163264o508369p749028
37576B2708570p270913l481050o68115q80276j436127n12414L3216j311801k794520
$$ y = [625701, 647283, 1583177, 3931558, 6427067, 6958379, 4562508, 294414, -3556373, -4972260, -3578940, -1002175, 521818, 175180, -1207746, -2840153, -4803440, -6778293, -7280002, -5256377, -1672218, 1534609, 3504600, 4617017, 5331276, 5892064, 6573054, 7183331, 6905780, 5617825, 4681440, 5267785, 6560655, 6898386, 6095314, 5277906, 5002734, 5023355, 5439892, 6544346, 7939572, 9297799, 11416932, 14878916, 18423516, 20698438, 22864841, 27069116, 33286179, 40936780, 52628781, 70994689, 90572414, 98541213, 87784952, 65944042, 47129231, 36965967, 30457598, 22708570, 15437657, 11956607, 11288492, 10408216, 8972089, 8459675, 8492891, 7181090, 4386570]
37567D386570k362956q25369j05536k46701p6356M29301L91480N956M31851J668314
37557C696554K072899O02937j479203k071159r50373J6985n18980j595860j427926
37548a654126l746Q92589J47483j261529j640786n83897Q65075J474578P79172
37539i85187p60558k029659j975954n19110J339228K468543K455507J519875J68092
37530A680777q27203p40521K64635R92556M77460q20150j558921j101942q2090
37521a715399N63195O45536O32584P78844P26808J56950l87159R9901J598181
37512C099441K559108J573634p64014k457238k431809j404782m90767K1330K81718
37503a3379L13033L27561P63786J449379J464991M27358p54973j009373l92516
$$ y = [4386570, 2023614, 1198245, 1092709, 846008, 769652, 1198953, 1590433, 1596389, 2028240, 3696554, 5769453, 6372390, 4893187, 2822028, 1871655, 1888640, 1369660, -226200, -1654126, -1657872, -765283, -617800, -1879329, -3520115, -4104012, -3238937, -1764359, -985187, -1745745, -3775404, -5751358, -6270468, -4931240, -2462697, -7190, 1512685, 1680777, 853574, 113053, 377688, 1370244, 1847704, 1027554, -531367, -1633309, -1715399, -1152204, -506668, 125916, 904760, 1631568, 1788518, 1401359, 1501260, 3099441, 5658549, 7232183, 6468169, 4010931, 1579122, 174340, -316427, -295097, -13379, 299654, 627215, 1391001, 2840380, 4305371, 4732729, 3977756, 2968383, 2575867]
37494B575867L07844O56801O45968K47481m58147j132392j609030j953096j818990
37485b537694o55744R93089J565193O51279j65068K40355N99392n74279k096001
37476a979478j660389L93217J429271N69209k36166K96838Q14119K3752r10912
37467a260539l91030R08338J253683N86068J41537J75611n9600n81108o93802
37458G9158m45092m03719k29177P88298J845028J242578p45022j581281M5511
37449E96282K123117K034474J13285j155594p50588r8877m85799j183522q30757
37440C62021N05214J663231K163330K509638K823802K357760R09775j85428M33711
37431A3543054J999762K260200M95421j408725j652983j088677j727015l446853
$$ y = [2575867, 2883711, 3540512, 4186480, 4433961, 3975814, 2843422, 1234392, -718704, -2537694, -3193438, -2200349, -635156, 16123, -148945, 91410, 690802, 116523, -1979478, -3639867, -3246650, -1817379, -1248170, -1484336, -1187498, -373379, -349627, -1260539, -1651569, -743231, 510452, 1096520, 1238057, 1413668, 1354068, 772960, 79158, -365934, -769653, -998830, -210532, 1634496, 2877074, 2132052, 550771, 596282, 2719399, 4753873, 4867158, 3711564, 2960976, 2862099, 2376300, 1192778, 362021, 867235, 2530466, 4693796, 7203434, 10027236, 12384996, 13294771, 13109343, 13543054, 15542816, 17803016, 18298437, 16889712, 15236729, 14148052, 12421037, 8974184]
37423H974184m014903k399524k74423M36901M7879P2665P51174R60598J86429
37414D740980o36472l60217R91731K194904J895911q1280k234748k610609r36445
37405B963755R20600J080519k94102j596922j759595q51156O35366J997275K254714
37396E350454J086564l62543p76023n51184j028640j969609j585205M82757K057087
37387B703658J400204k13035m46753O14397Q29902n12296j551997o75217J071423
37378C220286J443155N0078j252240q88892N50312J336451P96342k65084j011397
37369C979011j429734j547122q74461N82005J569584R95749l66622q33524k14421
37360A860465J49120k91815n53676n1539L88661J77426P3625O49711J073448O58175
$$ y = [8974184, 4959281, 2559757, 2285334, 2722235, 2770114, 2842779, 3593953, 4554551, 4740980, 4104508, 3744291, 4736022, 6930926, 8826837, 8745557, 6510809, 3900200, 2963755, 3884355, 4964874, 4670772, 3073850, 1314255, 463099, 1098465, 3095740, 5350454, 6437018, 6074475, 5298452, 4747268, 3718628, 1749019, 163814, 646571, 2703658, 4103862, 3890827, 3444074, 4058471, 4888373, 4376077, 2824080, 2148863, 3220286, 4663441, 4713519, 3461279, 2572387, 3122699, 4459150, 5255492, 4990408, 3979011, 2549277, 1002155, 127694, 709699, 2279283, 3275032, 2908410, 2074886, 1860465, 2009585, 1717770, 1164094, 1112555, 1501216, 1678642, 1752267, 2401978, 3475426, 4133601]
37350D133601L22831J011232J763612J092043n19014j292251q24121l09189m35809
37341D942935p69148r92197j069376m00521J377791K881127K233346q7014j656184
37332F460759j542824j157752j265584o05219J485284L333974L269317J832902
37324A1810857K50407j416156k951551k791101l70284J867952J326527r55594
37316F771057j925403j095982o78938j498837j803810n70306P39018O71506j45735
37307D62570m59372o6055Q97108K496183L797691L009012J80395j947406j376032
37298F994094M12740R00299J92931K8671L51298l72148j898153k153263p11978
37289C744491L37346j76723n95446Q25007L342147N406530O943154P947340O554694
$$ y = [4133601, 4456432, 5467664, 7231276, 8323319, 7804305, 6512054, 5687933, 5378744, 4942935, 4173787, 3181590, 2112214, 1711693, 3089484, 5970611, 8203957, 8116943, 6460759, 4917935, 3760183, 2494599, 1889380, 3374664, 6708638, 9977955, 11810857, 12061264, 10645108, 7693557, 4902456, 4532172, 6400124, 7726651, 6771057, 4845654, 3749672, 3070734, 1571897, -231913, -802219, -63201, 608305, 462570, 3198, -62857, 834251, 3330434, 7128125, 10137137, 10317532, 8370126, 6994094, 7406834, 8307133, 8500064, 8528735, 8880033, 8507885, 6609732, 4456469, 3744491, 4081837, 3905114, 3309668, 4134675, 7476822, 12883352, 19826506, 27773846, 34328540]
37280C4328540J373751n009673p929041o313821l773084l283986l530126k115800
37272C746760K8251J30417j842782l075731k187086q69446o58989n60342P03495
37263d585453J973691J226404j051742k120080n59895K040224L295176K625923
37255B844248J120658j34534p57792p44314l27187K0552M9698O6797L39978M45544
37245B923648j26667q88963p68539K64969R53453N91685J18524M88805Q83574
37236D440489N037j371965j108443Q23807J700201m9734k191033j777264M77830
37227I48925J346677r0r79074J29841J522535Q47466j122891j744896l82302R69734
37217A535925P15080l75852o06168L49638J225919Q07924o77571j825118j591527
$$ y = [34328540, 35702291, 30692618, 22763577, 16449756, 12676672, 9392686, 5862560, 3746760, 3775011, 3905428, 2062646, -1013085, -3200171, -4069617, -4728606, -5288948, -4585453, -2611762, -1385358, -2437100, -4557180, -5117075, -3076851, 218325, 2844248, 3964906, 3830372, 3072580, 2328266, 2001079, 2021631, 2071329, 2138126, 2478104, 2923648, 2796981, 1908018, 1139479, 1404448, 2357901, 2949586, 3068110, 3556915, 4440489, 4445526, 3073561, 1965118, 2788925, 4489126, 4439392, 2248359, 471095, 948925, 2295602, 2295512, 1316438, 1446279, 2968814, 3816280, 2693389, 948493, 566191, 1535925, 2251005, 1875153, 1268985, 1618623, 2844542, 3652466, 2974895, 1149777, -441750]
37208d41750m10715M16895K54546l78403o88565l74763M02236J104857R66807
37199H51145p2885p05708L07140K034619K193922L40316j443394j619372j081785
37190H03998j003278q32045j6511J86364j208647k546039j736295K95592J053480
37181e003381N03964O73573J671474J439192k97330j154717n1149J024005M75053
37172g19316n05222n94879o99331j652751k013990n60231J080242R43619J49062
37163d572797Q67330K222760J521441j100694k617705j697700j88931L98047Q19665
37154d348584J570786J351728l15461j327371R7633K466216L079557J827235P31608
37145E133347N02050j13340j632715k688853k196257j054351p27362j145881j069042
$$ y = [-441750, -852465, -435570, -181024, -559427, -1247992, -1622755, -1220519, -115662, 851145, 778260, 72552, 379692, 2414311, 4608233, 4948549, 3505155, 1885783, 803998, -199280, -1031325, -1047836, -861472, -2070119, -4616158, -6352453, -6056861, -5003381, -4499417, -3825844, -2154370, -715178, -1012508, -2167225, -2218374, -1194369, -719316, -1224538, -1819417, -2518748, -4171499, -6185489, -6745720, -5665478, -4721859, -4572797, -3705467, -1482707, 38734, -1061960, -3679665, -5377365, -5566296, -5168249, -4348584, -2777798, -1426070, -1741531, -3068902, -2971269, -505053, 2574504, 4401739, 5133347, 5635397, 5522057, 3889342, 1200489, -995768, -2050119, -2777481, -3923362, -4992404]
37136d992404m6167R56873Q90558q8240r24030r31364m04269p729O6490J04977
37126e375305L18098P17456J366176K093134J985239J59504k487957l382001j277149
37117e882805J508833J481630j454971l571206k079767J350102L154583K592314
37109b901287J901450K362349K594749J249064o57868j290505n05425N22429J226193
37100D501149J776152J877240R00514r19572k549769l323592l141126j879752
37092b758756J99424J727366J358082k82813j135228m05035O25869Q00278O01089
37083G30276Q05960J030164O09343j27175m92841n13060m25904N5948R98331J540217
37073D211259J003156L5981m23451o62842j456827k379320k248355r92545K67660
$$ y = [-4992404, -5038571, -4081698, -3191140, -3279380, -4203410, -5134774, -5539043, -5546772, -5480282, -5375305, -5057207, -4339751, -2973575, -880441, 1104798, 1264302, -1223655, -4605656, -5882805, -4373972, -2892342, -4347313, -7918519, -9998286, -8648184, -5493601, -2901287, -999837, 1362512, 3957261, 5206325, 4548457, 3257952, 2752527, 3274956, 4501149, 6277301, 8154541, 9055055, 8135483, 5585714, 2262122, -879004, -2758756, -2559332, -831966, 526116, 243303, -891925, -1296960, -671091, 129187, 730276, 1536236, 2566400, 3175743, 3048568, 2555727, 2042667, 1616763, 1672711, 2671042, 4211259, 5214415, 5250396, 4826945, 4164103, 2707276, 327956, -1920399, -2912944, -2645284]
37064b645284R19424J354231J704143J362703J40572j113456j553138j321026
37056a151831j072892j002012p11454J65176J390381K146991J828770Q83033M03106
37047B879268O73870P84603P1824q58843j142857q29956l24618L70721R51221
37038B575233M93984r19634j490515k54512Q62433l01454k433829k379542J9210
37029c828626J695499J030227l10348p29683p60890p66489K48120J933391J783123
37020B94324p76835k306278j52095L066947L111396M56966p77386P70544K309226
37011E996809J785013M24491k75221p99945j672707j978728j265405p40341j175904
37002B98062j478565o68573M52860R50613J376173K265169K626994J638077M24171
$$ y = [-2645284, -1725860, -371629, 1332514, 2695217, 2835789, 1722333, 169195, -1151831, -2224723, -3226735, -3938189, -3773013, -2382632, -235641, 1593129, 2476162, 2879268, 3553138, 4337741, 4409565, 3550722, 2407865, 1577909, 1253291, 1624012, 2575233, 3069217, 2149583, 659068, 404556, 1266989, 965535, -1468294, -3847836, -3828626, -2133127, -1102900, -1413248, -2142931, -2903821, -3670310, -3422190, -1488799, 294324, -482511, -2788789, -2940884, 126063, 3237459, 3694425, 2917039, 3687583, 5996809, 7781822, 8206313, 7931092, 7131147, 5458440, 3479712, 2214307, 1473966, 298062, -1180503, -1849076, -1396216, -445603, 930570, 3195739, 5822733, 7460810, 7884981]
36993G884981K77082L50986p38249k072852j718476k75016k91555j947771k233906
36984g64776M41424L368179L183590N96467r33394k51565M21668n40225j737939
36975C783429j312212O3497M70567j53836j87180P83418J201270M3051j545113
36966C146891j952035j242081n33009j00518O17942J524134J661521O49104o03709
36957C168240r02181L1162J427232K066056J074747j251817l384073l865515k753205
36948d389354j321264m74409r7578J36661J96524J30173L14570Q89726J430628
36939c184323J442219Q34884r3015p03961k71593J076683J906777J025012o47509
36930A385174j103616k17002M9670j097593j848795q53538K52495n69388k165511
$$ y = [7884981, 8162063, 8513049, 7774800, 5701948, 3983472, 3708456, 3416901, 1469130, -764776, -323352, 3044827, 6228417, 6824884, 5891490, 5639925, 6061593, 5521368, 3783429, 2471217, 2534714, 3005281, 2851445, 2664265, 3447683, 4648953, 4692004, 3146891, 1194856, -47225, -580234, -680752, -62810, 1461324, 3122845, 3771949, 3168240, 2266059, 2297221, 3724453, 5790509, 6865256, 5613439, 2229366, -1636149, -4389354, -5710618, -6185027, -6282605, -6145944, -5949420, -5819247, -5504677, -4614951, -3184323, -1742104, -907220, -1000235, -1704196, -1975789, -899106, 1007671, 2032683, 1385174, 281558, 64556, 114226, -983367, -2832162, -3685700, -3433205, -4002593, -6168104]
36921f168104j833164K77026J445304J018674J465276L798694N104008K792564
36913G900278j035933k344947q93408m8833j270991k079167l65920K055559K076136
36904C992774k43184j965526j330266M27299J282794Q59429J90169J18793O01940
36895C934222J059481Q80432j63520j638483k680842k702149j837674p13250R6411
36886c765372M15383M41411L72113N6131p16698j504115j351903r9652R95095
36877e157607P14935l93875p16690J82406J111850J091110M29667k97042j019928
36868d055174j316564j53252K385472M154330L168181K42040j893786j809430
36860G21817n24807K95734P5173o73906r77842q2887J485705J764392m88325l570300
$$ y = [-6168104, -8001268, -7724242, -6278938, -5260264, -3794988, 3706, 5107714, 7900278, 6864345, 4519398, 3625990, 3577157, 2306166, 226999, -138921, 1916638, 3992774, 3749590, 1784064, 453798, 881097, 2163891, 3023320, 3213489, 3332282, 3934222, 4993703, 5874135, 5710615, 4072132, 1391290, -1310859, -3148533, -3861783, -3765372, -3349989, -2908578, -2536465, -2480334, -3197032, -4701147, -6053050, -6152702, -5157607, -4442672, -4836547, -5553237, -5370831, -4258981, -3167871, -2738204, -3035246, -4055174, -5371738, -5524990, -3139518, 1014812, 4182993, 4425033, 2531247, 721817, 197010, 492744, 567917, -105989, -1083831, -1166718, 318987, 2083379, 1595054, -1975246]
36850a975246m257219j702760J481042K476616J247174l26384r57301o60270N9500
36841d614848O93796R41963J070682J516642J838639J036644o48759j490340o14251
36832b69832O32410P03605Q7362J81205R12025J080185M67362l6362j09189k60028
36822C388743n25855l52871J73261K94757p6634j64504L34234P43898M05153o87597
36812C532585k182527l375191l191711j415692K89111J19386j144399r68255J083244
36803g253449K376788J013286j329873j881226n96686M25537M14606O33885J773587
36794d423545K684441K315764J402992J194566J385781N68761j397358k611228
36786A120174j357944J427499K870710J435144j363365k945086k519136j179752
$$ y = [-1975246, -6232465, -7935225, -6454183, -3977567, -2730393, -3056777, -4014078, -4674348, -4614848, -3921052, -2979089, -1908407, -391765, 1446874, 2483518, 1834759, 344419, -269832, 362578, 1066183, 1153545, 1334750, 2246775, 3326960, 3794322, 3757960, 3648771, 3388743, 2862888, 2510017, 2683278, 2978035, 2901401, 2736897, 3071131, 3815029, 4220182, 3532585, 1350058, -2025133, -5216844, -6632536, -6343425, -6224039, -7368438, -8336693, -7253449, -4876661, -3863375, -5193248, -7074474, -7671160, -7245623, -6831017, -6197132, -4423545, -1739104, 576660, 1979652, 3174218, 4559999, 5128760, 3731402, 1120174, -237770, 1189729, 4060439, 5495583, 4132218, 1187132, -1332004, -2511756]
36778b511756j667O78259O00870j99463o07572N06887K243523K357016M00753
36769C466850j539982j862109j287071p41480M55456K567413L508600J396839
36761E964516k078044l420107j938109j14378L91492M67882R67713J024050J0446
36752A275461q93516m99428M77022O45400J6653l67676o4368N72138J138826J250644
36742C551156N48593n73253j035129o59185p27846j928168k786748j650410N51237
36733d709753J377474M12220k86507M71135J261231O10110m46666l9308J325146
36724b4918J248234r47847k951642k503183l67295Q55022J40945j004115q32449
36715f387248N96308J911820K043310Q63900j023925k503485k482043r74517N97593
$$ y = [-2511756, -2513423, -1835164, -1234294, -1433757, -2041329, -1534442, 709081, 3066097, 3466850, 1926868, 64759, -1222312, -1963792, -1508336, 1059077, 4567677, 5964516, 3886472, 466365, -1471744, -1586122, -1194630, -726748, 240965, 1265015, 1275461, 381945, -117483, 359539, 1004939, 1021592, 653916, 589548, 1161686, 2300512, 3551156, 4099749, 3526496, 2491367, 1832182, 1104336, -823832, -3610580, -5260990, -4709753, -3332279, -2920059, -3206566, -2735431, -1474200, -864090, -1310756, -1350064, -24918, 1223316, 275469, -2676173, -5179356, -5546651, -4691629, -4550684, -5554799, -6387248, -5790940, -3879120, -1835810, -971910, -1995835, -4499320, -6981363, -7955880, -7358287]
36706g358287Q38833n7697p56467n51236O2918N08683R24770J536294J906555
36697b945634J375591K8709j157569j191903p4172J071538J079952R8599m98156
36688b213045J38378J134279J061257o1006p56949K267J630601K643378J934658
36679E513818m41668k977921l478196j217099J726277K472198P40200j033625
36671A303984j109934l85344l67125q87388r74048o81604o44398o75954j73450
36662d595261O71977J237581J480403J544181J073800Q8761k70165O79769J554887
36653C465933O02276j492047k424791j663576q52499o89537J89797K315507L602356
36644C053419K144322o93616j914542r01361M8193q84515k644757k799652n84880
$$ y = [-7358287, -6519454, -6577151, -7333618, -7884854, -7821936, -7313253, -6388483, -4852189, -2945634, -1570043, -1541334, -2698903, -3890806, -3964978, -2893440, -1813488, -1714889, -2213045, -2074667, -940388, 120869, 59863, -697086, -694819, 935782, 3579160, 5513818, 5072150, 2094229, -1383967, -2601066, -874789, 1597409, 2337609, 1303984, 194050, -191294, -558419, -1445807, -2419855, -3101459, -3745857, -4421811, -4595261, -3923284, -2685703, -1205300, 338881, 1412681, 1501442, 1231277, 1911046, 3465933, 4068209, 2576162, 151371, -1512205, -2364704, -3054241, -2864444, -548937, 3053419, 5197741, 4504125, 2589583, 1688222, 1736415, 851900, -1792857, -4592509, -5177389]
36635e177389K165495L028589J666166J72239M72699J818100J801136k41529k209335
36626C496171k112910o13009L00808R634o94545j339678j852688j457593N20120
36617c743690K713380K611379O6362j895937r30696J416118J910915L7144j688546
36608D96429j422662m2752Q04438R15210R19150Q21455L51133j02593j04280j10088
36598B525440o06064q77178m9948J038012P41574o41817r80283L47488J263312
36589B760536K49844j126763o91636Q82706J303465L25845k76432P6226J84557
36580C688348k82960k11267L63253k93194k472069l767687k509194l06356O79403
36571e111723R98402K103151K997917J708121q09320j458399L25367J726906R20612
$$ y = [-5177389, -3011894, 16695, 1682861, 1855100, 2327799, 4145899, 5947035, 5705506, 3496171, 1383261, 770252, 1071060, 1080694, 386149, -953529, -2806217, -4263810, -3743690, -1030310, 1581069, 1647431, -248506, -1179202, 236916, 2147831, 2184975, 496429, -926233, -968985, -164547, 750663, 1669813, 2491268, 2842401, 2739808, 2635528, 2525440, 1919376, 1042198, 992250, 2030262, 2771836, 2130019, 1149736, 1497224, 2760536, 3010380, 1883617, 1191981, 2074687, 3378152, 3703997, 3427565, 3503791, 3688348, 3405388, 3194121, 3557374, 3264180, 792111, -2975576, -5484770, -5791126, -5111723, -4113321, -2010170, 987747, 2695868, 1886548, 428149, 753516, 2480422, 3401034]
36562C401034n43301p98024m94975q73312j115196J42841J995508K310913R64658
36553D990146j58360k58179o20223k073067l253361k485903l17444J073831O65605
36544b436955k39345J63807J799323K702188J419020j053646k298413j389765
36536a333786K4183J4885j022021j091337M12920J824193J666438P04343N19017
36527A718835R23134L38279j380982k199792p67905J266676J257229p27034j914714
36518a486274p00032J237138J542342M33282j92474M1066l34606j866171l043914
36509d369643k529705r71483K85147J039948J742238K192277J972626J451917
36501H13322J154231P36408j88993q51803m20750K04932m98592j921783j684896
$$ y = [3401034, 2857733, 2059709, 1564734, 691422, -423774, -280933, 1714575, 4025488, 4990146, 4831786, 4573607, 3953384, 1880317, -1373044, -3858947, -4176391, -3102560, -2436955, -2676300, -2512493, -713170, 1989018, 3408038, 2354392, 55979, -1333786, -1309603, -1294718, -2316739, -3408076, -2995156, -1170963, 495475, 1199818, 1718835, 2641969, 2980248, 1599266, -600526, -1368431, -101755, 1155474, 428440, -1486274, -2186306, -949168, 593174, 1026456, 833982, 875048, 540442, -1325729, -4369643, -6899348, -7870831, -7585684, -6545736, -4803498, -2611221, -638595, 813322, 1967553, 2703961, 2514968, 1663165, 1242415, 1447347, 948755, -973028, -2657924]
36492b657924Q32658L261719L400821J886476N56226k76873j324611k281208k172232
36483A225052j192637m49538p8285P99584K215610K893986J933528j11871k003253
36474E232176k772267j990916j83153J041640M36210j187010j791815o92570Q59126
36465a048579J608833J419432M40108j156513k322220j842352m39223k55457j495560
36456e091531j746475J48375J844286J021062r21621j187472K1443L54377m94634
36447f052190o22802M28275J013694N71046M74842J092547Q06621r88490k428291
36438e704748k023913p88530j24935L93578J536310K502282K301093J628476J545333
36429A264946J445965K12332j450392j711207k80244J153381J047975m42633j859529
$$ y = [-2657924, -1825266, 1436453, 4837274, 6723750, 7279976, 7003103, 5678492, 3397284, 1225052, 32415, -417123, -495408, 304176, 2519786, 5413772, 7347300, 7235429, 5232176, 2459909, 468993, 285840, 1327480, 1763690, 576680, -1215135, -1907705, -1048579, 560254, 1979686, 2419794, 1263281, -1058939, -2901291, -3340514, -3595971, -5091531, -6838006, -6689631, -4845345, -3824283, -4745904, -5933376, -5911933, -5557556, -6052190, -6674992, -6246717, -5233023, -4661977, -4187135, -3094588, -2287967, -3276457, -5704748, -7728661, -8517191, -8642126, -8248548, -6712238, -4209956, -1908863, -280387, 1264946, 2710911, 2923243, 1472851, -238356, -518600, 634781, 1682756, 1240123, -619406]
36420f19406j766309j43810J220436O26359j060576j313073K94858J330466M64091
36411i66964k89505R04245K344347J582237l81342q16174K06527L99598n01392
36402B481577o74247m6136n04912k010644k086387n486J814917J725530J055369
36393A749581J039223N43403j280459k680063j844690J91295J235761R15872J68811
36384C8734o41340j286956q62692P54873J969432J692799J130305J627461K213415
36375F636031J233126q98628k558808l266430l188773j721024J083896K926094
36367B45484J792023p50253j445788J02634J470332J433038J013358P08705k47048
36358D322485j534073j576767m09811p4613j301986k255277j564614k81243L35468
$$ y = [-619406, -2385715, -2529525, -1309089, -682730, -1743306, -3056379, -2761521, -1431055, -966964, -1256469, -352224, 1992123, 3574360, 3193018, 2376844, 2583371, 2982969, 2481577, 1807330, 1761194, 1256282, -754362, -2840749, -2846235, -1031318, 694212, 1749581, 2788804, 3332207, 2051748, -628315, -2473005, -2281710, -1045949, -130077, 38734, -602606, -1889562, -2752254, -1997381, -27949, 1664850, 2795155, 4422616, 6636031, 7869157, 6970529, 4411721, 1145291, -2043482, -3764506, -2680610, 245484, 2037507, 1287254, -158534, -55900, 1414432, 2847470, 3860828, 4569533, 4322485, 2788412, 1211645, 801834, 727221, -574765, -2830042, -4394656, -4675899, -4340431]
36349d340431P67070J619365K040027J260131Q2283n72214j089722j813552j818656
36340c865699n29436Q01186P64028j87109p44438o17517j28618P33432J466855
36331b307316P39226j398624k456879p24727J739782J704151o60287k405659k298675
36322h069008j743606j404597r3273K295709L645141K754900J313930J169522
36314a31282J531674O84350j000273j730271j051297m7952O88392J505430K244877
36305B693648J990039N66951q83716j266606p08593r7612o7606o85356j635949
36296i4800k431651k675130k237445j163511K79746J280547Q65662p15482j569185
36287h461249k14281K188408K965009J414954k31107Q5476J552225J992890J013504
$$ y = [-4340431, -3573361, -1953996, 86031, 1346162, 1428445, 856231, -233491, -2047043, -3865699, -4395135, -3593949, -2829921, -3017030, -3761468, -4378985, -4507603, -3774171, -2307316, -1568090, -2966714, -5423593, -6148320, -4408538, -2704387, -3364674, -5770333, -8069008, -9812614, -11217211, -11310484, -9014775, -5369634, -2614734, -1300804, -131282, 1400392, 2084742, 1084469, -645802, -1697099, -1745051, -1056659, 448771, 2693648, 4683687, 5250638, 4366922, 3100316, 2391723, 2294111, 2226505, 1541149, -94800, -2526451, -5201581, -7439026, -8602537, -8322791, -7042244, -6176582, -6892064, -8461249, -8675530, -6487122, -3522113, -2107159, -2338266, -2252790, -700565, 1292325, 2305829]
36278B305829R7492P2467K10699l7270m7726N85347R73302K43097r69524j447998
36268A985715j235990j356710j952386j943491p05118R49747J850880J734003
36260f73350R59106l14758j949983l209595l138770j690905k186P15050M05333
36251h900058J22533P56515J954907K503511J779344N17205r1733K14015O79799
36242d63962O79454M45640N78772J168873J525204O98974j479432l633279l621902
36233d101658q57412K438139L312624J470909m74269l86365R51794J430049N22027
36224D305838n21470p16723l44811j24390m11154j146867j765013j294621N21998
36215a497213K299016K232186L89296j237895j270193n08604m09903r40150q92719
$$ y = [2305829, 2403321, 2475788, 2686487, 2649217, 2601491, 3186838, 4160140, 4403237, 3433713, 1985715, 749725, -606985, -2559371, -4502862, -5207980, -4258233, -2407353, -673350, 285756, -29002, -1978985, -5188580, -8327350, -10018255, -10020441, -9305391, -8900058, -8777525, -8021010, -6066103, -3562592, -1783248, -1266043, -1357776, -1143761, -463962, 215492, 661132, 1239904, 2408777, 3933981, 4632955, 3153523, -479756, -4101658, -4959070, -2520931, 791693, 2262602, 1788333, 1401968, 2353762, 3783811, 4305838, 3784368, 3067645, 2722834, 2598444, 2187290, 1040423, -724590, -2019211, -1497213, 801803, 3033989, 3423285, 2185390, 915197, 406593, -3310, -943460, -1836179]
36206a836179J53442J197862J110407j36639j596855k212583j517389K4324J228101
36197c585509J150603J02119n35979K45370J932970K965375K276474K25705j871891
36188B905237k855171k378817q92930O94105J496471J224772M20827o6640R0204
36179F38058N26033P56152N98286L5302q48424j577574j438239l91481M94669
36170a207218J11926j294112k319524j978284o17200P33338J389171J281184P39227
36161c161492L13925M39882R38364J090370M83670m16254p98713m10284L53871
36152a166661J049449J476856J484228R90720L56615K66796Q32390J078048m4335
36143F324106k041424k962011j643563N77803J281635P785j175981n37145R91561
$$ y = [-1836179, -1682737, -484875, 625532, 488893, -1107962, -3320545, -4837934, -4813610, -3585509, -2434906, -2332787, -2868766, -2623396, -690426, 2274949, 4551423, 4777128, 2905237, 50066, -2328751, -3221681, -2527576, -1031105, 193667, 614494, 547854, 638058, 1164091, 1920243, 2518529, 2553831, 1705407, 127833, -1310406, -1701887, -1207218, -1095292, -2389404, -4708928, -6687212, -7304412, -6571074, -5181903, -3900719, -3161492, -2847567, -2407685, -1469321, -378951, 104719, -311535, -1110248, -1520532, -1166661, -117212, 1359644, 2843872, 3834592, 4191207, 4458003, 5290393, 6368441, 6324106, 4282682, 1320671, -322892, 254911, 1536546, 1544331, 368350, -168795, 822766]
36134H22766J329225K98593l07573M64566J435019J255761K97289l27640n81698
36125D686308j137578j793947j565594k46515J205521J922246J859681J213846
36117F143968P2982j082626j452570r49460m19653l67165k12810N59072J241239
36108C532977P71449o85376j933605k280340j990806j357017k81247J074689K060310
36099a088966K269959J941047J429530Q22978J86483l96737j097151j946049k151066
36090b9972q51142J120434J478628o08073k860489k423891M88729K857109K598713
36081A770046P23517m69127j93221M07179p101j365146k146631r08134J912498
36072b76120M025015L678217J644549j4680p11029j496888k619098k758566j399238
$$ y = [822766, 2151991, 2450584, 2143011, 2607577, 4042596, 5298357, 5595646, 5268006, 4686308, 3548730, 1754783, 189189, -57326, 1148195, 3070441, 4930122, 6143968, 6216950, 5134324, 3681754, 2732294, 2312641, 1945476, 1732666, 2291738, 3532977, 4304426, 3619050, 1685445, -594895, -2585701, -3942718, -4223965, -3149276, -1088966, 1180993, 3122040, 4551570, 5374548, 5561031, 5164294, 4067143, 2121094, -29972, -881114, 239320, 1717948, 1109875, -1750614, -4174505, -3685776, -828667, 1770046, 2493563, 2024436, 1831215, 2238394, 2231293, 866147, -1280484, -2188618, -276120, 3748895, 7427112, 9071661, 9056981, 8345952, 6849064, 4229966, 1471400, 72162]
36063G2162k34484q11477j961596j348362R76492K440686J506762l06792o70937
36054c37546M96662J297146N76635p70794j266295o90576L5824K85811K67665
36045a05468K07880j32424p01167o89411L09735J168771M38717j395759k195017
36036c094143j017166O37122J144227J036917J715663K784366K341819j89875
36028E358930k997741m020041l123234j623185m16303O41992J762003K412079
36020b005500J922268O88031Q8933P39012J348066L19814j681565k133455m4013
36011g58409K450749K798366J113992p00887j810011k668479l093539k214492
36003d882710m01934O54681L00199j86312L58639J406190J917826J828899J452374
$$ y = [72162, -162322, -973799, -2935395, -4283757, -3307265, -866579, 640183, 333391, -337546, 159116, 1456262, 2032897, 1262103, -4192, -694768, -658944, -373133, -105468, 102412, -30012, -731179, -1420590, -1110855, 57916, 496633, -899126, -3094143, -4111309, -3474187, -2329960, -1293043, 422620, 3206986, 5548805, 5358930, 2361189, -1658852, -4782086, -6405271, -6821574, -6179582, -4417579, -2005500, -83232, 604799, 693732, 1432744, 2780810, 3100624, 1419059, -714396, -758409, 1692340, 4490706, 5604698, 4903811, 3093800, 425321, -2668218, -4882710, -5284644, -4629963, -4329764, -4516076, -4157437, -2751247, -833421, 995478, 2447852]
35994B447852N21556j045297k232878k001796q29729o7675k2630K02373R75719
35985b052505J386442O68969m60720o69055J42215O91545J35449p58027q22234
35976a737921l01673m43268j397909j742890n38778J219473J995900J687292J249260
35967a0514J085439R22137P15692N00137j82585j444214k136194j249924J65135
35958a634891K18962q64437j004521L35934J190947K98851p98428k05110J395333
35949a067360J896330Q10700m47909p15271r9829P89732J421686J282865K03843
35940D074787j222609k067386j796737m10151J569504K936080K447809K67303
35932E798600j869287k504610j895670j137683o37248j21504N07576J046105J263108
$$ y = [2447852, 2969408, 1924111, -308767, -2310563, -3140292, -3207967, -3230597, -3028224, -2052505, -666063, 2906, -457814, -1126869, -984654, -293109, -157660, -915687, -1737921, -2039594, -2482862, -3880771, -5623661, -6162439, -4942966, -2947066, -1259774, -10514, 1074925, 1997062, 2712754, 3212891, 3030306, 1586092, -550102, -1800026, -1634891, -1415929, -2280366, -3284887, -2948953, -1758006, -1459155, -2257583, -2462693, -1067360, 828970, 1639670, 1191761, 476490, 376661, 1166393, 2588079, 3870944, 4074787, 2852178, 784792, -1011945, -1422096, 147408, 3083488, 5531297, 5798600, 3929313, 1424703, -470967, -1608650, -2245898, -2367402, -1859826, -813721, 449387]
35923D49387Q78846j52536j094824j019848k04333J47234j27446J27023J137444
35914A40947J368450k227j371463r35825O57696J470040J026654L03030j62147
35905B495155n15166o25959l43694j02202q9574K78719R10065M26242j447775
35896I85811k461199r15286J297715J309068l06575p32437L50775O51446l87194
35887b07876p42098K46502N51772q60187k073070j335847M17269J538506J849059
35878f15970J551558K75607j354911j448124K63927J385200M10234p97442p7608
35869d07529J441309J223822o64466j915114j432386j80771Q07899J277064J028789
35860A178617R5974o94912o92263m41494n79852n74444J14195O40957J52553m26676
$$ y = [449387, 1328233, 1175697, 80873, -938975, -1143308, -996074, -1123520, -996497, 140947, 1509397, 1507170, 135707, -800118, -142422, 1327618, 2354272, 2657302, 2495155, 1979989, 1354030, 1010336, 908134, 818560, 1097279, 2007344, 2433586, 985811, -1475388, -2390674, -1092959, 216109, -90466, -822903, -472128, 179318, -207876, -949974, -703472, -151700, -1011887, -3084957, -4420804, -4003535, -2465029, -615970, 935588, 1211195, -143716, -1591840, -1327913, 57287, 467521, -329921, -407529, 1033780, 2257602, 1593136, -321978, -1754364, -1935135, -1127236, 149828, 1178617, 1274591, 579679, -112584, -554078, -1133930, -1708374, -1594179, -953222, -800669, -1227345]
35850a227345J96011J338887J403170O04043N04022J217486J302303L98645j66479
35841E570743K93220P92172M83635p7719q0549L55852O28534L45332o47456k040473
35831E623291k835933k251576p47302O99711J886941K823381K562143L41163k419309
35822E682510l220842j733895j49891l4966o11687n78259J37383J049210J904989
35813B444552K154760J198306j93109l56460O42192P06588r68705k274162j436523
35804A917439k2066m90365k102145j952564M17053K187772J414095m06771r69882
35795g434m64820o22337j584019j629981Q8010K128494K626542J568543M33858
35786B536856J70492M10358M29971k6964q71243j703275j623166o8399J798437
$$ y = [-1227345, -1031334, 307553, 1710723, 2314766, 2818788, 4036274, 5338577, 5737222, 5570743, 5863963, 6656135, 7139770, 7062051, 6981502, 7337354, 7965888, 8311220, 7663764, 5623291, 2787358, 535782, -211520, 488191, 2375132, 5198513, 7760656, 8101819, 5682510, 2461668, 727773, 577882, 542916, -68771, -647030, -509647, 539563, 2444552, 4599312, 5797618, 5604509, 5248049, 5890241, 6596829, 5628124, 3353962, 1917439, 1895373, 1405008, -697137, -2649701, -2232648, -44876, 1369219, 962448, -7434, -472254, -1094591, -2678610, -4308591, -4220581, -2092087, 534455, 2102998, 2536856, 2707348, 3117706, 3547677, 3520713, 2649470, 946195, -676971, -745370, 1053067]
35777A053067J749652o55254k977918k792292p26437P69522Q58802P13991R26028
35768a080839O38556m78479j310053j049247l57509l709L40491J077068J567851
35759f55870J026888k05294j068050r51778l8926R23147J002173M6081o78505
35750f00134P3039J412229J189950p17237j870335q43113N91226K52693j122617
35741a634299j199646M45941K073407K384047J619205M54313o09717r90601n53773
35732A988877k01312p33836j448461j090046J71090J028338J013843Q24898Q29416
35723B382807N75061j69112r65695j334977j042324n1456J032421J082791j4618
35714A494898p56652j59681N08704k32956j371410r30791N65758Q13978l83823
$$ y = [1053067, 2802719, 2147465, -830453, -3622745, -4349182, -3579660, -2720858, -2006867, -1080839, -442283, -920762, -2230815, -3280062, -3637571, -3641280, -3300789, -2223721, -655870, 371018, 165724, -902326, -1854104, -1893030, -969883, 32290, 78371, -600134, -527095, 885134, 2075084, 1357847, -512488, -1355601, -764375, -511682, -1634299, -2833945, -2388004, -314597, 2069450, 3688655, 4142968, 3533251, 2542650, 1988877, 1787565, 1053729, -394732, -1484778, -1313688, -285350, 728493, 1553391, 2382807, 2957868, 2788756, 1823061, 488084, -554240, -605696, 426725, 1509516, 1494898, 738246, 578565, 1087269, 854313, -517097, -1447888, -882130, -68152, -451975]
35705d51975p99765M36310J592523J489945J090731J003535K36468j223882j384730
35696A989160L86602J556892K06547j705522j438452J78608M51266o70623j020973
35687f6495j87854K38367m5287K52249J006325M85731j337915k171483r30309
35678b756671O85359J148544J226351J888268K315428J578976M90969Q7424k83887
35669F380761j645507l281894l617324k429059p78980N52112J291082J084096
35661b444713L0650p58338l77725N65969R22162O67318N13837N20040L31355K20255
35651A90810N79709Q82358M71861q2203J72948P88598M86585p41295j619514j511093
35641c81236q75785j9897R81517J290217J25909j340959r56284J152063K320838
$$ y = [-451975, -1251740, -815430, 777093, 2267038, 3357769, 4361304, 4597772, 3373890, 1989160, 2375762, 3932654, 4139201, 2433679, 995227, 1173835, 1625101, 954478, -66495, -254349, -15982, -61269, 190980, 1197305, 1683036, 345121, -1826362, -2756671, -2071312, -922768, 303583, 2191851, 4507279, 6086255, 6577224, 6664648, 6380761, 4735254, 1453360, -2163964, -4593023, -5372003, -4819891, -3528809, -2444713, -2414063, -3172401, -3550126, -2984157, -2061995, -1394677, -880840, -360800, -29445, 190810, 770519, 1652877, 2124738, 2042535, 2215483, 3004081, 3490666, 2749371, 1129857, -381236, -1257021, -1276918, -295401, 994816, 1120725, -220234, -1176518, -24455, 2296383]
35632B296383J047249j076130k029925j901195j476056l73985J556819K673262
35624G16422J611619j86567k88963J124392J733508P05146m79462p54467p07357
35615C474271p23902r7364J159874J463066j73655k373592k990032j651162K06003
35606a706493J140538P34039n41215j645442j590472m14426P74307J141321J019351
35597a088492J031598R79979L22851o81819j114881n58779M64145J167060J178836
35588A700498O04010k00848q42982j096559r83910o73895l47577q7790J82483
35579a746570M79627M13529m71317j708367j929811n82296R97584J259212O89265
35570b599144J022722K445007L197749K147067J60452j458643k322609k251775
$$ y = [2296383, 3343632, 2267502, 237577, -1663618, -3139674, -3513659, -1956840, 716422, 2328041, 2141474, 1852511, 2976903, 4710411, 5415557, 4936095, 4181628, 3474271, 2750369, 2653005, 3812879, 5275945, 5102290, 2728698, -261334, -1912496, -1706493, -565955, 168084, -373131, -2018573, -3609045, -4023471, -3249164, -2107843, -1088492, -56894, 923085, 1245936, 564117, -550764, -1109543, -645398, 521662, 1700498, 2304508, 2103660, 1260678, 164119, -819791, -1493686, -1841263, -1929053, -1746570, -1266943, -853414, -1324731, -3033098, -4962909, -5545205, -4547621, -3288409, -2599144, -1576422, 868585, 4066334, 6213401, 6373853, 4915210, 2592601, 340826]
35562C40826r91362N23220M35328j289853k137567n51869J584837J876432J054125
35553H44117J136518J438782k09697k908028l177568n13351J280805j85501k156051
35544d449974j113379J760930K659665J036651r8809P05878J374726J04413j714413
35535B65688j852852n56023K78533N5148k13578m1603j55911q87761j285601m81923
35525d875883R19711J596310J200048N64943M08762N64611N88093M56528L18880
35516A742003M6694m66888q56633o86986j76326L8397j49771k03790O7625M8379
35506e97296o74454j284296m94351J601954L105900K246878m61687k528995k093499
35497a179846J44197J869062J719637M22524m96866m55353l0819j971o19225j508389
$$ y = [340826, -650536, -127316, 308012, -981841, -3119408, -3671277, -2086440, -210008, 844117, 1980635, 3419417, 3209720, 301692, -2875876, -3389227, -2108422, -2293923, -4449974, -5563353, -3802423, -1142758, -106107, -204916, 500962, 1875688, 1980101, 265688, -1587164, -2143187, -1864654, -1809506, -2023084, -2064687, -2220598, -3108359, -4393960, -4875883, -3956172, -2359862, -1159814, -594871, -186109, 378502, 966595, 1423123, 1742003, 1788697, 1321809, 465176, -221810, -398136, -359739, -509510, -713300, -645675, -597296, -1271750, -2556046, -3050397, -1448443, 1657457, 3904335, 3442648, 913653, -1179846, -1035649, 833413, 2553050, 2975574, 2478708, 2023355, 1992536, 1990565, 1371340, -137049]
35487a37049j885535j146608L18465J170215N33422p80638j082254J43306J592726
35478a273950J764948P24377j52172O1797Q00511Q31586j58731j161204j101427
35469C35735j49365O04899N68630J73795K8390K09055N33403Q50491Q42518K90325
35459D287876j86542M03950J719208J910604J6708k461141l476349l013193k402477
35450c201356j927058q69185N52707J245134J143127J155815J154555O9640j647096
35441b323717j871711j0645J704957J413193K73192L04998J163755J085611j5258
35432A724375n73195l9391M63649J18083n95464r70230p82373Q6109J408524J997101
35422B837188P67041j381458k194233j020927K42467j19846j243805j107723N19597
$$ y = [-137049, -2022584, -3169192, -2850727, -1680512, -1147090, -1927728, -3009982, -2866676, -1273950, 490998, 1215375, 1063203, 1125000, 1925511, 2757097, 2598366, 1437162, 335735, 186370, 791269, 1359899, 1533694, 1562084, 1771139, 2304542, 3155033, 3997551, 4287876, 4101334, 4505284, 6224492, 8135096, 8151804, 5690663, 2214314, -798879, -3201356, -5128414, -5997599, -5444892, -4199758, -3056631, -1900816, -746261, -676621, -2323717, -4195428, -4206073, -2501116, -1087923, -814731, -509733, 654022, 1739633, 1724375, 1151180, 1111789, 1575438, 1693521, 1098057, 127827, -654546, -568437, 840087, 2837188, 3604229, 2222771, 28538, -992389, -749922, -869768, -2113573, -3221296, -2701699]
35413b701699J873936J633755L34179p98825j377813j637652j411022l27407J026002
35404c386546J204321k18031j609098j133496P06093J620714O50371o75013p48976
35395c589661O72L97106N87927J309164J948429J182147o91558j797359j251435
35386a904568j96541J04822j43648j82795k9851r8018k84906j96652K40113R02981
35376a789063J657675K005279J255861l70237j512933j314294p28072j256230
35368b052014k726051l414117k414001q07459k6554P6240O68750J896633K492280
35359f306293J606964J07259n58211j47641N10652R64851J373340J472822O22742
35350c53515q14591j379492m57538P26982Q58902L06360J71980M60815M18639
$$ y = [-2701699, -827763, 805992, 1140171, 341346, -1036467, -2674119, -4085141, -4412548, -3386546, -2182225, -2400256, -4009354, -5142850, -4436757, -2816043, -2165672, -2840685, -3589661, -3588989, -3191883, -2603956, -1294792, 653637, 1835784, 1144226, -653133, -1904568, -2101109, -1996287, -2139935, -2322730, -2352581, -2450599, -2735505, -2932157, -2692044, -1789063, -131388, 1873891, 3129752, 2759515, 1246582, -67712, -795784, -2052014, -4778065, -8192182, -10606183, -11413642, -11440196, -11363956, -10695206, -8798573, -6306293, -4699329, -4592070, -5150281, -5297922, -4787270, -3822419, -2449079, -976257, -353515, -1168106, -2547598, -3005136, -2278154, -1419252, -1112892, -940912, -480097, -61458]
35341f1458N2550p6K89751M94692P80581J513010K074003J430830j95092j493821
35331D884970j831207j616556j068983l5604R83718J100771M39183r1774l78321
35322B386197r18508j208689k99150R38270M36285j615487k441236q80914N93437
35313c009795k67838j948388j735444L7597R82602O21680N27544J140932J230858
35304b420252M78092R0785N06925O50407L6554k58262N02754J337286R21340o53085
35294A192544k137864k455570j481290j34192L05237l82986r20798l09104N98232
35285e725791N20184m960M07309J292008Q81393o81023j154572K50971J604185
35276b610296J485999J066268J499825J571290L6641j548626r30238J061899J541658
$$ y = [-61458, -8908, -8984, 280767, 775459, 1556040, 3069050, 5143053, 6573883, 6378791, 4884970, 3053763, 1437207, 368224, 332620, 1316338, 2417109, 2856292, 2764518, 2386197, 1467689, 259000, -40150, 898120, 1334405, -281082, -2722318, -3603232, -3009795, -3277633, -5226021, -6961465, -6923868, -5941266, -5319586, -4792042, -3651110, -2420252, -1942160, -1851375, -1344450, -694043, -657489, -915751, -412997, 924289, 1845629, 1192544, -945320, -3400890, -4882180, -5016372, -4711135, -5094121, -6014919, -6324023, -5725791, -5205607, -5210567, -4803258, -3511250, -2629857, -3310880, -4465452, -4214481, -2610296, -1124297, -58029, 1441796, 3013086, 3049727, 1501101, 570863, 1632762, 3174420]
35267C174420j07972j570224j312815m56660k89480j55556R18868K119829J924748
35258D245158M02909r92934j492688j573598j582604j058294J77389J188306R61115
35249B74759j14842n87113K38691J470747J811395R54469n48229k156142l381953
35240b038218l476050k074281l8854J287981J652301J770672J731865Q33268p13243
35231a064559j395251n08597O40145O94230K39737M83173R44592K60371j207066
35222i13225j525080j09604J243668Q37181p54300j740985j347548j76912R28108
35213c558697J540087J548334J129982P39411P16045R15351Q67619K30319q70402
35204C258049j784827j822691j069739l80530j30746M61312J933848L059489K072557
$$ y = [3174420, 3066448, 1496224, 183409, -273251, -562731, -718287, 200581, 2320410, 4245158, 4648067, 3655133, 2162445, 588847, -993757, -2052051, -1874662, -686356, 274759, 159917, -427196, -188505, 1282242, 3093637, 4048106, 3499877, 1343735, -2038218, -5514268, -7588549, -7627403, -6339422, -4687121, -2916449, -1184584, -351316, -1064559, -2459810, -2968407, -2328262, -1634032, -1394295, -911122, 33470, 293841, -913225, -2438305, -2547909, -1304241, -467060, -1221360, -2962345, -4309893, -4486805, -3558697, -2018610, -470276, 659706, 1399117, 2115162, 3030513, 3898132, 4128451, 3258049, 1473222, -349469, -1419208, -1799738, -1930484, -1469172, 464676, 3524165, 5596722]
35195E596722p16243l017100l450990k790909j938094n17403J494807K533633
35187b805577J535250r14K3234J147165J260387J04193n38417j29326k66613j569564
35177a240182k119906m82601J669395J894460N98228J40849J129648J947451J814644
35168E351986J908481K778786K770059M84431k486948l090009p55904J659982
35160H620864J215319j765533m215275l735746q88142J851908K795797K226982
35152F106174J236677L51780k69215j44143J012054K416274K943296K678411K708485
35143A9039793L323023L630232L281068L286418M411643N896422O768579P582689
35135E7219867R724859J3437710J7494638K0809135K4253070L1220170M5099911
$$ y = [5596722, 4880479, 1863379, -1587611, -4378520, -6316614, -6834017, -5339210, -2805577, -1270327, -1271241, -1248007, -100842, 1159545, 1263738, 725321, 595995, 329382, -1240182, -3360088, -3842689, -2173294, -278834, 319394, 460243, 1589891, 3537342, 5351986, 7260467, 10039253, 12809312, 13293743, 10806795, 7716786, 6960882, 8620864, 9836183, 8070650, 3855375, 119629, -768513, 1083395, 3879192, 6106174, 7342851, 7694631, 7425416, 7281273, 8293327, 10709601, 13652897, 16331308, 19039793, 22362816, 25993048, 29274116, 32560534, 36972177, 42868599, 49637178, 57219867, 66944726, 80382436, 97877074, 118686209, 142939279, 174159449, 219259360]
35128B19259360O3014714P1692266N4893238J0404138m1840757p4267824p5740765
35121B27414370n8222198m0128986k8792388k1094665j4460475j0332532r011887
35114D5371239p725131m899894k332618j920386l066872m218829m602051l737639
35106A2867819j459158Q95343J357858M0454r33829o40033l65872r19175j302645
35097I540762r25243p48224j103396p53354M64748M67791j737659l742391l000800
35088a537766n87099P18659N28846M26402P30621N17688L4662K46533M70611p09969
35078H39188k405927k173886O4720J667704J266340L88887L95542N04729N237
35069E52534p0407R81793J855769J271374Q973o30992q06192j002095n43897Q91725
$$ y = [219259360, 282274074, 353966340, 408859578, 419263716, 377422959, 303155135, 227414370, 169192172, 129063186, 100270798, 79176133, 64715658, 54383126, 45371239, 37646108, 32746214, 30413596, 28493210, 25426338, 21207509, 16605458, 12867819, 11408661, 12304004, 13661862, 13702316, 12768487, 12128454, 11762582, 10843407, 9540762, 8615519, 7867295, 6763899, 6010545, 6475293, 6943084, 5205425, 1463034, -1537766, -2124865, -1406206, -877360, -450958, 279663, 797351, 832013, 1078546, 1549157, 839188, -1566739, -3740625, -3675905, -2008201, -741861, -352974, 42568, 547297, 552534, 482127, 1463920, 3319689, 4591063, 4600036, 3969044, 3162852, 2160757, 1616860, 2508585]
35059B508585J681508L26847j849427k264060p11643O92286Q01168M40909J65099
35050A791272o79304k049085k382119q13215J161677J505456L18048m91079J84324
35041a454025J458993J933518J479537J033773J010510P00527m74723j746310
35033C941800j836786q10948j19779o35292j579536j759026r43181M23050J848156
35024a471542K510133J488612p35009k012174r49653J229614K457869K532687
35016E050537K520433K299217P58429j763015l286576k775970j285333j65937
35008A351785L99517O79325O13727K47462k20958j089489k593117l575246k353338
34999f540332O74490K993102L183993K467650K251810K029425R62614k12802n15543
$$ y = [2508585, 4190093, 4516940, 2667513, 403453, -308190, 384096, 1185264, 1626173, 1791272, 1111968, -937117, -3319236, -4132451, -2970774, -1465318, -1147270, -1638349, -1454025, 4968, 1938486, 3418023, 4451796, 5462306, 6162833, 5688110, 3941800, 2105014, 1294066, 1174287, 538995, -1040541, -2799567, -3742748, -3319698, -1471542, 1038591, 2527203, 1792194, -219980, -1169633, 59981, 2517850, 5050537, 7570970, 9870187, 10628616, 8865601, 5579025, 2803055, 1517722, 1351785, 1751302, 2430627, 3044354, 3291816, 3070858, 1981369, -611748, -4186994, -6540332, -5865842, -2872740, 311253, 2778903, 5030713, 7060138, 8022752, 7809950, 7294407]
34990G294407n08390r75579j099962o361R41198j79545k376408k530031J38460
34981F97789K714841K445809O0221j789147j950382j379053j164317j179063n98153
34972b141455Q16732K041508J606640m76431k035344j039368J558015K657557
34964B987854R82090j280357j576741l15916K74013l61990n87092N87228J875638
34955B584727J558477k13674j827597k231163j640658o30249M47389J115746Q45624
34946H622j01652o21539j01065P74606J138303J205397J546843J714896Q79284
34937F443695m65692r41248m68674l82145j032544j092474j3980P15350O4290
34928B826578n82894K46119J381433Q81667n44106o63879L95636L62479j115108
$$ y = [7294407, 6786017, 5810438, 4710476, 4704115, 5645313, 5465768, 3089360, 559329, 697789, 3412630, 5858439, 5918660, 4129513, 2179131, 800078, -364239, -1543302, -2141455, -1324723, 716785, 2323425, 1846994, -188350, -1227718, 330297, 2987854, 3969944, 2689587, 1112846, 796930, 1070943, 708953, 121861, 709089, 2584727, 4143204, 3929530, 2101933, -129230, -1769888, -2400137, -1952748, -837002, 8622, -93030, -714569, -815634, -41028, 1097275, 2302672, 3849515, 5564411, 6443695, 5978003, 5036755, 4568081, 4185936, 3153392, 2060918, 2046938, 2762288, 2826578, 2243684, 2489803, 3871236, 4752903, 4208797, 3544918, 3940554, 4303033, 3187925]
34919C187925j683187k44387J173457P83604k34259l7308R47445J269198R04501
34910F066989M94894l64725j938714k707292j281458Q83142J137424m43824j240049
34901F06387q7738J319743J345471M43337l60490r38036j127611k56530J247079
34892B191612J478688k92064k036549j637718M2885N88149l78270j109821q38289
34883a991377o88038j226000j250113M2623J400949J386464O92094J028331K377552
34874A772485K969241J793859l08859k102297l085872k940050j347775R05918
34866b343350J952420J042476j98191J10171J475817J884001P48405n52785r59356
34857C159608r14201r55953o47081L49275J267314J216596M17765l07623o60230
$$ y = [3187925, 1504738, 1260351, 2433808, 3217412, 2983153, 2945845, 3893290, 5162488, 6066989, 6561883, 6197158, 4258444, 1551152, 269694, 1152836, 2290260, 1846436, 606387, 518649, 1838392, 3183863, 3627200, 3266710, 2328674, 1201063, 944533, 2191612, 3670300, 3378236, 1341687, -296031, -253146, 335003, -43267, -1153088, -1991377, -2679415, -3905415, -5155528, -5112905, -3711956, -2325492, -1633398, -605067, 1772485, 4741726, 6535585, 6226726, 4124429, 1038557, -1901493, -3249268, -2343350, -390930, 651546, 453355, 563526, 2039343, 3923344, 4671749, 4118964, 3159608, 2245407, 1289454, 642373, 991648, 2258962, 3475558, 3893323, 3585700, 2925470]
34848B925470p53838m34993M94968J651639K261723J868880O31258p49746j346950
34839F548411r01018m84358j344603k844086k766478l14996K429498L035961J613968
34830D972299q670r37013j483250j602765r49920k18493n62586j546551j362344
34821c699293N03649K300849K297677Q14546o35493j145309o79101M58639J547279
34812A763443J522828L0958j842455k491414j375055N17516J603862J099079k29040
34803E99722p92463j723J008510J037338N93259R02385J611242J113565p47795
34794E324040k037644j392770J76376R82829Q10256L52138k42896r78670j154061
34785A839598l64946K74073n89944k330763k810816j111185J330756K472919J684358
$$ y = [2925470, 2171632, 1736639, 2231607, 3883246, 6144969, 8013849, 8645107, 7895361, 6548411, 5647393, 5163035, 3818432, 974346, -1792132, -2107128, 322370, 3358331, 4972299, 4963629, 4026616, 2543366, 940601, -9319, -227812, -790398, -2336949, -3699293, -3195644, -894795, 1402882, 2217428, 1581935, 436626, -242475, 216164, 1763443, 3286271, 3317229, 1474774, -1016640, -2391695, -1874179, -270317, 828762, 599722, -192741, -194464, 814046, 1851384, 2444643, 3347028, 4958270, 6071835, 5324040, 3286396, 1893626, 2070002, 3052831, 3863087, 4215225, 3972329, 2993659, 1839598, 1474652, 1748725, 1158781, -1171982, -3982798, -5093983, -3763227, -1290308, 394050]
34776C94050j18014j551856j742206p76002N27424J449081J868932J832597J169708
34767C053714N0758n96718j7395J268131J996545J624058O34623l66043j166115
34758F481558j740509k190222k685576k858798j686869J068919L621219L609771
34750C619493R49468j843428k473510j100830N28688J173789P58345j96906r98242
34741D16867j074089m82190J38397M74460R41542J758008K183532J399033j78086
34732E577474j244677j209068p26211n56303n92935l90000j30128m39113j336152
34723a047113j953106j541162l91099O41199J318034K137040L140139L244386
34715E548318J397090j759084m013473l636716j079488J483281K132451P26947
$$ y = [394050, 276036, -1275820, -3018026, -3794028, -3266604, -1817523, 51409, 1884006, 3053714, 3104472, 2507754, 2490359, 3758490, 5755035, 7379093, 8013716, 7647673, 6481558, 4741049, 2550827, -134749, -2993547, -4680416, -3611497, 9722, 3619493, 4568961, 2725533, 252023, -848807, -320119, 853670, 1612015, 1415109, 416867, -657222, -1139412, -1001015, -526555, 414987, 2172995, 4356527, 5755560, 5577474, 4332797, 3123729, 2397518, 1841215, 1248280, 858280, 728152, 289039, -1047113, -3000219, -4541381, -4932480, -4291281, -2973247, -836207, 2303932, 5548318, 6945408, 5186324, 1172851, -2463865, -3543353, -2060072, 72379, 799326]
34707G99326j243631k127605j551370n43618k42537n73205m12673R40201K770752
34698b184360L631462K838484J014794p51373j860994k183151j604418k42049
34690a341605J016434J002549l30669j594412j594313p90931m49623p59791p45302
34681e587663J21559J268021K071694K512362K477627J477323l44858j756615
34673B239450j735226o84297K20316L87885L5082l68299l78560J19671M81209
34664C17231r2390j097316q96573R57383K675554K522864J101428Q2037l18011
34655E252207r41575j562487j137588Q8321O86595L25857J33428N44729N80257
34646C969744k74889j162618j446946j628095j919636j474607j5311J155542R14207
$$ y = [799326, -444305, -2571910, -4123280, -4666898, -4909435, -5482640, -5895313, -4955112, -2184360, 1447102, 4285586, 5300380, 4549007, 2688013, 504862, -1099556, -1341605, -325171, 677378, 346709, -1247703, -2842016, -3632947, -4082570, -4842361, -5587663, -5466104, -4198083, -2126389, 385973, 2863600, 4340923, 3996065, 2239450, 504224, -180073, 40243, 428128, 463210, 94911, -283649, -163978, 317231, 224841, -872475, -1769048, -811665, 1863889, 4386753, 5488181, 5570218, 5252207, 4310632, 2748145, 1610557, 1698878, 2385473, 2711330, 2844758, 3389487, 3969744, 3694855, 2532237, 1085291, -542804, -2462440, -3937047, -3952358, -2796816, -1882609]
34637a882609p8324o60868r06340j247363r48175Q23383K975746L357313J637106
34628C069869k21987o69035m01584q45353j816950j769772j17819J643477J564059
34619D34905m14421k331468k428402q95701Q10842J654701J449252L89124q34166
34610b165334j025014J37882J104599L01001j293728j209542Q32907K366683J819719
34601H69173N62978L01011N09144M3540m83393N8920R77700P73479l13736q14777
34591B484039n49378o36783j255001j313960m26237M44793N06811r385o17981
34582a373082j044188r59522l30094J58044N4237M5339O76333R10965k92806j623984
34572c778758q97501J327658K150956O71604o86554p5835J072766P37117m71774
$$ y = [-1882609, -1960933, -2621801, -3528141, -4775504, -5723679, -4900296, -1924550, 1432763, 3069869, 2847882, 2178847, 1777263, 931910, -885040, -2654812, -2772631, -1129154, 434905, 20484, -2310984, -4739386, -5635087, -4824245, -3169544, -1720292, -1331168, -2165334, -3190348, -3052466, -1947867, -1646866, -2940594, -4150136, -3317229, -950546, 869173, 1432151, 1733162, 2242306, 2285846, 1802453, 1861373, 2839073, 3612552, 3298816, 2484039, 1934661, 1297878, 42877, -1271083, -1697320, -1252527, -745716, -755101, -1373082, -2417270, -3376792, -3706886, -3548842, -3494605, -3449266, -2772933, -1861968, -2154774, -3778758, -4676259, -3348601, -1197645, -526041, -1212595, -1288430, -215664, 521453, 49679]
34563D9679p41938j19975M0465l37948k36752K07064j93079j270215j199750P46902
34553c055547K642659K169834l28111k150124j450473P18766J873966J018388
34545A439358n66354j240945q04996n2614N77378J106378J331413R56086J37628
34536B883332p91524j720029k209924j349135P92095K433779K244120J341794
34528C624508J346675J413466k49683k555711k519345k29936P59623r31135k128594
34519a470132l30061K077284J671620o92589j829068j395517j369525j712167
34511e050155n44089J813434K762907J596330L81381K31947j34254j370072k062854
34502b375425j437936p67265p60032r2532J859349L138967K026777q3962p04492
$$ y = [49679, -692259, -812234, -771769, -1109717, -1346469, -1139405, -1332484, -2602699, -3802449, -3055547, -412888, 1756946, 1428835, -721289, -2171762, -1452996, 420970, 1439358, 873004, -367941, -1172937, -1225551, -648173, 458205, 1789618, 2745704, 2883332, 2091808, 371779, -1838145, -3187280, -2395185, 38594, 2282714, 3624508, 4971183, 6384649, 6134966, 3579255, 1059910, 829974, 1589597, 658462, -1470132, -1800193, 277091, 1948711, 1256122, -572946, -1968463, -3337988, -5050155, -5594244, -3780810, -1017903, 578427, 959808, 1191755, 1057501, -312571, -2375425, -3813361, -4580626, -5340658, -5433190, -3573841, -434874, 1591903, 1507941, 803449]
34493H03449K23116Q65942N61396K97057O60764J107981J110163O86341o6264
34484F249945r34919j354166j118867r61065j526504k200609j879730n50360P58198
34475c518077J253438Q89079Q6783l32564L74713J580647J297846j256032l820834
34466c445001l440436l11172K446773K856705K084144J939073K265435J964454
34458F359975J182269Q44662P21526l31200k219145l199433k134125p8190J107434
34449B253773R55106L54957n6967l29679l06000L18690Q70771P8275j795564k624665
34439b81303j298531M30306N42106m3086Q90881K740367K476944n97058l357541
34430A503085l203584j358814k45892J40037J035171J869414J106722p95968j815441
$$ y = [803449, 1026565, 1892507, 2453903, 2750960, 3411724, 4519705, 5629868, 6316209, 6249945, 5315026, 3960860, 2841993, 1880928, 354424, -1846185, -3725915, -4276275, -3518077, -2264639, -1375560, -1288777, -1621341, -1246628, 334019, 1631865, 375833, -3445001, -6885437, -7196609, -4749836, -1893131, 191013, 2130086, 4395521, 6359975, 7542244, 8386906, 9108432, 8777232, 6558087, 3358654, 1224529, 1146339, 2253773, 3208879, 3563836, 3506869, 3177190, 2871190, 3189880, 4060651, 4138926, 2343362, -281303, -1579834, -1149528, -607422, -650508, 240373, 2980740, 5457684, 4860626, 1503085, -1700499, -3059313, -3305205, -3165168, -2129997, -260583, 846139, 50171, -1765270]
34421a765270j348580n21656J95191J370016K571038K250424J95422j780695k194784
34412a028894j376458k13965Q71823J219058M9963j848717k265167m42659J658744
34403c376272K095221J483541J445432J804534J094498q28823k367125k210540
34395h59534n96486J297667K257059J570004l71635k087902k318502j206148J99405
34386b116072J137030J399816J123232R09509J358460J819642P03341j974448
34378D360510l628962k263865M60645J327071K6331q30855O6420J139894J035215
34369A692404P27181J293579J775932R82321j99665k20609N00972L21090r33236
34360E939969j916953k079270k151145k287375j504580N13165K418171K727076
$$ y = [-1765270, -3113850, -3635506, -3440315, -2070299, 500739, 2751163, 2946585, 1165890, -1028894, -2405352, -2619317, -1747494, -528436, -478473, -2327190, -4592357, -5035016, -3376272, -1281051, 202490, 1647922, 3452456, 4546954, 3718131, 1351006, -859534, -1456020, -158353, 2098706, 3668710, 3297075, 1209173, -1109329, -2315477, -2116072, -979042, 420774, 1544006, 2453515, 3811975, 5631617, 6334958, 4360510, 731548, -1532317, -1071672, 255399, 281730, -549125, -482705, 657189, 1692404, 2419585, 3713164, 5489096, 6471417, 6271752, 6051143, 6552115, 6873205, 5939969, 4023016, 1943746, -207399, -2494774, -3999354, -3486189, -1068018, 1659058]
34352A659058J486619r5235r57923p44690K14281J021576Q79271j8471p55350
34343B689136r98841j323283k005406k359856j746874m77748Q21015J980431K780800
34334f40626K495266R25228o55848p05521O28444J687946J346630N4637j034668
34325D101488j151048k28311R88417J216929q2635j738151k109018j216473n08257
34316g27059n48572m18616K93630N95316j7633l92490K94843Q15003j69772j532814
34306a808164j124587P53257J530137J22846j529563j283589N13022J965015J984463
34297A122837Q59406m84029r72927n0547J358855J389257m35005k182485j752268
34288a146906M98651K324029K301327R87891l15085r05083p56927j20180O14979
$$ y = [1659058, 3145677, 3050442, 2092519, 1347829, 1562110, 2583686, 3462957, 3444486, 2689136, 1690295, 367012, -1638394, -3998250, -5745124, -6222872, -5401857, -3421426, -640626, 1854640, 2779868, 2124020, 1418499, 2046943, 3734889, 5081519, 5136156, 4101488, 2950440, 2722129, 3710546, 4927475, 4844840, 3106689, 997671, -218802, -727059, -1275631, -1694247, -1400617, -805301, -822934, -1215424, -920581, -105578, -275350, -1808164, -2932751, -2179494, -649357, -526511, -2056074, -3339663, -2826641, -861626, 1122837, 1982243, 1498214, 525287, 474740, 1833595, 3222852, 2787847, 605362, -1146906, -648255, 1675774, 3977101, 4964992, 4649907, 3744824, 2987897, 2867717, 3482696]
34279C482696R95192P01594k37023j264516j504558o87022J84630j33410j319409
34270B18174j672900m38141J101792J405904N03759o50250j524981j782935q65436
34261c705014R02781J764597N86566j262874j624939m83085M82019O64267Q86860
34252a788822J285481R86485M3196l49779K3597j0907p70655r63976M4054J016233
34242d85093Q62822K42162Q5349N7617l50940o42420m57121n21759j130311j060818
34232c400512M52942J944764J672649L02638k34326K91096N73772K66601J76079
34223B045703K59634m23158j633450j777812k71374J440839J686622K50285j872714
34214b95425l219264k439014L90787K949222K721936J21878j917045j686681m08023
$$ y = [3482696, 4477888, 5179482, 4942459, 3677943, 2173385, 1486363, 1670993, 1537583, 218174, -1454726, -1892867, -791075, 614829, 1118588, 468338, -1056643, -2839578, -3705014, -2802233, -1037636, -451070, -1713944, -3338883, -3821968, -3339949, -2675682, -1788822, -503341, 483144, 526340, 176561, 200158, 189251, -581404, -1545380, -1501326, -485093, 377729, 619891, 705240, 762857, 411917, -230503, -687624, -1209383, -2339694, -3400512, -2947570, -1002806, 669843, 972481, 738155, 1029251, 1603023, 1869624, 2045703, 2305337, 1882179, 248729, -1529083, -1800457, -359618, 1327004, 1577289, -295425, -3514689, -5953703, -5562916, -2613694, 108242, 230120, -1686925, -3373606, -3781629]
34205c781629J73875O4654P8439K62238L63824O19359J034006R44955K09197k47114
34195b78196P6989L78373P9232n7142N22314Q15430o9005j073023p52948K42810
34185a15166K15335o58596n66999Q90661J977021J466212J87349o46821r92564
34176A756432j052052l19639J241901K144882R13752j761671l590309l266062
34168c932766j563667Q1555J112871J678083J734235J067218j0522o67126m81810
34159i81929J260m3409o83099j182099q80814J56639J229642J455240M09974j230794
34149a749389k001756j216626J03438O65856P81891J489189K161256J018350j588241
34140c36032k672984o90089J862893J822395k08575j170065k63425L77024n03421
$$ y = [-3781629, -3607754, -3543100, -3464661, -3202423, -2838599, -2219240, -1185234, -240279, -31082, -278196, -201207, 177166, 256398, 199256, 721570, 1537000, 1467995, 394972, -357976, -115166, 100169, -558427, -1125426, -234765, 1742256, 3208468, 3395817, 2748996, 1756432, 704380, 384741, 1626642, 3771524, 4685276, 2923605, -666704, -3932766, -5496433, -5414878, -4302007, -2623924, -889689, 177529, 167007, -500119, -981929, -980669, -1024078, -1707177, -2889276, -3770090, -3613451, -2383809, -928569, -518595, -1749389, -3751145, -4967771, -4864333, -4198477, -3416586, -1927397, 233859, 1252209, -336032, -3009016, -3699105, -1836212, -13817, -222392, -1392457, -1655882, -1278858, -1782279]
34131a782279j488547j028811M19816J566651J838436J043067q59604k826485
34123c117756l081229j321926O72144J383184J168096Q18522J38298q76072r35405
34114e152144Q70844L272447M191207L243504J611138J52288j010893j644869
34106E533522j567561j307538j410988j467128q91118j26955J26680K82134J030250
34097B01298J649281Q14050j070788k006766j020562P72590J892767J938906J133642
34088D304418j80251j217498j151222k49665L85371L58529J30768l19967j419153
34079F41330k410403j756242K27347J099074k11238j486041m05827J933943K730199
34070C62142J560839M36181L30829J13060r58122j920883j933728j571111j432407
$$ y = [-1782279, -3270826, -4299637, -3879821, -2313170, -474734, 568333, -291271, -3117756, -6198985, -7520911, -6848767, -5465583, -4297487, -3478965, -3340667, -4216739, -5152144, -4281300, -1008853, 3182354, 6425858, 8036996, 8189284, 7178391, 5533522, 3965961, 2658423, 1247435, -219693, -1110811, -1237766, -1111086, -828952, 201298, 1850579, 2664629, 1593841, -412925, -1433487, -660897, 1231870, 3170776, 4304418, 4124167, 2906669, 1755447, 1505782, 1891153, 2249682, 2380450, 2060483, 641330, -1769073, -3525315, -3297968, -2198894, -2410132, -3896173, -4302000, -2368057, 362142, 1922981, 2359162, 2689991, 2803051, 1844929, -75954, -2009682, -3580793, -5013200]
34061e013200r87589J62316J141740J094030O47345Q54197J406465J227750L70616
34052I03670o6606K24652L54651j73477o86524n92947l92534p97428j576065j926902
34042d729510j483432m20765Q78867J733281J427188L27097Q170J185032K137536
34033A063464P26189k229713l407910j275295J783194K621872J208898m1440K06057
34024F55316J028916J171801N34735l46738j058408j290223r42587m05137q5845
34015g38170J91861O18502O51961j02931o96074N9212J478820J673249M16159
34006C552589m62797K2200O25663K14319l77363j03458L53512q63n28825k84176
33996C010801j14088j285840k786185k384184k04372J116178K13289j134802o87086
$$ y = [-5013200, -6000789, -5838473, -4696733, -3602703, -2955358, -2101161, -694696, 533054, 903670, 837064, 1061716, 1416367, 1242890, 556366, -36581, -429115, -1226543, -2802608, -4729510, -6212942, -6633707, -5754840, -4021559, -2594371, -2267274, -2259104, -1074072, 1063464, 1789653, -440060, -3847970, -5123265, -3340071, -718199, 490699, 449259, 655316, 1684232, 2856033, 3390768, 3044030, 1985622, 695399, -247188, -652325, -738170, -546309, 72193, 724154, 621223, -74851, -15639, 1463181, 3136430, 3552589, 3089792, 3111992, 3737655, 3951974, 3574611, 3471153, 3824665, 3823802, 3294977, 3010801, 2896713, 1610873, -1175312, -3559496, -3763868, -2647690, -2434401, -3569203, -4256289]
33987d256289J364284L101637L248638J964546K41916p39793m47625K59264j9883
33978D716695j273211j946751j187740p8668K6206p10904j326730j537189j496785
33969d815077r66649J16866Q96597O13698m2357K88832J754712L091166L041667
33960C979455J245242j728736m281980m407592j777254J216047K019042J241402
33952b494374J621481L668876M574615K339505j079572k410804j395421l98041
33944D426265n08500m41702N63006J084373j15862j706949j431650O09825K003486
33935D482292J297781k61774p43028m5597N01437K46632k80132o75643j207545
33926C314423j837123j816010q56926J27202K24828j56719o8546L64727K30040
$$ y = [-4256289, -2892005, 209632, 3458270, 5422816, 5664732, 4924939, 4477314, 4736578, 4716695, 3443484, 1496733, 308993, 230325, 256531, -454373, -1781103, -3318292, -4815077, -5781726, -5664860, -4768263, -4154565, -4196922, -3908090, -2153378, 937788, 3979455, 5224697, 3495961, -786019, -5193611, -6970865, -5754818, -3735776, -2494374, -872893, 2795983, 7370598, 9710103, 8630531, 6219727, 4824306, 4426265, 3917765, 3476063, 4039069, 5123442, 5007580, 3300631, 1868981, 2478806, 4482292, 5780073, 5518299, 4775271, 4729674, 5231111, 5477743, 5197611, 4521968, 3314423, 1477300, -338710, -1195636, -1068434, -843606, -1000325, -1068871, -704144, -474104]
33917d74104m41756m92464N27233J477864J217171J71971m85159n35971o05709
33908C59076p98313n88298m968J96696j98129m22944l7623K18519l46970r90387
33898b613341m44714J038824J719017O41933j096248j854785j401932o29426M9791
33889d590881R52983J953129K189835J306167J39852l61044l08455l43595m28648
33880E09343J4060R39671J484987J048911n8102j172158j856897j741539n39918
33871a371642J233366K160102J322050m40731j429855j133517n52216m45432k85493
33862i43368N00992J155791N08184j111703k054503j540097n73250k43871j37774
33853d439599O90578J884723K124696J099321k6479k84369k3707N92k77372n98291
$$ y = [-474104, -915860, -1408324, -881091, 596773, 1813944, 1985915, 1500756, 964785, 359076, -439237, -1027535, -1032503, -835807, -1033936, -1456880, -1494503, -1275984, -1622954, -2613341, -3058055, -2019231, -300214, 341719, -754529, -2609314, -4011246, -4640672, -4590881, -3637898, -1684769, 505066, 1811233, 1951085, 1590041, 1281586, 937991, 509343, 523403, 1463074, 2948061, 3996972, 3938870, 2766712, 909815, -831724, -1371642, -138276, 2021826, 3343876, 2903145, 1473290, 339773, -212443, -657875, -943368, -442376, 713415, 1221599, 109896, -1944607, -3484704, -4057954, -4301825, -4439599, -3749021, -1864298, 260398, 1359719, 1333240, 1048871, 1025164, 1025756, 748384, 150093]
33843A50093r61757j090670j32319K003258L569377K663631o4219j791666r90901
33834C354827P43420J031930k37559j277668j062660k85904R2308n4203n24278
33825A780213j242843j760281j262137K41451J446326J253223K10269l99280m74039
33816b07098r70274j960771k133364p09529J228649K154753K020414J727182J318684
33807B468646J28888j381110j533062J90809J912009J556187m21984j678298j068770
33798A73315O6017o8706j301772j754500k92503J821261K115731j39768k637985
33789b018910k461644K59273K283259J349465r80579j762361p64999j55802o68947
33780d921245o23931P80865J694668N71715j032338o60597J242185K011656P87296
$$ y = [150093, -811664, -1902334, -2034653, -31395, 3537982, 6201613, 6137394, 4345728, 3354827, 4098247, 5130177, 4892618, 3614950, 2552290, 2266386, 2358694, 2304491, 1780213, 537370, -1222911, -2485048, -2243597, -797271, 455952, 666221, 266941, -207098, -1177372, -3138143, -5271507, -5981036, -4752387, -2597634, -577220, 1149962, 2468646, 2597534, 1216424, -316638, -125829, 1786180, 3342367, 2920383, 1242085, 173315, 239332, 170626, -1131146, -2885646, -3178149, -1356888, 758843, 619075, -2018910, -4480554, -4221281, -1938022, -588557, -1569136, -3331497, -4096496, -4252298, -4921245, -5545176, -4764311, -3069643, -2497928, -3530266, -4190863, -2948678, -937022, -149726]
33771a49726m35322l6553R60271P36140o37145j513425r33161M24624J247192
33762c37105Q89407j67018p80144k44986Q96041J394101P01056n53406j497207
33753C00739j842703j653125r78519r3067M60357M94513M41828O64356R38685
33744a266936R56745Q54400Q41960P78511N70829N53246R38504J238690P82588
33735F248537l94964j569040j982813j255258L58029J746831J658651K40678p97877
33726D252774l63793L89323k35976j709656j806174Q5090J838324J403082n68489
33717C284505j837136j418871k71362L53700K27344r2733p6377L22022O84631
33708A175723N87044J26265k08365k24551j84032j95492l2487K27961Q5613m26127
$$ y = [-149726, -585048, -621601, 338670, 1074810, 437665, -1075760, -2008921, -1584297, -337105, 552302, 385284, -394860, -639846, 256195, 1650296, 2351352, 1797946, 300739, -1541964, -3195089, -4173608, -4266675, -3806318, -3311805, -2869977, -2205621, -1266936, -310191, 544209, 1386169, 2164680, 2735509, 3288755, 4227259, 5465949, 6248537, 5853573, 4284533, 2301720, 1046462, 1404491, 3151322, 4809973, 5050651, 4252774, 3888981, 4278304, 4042328, 2332672, 526498, 611588, 2449912, 3852994, 3284505, 1447369, 28498, -242864, 110836, 338180, 245447, 169070, 491092, 1175723, 1762767, 1889032, 1680667, 1456116, 1272084, 1076592, 1044105, 1272066, 1357679, 931552]
33698I31552l67752Q19487K172675K191168P16199r26472j542301j162096n75401
33689B257059l62672m40901k21699O75842J649214J494843J3459j353103j259594
33680B452448l14119j58880j027260j479634o03798P57759J298167P33618l63821
33671A294480j276731j307599j85635J213575J441885K83916q55216q41720j42270
33662c75315K89504L57149K55154l15950j265213j433982j36402J409423J631729
33653D16097R13602P45477J138723Q17260k15353m43127N01090R98941J5785j353083
33643C535412j904378k129129k650644k484259o87872J404178J685103M17301
33635b814288j95834O41628J474329J254500P34573N41747j32342j669441k493434
$$ y = [931552, 563800, 1383287, 3555962, 5747130, 6463329, 5536857, 3994556, 2832460, 2257059, 1894387, 1453486, 1231787, 1907629, 3556843, 5051686, 5065145, 3712042, 2452448, 2138329, 1979449, 952189, -527445, -1131243, -373484, 924683, 1658301, 1294480, 17749, -1289850, -1475485, -261910, 1179975, 1463891, 608675, -233045, -375315, -85811, 271338, 526492, 210542, -1054671, -2488653, -2625055, -1215632, 416097, 1329699, 2075176, 3213899, 4031159, 3815806, 3372679, 3873769, 4872710, 4888495, 3535412, 1631034, -498095, -3148739, -5632998, -6320870, -4916692, -3231589, -2814288, -3010122, -2368494, -894165, 360335, 1094908, 1636655, 1504313, -165128, -2658562]
33626b658562j136378J193204J994558R04263j94798l54012o94357j810676k176500
33617d933258n72752J471331J611792J49558n94692K5440L04053n29499q65780
33608c933807L09067J277751L57024r49522r0305K219774K645172J07077k640443
33599f98212k865770r88541J001106K134164K293965J360869L4845m1282J389274
33590C620418K079247K52911k457688l039663j212865N98544Q72895L55377k5016
33581A044160l66255o06878j27253Q27600R43766k51376j567909j781051r21685
33572b806881L46223J317268J025531r19879k904606k574748j78338J380430P76856
33563d538144K47088J685063L072815J485172j883782k931509m05525K686934
$$ y = [-2658562, -3794940, -2601736, -607178, 297085, 102287, -251725, -946082, -2756758, -4933258, -5506010, -4034679, -2422887, -2273329, -2868021, -2842581, -2538528, -3068027, -3933807, -3624740, -2346989, -1989965, -2939487, -3029792, -810018, 1835154, 1942231, -698212, -3563982, -4552523, -3551417, -1417253, 876712, 2237581, 2272426, 2231144, 3620418, 5699665, 5952576, 3494888, 455225, -757640, -159096, 713799, 1069176, 1044160, 677905, 71027, -56226, 771374, 1715140, 1463764, -104145, -1885196, -2806881, -2460658, -1143390, -117859, -1037738, -3942344, -6517092, -6695430, -5315000, -4538144, -4291056, -2605993, 466822, 1951994, 68212, -2863297, -3268822, -581888]
33555e81888L681547L264525K892971J985035l56527k685940k709320p39150M87686
33546E238939n42485k381593k938558k098622j172052p46284l51199R8887m9014
33537d941981p14537n06283J332757L206272K893003P63111m68269M24373J419150
33528C407596M03310j573385j994539o92066K77811J00441Q1634P91105P68592
33519A570499q22820k243605j528245N38882J613038J144667O26157P80321N29210
33510B208104p49516j671379p52560J123965J629302J80863j174573n40552J257324
33501A510978J887523O71154q63339j519748j870170k443223k115639N1565K413084
33492b277815K370199K00740j010405K54107J856448J445520n809q791J419670
$$ y = [-581888, 3099659, 6364184, 9257155, 11242190, 10885663, 8199723, 5490403, 4751253, 5238939, 4696454, 2314861, -623697, -2722319, -3894371, -4640655, -4991854, -4892967, -4941981, -5656518, -6162801, -4830044, -1623772, 1269231, 2032342, 1564073, 1988446, 3407596, 3810906, 2237521, 242982, -449084, -171273, -70832, 10802, 801907, 1570499, 747679, -1495926, -3024171, -2485289, -872251, 272416, 898573, 1678894, 2208104, 1458588, -212791, -965351, 158614, 1787916, 1968779, 794206, 253654, 1510978, 3398501, 4069655, 3206316, 1686568, -183602, -2626825, -4742464, -4690899, -2277815, 92384, 293124, -717281, -463174, 1393274, 2838794, 2832985, 2824194, 4243864]
33483D243864J869337K64856j696666k116064j172936k64336j85551q21419j621850
33474a500765j759873o92049Q43632J213444j06029j706701k108261j566091j107596
33465h490289o54591M81262J730620J651456L49300k00383R90624K216684J495419
33456d29898l82318r00694N46472J886874J403172j50036j117916j196847j091000
33447a432191j019732q04566o93562q20772m04520J129259K585373K122516l5903
33438F25902j548005r87509M44556Q62499J36693n04017m35785j65058k42875
33429a813599m47347p3193J175297K508088K562863J136356q2674L84141J382395
33420F732327N13898k055213l341342j798373M09474P48902j61423l38840K5953
$$ y = [4243864, 6113201, 6378057, 4681391, 2565327, 1392391, 1128055, 942504, 121085, -1500765, -3260638, -3952687, -3109055, -1895611, -2001640, -3708341, -5816602, -7382693, -8490289, -9144880, -8663618, -6932998, -5281542, -4932242, -5132625, -4142001, -1925317, -429898, -812216, -1712910, -1166438, 720436, 2123608, 1973572, 855656, -341191, -1432191, -2451923, -3256489, -3950051, -4770823, -5175343, -4046084, -1460711, 661805, 625902, -922103, -1909612, -1465056, -602557, -465864, -969881, -1405666, -1570724, -1813599, -2260946, -2334139, -1158842, 1349246, 3912109, 5048465, 4965791, 5349932, 6732327, 7246225, 5191012, 1849670, 51297, 460771, 1209673, 1048250, 709410, 735363]
33411G35363o31681k023157k320682j245446k61777J74303J001741J995245J402606
33402a173485j069498l049319k354362M32834K981421L506188J712952j008330
33394b1599k096761l01316K144161J901312p21803k043834n79770R08279L05597
33385e05734m22733Q18204K103942Q01728j475039j401971K34918r7385k199409
33376b143479j971333J739416M804407L910751R55906q11371j473000k457737
33368B553560k819887r89613J549728J835111j23594j517937j037672k12120l64486
33359a126910p61429m08138L06206N72827L48905r9661p02339j100443o98626
33350c669608K92042P91459L40207j61267K68372J333088J910388J423786L63960
$$ y = [735363, 103682, -1919475, -4240157, -5485603, -5747380, -5573077, -4571336, -2576091, -1173485, -2242983, -5292302, -7646664, -7213830, -4232409, -726221, 986731, -21599, -2118360, -2419676, -275515, 1625797, 903994, -1139840, -1719610, -811331, -505734, -928467, -110263, 1993679, 2795407, 1320368, -81603, 153315, 55930, -2143479, -4114812, -2375396, 2429011, 6339762, 7295668, 6484297, 5011297, 2553560, -266327, -1255940, 293788, 2128899, 2005305, 487368, -550304, -762424, -1126910, -1888339, -2296477, -1990271, -1417444, -1068539, -1168200, -1870539, -2970982, -3669608, -3377566, -2586107, -2245900, -2407167, -2138795, -805707, 1104681, 2528467, 2892427]
33341B892427k97166m2411O30625O78232j82349r95898r17228n09865p99263j494628
33331a037524j422792n62019k02584q99701j644625j447895m74393P69993K008421
33322d913119K511948J454483l18314o02423R79277J884230L11560j761694j365516
33313a819568R96904K282848J477344L49338n2903n82837j346405r87177L89049
33304G06593N15995j279916k366211q78540J023768O21339q28268l73604J319416
33295a539428R45596j537598k197752P43913L827845L372794O53093n15228O44276
33286D397511J565972O00308j155429k086872j881964r40766K11393O00604n05051
33277H05706k089685j973449M08928K922192L178609J197143j129774k406452
$$ y = [2892427, 2595261, 2552850, 3183475, 3861707, 3679358, 2683460, 1766232, 1256367, 457104, -1037524, -2460316, -3022335, -3224919, -4124620, -5769245, -7217140, -7691533, -6921540, -4913119, -2401171, -946688, -1265002, -1867425, -888148, 996082, 1307642, -454052, -1819568, -822664, 1460184, 2937528, 3286866, 3233963, 2651126, 1304721, 317544, 706593, 1222588, -57328, -2423539, -3302079, -2278311, -1656972, -2485240, -2858844, -1539428, -593832, -2131430, -4329182, -3585269, 242576, 3615370, 4268463, 3753235, 4397511, 5963483, 6563791, 5408362, 3321490, 1439526, 498760, 710153, 1310757, 805706, -1283979, -3257428, -2848500, 73692, 3252301, 4449444, 3319670, 913218]
33269I13218k590178k026651q65623M33067R35384J29675j311832k058770j372946
33260g814656L22022K019109L035352L308155L052462K404298J387422K9346j499321
33251F244189k709156k890306j779873j44311P68804N12434k45709p70394r60960
33242a975282p62065K00274J637322K059400M28177k031878k994765j955471o41821
33233f036109l10686j27854J040057K546030K872972J813416M98340k78332n73253
33224A444581m29399K47863R37112P69765k03771r48068q98306o03853o27712
33215c11788p09512m53415P444N34837J287158J878993J256167n84115j676235
33206A229534l67906J979202K298567j10277k524845k377730l75057R60107O80997
$$ y = [913218, -1676960, -3703611, -4569234, -4136167, -3200783, -3071108, -4382940, -6441710, -7814656, -7492634, -5473525, -2438173, 869982, 3922444, 6326742, 7714164, 7743510, 6244189, 3535033, 644727, -1135146, -1279457, -510653, 1781, -243928, -1014322, -1975282, -2737347, -2537073, -899751, 1159649, 1587826, -444052, -3438817, -5394288, -6036109, -6346795, -6474649, -5434592, -2888562, -15590, 1797826, 2296166, 2017834, 1444581, 1015182, 1263045, 2200157, 2969922, 2766151, 1818083, 919777, 315924, -311788, -1021300, -1474715, -1467271, -932434, 354724, 2233717, 3489884, 2905769, 1229534, 861628, 2840830, 5139397, 5029120, 2504275, 126545, -248512, 711595, 1392592]
33197A392592K502J01663P01319Q36169R5363j041790j613519j000813K86872
33188b39642R77579O05428J70594O03264J224026P27212p72460j848243j689403
33179b41645p80233J71842P78872N88927m56365j182946l35237J258793J383075
33170A185083k49844j259303j08470J496979J222943l87016r41272J81726J256662
33161B397488R32366k52266j154668j429909j374361j301628j257601q55313L49676
33152c946216J862747K311170J219666j11523m27408k36412n23890q67046m61661
33143a180573j7310o21832j493151j124931j04319k36155j144890o36977J327590
33134e232548K086356N57779q66785j42263J352600J419455N14704M55272J275109
$$ y = [1392592, 1395094, 1496757, 2198076, 3034245, 3129608, 2087818, 474299, -526514, -239642, 737937, 1343365, 1513959, 2117223, 3341249, 4068461, 3296001, 1447758, -241645, -1021878, -850036, -71164, 517763, 61398, -1121548, -1456785, -197992, 1185083, 935239, -324064, -432534, 1064445, 2287388, 1900372, 959100, 1140826, 2397488, 3329854, 3077588, 1922920, 493011, -881350, -2182978, -3440579, -4295892, -3946216, -2083469, 227701, 1447367, 1335844, 908436, 672024, 148134, -718912, -1180573, -1197883, -1819715, -3312866, -4437797, -4542116, -4778271, -5923161, -6560138, -5232548, -3146192, -2588413, -3455198, -3597461, -2244861, -825406, -310702, 144570, 1419679]
33125A419679J523947O16865q79099k313710k856604j539643J098162K662052
33117b68351J742110j79997j139872j370138j744159j383779O49658K729034K581542
33108A616048Q25743k64319n90537j638469k746832j668368J062709K065923K43981
33099a094121j469036q02790N79195L34676p53504n27558R13574J637605P89288
33090c92671p36031j697429j315503M05737K193621K421487J247474M59576N68657
33081C154918j179j840575k977473k007216n64016m80573n13413J329027L741921
33072a58579L629693R08358j365977j507204q44171o02503o2685J262053K061665
33063C320650J207058l84283j131554q77040n70505p45147j094974r52270J76302
$$ y = [1419679, 2943626, 3560491, 2681392, 367682, -2488922, -4028565, -2930403, -268351, 1473759, 1293762, 153890, -1216248, -2960407, -4344186, -3694528, -965494, 1616048, 2441791, 2177472, 1586935, -51534, -2798366, -4466734, -3404025, -1338102, -1094121, -2563157, -3365947, -2786752, -2452076, -3205580, -3733138, -2819564, -1181959, -392671, -1128702, -2826131, -4141634, -3735897, -1542276, 879211, 2126685, 2586261, 3154918, 3153739, 1313164, -1664309, -3671525, -4235541, -4716114, -5229527, -3900500, -158579, 3471114, 4379472, 3013495, 1506291, 662120, 59617, -3068, 1258985, 3320650, 4527708, 4143425, 3011871, 2134831, 1564326, 819179, -275795, -1228065, -1051763]
33054a051763J864774K536332J018150j589267k813123j789593q0862P35803Q34993
33045c34556R61635R53010L74170m60148j032017j355355j411805p31789O33712
33036b403143J518073R36036n47434j477152j095834K18609J505435J743098N31079
33027I28767j199806j825363q53954O01720J502738J952799K057685J097960j041009
33018C221537k748231k427751o62007O57488P25560R1990p24235j364938r81674
33009d212261P71186K364431J816188n24878k339701k518141k091919j750876
33001h485971n96705J743906L722186L918830K959157J962429N16129j994639
32993C745322m096966l461741k34090K682714K900377Q46480j284015j722528
$$ y = [-1051763, 813011, 3349343, 4367493, 2778226, -34897, -1824490, -1905352, -1169549, -334556, 627079, 1580089, 1954259, 1494111, 462094, -893261, -2305066, -3036855, -2403143, -885070, 50966, -496468, -1973620, -3069454, -2850845, -1345410, 397688, 928767, -271039, -2096402, -2950356, -2348636, -845898, 1106901, 3164586, 4262546, 3221537, 473306, -1954445, -2616452, -1958964, -1233404, -1141414, -1865649, -3230587, -4212261, -3441075, -1076644, 739544, 214666, -2125035, -4643176, -6735095, -8485971, -9082676, -7338770, -3616584, 302246, 3261403, 5223832, 5739961, 3745322, -351644, -3813385, -4047475, -1364761, 1535616, 2382096, 1098081, -624447]
32985f24447k23888J886577K599229J091843j238189k420890k242591j773806
32977b946162j135279L45464J848406J350956j043520k398321r63469J162668
32969c779257J255271M351j03577R46337J021272j88879o91197J39298M65351
32960i31030n91121j251093k13378R88179O42884j80443L97647J701285J663647
32951B226577M13083K9294J006385J501189M01845j066867j476758j123923r67215
32942I43610j088849j150318j260505j463682j208776j63451J081075J778649
32934b532247J916283J800509J404979P31233K59813M10197R08839J134268P55540
32925F789414k08012j459628k330115k207314j312406m45514J47369P85935J115649
$$ y = [-624447, -848335, 1038242, 3637471, 4729314, 3491125, 1070235, -1172356, -2946162, -4081441, -3735977, -1887571, -536615, -1580135, -3978456, -4941925, -3779257, -2523986, -2519635, -2623212, -1676875, -655603, -844482, -1535679, -1396381, -931030, -1522151, -2773244, -2986622, -1998443, -1355559, -1536002, -1138355, 562930, 2226577, 2639660, 2668954, 3675339, 5176528, 5578373, 4511506, 3034748, 1910825, 943610, -145239, -1295557, -2556062, -4019744, -5228520, -5391971, -4310896, -2532247, -615964, 1184545, 2589524, 3320757, 3580570, 3990767, 4899606, 6033874, 6789414, 6581402, 5121774, 2791659, 584345, -728061, -1173575, -1026206, -240271, 875378]
32916H75378J62954j759120k559173r36992J557986K382212J202194j75372n57601
32907A92466m41831m60044l77145l9828l9371p54440j527803j406195k77208J057162
32897d074237J626325J057001j2752l78601L68164J126489O31769o82474j107797
32888a446113L8995J533518J892622R96216k63474j101086j193027o76783k57889
32879d77021o81517j715242k284793j905764j213331p64302k77330M31272Q25717
32870h062311P57515J145960K441456L308692K286853K17964n99315M13875J350570
32861C261259N25590j408614k622614k311114j038906K88653J015647Q10458j01903
32852a581544r64685j203133r79803p98602p81298n52395L14832J770575L000888
$$ y = [875378, 1038332, -720788, -3279961, -4216953, -2658967, -276755, 925439, 750067, 192466, -249365, -709409, -1086554, -1126382, -1165753, -1920193, -3447996, -4854191, -5131399, -4074237, -2447912, -1390911, -1403663, -1782264, -1414100, -287611, 344158, -338316, -1446113, -1407118, 126400, 2019022, 3015238, 2751764, 1650678, 457651, -219132, -477021, -1158538, -2873780, -5158573, -7064337, -8277668, -9041970, -9319300, -8888028, -8062311, -7304796, -6158836, -3717380, -408688, 1878165, 2096129, 1496814, 1910689, 3261259, 3786849, 2378235, -244379, -2555493, -3594399, -3305746, -2290099, -1479641, -1581544, -2546229, -3749362, -4729165, -5527767, -6309065, -6861460, -6546628, -4776053, -1775165]
32843a775165K888872J296680l09823l36860Q45903J263854j4754j680287k118868
32834E9552j467267r40397j011668j236518j231815q72328l8377R61895J287589
32825d489334P41365L39795P22944Q98590n9776r90033k19548J451609J656011
32816E1623K19590n24720L83124R80327j75163j476322r22952P03111J410281
32807F48899J198567J390147J847069J265433l16658j543408j977954k246413
32799B65682k171521r01563J051430J958869J314514K79755m44599j162369j381272
32790a191074J34874K726494L590249J492495j233708j912796r84215m87808o60951
32781A473560k25623Q77432J276685M17260p80059j435515j441915q18254K73104
$$ y = [-1775165, 1113707, 2410387, 2100564, 1763704, 2609607, 3873461, 3858707, 2178420, 59552, -1407715, -2348112, -3359780, -4596298, -5828113, -6700441, -6738818, -5776923, -4489334, -3747969, -3408174, -2685230, -1786640, -1846416, -2836449, -3055997, -1604388, 51623, 271213, -253507, 129617, 1109944, 934781, -541541, -1464493, -761382, 648899, 1847466, 3237613, 5084682, 6350115, 6033457, 4490049, 2512095, 265682, -1905839, -2807402, -1755972, 202897, 1517411, 1797166, 1352567, 190198, -1191074, -1056200, 1670294, 5260543, 6753038, 5519330, 3606534, 2622319, 2134511, 1473560, 1247937, 2125369, 3402054, 3819314, 3039255, 1603740, 161825, -656429, -383325]
32772c83325R13307J65218j446195k292034j625419l30589L37583k9794r40674
32763e631922j387110n04943J319282K320644J304409o11084j308309m09854N86507
32754d322380O79312L41730R2823k53091m99119J70720J582548K127260R18810
32745H38613p62900j312968j056898j252376j584177m87173J984845L373656J813312
32736A553934j247579k567834j028222J192642J566096J95366r48777r26777o10088
32727b821239p61587q52823k84770M63881P44973Q56681J311118J731411J477235
32718A864880Q05603M63093O08606R55112J349394J387236L40819j451413k159278
32709D164052q87483M91627j94364j989067k152692m00586Q69025N63312K67550
$$ y = [-383325, 529982, 695200, -750995, -3043029, -4668448, -4999037, -4661454, -4691248, -5631922, -7019032, -7523975, -6204693, -3884049, -2579640, -3190724, -4499033, -4908887, -4322380, -3643068, -3301338, -3208515, -3461606, -3960725, -3790005, -2207457, -80197, 838613, 75713, -1237255, -2294153, -3546529, -5130706, -5617879, -3633034, -259378, 1553934, 306355, -2261479, -3289701, -2097059, -530963, -335597, -1284374, -2211151, -2821239, -3582826, -4435649, -4720419, -4256538, -3511565, -2654884, -1343766, 387645, 1864880, 2670483, 3133576, 3742182, 4697294, 6046688, 7433924, 7774743, 6323330, 4164052, 3276569, 3768196, 3573832, 1584765, -567927, -968513, -99488, 463824, 731374]
32700G31374J034314J547508O42826p26073j415756j852001k372746j883253K5182
32691d268625J431865O32686j088422j331987q1717P88965O03749L00614L13756
32682b699116J15314l26046l78886M2745M81848Q78223J268472J077521P5000
32673E35075n79140K17212J576226J752088O85115k53130n10663n28467j90280
32664B704036Q34539J542663O30620j019098j211261P1945M98950q25648j904289
32655A322457j121731L23991N98696j07264o43285j033942j836507k469303j852125
32646f819013j27603J516919K289474K150677J313536K35366m06247m02660j80341
32637d29892P8012O48951J253064R77467j60004p73970r3667P63838N08991m14209
$$ y = [731374, 1765688, 3313196, 3956022, 3229949, 1814193, -37808, -2410554, -4293807, -4268625, -2836760, -2204074, -3292496, -4624483, -4706200, -3917235, -3313486, -3012872, -2699116, -2583802, -2909848, -3288734, -3245989, -2764141, -1885918, -617446, 460075, 535075, -44065, 173147, 1749373, 3501461, 4186576, 3933446, 3422783, 2894316, 2704036, 3538575, 5081238, 5711858, 4692760, 3481499, 3553444, 4052394, 3226746, 1322457, 200726, 524717, 1123413, 1016149, 372864, -661078, -2497585, -4966888, -6819013, -6946616, -5429697, -3140223, -989546, 323990, 559356, 153109, -249551, -429892, -351880, 297071, 1550135, 2527602, 2367598, 1593628, 1499961, 2263799, 2772790, 2358581]
32627B358581q09045o59035p52563j080271r55684l09756L00775O48780Q38215
32618d20003P66614M93253O22140J330148J558443L16045j604159k393402j517262
32609h48183j79704L85818J28866k67802k16018M31389J283920J709711J513430
32600C941427R55197k8134j697815l236776k963963p86914R49220N02872o74127
32591c039013k79187J065214R05760p45227j149469P74286K610049K112620L96939
32582B651972j46515O05310R22950J40099o89366o77854j93984o5052o15675j495844
32572D36041j898560j133802N51878J997459K328321J748341Q48188k31786j424658
32563C221422k160035j928727j071337l33066J04751N60177J074451J303070J053878
$$ y = [2358581, 1549536, 890501, 137938, -942333, -1898017, -2207773, -1906998, -1258218, -420003, 346611, 839864, 1462004, 2792152, 4350595, 4666640, 3062481, 669079, -848183, -1027887, -642069, -513203, -781005, -997023, -565634, 718286, 2427997, 3941427, 4896624, 4868490, 3170675, -66101, -3030064, -3816978, -2867758, -2364886, -3039013, -3318200, -2252986, -1347226, -2092453, -3241922, -2467636, 142413, 2255033, 2651972, 2505457, 3110767, 4033717, 4173816, 3484450, 2806596, 2612612, 2547560, 1931885, 436041, -1462519, -2596321, -2044443, -46984, 2281337, 4029678, 4877866, 4646080, 3221422, 1061387, -867340, -1938677, -2271743, -2166992, -1606815, -532364, 770706, 1824584]
32554A824584M79195j19395l58013J4779N59545K79303j015397j895846q68832
32545a100077J336795K196056N45610j703480j949338l44340N07694p07193k131323
32536c349596j467936O67121J744792J052786L59063O85635O94635n91491j512637
32527a717628j99891K097143K521612P73238p38652p36575m76388r20850j081516
32518d79507k01842O19316L40782l16701m74402o63569j254934j102746L00128
32509c233475R69793p87318k971960k203400J090641K899353J327655q99603p02993
32500d511307J113845J647256K00247j228105j018708K57418J087197R18761M60805
32491a072591M77591O18911j49359j707162k179332k83399K295376K593835L72604
$$ y = [1824584, 2303779, 2184384, 1826371, 1841150, 2400695, 2679998, 1664601, -231245, -1100077, 236718, 2432774, 2978384, 1274904, -674434, -1018774, -511080, -1218273, -3349596, -4817532, -4150411, -2405619, -1352833, -993770, -308135, 386500, -204991, -1717628, -1917519, 179624, 2701236, 3474474, 2735822, 1999247, 1522859, 602009, -479507, -681349, -62033, 278749, -37952, -512354, -1175923, -2430857, -3533603, -3233475, -2263682, -3051000, -6022960, -8226360, -7135719, -4236366, -2908711, -3808314, -4511307, -3397462, -1750206, -1549959, -2778064, -3796772, -3539354, -2452157, -1533396, -1072591, -595000, 23911, -125448, -1832610, -4011942, -4295341, -1999965, 593870, 966474]
32482I66474j547983j333247l08773j50687k62906K97703M41965q61708j745234
32473d504396J26354L113919L181189M0779j965554k85641K051965J287145j375335
32464A670425k104618n29013K94780p24270j233292J41097J408197P35819n20350
32455h61225m47201k9226j297475l358233l202242j73970K970742L751415K511800
$$ y = [966474, -581509, -1914756, -2223529, -2374216, -2637122, -2339419, -1897454, -2759162, -4504396, -4378042, -1264123, 1917066, 1957845, -7709, -293350, 1758615, 3045760, 1670425, -434193, -963206, -668426, -1392696, -2625988, -2484891, -1076694, -340875, -861225, -1308426, -1337652, -2635127, -5993360, -9195602, -9369572, -6398830, -2647415, -135615]
$$ [...]
##END NTUPLES=NMR SPECTRUM
##END=
