##TITLE=31Pdec_B3f0606
 CDCl3
 24 sc
 7.6.2024
##JCAMPDX= 6.0         $$ Bruker NMR JCAMP-DX V2.0
##DATA TYPE= NMR SPECTRUM
##DATA CLASS= NTUPLES
##ORIGIN= UXNMR, Bruker Analytische Messtechnik GmbH
##OWNER= root
$$ XWIN-NMR		Version 3.5
$$ Fri Jun  7 15:57:55 2024 Russian Standard Time (UT+4h)  she@DPX200
##.OBSERVE FREQUENCY= 81.013821
##.OBSERVE NUCLEUS= ^31P
##.ACQUISITION MODE= SIMULTANEOUS
##.ACQUISITION SCHEME= undefined
##.AVERAGES= 24
##.DIGITISER RES= 16
##SPECTROMETER/DATA SYSTEM= spect
##.PULSE SEQUENCE= zgpg30
##.SOLVENT NAME= CDCl3
##.SHIFT REFERENCE= (INTERNAL, CDCl3, 0, 248.564)
##AUDIT TRAIL= $$ (NUMBER, WHEN, WHO, WHERE, WHAT)
$$ ##TITLE= Audit trail, XWIN-NMR		Version 3.5
$$ ##JCAMPDX= 5.01
$$ ##ORIGIN= Bruker BioSpin GmbH
$$ ##OWNER= she
$$ F:/spectra/data/she/nmr/P31/1/pdata/1/auditp.txt
$$ ##AUDIT TRAIL=  $$ (NUMBER, WHEN, WHO, WHERE, WHAT)
(   1,<2024-06-07 15:56:42.81 +0400>,<she>,<DPX200>,
      <created by zg, POWCHK disabled, PULCHK disabled
       configuration hash MD5:
       00 E9 B6 7A A2 85 ED C7 34 08 36 98 17 FE 4E 26
       data hash MD5: 32K
       C8 AC BC 04 EF 00 B8 6C 18 CB CF 8F 02 BD E2 67>)
(   2,<2024-06-07 15:57:16.32 +0400>,<she>,<DPX200>,
      <Start of raw data processing
       efp BC_mod = 2 LB = 10 FT_mod = 6 PKNL = 1 PHC0 = -209.5571 PHC1 = 59.4 SI = 64K 
       data hash MD5: 64K
       52 07 53 85 B9 FB 80 CA 2F 26 A8 FF 28 D1 47 91>)
(   3,<2024-06-07 15:57:33.14 +0400>,<she>,<DPX200>,
      <pk PHC0 = 4.584572 PHC1 = 0 
       data hash MD5: 64K
       4B CB AF D3 8A 9C 49 E9 94 75 70 6F 51 A2 03 1B>)
$$ ##END=
$$ 
$$ hash MD5
$$ 06 BD 4A 20 CF 89 A9 26 76 A3 48 99 64 66 C9 E1
##$RELAX= 
##$RELAX= 
##$RELAX= 
##$RELAX= 
##$RELAX= 
##$RELAX= 
##$RELAX= 
##$RELAX= 
##$RELAX= 
$$ Bruker specific parameters
$$ --------------------------
##$DU= <F:/spectra>
##$EXPNO= 1
##$NAME= <P31>
##$PROCNO= 1
##$TYPE= <nmr>
##$USER= <she>
##$AMP= (0..31)
100 100 100 100 100 100 100 100 100 100 100 100 100 100 100 100 100 100 
100 100 100 100 100 100 100 100 100 100 100 100 100 100 
##$AQSEQ= 0
##$AQ_mod= 1
##$AUNM= <au_zg>
##$AUTOPOS= <>
##$BF1= 81.014009
##$BF2= 200.13
##$BF3= 200.13
##$BF4= 200.13
##$BF5= 200.13
##$BF6= 200.13
##$BF7= 200.13
##$BF8= 200.13
##$BYTORDA= 1
##$CFDGTYP= 0
##$CFRGTYP= 5
##$CHEMSTR= <none>
##$CNST= (0..31)
1 1 145 1 1 1 1 1 1 1 1 1 1 1 1 1 1 1 1 1 1 1 1 1 1 1 1 1 1 1 1 1 
##$CPDPRG= <waltz16>
##$CPDPRG1= <>
##$CPDPRG2= <waltz16>
##$CPDPRG3= <>
##$CPDPRG4= <mlev>
##$CPDPRG5= <mlev>
##$CPDPRG6= <mlev>
##$CPDPRG7= <mlev>
##$CPDPRG8= <mlev>
##$CPDPRGB= <>
##$CPDPRGT= <>
##$D= (0..31)
0 1 0 0 0 0 0 0 0 0 0 0.03 2e-05 3e-06 0 0 0 0 0 0 0 0 0 0 0 0 0 0 0 0 
0 0 
##$DATE= 1717761402
##$DBL= (0..7)
120 120 120 11 120 120 24 19 
##$DBP= (0..7)
150 150 150 150 150 150 150 150 
##$DBP07= 0
##$DBPNAM0= <>
##$DBPNAM1= <>
##$DBPNAM2= <>
##$DBPNAM3= <>
##$DBPNAM4= <>
##$DBPNAM5= <>
##$DBPNAM6= <>
##$DBPNAM7= <>
##$DBPOAL= (0..7)
0.5 0.5 0.5 0.5 0.5 0.5 0.5 0.5 
##$DBPOFFS= (0..7)
$$ [...]
##$SUBNAM2= <"">
##$SUBNAM3= <"">
##$SUBNAM4= <"">
##$SUBNAM5= <"">
##$SUBNAM6= <"">
##$SUBNAM7= <"">
##$SUBNAM8= <"">
##$SUBNAM9= <"">
##$SW= 501.771253377433
##$SWIBOX= (0..15)
0 1 3 0 0 0 0 0 0 0 0 0 0 0 0 0 
##$SW_h= 40650.406504065
##$TD= 32768
##$TD0= 1
##$TE= 0
##$TE2= 300
##$TE3= 300
##$TEG= 300
##$TL= (0..7)
0 120 53 12 22 120 120 120 
##$TP= (0..7)
150 150 150 150 150 150 150 150 
##$TP07= 0
##$TPNAME0= <>
##$TPNAME1= <>
##$TPNAME2= <>
##$TPNAME3= <>
##$TPNAME4= <>
##$TPNAME5= <>
##$TPNAME6= <>
##$TPNAME7= <>
##$TPOAL= (0..7)
0.5 0.5 0.5 0.5 0.5 0.5 0.5 0.5 
##$TPOFFS= (0..7)
0 0 0 0 0 0 0 0 
##$TUNHIN= 0
##$TUNHOUT= 0
##$TUNXOUT= 0
##$USERA1= <user>
##$USERA2= <user>
##$USERA3= <user>
##$USERA4= <user>
##$USERA5= <user>
##$V9= 5
##$VALIST= <valist>
##$VCLIST= <CCCCCCCCCCCCCCC>
##$VD= 0
##$VDLIST= <DDDDDDDDDDDDDDD>
##$VPLIST= <PPPPPPPPPPPPPPP>
##$VTLIST= <TTTTTTTTTTTTTTT>
##$WBST= 1024
##$WBSW= 4
##$XGAIN= (0..3)
0 0 0 0 
##$XL= 0
##$YL= 0
##$YMAX_a= 2907
##$YMIN_a= -2132
##$ZGOPTNS= <>
##$ZL1= 120
##$ZL2= 120
##$ZL3= 120
##$ZL4= 120
##$ABSF1= 0
##$ABSF2= 0
##$ABSG= 0
##$ABSL= 0
##$ALPHA= 0
##$AQORDER= 0
##$ASSFAC= 0
##$ASSFACI= 0
##$ASSFACX= 0
##$ASSWID= 0
##$AUNMP= <proc_1d>
##$AZFE= 0.1
##$AZFW= 0.5
##$BCFW= 0
##$BC_mod= 2
##$BYTORDP= 0
##$COROFFS= 0
##$CY= -3
##$DATMOD= 1
##$DC= 0
##$DFILT= <>
##$DTYPP= 0
##$F1P= 0
##$F2P= 0
##$FCOR= 1
##$FTSIZE= 65536
##$FT_mod= 6
##$GAMMA= 0
##$GB= 0
##$INTBC= 1
##$INTSCL= 6.047779e-11
##$ISEN= 30
##$LB= 10
##$LEV0= 0
##$LPBIN= 0
##$MAXI= 10000
##$MC2= 0
##$MEAN= 0
##$ME_mod= 0
##$MI= 50
##$NCOEF= 0
##$NC_proc= -9
##$NLEV= 6
##$NOISF1= 182.463
##$NOISF2= 159.3651
##$NSP= 0
##$NTH_PI= 0
##$NZP= 0
##$OFFSET= 248.5645
##$PC= 4
##$PHC0= -204.9725
##$PHC1= 59.4
##$PH_mod= 1
##$PKNL= yes
##$PPARMOD= 0
##$PSCAL= 0
##$PSIGN= 0
##$REVERSE= no
##$SF= 81.0140089999694
##$SI= 65536
##$SIGF1= 159.3651
##$SIGF2= -187.1042
##$SINO= 113.3802
##$SIOLD= 16384
##$SREGLST= <1H.CDCl3>
##$SSB= 0
##$STSI= 65536
##$STSR= 0
##$SW_p= 40650.406504065
##$SYMM= 0
##$S_DEV= 0
##$TDeff= 32768
##$TDoff= 0
##$TI= <>
##$TILT= no
##$TM1= 0
##$TM2= 0
##$TOPLEV= 0
##$USERP1= <user>
##$USERP2= <user>
##$USERP3= <user>
##$USERP4= <user>
##$USERP5= <user>
##$WDW= 1
##$XDIM= 65536
##$YMAX_p= 287706045
##$YMIN_p= -29296956
$$ End of Bruker specific parameters
$$ ---------------------------------
##NTUPLES= NMR SPECTRUM
##VAR_NAME=  FREQUENCY,     SPECTRUM/REAL,   SPECTRUM/IMAG
##SYMBOL=    X,             R,               I
##VAR_TYPE=  INDEPENDENT,   DEPENDENT,       DEPENDENT
##VAR_FORM=  AFFN,          ASDF,            ASDF
##VAR_DIM=   65536,         65536,           65536
##UNITS=     HZ,            ARBITRARY UNITS, ARBITRARY UNITS
##FACTOR=    0.620285442955139, 1,           1
##FIRST=     20137.2065510682, 0,            0
##LAST=      -20513.1999529968, 0,           0
##MIN=       -20513.1999529968, -29296956,   0
##MAX=       20137.2065510682, 287706045,    0
$$ Real data points
##PAGE= N=1
##DATA TABLE= (X++(R..R)), XYDATA
$$ [...]
39095b031565k23258k84394l21811l26419k94995k31417j48791o8722j5613q563
39085c955548n5342j50108k73872l97753m90349n28594n06999m39363l51208k67216
39075g416352k00709j50347j04532m9678K2945J14726K20667L31079M32592N09439
39065f290170N46531N34079M71453L67637K37891R9129l2801j43639k21477k59509
39055d690876k58861k28242j80091j26132p4868l0819N596L7325O8344J00402
39045e378222J30873J53281J60521J49177J22458Q9429O0533M2019L2771K5193
39035d411967R419k1348o6989j19991j68349j99923k06416j86398j47018j02774
39025e621754p0013n8830o6985p9792p6432l9653L5783J40093K52615L50705M18307
$$ plain form
39095 -2031565 -2254823 -2539217 -2861028 -3187447 -3482442 -3713859 -3862650 -3931372 -3946985 -3955548
39085 -3955548 -4010890 -4160998 -4434870 -4832623 -5322972 -5851566 -6358565 -6797928 -7149136 -7416352
39075 -7416352 -7617061 -7767408 -7871940 -7921618 -7898673 -7783947 -7563280 -7232201 -6799609 -6290170
39065 -6290170 -5743639 -5209560 -4738107 -4370470 -4132579 -4033450 -4066251 -4209890 -4431367 -4690876
39055 -4690876 -4949737 -5177979 -5358070 -5484202 -5559070 -5589889 -5584293 -5546968 -5478624 -5378222
39045 -5378222 -5247349 -5094068 -4933547 -4784370 -4661912 -4572483 -4511950 -4469931 -4437160 -4411967
39035 -4411967 -4402548 -4423896 -4490885 -4610876 -4779225 -4979148 -5185564 -5371962 -5518980 -5621754
39025 -5621754 -5691767 -5750597 -5817582 -5897374 -5973806 -6013459 -5977676 -5837583 -5584968 -5234263 -4815956
39014d815956M49594M46848M15515L60735K87600K03666J19940M8210l473l3694
39004b521015m7211n2220n6779o5465p7510q7658q9274p7576n1501j4393K6085
38993c114517N9208P3547N9387J0769p1872j78771k90489l82828m35332m38425
38983d709323l95485l20018k30025j41580o3501M974P2367J49795K44744L56423
38973e031629M74660N82366O59774O88698O56528N60048M07756K18692J7833j69382
38963i34656l21348m23673m72010m72958m41308l94310l45894l03152k65267k24558
38953d599134j69822r1636J2741J37996K73894M10212N39445O55738P52342Q20963
38943a257261Q54079Q48065Q04678P30319O34208N26322M15348L07027K03764
$$ plain form
39014 -4815956 -4366362 -3919514 -3503999 -3143264 -2855664 -2651998 -2532058 -2483848 -2487321 -2521015
39004 -2521015 -2568226 -2620446 -2677225 -2742690 -2820200 -2907858 -2997132 -3074708 -3126209 -3140602 -3114517
38993 -3114517 -3055309 -2981762 -2922375 -2911606 -2983478 -3162249 -3452738 -3835566 -4270898 -4709323
38983 -4709323 -5104808 -5424826 -5654851 -5796431 -5859932 -5854958 -5782591 -5632796 -5388052 -5031629
38973 -5031629 -4556969 -3974603 -3314829 -2626131 -1969603 -1409555 -1001799 -783107 -765274 -934656
38963 -934656 -1256004 -1679677 -2151687 -2624645 -3065953 -3460263 -3806157 -4109309 -4374576 -4599134
38953 -4599134 -4768956 -4860592 -4847851 -4709855 -4435961 -4025749 -3486304 -2830566 -2078224 -1257261
38943 -1257261 -403182 444883 1249561 1979880 2614088 3140410 3555758 3862785 4066549
38934D066549J05969J4154p0006j44125k05839k52200k78483k79010k51241k00547
38924B505221j41068r0786o3783o4877q9674j28837j72889k14597k48799k71730
38914A018181k81305k77577k61847k34828j96357j47636r3784m3316m049K1565
38904e00953L8122N5115Q2857J29106J97305K85634L85817M82825N57458N92100
38894B305386N76786N12241M09043K84407J58067M7847l4267q4142j04892j04207
38884C966269r0940p2048n1035k8303k735K6826O0517R6392J29813J54604J66042
38873D355402J63462J50504J33380J18427J09146J02904Q9695N6122o182r3320
38863E179540j89009k72125l26844l48821l43871l20753k83296k27621j46428
$$ plain form
38934 4066549 4172518 4186672 4116666 3972541 3766702 3514502 3236019 2957009 2705768 2505221
38924 2505221 2364153 2273367 2209584 2144707 2055033 1926196 1753307 1538710 1289911 1018181
38914 1018181 736876 459299 197452 -37376 -233733 -381369 -475153 -518469 -522518 -500953
38904 -500953 -462831 -407716 -324859 -195753 1552 287186 673003 1155828 1713286 2305386
38894 2305386 2882172 3394413 3803456 4087863 4245930 4293777 4259510 4175368 4070476 3966269
38884 3966269 3875329 3803281 3752246 3723943 3721208 3748034 3808551 3904943 4034756 4189360 4355402
38873 4355402 4518864 4669368 4802748 4921175 5030321 5133225 5222920 5279042 5272860 5179540
38863 5179540 4990531 4718406 4391562 4042741 3698870 3378117 3094821 2867200 2720772
38854B720772l7322R0592K16313L13371L60026L48187K86390J95129R7213Q817
38844D599488o3726j20537j62000j85029j84380j57196j06917m4048J6310N9222
38834C651187P5662O6830M4131K4015K0940M3045R1901J63595K48279L28982L83078
38823E141645L88374L31666K14921N5552j19129k80036m03654m77160n00931m87520
38813C863728m56136m24256m01021l86436l76031l66292l56623l47571l38209
38804D11153l25216l03663k68227k14332j39901m7884N1730J42569K06374K30244
38794b57153K13501J70206J24717J01565J14961J63793K34079L05775L59375L80153
38784A910972L60437L00547K08330R7406j5112j11235j75667k00220j86933j47289
$$ plain form
38854 2720772 2683450 2774042 2990355 3303726 3663752 4011939 4298329 4493458 4590671 4599488
38844 4599488 4535762 4415225 4253225 4068196 3883816 3726620 3619703 3575655 3591965 3651187
38834 3651187 3726849 3793679 3837810 3861825 3882765 3925810 4017711 4181306 4429585 4758567 5141645
38823 5141645 5530019 5861685 6076606 6132158 6013029 5732993 5329339 4852179 4351248 3863728
38813 3863728 3407592 2983336 2582315 2195879 1819848 1453556 1096933 749362 411153
38804 411153 85937 -217726 -485953 -700285 -840186 -888070 -836340 -693771 -487397 -257153
38794 -257153 -43652 126554 251271 352836 467797 631590 865669 1171444 1530819 1910972
38784 1910972 2271409 2571956 2780286 2877692 2862580 2751345 2575678 2375458 2188525 2041236
38774B041236r7376n1854k0133n734p334k0000l6876n2009o3277p2977q5242j02760
38762A425664j26022j55092j90645k32108k74801l09840l27872l23762k98738
38753h13216k59191k13905j71620j39723j23799j27409j51171j91017k36882k74117
38743b702050k88444k72490k30097j75782j29485j09027j23727j71943k43466
38734d446511l24590m02201m64839n02058n04919m68554l94911k93304j77865
38725g979752o3100M0489J28294J99959K55681K94100L14041L18302L14954L13745
38715e863287L19964L30656L35953L23907K84915K13491J08702k4172j70771l07361
38705d448003m06581m47604m24382l46544k33338j05594K0223J34870K36526L27898
$$ plain form
38774 2041236 1943860 1892006 1871873 1866139 1858805 1838805 1801929 1749920 1686643 1613666 1528424 1425664
38762 1425664 1299642 1144550 953905 721797 446996 137156 -190716 -514478 -813216
38753 -813216 -1072407 -1286312 -1457932 -1597655 -1721454 -1848863 -2000034 -2191051 -2427933 -2702050
38743 -2702050 -2990494 -3262984 -3493081 -3668863 -3798348 -3907375 -4031102 -4203045 -4446511
38734 -4446511 -4771101 -5173302 -5638141 -6140199 -6645118 -7113672 -7508583 -7801887 -7979752
38725 -7979752 -8042852 -8002363 -7874069 -7674110 -7418429 -7124329 -6810288 -6491986 -6177032 -5863287
38715 -5863287 -5543323 -5212667 -4876714 -4552807 -4267892 -4054401 -3945699 -3969871 -4140642 -4448003
38705 -4448003 -4854584 -5302188 -5726570 -6073114 -6306452 -6412046 -6391823 -6256953 -6020427 -5692529
38695e692529M10600M80147N25983N37099N08724M44888L56151K55860J57593
38686b015484P3253J0456k9909n3388o8116p9580q7627q7527p4040m5488n237
38675b462687L9567Q0304J08824J19277J10196Q5548N2941J9656j0215l5079n2995
38664a944663o0077n1821k5835J6442P0187J28884J85729K33919K66422K76530
38654i04283K59695K15622J49567P2369p90n3663p4110n8797j4151M7271J12193
38643b49077J70157K13817K37554K36794K09463J58478R2530K3113m0446r3776
38633I58607j35978j66446j83703j86637j75670j52560j20246q4100n3539m1653
38623c41925o1688j21221k16701l31855m42242n24400n64560n62128n27029m73568
$$ plain form
38695 -5692529 -5281929 -4801782 -4275799 -3738700 -3229976 -2785088 -2428937 -2173077 -2015484
38686 -2015484 -1942231 -1931775 -1961684 -2015072 -2083188 -2162768 -2250395 -2337922 -2411962 -2457450 -2462687
38675 -2462687 -2423120 -2342816 -2233992 -2114715 -2004519 -1918971 -1866030 -1846374 -1856589 -1891668 -1944663
38664 -1944663 -2004740 -2056561 -2082396 -2065954 -1995767 -1866883 -1681154 -1447235 -1180813 -904283
38654 -904283 -644588 -428966 -279399 -207030 -207820 -261483 -335593 -394390 -408541 -361270 -249077
38643 -249077 -78920 134897 372451 609245 818708 977186 1069716 1092829 1052383 958607
38633 958607 822629 656183 472480 285843 110173 -42387 -162633 -246733 -300272 -341925
38623 -341925 -403613 -524834 -741535 -1073390 -1515632 -2040032 -2604592 -3166720 -3693749 -4167317
38613d167317m14529l57888l06835k61864k22793j89440j61354j37544j16202
38604f335766r4104o6516k8759K1245Q1937J49887K22427K98079L74193M44776
38594d932601N01559N37951N52313N47404N26501M89699M33301L52362K44329
38585g47182J11889l5990j85047l18441m20473m80265m94371m67057m07686l26651
38575c771274k33098j36263m8133J7085M7977M1694N352m7882j04156j51390j78495
38564d558583j74756j32783n4047M7811J50131K30070K73819K80986K62604K34828
38554c439920K11603J99484J96576J95537J88273J69776J40296J06270P9497P3159
38544a879449R5136J42267K00016K48510K71294K61590K23029J65593J00108L4857
$$ plain form
38613 -4167317 -4581846 -4939734 -5246569 -5508433 -5731226 -5920666 -6082020 -6219564 -6335766
38604 -6335766 -6429870 -6496386 -6525145 -6503900 -6421963 -6272076 -6049649 -5751570 -5377377 -4932601
38594 -4932601 -4431042 -3893091 -3340778 -2793374 -2266873 -1777174 -1343873 -991511 -747182
38585 -747182 -635293 -671283 -856330 -1174771 -1595244 -2075509 -2569880 -3036937 -3444623 -3771274
38575 -3771274 -4004372 -4140635 -4188768 -4171683 -4123706 -4082012 -4076660 -4124542 -4228698 -4380088 -4558583
38564 -4558583 -4733339 -4866122 -4920169 -4872358 -4722227 -4492157 -4218338 -3937352 -3674748 -3439920
38554 -3439920 -3228317 -3028833 -2832257 -2636720 -2448447 -2278671 -2138375 -2032105 -1952608 -1879449
38544 -1879449 -1784313 -1642046 -1442030 -1193520 -922226 -660636 -437607 -272014 -171906 -137049
38534a37049k4040p0105r5460r3622o4289j5707L7737Q0737J01344R2910N4932
38523a32612o253p7894j43629j87881j99881j75858j19432m0721M5774J24525
38513i13862J83001K14900K20891K06373J77854J40268R6435M8032l383n5829
38503C14680j06628j52130j87553k07537k07622j85981j43856q4213j0103P5394
38493h95549J67668K59751L43125M09369M51574M65998M54072M22685L80993L35412
38483B795098K86883K32463J69463R8803K5792m1714r6691j36057j61662j78543
38473B993835j91385k00806k01373j83218j37765o4725K4620J10871J74846K05800
38463B530700K05012J83157J53309J24136R7809P3362N1771L8405M1637O9325
$$ plain form
38534 -137049 -161089 -231194 -326654 -420276 -484565 -500272 -462535 -381798 -280454 -187544 -132612
38523 -132612 -138865 -216759 -360388 -548269 -748150 -924008 -1043440 -1084161 -1038387 -913862
38513 -913862 -730861 -515961 -295070 -88697 89157 229425 325860 373892 370509 314680
38503 314680 208052 55922 -131631 -339168 -546790 -732771 -876627 -960840 -970943 -895549
38493 -895549 -727881 -468130 -125005 284364 735938 1201936 1656008 2078693 2459686 2795098
38483 2795098 3081981 3314444 3483907 3582710 3608502 3566788 3470097 3334040 3172378 2993835
38473 2993835 2802450 2601644 2400271 2217053 2079288 2014563 2039183 2150054 2324900 2530700
38463 2530700 2735712 2918869 3072178 3196314 3294123 3367485 3419256 3457661 3499298 3568623
38453C568623J24968K04636K95933L80289M37985M53609M19827L38678K20369
38444F444917P9979o6374k03907l19804m03798m50230m60501m43563m13056l82068
38434C381595l57872l39235l17804k83273k29732j59720q3569j4437L7781O9701
38424A703435Q3194Q1717O7873M3726J2478k0512m8104o3180o1970m7440k9626
38413A721591k0985k9337n3572q4836j11565j25048j23598j14222j10476j26356
38403H21596j68750k32839l03341l61250l92765l95553l78635l55832l37599l27330
38393b432298l23959l26917l37877l57660l81811l99667l98268l68404l08426
38384e635287k23695j22888j4422R4613J97047K84060L45969L76115L75661L55508
$$ plain form
38453 3568623 3693591 3898227 4194160 4574449 5012434 5466043 5885870 6224548 6444917
38444 6444917 6524896 6458522 6254615 5934811 5531013 5080783 4620282 4176719 3763663 3381595
38434 3381595 3023723 2684488 2366684 2083411 1853679 1693959 1610390 1595953 1633734 1703435
38424 1703435 1786629 1868346 1936219 1979945 1992423 1971911 1923807 1860627 1798657 1751217 1721591
38413 1721591 1700606 1671269 1617697 1532861 1421296 1296248 1172650 1058428 947952 821596
38403 821596 652846 420007 116666 -244584 -637349 -1032902 -1411537 -1767369 -2104968 -2432298
38393 -2432298 -2756257 -3083174 -3421051 -3778711 -4160522 -4560189 -4958457 -5326861 -5635287
38384 -5635287 -5858982 -5981870 -5996292 -5901679 -5704632 -5420572 -5074603 -4698488 -4322827 -3967319
38374c967319L32956L24270L37552L70080M11155M47943M70550M73983M57356
38365c41474M22259L72128L12673K51977J98817J59376J34527J19911J08991R6911
38355A836096Q2480O7550N4749M4879L4761J6843j7926p4363j48087k25677k90725
38344A380580l31825l47468l45560l38553l37048l44849l57668l65985l60125
38335a748501l34644k89995k31347j65979j01087m3252J096K6375L0967K0752
38325b835615R238J2855M4268J08205K01407L15026M37112N54488O54437P26412
38315B27833P63599P63880P29469O65065N75801M67016L45784K21436J03015m350
38305D858548j00283j86620k64828l35707l99722m55683m99131n23407n23246
$$ plain form
38374 -3967319 -3634363 -3310093 -2972541 -2602461 -2191306 -1743363 -1272813 -798830 -341474
38365 -341474 80785 452913 765586 1017563 1216380 1375756 1510283 1630194 1739185 1836096
38355 1836096 1918576 1986126 2040875 2085754 2120515 2137358 2119432 2045069 1896982 1671305 1380580
38344 1380580 1048755 701287 355727 17174 -319874 -664723 -1022391 -1388376 -1748501
38335 -1748501 -2083145 -2373140 -2604487 -2770466 -2871553 -2914805 -2913709 -2887334 -2856367 -2835615
38325 -2835615 -2826377 -2813522 -2769254 -2661049 -2459642 -2144616 -1707504 -1153016 -498579 227833
38315 227833 991432 1755312 2484781 3149846 3725647 4192663 4538447 4759883 4862898 4858548
38305 4858548 4758265 4571645 4306817 3971110 3571388 3115705 2616574 2093167 1569921
38296A569921m97491m48817l81997l02977k19195j40223p7972m5226n1495r7495
38286f92967j72627k58711l38229m01427m47769m81650n05917n17707n09411m73795
38276d800210m09354l22201k24401j30785n5710r854K554j4885n1084q9476j12304
38265f217710j07467p5079k8727J0893K6145R942l3126r0954j49782j98650k30846
38254g085361k42834k32585j99032j42717o6597K3568J19241K09697K83631L31503
38244g001486L47761L32244K90764K34666J78855J38013J21763J30448J53462
38235e073510J71592J63469J14108K1707j00962k31583l47058m31134m77258m86760
38225f677389m65354m20917l63172l03839k55560k28881k28327k49920k82138
$$ plain form
38296 1569921 1072430 623613 241616 -61361 -280556 -420779 -498751 -543977 -595472 -692967
38286 -692967 -865594 -1124305 -1462534 -1863961 -2311730 -2793380 -3299297 -3817004 -4326415 -4800210
38276 -4800210 -5209564 -5531765 -5756166 -5886951 -5942661 -5952515 -5949961 -5964846 -6015930 -6105406 -6217710
38265 -6217710 -6325177 -6400256 -6428983 -6418090 -6391945 -6382003 -6415129 -6506083 -6655865 -6854515 -7085361
38254 -7085361 -7328195 -7560780 -7759812 -7902529 -7969126 -7945558 -7826317 -7616620 -7332989 -7001486
38244 -7001486 -6653725 -6321481 -6030717 -5796051 -5617196 -5479183 -5357420 -5226972 -5073510
38235 -5073510 -4901918 -4738449 -4624341 -4602634 -4703596 -4935179 -5282237 -5713371 -6190629 -6677389
38225 -6677389 -7142743 -7563660 -7926832 -8230671 -8486231 -8715112 -8943439 -9193359 -9475497
38216i475497l09972l19374k99970k46278j58761m4400Q4627K14255L32012M29007
38206i794351N00624N46479N69455N73557N61824N36076M98358M51926M00060
38197e155992L43885K81996K13086J39781P0475J7641o633M140M7037J09184J71426
38186c763974K14626K25132J96909J31400L7713o6802j58696k15233k23172j84043
38176c806140j12934l2205L6135P6706Q4195O3366K5866j4575m6362o2474o1090
38165c849512m4961j9819P905L3525N6038P8615J06820J44642J90517K36512K71894
38154b787824K88560K84168K61253K24471J78978J30529Q5556M9902K7006J7108
38144a240293J8137K7419M3036O4133R0040J18484J43578J54906J39069Q4302
$$ plain form
38216 -9475497 -9785469 -10104843 -10404813 -10651091 -10809852 -10854252 -10769625 -10555370 -10223358 -9794351
38206 -9794351 -9293727 -8747248 -8177793 -7604236 -7042412 -6506336 -6007978 -5556052 -5155992
38197 -5155992 -4812107 -4530111 -4317025 -4177244 -4106769 -4089128 -4095761 -4091621 -4044584 -3935400 -3763974
38186 -3763974 -3549348 -3324216 -3127307 -2995907 -2958194 -3024996 -3183692 -3398925 -3622097 -3806140
38176 -3806140 -3919074 -3951279 -3915144 -3838438 -3754243 -3690877 -3665011 -3679586 -3725948 -3788422 -3849512
38165 -3849512 -3894473 -3914292 -3906387 -3872862 -3816824 -3738209 -3631389 -3486747 -3296230 -3059718 -2787824
38154 -2787824 -2499264 -2215096 -1953843 -1729372 -1550394 -1419865 -1334309 -1284407 -1257401 -1240293
38144 -1240293 -1222156 -1194737 -1151701 -1087568 -997528 -879044 -735466 -580560 -441491 -357189
38134c57189j3033j43242k83180m02817m76285m91640m54007l80867k92940k05892
38124c501092j26312n2453K1735J01335J86096K68612L35797L73160L70240L24822
38114a698060K43761J40009K7637q2435j84140k75009l52935m13306m49226m55227
38104c498931m31309l83197l18628k43492j61057p3348J8265J14000K16174L27641
38094d433882M48604N73763O91773P87842Q48459Q65714Q39215P75632O86921
38085B084041N87312M89049L98505L15272K34593J50676N8385m6462j66519l01113
38075C803739m43918n81580o94991p64034p74468p23417o20346m83369l33663
38066a616047j90871p0532J7194O8128Q3801O9606L1980k3240q9694j57870k14462
$$ plain form
38134 -357189 -370222 -513464 -796644 -1199461 -1675746 -2167386 -2621393 -3002260 -3295200 -3501092
38124 -3501092 -3627404 -3679857 -3658122 -3556787 -3370691 -3102079 -2766282 -2393122 -2022882 -1698060
38114 -1698060 -1454299 -1314290 -1286653 -1369088 -1553228 -1828237 -2181172 -2594478 -3043704 -3498931
38104 -3498931 -3930240 -4313437 -4632065 -4875557 -5036614 -5109962 -5091697 -4977697 -4761523 -4433882
38094 -4433882 -3985278 -3411515 -2719742 -1931900 -1083441 -217727 621488 1397120 2084041
38085 2084041 2671353 3160402 3558907 3874179 4108772 4259448 4317833 4271371 4104852 3803739
38075 3803739 3359821 2778241 2083250 1319216 544748 -178669 -799015 -1282384 -1616047
38066 -1616047 -1806918 -1877450 -1860256 -1792128 -1708327 -1638721 -1606741 -1629981 -1719675 -1877545 -2092007
38055b092007k45816k43748k10125j57333j04156o8508o0177p7256j07946j35857
38045c502929j45366j25220p0796J4512J19603K28255L23092L89372M17620M04950
38035a946907L54887K75587J76960O7913m5098j57619k65205l61094m35351m76680
38025b812607m76514m33391l54928k55650j51341n3174L4389J10800J74473K20331
38015c997612K42078K37228K10678J73947J40507J20080J15196J21769J32960
38006b503169J43750J53424J64740J80677K00973K20610K31251K24765J96493
37997g86486J46112P6023j0541j09445k13788l12707l93154m44531m63497m55610
37987b967624m32402m05609l82223l63161l45341l24775k98533k65086k23744
$$ plain form
38055 -2092007 -2337823 -2581571 -2791696 -2949029 -3053185 -3121693 -3181870 -3259126 -3367072 -3502929
38045 -3502929 -3648295 -3773515 -3844311 -3829799 -3710196 -3481941 -3158849 -2769477 -2351857 -1946907
38035 -1946907 -1592020 -1316433 -1139473 -1071560 -1116658 -1274277 -1539482 -1900576 -2335927 -2812607
38025 -2812607 -3289121 -3722512 -4077440 -4333090 -4484431 -4537605 -4503216 -4392416 -4217943 -3997612
38015 -3997612 -3755534 -3518306 -3307628 -3133681 -2993174 -2873094 -2757898 -2636129 -2503169
38006 -2503169 -2359419 -2205995 -2041255 -1860578 -1659605 -1438995 -1207744 -982979 -786486
37997 -786486 -640374 -564351 -574892 -684337 -898125 -1210832 -1603986 -2048517 -2512014 -2967624
37987 -2967624 -3400026 -3805635 -4187858 -4551019 -4896360 -5221135 -5519668 -5784754 -6008498
37978f008498j73906j14928m7201K5773R5883J51582J82222J83399J59783J23163
37968e422728Q6802N9594M3192L2699J9644m391m4336r9211j61501k18811k57474
37957e966521k67241k45477j98596j39304q0727l0853R623M5491Q2669J23500
37947f667436J64075J95808K11052K09212J98331J90501J94236K09282K27104
37938d867835K36109K27902K00916J59961J12919O7153K7676k428k0419k2992
37928c881038p240K7085P5880J31349J84915K30788K68270L01523L36455L75758
37918a956255M14871M41999M43320M10482L45472K59372J66581P9472P129m3127
37908E69316o5583n8900k8650J4394N9835J02700J43918J86506K30858K72620
$$ plain form
37978 -6008498 -6182404 -6297332 -6344533 -6318760 -6222877 -6071295 -5889073 -5705674 -5545891 -5422728
37968 -5422728 -5335926 -5276332 -5233140 -5200441 -5180797 -5185188 -5229524 -5328735 -5490236 -5709047 -5966521
37957 -5966521 -6233762 -6479239 -6677835 -6817139 -6897866 -6928719 -6919096 -6873605 -6790936 -6667436
37947 -6667436 -6503361 -6307553 -6096501 -5887289 -5688958 -5498457 -5304221 -5094939 -4867835
37938 -4867835 -4631726 -4403824 -4202908 -4042947 -3930028 -3862875 -3835199 -3837627 -3858046 -3881038
37928 -3881038 -3888278 -3861193 -3785313 -3653964 -3469049 -3238261 -2969991 -2668468 -2332013 -1956255
37918 -1956255 -1541384 -1099385 -656065 -245583 99889 359261 525842 605314 612443 569316
37908 569316 503733 444833 416183 430577 490412 593112 737030 923536 1154394 1427014
37898A427014L04273L19098L14753K94290K64400K32440K03973J81462J63950
37889C705653J47616J27305R8912O1620J8307k6456o9178j08098j41156j64265
37879C650260j73044j66932j51161j34028j21734j15122j10061j00247q0581n0227
37869B447123j4424J6154K9036J5073k7540r2500j67816k39665k95789l27718
37859A341934l32020l10501k69132k16038j59642j07368o4591l3737j4399m474
37849a69968j198j059L30O968K0366L8900N9472P9754R8731J15264J26512J27974
37837E02046J15400Q7206M5574m368n6389j04963j46826j82207k14401k46468
37827b05396k76690k96884k96101k67179k10933j34972m8840M0486J29886K18363
$$ plain form
37898 1427014 1731287 2050385 2365138 2659428 2923828 3156268 3360241 3541703 3705653
37889 3705653 3853269 3980574 4079486 4141106 4159413 4132957 4063779 3955681 3814525 3650260
37879 3650260 3477216 3310284 3159123 3025095 2903361 2788239 2678178 2577931 2497350 2447123
37869 2447123 2432699 2448853 2477889 2492962 2465422 2372922 2205106 1965441 1669652 1341934
37859 1341934 1009914 699413 430281 214243 54601 -52767 -117358 -151095 -165494 -169968
37849 -169968 -171166 -172225 -171895 -164927 -144561 -105661 -46189 33565 132296 247560 374072 502046
37837 502046 617446 704652 750226 745858 689469 584506 437680 255473 41072 -205396
37827 -205396 -482086 -778970 -1075071 -1342250 -1553183 -1688155 -1736995 -1696509 -1566623 -1348260
37817a348260L04175L83034M48296M92910N11992N04832M75250M30060L76533
37808B578822L20494K65740K14010J64531J13749N6642j0120q5291j62848k35170
37798C220559k97560l51037m01353m54544n11808n66852o07243o18710n90131
37789a178679n17239m04472k64576j16154K0446J27650J93959K14951J92212J31621
37779a600281M2410o2650j67063k52002l00166l01179k55951j77120q4695Q73
37769c157824O4772J01032J13171J12887J16811J41367J97322K86240L99859N22076
37759a102287O32991P14385P54791P51625P09363O35732N39064M27964L11659
37750D375287J98789R4381k515r7609j96239k97935l95281m78160n39464n77314
$$ plain form
37817 -1348260 -1044085 -661051 -212755 280155 792147 1296979 1772229 2202289 2578822
37808 2578822 2899316 3165056 3379066 3543597 3657346 3713988 3703868 3618577 3455729 3220559
37798 3220559 2922999 2571962 2170609 1716065 1204257 637405 30162 -588548 -1178679
37789 -1178679 -1695918 -2100390 -2364966 -2481120 -2460674 -2333024 -2139065 -1924114 -1731902 -1600281
37779 -1600281 -1557871 -1620521 -1787584 -2039586 -2339752 -2640931 -2896882 -3074002 -3158697 -3157824
37769 -3157824 -3093052 -2992020 -2878849 -2765962 -2649151 -2507784 -2310462 -2024222 -1624363 -1102287
37759 -1102287 -469296 245089 999880 1751505 2460868 3096600 3635664 4063628 4375287
37750 4375287 4574076 4668457 4665942 4568333 4372094 4074159 3678878 3200718 2661254 2083940
37740B083940n92994n88126n64646n27144m84308m47071m24331m19119m27774
37731b391573m42224m53325m52627m31651l80345k87575j45190M6008K72166N07350
37721d158986P19626Q79219R65165R68721Q93649P54154N71284L68899J70500
37712B132231k686j33288k10069k30544k02458j42806p4257j9997J488j9682q2930
37701A015002j77412k84477l82717m54875m93417n00817m84131m48190l93191
37692b604225l17871k24011j17494n925J03335K02453K81634L30300L41210L14213
37682a696381K56255J77440Q6102j3814j21663k36378l52685m59454n41412n83885
37672c485875n78817n29168m48943l58281k75908k12424j67095j29391q5202k5497
$$ plain form
37740 2083940 1490946 902820 338174 -188970 -673278 -1120349 -1544680 -1963799 -2391573
37731 -2391573 -2833797 -3287122 -3739749 -4171400 -4551745 -4839320 -4984510 -4938502 -4666336 -4158986
37721 -4158986 -3439360 -2560141 -1594976 -626255 267394 1021548 1592832 1961731 2132231
37712 2132231 2129545 1996257 1786188 1555644 1353186 1210380 1136123 1116126 1117614 1097932 1015002
37701 1015002 837590 553113 170396 -284479 -777896 -1278713 -1762844 -2211034 -2604225
37692 -2604225 -2922096 -3146107 -3263601 -3269526 -3166191 -2963738 -2682104 -2351804 -2010594 -1696381
37682 -1696381 -1440126 -1262686 -1176584 -1190398 -1312061 -1548439 -1901124 -2360578 -2901990 -3485875
37672 -3485875 -4064692 -4593860 -5042803 -5401084 -5676992 -5889416 -6056511 -6185902 -6271104 -6296601
37662f296601M7248J19374J73146J95598J83395J42071Q2046J4594n0678j06704
37652e496511j48724j73913j81575j73659j54656j30355j05986q4631o6729n1136
37642f767875l7484k8169k7975m1137o8209j05358j46105j83101k08316k12970
37632g826699j89785j37559o4187J5811Q8777J48838J98851K45116K90801L33186
37622f896850L65954L83851L86297L77808L65183L53265L42275L28769L09468
37613c683980K84715K58600K35869K18389K03942J87806J65687J36279J02460
37604a890233P0617M7908L8324L9929M5636M7535M1695K9717J5772J778j5054
37593a526376m0140p6824j23081j71972k14540k42384k48845k29868j85149j18251
$$ plain form
37662 -6296601 -6249353 -6129979 -5956833 -5761235 -5577840 -5435769 -5353723 -5339129 -5389807 -5496511
37652 -5496511 -5645235 -5819148 -6000723 -6174382 -6329038 -6459393 -6565379 -6650010 -6716739 -6767875
37642 -6767875 -6805359 -6833528 -6861503 -6902640 -6970849 -7076207 -7222312 -7405413 -7613729 -7826699
37632 -7826699 -8016484 -8154043 -8218230 -8202419 -8113642 -7964804 -7765953 -7520837 -7230036 -6896850
37622 -6896850 -6530896 -6147045 -5760748 -5382940 -5017757 -4664492 -4322217 -3993448 -3683980
37613 -3683980 -3399265 -3140665 -2904796 -2686407 -2482465 -2294659 -2128972 -1992693 -1890233
37604 -1890233 -1819616 -1771708 -1733384 -1693455 -1647819 -1600284 -1558589 -1528872 -1513100 -1511322 -1526376
37593 -1526376 -1566516 -1643340 -1766421 -1938393 -2152933 -2395317 -2644162 -2874030 -3059179 -3177430
37583c177430l4663O0814J64611K72401L76987M68566N37040N74347N75764N40857
37573C59294M74686L88264K96782K15523J55246J19395J04218J01040R9163Q8644
37563B402255O2880K0616l4017r3919j52466k05330k50016k84709l08141l20004
37553H37149l20510l08962k83055k40291j80833j09691l6141K9676Q0833J15314
37543d16511J33947J36455J19193P6748O013r0476k04200l22712m31748n16036
37533a509327n59789n49374m78523l53120j91389j8244J43064K77255L78701M49365
37523b411381M95458N24565N43315N55472N61137N58036N44154N19350M84437
37514B374543M39147L81645L10387K26737J36313M8293k7426q4433j23066j49831
$$ plain form
37583 -3177430 -3212093 -3151279 -2986668 -2714267 -2337280 -1868714 -1331674 -757327 -181563 359294
37573 359294 833980 1222244 1519026 1734549 1889795 2009190 2113408 2214448 2313611 2402255
37563 2402255 2465135 2485751 2451734 2357815 2205349 2000019 1750003 1465294 1157153 837149
37553 837149 516639 207677 -75378 -315669 -496502 -606193 -642334 -612658 -531825 -416511
37543 -416511 -282564 -146109 -26916 49832 55845 -34631 -238831 -561543 -993291 -1509327
37533 -1509327 -2069116 -2618490 -3097013 -3450133 -3641522 -3659766 -3516702 -3239447 -2860746 -2411381
37523 -2411381 -1915923 -1391358 -848043 -292571 268566 826602 1370756 1890106 2374543
37514 2374543 2813690 3195335 3505722 3732459 3868772 3917065 3889639 3805206 3682140 3532309
37504C532309j72840j96633k20284k39311k49186k47991k37272k20988k03655
37495A544149j89361j82369j87466k07866k41678k80677l13655l31935l32505
37486g23363l16597k85661k38929j75042r6557j3125O0130J08499J23956J08065
37476a448624P0605K5331j5075m2790n5765n5569m4048k1400J3213N9172J11812
37465a403138J61481J95489K02750J78990J29367O6578N232m4462q0231j06755
37455f94699j31014j56834j81915j99143k01482j87077j60776j30847j03774q1558
37445b229119o3133m7627l6171l1341l5284m7848o5289q0352q4306p0359l6602
37434b827431J3164P1088J28408J78575K18788K49308K71377K85478K90851K85909
$$ plain form
37504 3532309 3359469 3162836 2942552 2703241 2454055 2206064 1968792 1747804 1544149
37495 1544149 1354788 1172419 984953 777087 535409 254732 -58923 -390858 -723363
37486 -723363 -1039960 -1325621 -1564550 -1739592 -1836149 -1849274 -1789144 -1680645 -1556689 -1448624
37476 -1448624 -1378019 -1352688 -1367763 -1410553 -1466318 -1521887 -1565935 -1587335 -1574122 -1514950 -1403138
37465 -1403138 -1241657 -1046168 -843418 -664428 -535061 -468483 -463251 -507713 -587944 -694699
37455 -694699 -825713 -982547 -1164462 -1363605 -1565087 -1752164 -1912940 -2043787 -2147561 -2229119
37445 -2229119 -2292252 -2339879 -2376050 -2407391 -2442675 -2490523 -2555812 -2636164 -2720470 -2790829 -2827431
37434 -2827431 -2814267 -2743179 -2614771 -2436196 -2217408 -1968100 -1696723 -1411245 -1120394 -834485
37424h34485K68953K39263J98602J51903J05757O5316L2397O811j0417j5655n136
37413B03309K0507N3587Q0941Q8999O9494K3023m1067j08172j63208j94264j93926
37402a60777j59347r2643j829R9358J94254K67961L11209L21211L00371K55148
37392A334916J95744J34496Q1536M0069N582k9985p2591j23120j77558k28066
37382A161023k63996k74345k52697k02755j40209q8076o6810q4456j32987j93214
37372e38522k45260k78042k92250k96207k98429l02268l05141l00982k82855k44396
37362c384352j80975r1618J8982J39861K55449L49248M08543M28422M12985L73150
37352a270305L22620K74062K36074K10666J92335J70820J37336R0303L6034j6305
$$ plain form
37424 -834485 -565532 -326269 -127667 24236 129993 195309 227706 234517 224100 208445 203309
37413 203309 223816 277403 358344 447343 516837 539860 498793 390621 227413 33149 -160777
37402 -160777 -320124 -412767 -414596 -315238 -120984 146977 458186 779397 1079768 1334916
37392 1334916 1530660 1665156 1746692 1786761 1792343 1762358 1689767 1566647 1389089 1161023
37382 1161023 897027 622682 369985 167230 27021 -61055 -127865 -212321 -345308 -538522
37372 -538522 -783782 -1061824 -1354074 -1650281 -1948710 -2250978 -2556119 -2857101 -3139956 -3384352
37362 -3384352 -3565327 -3656945 -3637963 -3498102 -3242653 -2893405 -2484862 -2056440 -1643455 -1270305
37352 -1270305 -947685 -673623 -437549 -226883 -34548 136272 273608 363911 399945 383640
37342C83640o1213r9448j34809j68196j94032k02150j83795j37470p0730K947
37332h65256O9935J21163J53734J70023J76261J81246J94499K23479K71202L35180
37322A031466M07309M74085N18332N23708M80761L91186K68129J33066J0624p7920
37312D160746j21078j20842r1263n2382k2240j0344j5231k7263l5257l3123k2531
37301C609192j0782o233j4505l7327p3658j21482j78461k41000l03152l57417
37291B265175l97584m21109m28633m20976l96944l54581k94788k23851j52671
37282h25962r3579n6564m5739n7033p9223r9624j11360j16613j23112j37197j59403
37271a905409j85430k10592k33470k55800k79038l01080l16518l20063l09558
$$ plain form
37342 383640 322427 222979 88170 -80026 -274058 -476208 -660003 -797473 -868203 -865256
37332 -865256 -795321 -674158 -520424 -350401 -174140 7106 201605 425084 696286 1031466
37322 1031466 1438775 1912860 2431192 2954900 3435661 3826847 4094976 4228042 4238666 4160746
37312 4160746 4039668 3918826 3827563 3775181 3752941 3742597 3727366 3700103 3664846 3631723 3609192
37301 3609192 3598410 3592177 3577672 3540345 3466687 3345205 3166744 2925744 2622592 2265175
37291 2265175 1867591 1446482 1017849 596873 199929 -154652 -449440 -673291 -825962
37282 -825962 -919541 -976105 -1021844 -1078877 -1158100 -1257724 -1369084 -1485697 -1608809 -1746006 -1905409
37271 -1905409 -2090839 -2301431 -2534901 -2790701 -3069739 -3370819 -3687337 -4007400 -4316958
37262d316958k85858k50444k03301j42446o5402K7266J27736K19947K84744L08481
37252d296235K88827K34141J58882P9144R712l8249n9044n2935k5088J6290O2250
37241c622305J05625J42957J74457K02033K27108K49806K69217K83239K87575
37232a680288K75406K39733J77973R5491M900p8649j42887j81815j96967j97190
37222a684293j96165k06881k35060k75882l16583l42970l45257l20186k69760
37213d193037j98993j14501k3856O5221J46243K15086K69977L10427L36135L46835
37203b840463L43190L28087L07193K87631K74606K67842K60873K44731K13806
37194c12504J69393J18327O8437K4990r513l3641m6572m9928m9814n6015p7543
$$ plain form
37262 -4316958 -4602816 -4853260 -5056561 -5199007 -5264409 -5237143 -5109407 -4889460 -4604716 -4296235
37252 -4296235 -4007408 -3773267 -3614385 -3535241 -3525529 -3563778 -3622822 -3675757 -3700845 -3684555 -3622305
37241 -3622305 -3516680 -3373723 -3199266 -2997233 -2770125 -2520319 -2251102 -1967863 -1680288
37232 -1680288 -1404882 -1165149 -987176 -891685 -886785 -965434 -1108321 -1290136 -1487103 -1684293
37222 -1684293 -1880458 -2087339 -2322399 -2598281 -2914864 -3257834 -3603091 -3923277 -4193037
37213 -4193037 -4392030 -4506531 -4530387 -4465166 -4318923 -4103837 -3833860 -3523433 -3187298 -2840463
37203 -2840463 -2497273 -2169186 -1861993 -1574362 -1299756 -1031914 -771041 -526310 -312504
37194 -312504 -143111 -24784 43653 68643 59130 25489 -21083 -71011 -120825 -176840 -254383
37183b54383j16983j67807k16984k51561k64836k58363k39368k16190j94901j78288
37173b359664j66584j58514j51838j43344j28923j04064o4772q754O2900J43968
37163c079589K23138K87702L29801L50555L58046L60335L59450L51527L32493
37154a26542L03647K71826K43804K19716J91196J46124P6919j2830j07045j81502
37144A025313k11832j82035r0314M9822K13205L69839M92791N65050N83056N55090
37134C369985M95121M15917L25825K30465J36453N2871j1218n0929o7453o5951
37124D831086n1428k6100J0130N7637J15832J83330K58276L37443M14338M77668
37114F608212N12285N03597M43809L36048J93234L2821j28297k75751l97626m84847
$$ plain form
37183 -254383 -371366 -539173 -756157 -1007718 -1272554 -1530917 -1770285 -1986475 -2181376 -2359664
37173 -2359664 -2526248 -2684762 -2836600 -2979944 -3108867 -3212931 -3277703 -3286457 -3223557 -3079589
37163 -3079589 -2856451 -2568749 -2238948 -1888393 -1530347 -1170012 -810562 -459035 -126542
37154 -126542 177105 448931 692735 912451 1103647 1249771 1326690 1313860 1206815 1025313
37144 1025313 813481 631446 541132 590954 804159 1173998 1666789 2231839 2814895 3369985
37134 3369985 3865106 4281023 4606848 4837313 4973766 5026637 5015419 4964490 4897037 4831086
37124 4831086 4779658 4753558 4763688 4821325 4937157 5120487 5378763 5716206 6130544 6608212
37114 6608212 7120497 7624094 8067903 8403951 8597185 8630006 8501709 8225958 7828332 7343485
37104G343485n32563n41383n17807m74049m26687l93030l85936m09818m60182
37095C202030n26138n93981o50365o84526o89293o61326o01717n17268m20767
37086b143351l28111k52645j99685j64337j33911r4090l5991L9521J22601J98971
37076b991028K54880K80648K73335K38497J88800J38082R3995N4929J3962l3335
37066a487235q3122j23396j39368j20731o7199R836Q9949J49955J72152J51416
37056a447743R7445L0435k7862o3095p3222o7606o0985o5120q2641j06781j26915
37045a994090j35665j32758j23934j16711j15991j21803j29955j34646j31127
37036c136680j16663q9788m9098P111P9913J67874K65326L62124M45773N05107
$$ plain form
37104 7343485 6810922 6269539 5751732 5277683 4850996 4457966 4072030 3662212 3202030
37095 3202030 2675892 2081911 1431546 747020 57727 -603599 -1205316 -1722584 -2143351
37086 -2143351 -2471462 -2724107 -2923792 -3088129 -3222040 -3316130 -3352121 -3312600 -3189999 -2991028
37076 -2991028 -2736148 -2455500 -2182165 -1943668 -1754868 -1616786 -1522791 -1467862 -1453900 -1487235
37066 -1487235 -1570357 -1693753 -1833121 -1953852 -2021051 -2011215 -1921266 -1771311 -1599159 -1447743
37056 -1447743 -1350298 -1319863 -1347725 -1410820 -1484042 -1551648 -1612633 -1677753 -1760394 -1867175 -1994090
37045 -1994090 -2129755 -2262513 -2386447 -2503158 -2619149 -2740952 -2870907 -3005553 -3136680
37036 -3136680 -3253343 -3343131 -3392229 -3385118 -3305205 -3137331 -2872005 -2509881 -2064108 -1559001
37026a559001N33575N30540N00407M50696L90087L26990K68345K18237J76742
37017A836618J40327J04794O9494L9455K3006K6108M7825Q0657J15333J45862
37007B629479J70452J87780J92363J74012J22748L5762p8931k04730l22821m18656
36997B487458m85597n25041n43654n49142n46685n38106n24261n08468m97491
36988b230987m98253n11968n30041n35533n10216m43212l36020k01414n7557P8911
36978e776290J97517K94859L72353M32607M76353N01067N01518M72321M11735
36969b115960L24750K22969J21013L2262l3393p0222p8056o4131m2220k7490k9989
36958a760467n1162q4400j17492j35455j24510p7497J682R7766J88903K54184
$$ plain form
37026 -1559001 -1025426 -494886 5521 456217 846304 1173294 1441639 1659876 1836618
37017 1836618 1976945 2081739 2151233 2190688 2213694 2239802 2287627 2368284 2483617 2629479
37007 2629479 2799931 2987711 3180074 3354086 3476834 3512596 3433665 3228935 2906114 2487458
36997 2487458 2001861 1476820 933166 384024 -162661 -700767 -1225028 -1733496 -2230987
36988 -2230987 -2729240 -3241208 -3771249 -4306782 -4816998 -5260210 -5596230 -5797644 -5855201 -5776290
36978 -5776290 -5578773 -5283914 -4911561 -4478954 -4002601 -3501534 -3000016 -2527695 -2115960
36969 -2115960 -1791210 -1568241 -1447228 -1414966 -1448359 -1518581 -1596637 -1660768 -1702988 -1730478 -1760467
36958 -1760467 -1811629 -1896029 -2013521 -2148976 -2273486 -2350983 -2349301 -2251535 -2062632 -1808448
36948a808448K80440K65592K17666J50786Q0503K0172k1448m1947m5864m3152
36938i45700m5272o0300q9110j24475j53774j64431j49407j09777n3284R478O8660
36927a817392J17248J51839J72474J81239J79759J66846J38179Q8956J8369o6975
36917f69458j53453k25168k70336k85087k72762k40633j97741j55043j25282j19824
36907b714787j43162j89084k41847k82106k94372k72534k21127j52017p8327r248
36897d598611N1238J01938J41548J68168J80965J81460J72989J59197J43281J28292
36887c169535J17237J11784J09806J03728Q1817L2964m7307j53231k69970l78744
36877c461451m62954n12426n24742n04167m59335m00613l37682k77649k24126
$$ plain form
36948 -1808448 -1528008 -1262416 -1044750 -893964 -813461 -793289 -814737 -856684 -902548 -945700
36938 -945700 -990972 -1051272 -1140382 -1264857 -1418631 -1583062 -1732469 -1842246 -1895530 -1886052 -1817392
36927 -1817392 -1700144 -1548305 -1375831 -1194592 -1014833 -847987 -709808 -620852 -602483 -669458
36917 -669458 -822911 -1048079 -1318415 -1603502 -1876264 -2116897 -2314638 -2469681 -2594963 -2714787
36907 -2714787 -2857949 -3047033 -3288880 -3570986 -3865358 -4137892 -4359019 -4511036 -4589363 -4598611
36897 -4598611 -4547373 -4445435 -4303887 -4135719 -3954754 -3773294 -3600305 -3441108 -3297827 -3169535
36887 -3169535 -3052298 -2940514 -2830708 -2726980 -2645163 -2612199 -2659506 -2812737 -3082707 -3461451
36877 -3461451 -3924405 -4436831 -4961573 -5465740 -5925075 -6325688 -6663370 -6941019 -7165145
36868g165145j77657j37269j02139p2233m7608k7136p960J3543L9694P0047J02220
36857g511643J34571J68154K05768K48740K94354L35937L65172L75203L63353
36848e020391L32421K89636K43374J99710J60898J25931R1843N4829J1792l7541
36838c547498q9197j35909j70415j88770j91254j80572j59586j30728r6840o1251
36828d952020k6147R070M7308R1418J41785J94978K43615K77940K89579K75833
36818c406641K41121J94124J42983R2046M1508j0807o6483j23557j75650k14355
36808c285711k33317k30803k09370j74122j31431q8670n4225l6838m3230p4531
36798d562248j23970j78352k22467k43010k30489j80807r7650O898J15931K13681
$$ plain form
36868 -7165145 -7342802 -7480071 -7582210 -7654443 -7702051 -7729187 -7737147 -7723604 -7683910 -7613863 -7511643
36857 -7511643 -7377072 -7208918 -7003150 -6754410 -6460056 -6124119 -5758947 -5383744 -5020391
36848 -5020391 -4687970 -4398334 -4154960 -3955250 -3794352 -3668421 -3576578 -3521749 -3509957 -3547498
36838 -3547498 -3636695 -3772604 -3943019 -4131789 -4323043 -4503615 -4663201 -4793929 -4890769 -4952020
36828 -4952020 -4978167 -4969097 -4921789 -4830371 -4688586 -4493608 -4249993 -3972053 -3682474 -3406641
36818 -3406641 -3165520 -2971396 -2828413 -2736367 -2694859 -2705666 -2772149 -2895706 -3071356 -3285711
36808 -3285711 -3519028 -3749831 -3959201 -4133323 -4264754 -4353424 -4407649 -4444487 -4487717 -4562248
36798 -4562248 -4686218 -4864570 -5087037 -5330047 -5560536 -5741343 -5838993 -5832095 -5716164 -5502483
36788e502483K89319L36974L54300L41976L03809K46532J79476J14362O4370M1695
36778c229670N4074J01606J75161K58127L32343L85983M17954M35257M45810M53008
36768a70347M55658M51432M39538M20816L96528L67888L36354L03121K67207K24029
36758C492224J66839R0706m078j11699k22871l27399m16487m84593n29529n50012
36748A103101n42976n04474m34430l41082k40985j54702j01084r2281j30037k03901
36738a642851k92928l71533m17740m20008l78932l03399k04562r2061K6082J42025
36728c955907K47550L34620L96176M27032M25061L92352L35753K66855K01171
36719i29337J55089J40073J56850J94162K34014K60228K64771K48375K16568J74953
$$ plain form
36788 -5502483 -5213164 -4876190 -4521890 -4179914 -3876105 -3629573 -3450097 -3335735 -3271365 -3229670
36778 -3229670 -3175596 -3073990 -2898829 -2640702 -2308359 -1922376 -1504422 -1069165 -623355 -170347
36768 -170347 285311 736743 1176281 1597097 1993625 2361513 2697867 3000988 3268195 3492224
36758 3492224 3659063 3749769 3745691 3633992 3411121 3083722 2667235 2182642 1653113 1103101
36748 1103101 560125 55651 -378779 -719861 -960846 -1115548 -1216632 -1308913 -1438950 -1642851
36738 -1642851 -1935779 -2307312 -2725052 -3145060 -3523992 -3827391 -4031953 -4124014 -4097932 -3955907
36728 -3955907 -3708357 -3373737 -2977561 -2550529 -2125468 -1733116 -1397363 -1130508 -929337
36719 -929337 -774248 -634175 -477325 -283163 -49149 211079 475850 724225 940793 1115746
36709A115746J27316P6730K7177j6709n1262p4751q6809q7624p8297o1827m3131
36698H46559k7241j6746j0576n584k61K036o868l5754q7772j56081k24959k76547
36686B06k99034k90643k57238k06861j46177q0683j6491L9074P8618R6489Q9984
36675i92756N9598Q813n5693j23651j82018k17870k21817j89741j22611k5896
36665b063642R0671K13999L29735M24602M88144N13930N00469M51475L75506K85430
36655A610319J97030J25366P9396N8611N4862N8121O1447O1469N4876L4705r450
36644B386752q6188j95609l26857m61919n81971o71495p19542p20808o77278n98185
36634b653100m96926l86813k78350j78750r2741k3611K6358N6714P0272P3444
$$ plain form
36709 1115746 1243062 1319792 1346969 1330260 1278998 1204247 1117438 1029814 951517 889690 846559
36698 846559 819318 802572 791996 786412 786151 788187 781319 745565 657793 501712 276753 206
36686 206 -298828 -589471 -846709 -1053570 -1199747 -1280430 -1296921 -1257847 -1179229 -1082740 -992756
36675 -992756 -933158 -924345 -980038 -1103689 -1285707 -1503577 -1725394 -1915135 -2037746 -2063642
36665 -2063642 -1972971 -1758972 -1429237 -1004635 -516491 -2561 497908 949383 1324889 1610319
36655 1610319 1807349 1932715 2012111 2070722 2125584 2183705 2245152 2306621 2361497 2396202 2386752
36644 2386752 2300564 2104955 1778098 1316179 734208 62713 -656829 -1377637 -2054915 -2653100
36634 -2653100 -3150026 -3536839 -3815189 -3993939 -4086680 -4110291 -4083933 -4027219 -3956947 -3883503
36624c883503P4459Q0428R4704J15188J34008J39829J22847Q0120J7576n2494
36614c076838j16307j62578j84223j78402j46258r3001k7720L8211R4291J33966
36604c718859J55618J61006J52979J34451J08907Q1378N8748M8926N8542Q9455
36594b668849J36029J86045K26200K48820K54812K51165K46066K45989K55964
36585f17759K81030L26404L95731M88528N98628P14657Q22265R06594R54391R56500
36575E826969R11175Q26254P17400O02081M92569L92231K97172K01782J04264
36566A0371897Q544p8363j50638k06119k45829k72150k87350k92838k89303k77723
36556H280128k60463k41029k22335k04952j86690j63794j33724r8971o9440n9949
$$ plain form
36624 -3883503 -3809044 -3728616 -3633912 -3518724 -3384716 -3244887 -3122040 -3041920 -3024344 -3076838
36614 -3076838 -3193145 -3355723 -3539946 -3718348 -3864606 -3957607 -3985327 -3947116 -3852825 -3718859
36604 -3718859 -3563241 -3402235 -3249256 -3114805 -3005898 -2924520 -2865772 -2816846 -2758304 -2668849
36594 -2668849 -2532820 -2346775 -2120575 -1871755 -1616943 -1365778 -1119712 -873723 -617759
36585 -617759 -336729 -10325 385406 873934 1472562 2187219 3009484 3916078 4870469 5826969
36575 5826969 6738144 7564398 8281798 8883879 9376448 9768679 10065851 10267633 10371897
36566 10371897 10380441 10302078 10151440 9945321 9699492 9427342 9139992 8847154 8557851 8280128
36556 8280128 8019665 7778636 7556301 7351349 7164659 7000865 6867141 6768170 6698730 6638781
36546F638781q2786j40436k24097l18396m08053m82420n36685n70139n82426n70314
36536B723029n28121m52421l47555k27217j10420j4480N0654Q3718Q9741P6731
36526A343659N3640K9193J0246N1j952J609Q109J6081K5746L9188N9159Q5819
36514A670548J13293J29627J21681Q2886J9204n0821j02934j17724q8985k5313
36504A751462N5153J32859J93495K30971K47005K48495K43820K38923K34236K23871
36494C800290J98344J50413Q1173K568o5599j02730r4924l9985N1366J58047K54568
36483D393531L18842L38863L14965K56741J77043Q6959n966r6640j80353k51331
36473E352654l02807l28678l25965k96401k45814j81329j08333k9577N2574J32494
$$ plain form
36546 6638781 6555995 6415559 6191462 5873066 5465013 4982593 4445908 3875769 3293343 2723029
36536 2723029 2194908 1742487 1394932 1167715 1057295 1042815 1093469 1177187 1266928 1343659
36526 1343659 1397299 1426492 1436738 1436789 1434837 1436446 1444555 1460636 1486382 1525570 1584729 1670548
36514 1670548 1783841 1913468 2035149 2118035 2137239 2086418 1983484 1865760 1776775 1751462
36504 1751462 1806615 1939474 2132969 2363940 2610945 2859440 3103260 3342183 3576419 3800290
36494 3800290 3998634 4149047 4230220 4232788 4167189 4064459 3969535 3929550 3980916 4138963 4393531
36483 4393531 4712373 5051236 5366201 5622942 5799985 5886944 5880978 5784338 5603985 5352654
36473 5352654 5049847 4721169 4395204 4098803 3852989 3671660 3563327 3533750 3586324 3718818
36463C718818J99825K42587K53462K34724J97956J58574J28807J13332J09328
36454E357413J09659J06399R2698O3376J5799m8452j22788j97300k61907l08431
36444D806466l30880l26021k95412k46576j90066j33352p6702j4707N8437J45056
36434C396243K43841L51488M63211N71644O65846P32186P57658P34613O64180
36425H580910N56001M24557K85190J52515M0221m0291q2977q9433o8158l1152
36415I727383R989M6558P2991Q5325P9891N4257J0269m3848r5087j30467j41960
36404I675301j28940r7640n8098j9311J5574N0994R5759J56477K31924L11915
36394A0233955L80690M22118M24035L81056K96222J81376N5530n9030j41977j80206
$$ plain form
36463 3718818 3918643 4161230 4414692 4649416 4847372 5005946 5134753 5248085 5357413
36454 5357413 5467072 5573471 5666169 5729545 5745344 5696892 5574104 5376804 5114897 4806466
36444 4806466 4475586 4149565 3854153 3607577 3417511 3284159 3207457 3192750 3251187 3396243
36434 3396243 3640084 3991572 4454783 5026427 5692273 6424459 7182117 7916730 8580910
36425 8580910 9136911 9561468 9846658 9999173 10039394 9999103 9916126 9826693 9758535 9727383
36415 9727383 9737372 9783930 9856921 9942246 10022137 10076394 10086663 10042815 9947728 9817261 9675301
36404 9675301 9546361 9448721 9390623 9371312 9386886 9437880 9533639 9690116 9922040 10233955
36394 10233955 10614645 11036763 11460798 11841854 12138076 12319452 12374982 12315952 12173975 11993769
36384A1993769j71522j25066n7387J4447P8942J32121J75565K13141K48520K83643
36374A2786173L17882L48077L69445L76650L64996L32517K82771K25891J75621
36365A5580023J43443J33781J43495J65146J91162K16553K39597K61337K84898
36356A7359435L14937L56672M13736M85575N66642O48920P26540P98985Q70567
36347B2542009R47004J032215J127449J232333J345755J465592J588039J708117
36339C2988513J821548J926835K026613K128262K243658K387057K570678K799884
36331E0893048L071138L374057L695948M026672M363008M711974N091320N525518
36323H4752683O038184O644275P345035Q126959Q964759R827288J0683495J1504585
$$ plain form
36384 11993769 11822247 11697181 11639794 11654241 11733183 11865304 12040869 12254010 12502530 12786173
36374 12786173 13104055 13452132 13821577 14198227 14563223 14895740 15178511 15404402 15580023
36365 15580023 15723466 15857247 16000742 16165888 16357050 16573603 16813200 17074537 17359435
36356 17359435 17674372 18031044 18444780 18930355 19496997 20145917 20872457 21671442 22542009
36347 22542009 23489013 24521228 25648677 26881010 28226765 29692357 31280396 32988513
36339 32988513 34810061 36736896 38763509 40891771 43135429 45522486 48093164 50893048
36331 50893048 53964186 57338243 61034191 65060863 69423871 74135845 79227165 84752683
36323 84752683 90790867 97435142 104780177 112907136 121871895 131699183 142382678 153887263
36315A53887263J2261297J2919060J3434857J3756771J3824977J3574258J2940570
36308B46599053J1873339J0351416Q397166O082860L526239Q75972j709086m081684
36300B81915275o124731p763686q970503r757863j0165685j0245649j0050307
36293B18836851r629380r030571q300407p483132o618686n740991m876303m041458
36285A63115923l243764k484843j767689j102358n05908L441M13371P21218R33180
36276A56082571J060979J118434J118931J073601R90145Q72957P25036N50480
36268A63593134L54933J42515q8660l47942o47914r96832j393023j825126k277010
36259A56514075k732839l178141l597019l969402m272395m485996m599459m614111
$$ plain form
36315 153887263 166148560 179067620 192502477 206259248 220084225 233658483 246599053
36308 246599053 258472392 268823808 277220974 283303834 286830073 287706045 285996959 281915275
36300 281915275 275790544 268026858 259056355 249298492 239132807 228887158 218836851
36293 218836851 209207471 200176900 191876493 184393361 177774675 172033684 167157381 163115923
36285 163115923 159872159 157387316 155619627 154517269 154011361 154014802 154428173 155149391 156082571
36276 156082571 157143550 158261984 159380915 160454516 161444661 162317618 163042654 163593134
36268 163593134 163948067 164090582 164001922 163653980 163006066 162009234 160616211 158791085 156514075
36259 156514075 153781236 150603095 147006076 143036674 138764279 134278283 129678824 125064713
36251A25064713m541345m397561m198937l958414l685932l391099l085569k782606
36243I5023250k493928k226517j981892j757965j551547j359962j181440j014716
36235H1455283q58340p10235n68112m30926l00977j85911r9440n9472q2952j79031
36225G7979887l44268n63239q14080j074937j327537j557521j754079j910302
36217F8633924k023355k093287k121618k111752k070888k010527j943352j877921
36209E2381224j814956j747429j663858j553067j409340j236773j050388q71706
36201D1033707p19964o04269n21993m63784m20325l85753l56993l32117l10246
36192C6918263k92400k80979k77238k78487k77458k64911k34516j87241j32558
$$ plain form
36251 125064713 120523368 116125807 111926870 107968456 104282524 100891425 97805856 95023250
36243 95023250 92529322 90302805 88320913 86562948 85011401 83651439 82469999 81455283
36235 81455283 80596943 79886708 79318596 78887670 78586693 78400782 78301342 78241870 78158918 77979887
36225 77979887 77635619 77072380 76258300 75183363 73855826 72298305 70544226 68633924
36217 68633924 66610569 64517282 62395664 60283912 58213024 56202497 54259145 52381224
36209 52381224 50566268 48818839 47154981 45601914 44192574 42955801 41905413 41033707
36201 41033707 40313743 39709474 39187481 38723697 38303372 37917619 37560626 37228509 36918263
36192 36918263 36625863 36344884 36067646 35789159 35511701 35246790 35012274 34825033 34692475
36183C4692475q5299n9889o5080j01449j61719k32842k99227l46903l67825l62424
36173C2609818l38563l06892k75186k45448k15841j85562j57963j38868j31864
36164C0613631j35433j44679j55396j66230j77612j90259k06176k31277k75627
36155B8930942l48863m53039n78441p06166q16356q96606r45196r67674r70106
36146B2248495r54177r17401q57555p77541o86982n99643n28549m81409m57960
36137A5987278m49750m42640m22060l79470l16739k45425j80902j34919j10898
36128A3304475j04195j06081j08604j07803j04250j01494j04173j17172j45620
36119A2305083j94047k63879l50796m44892n34593o11890o74869p25493p64127
$$ plain form
36183 34692475 34607176 34547287 34482207 34380758 34219039 33986197 33686970 33340067 32972242 32609818
36173 32609818 32271255 31964363 31689177 31443729 31227888 31042326 30884363 30745495 30613631
36164 30613631 30478198 30333519 30178123 30011893 29834281 29644022 29437846 29206569 28930942
36155 28930942 28582079 28129040 27550599 26844433 26028077 25131471 24186275 23218601 22248495
36146 22248495 21294318 20376917 19519362 18741821 18054839 17455196 16926647 16445238 15987278
36137 15987278 15537528 15094888 14672828 14293358 13976619 13731194 13550292 13415373 13304475
36128 13304475 13200280 13094199 12985595 12877792 12773542 12672048 12567875 12450703 12305083
36119 12305083 12111036 11847157 11496361 11051469 10516876 9904986 9230117 8504624 7740497
36110G740497p84758p74619p19312o10913m54727k71140r1454N1143J32720J47736
36100D365173J11569N4159P393p221J5576O7346J33917K03229K68525L26189L71531
36089E917386L97005L94395L58875K91825K00855R7354p259j04666j90228k60911
36079G094631l13180l43570l51501l41203l20707k98678k80986k68296k55804
36070D320706k36263k05256j64470j19304p2581k0764M3007J21477K08105K88551
36060D163208L47614L76904L78746L64400L47859L38842L39077L43576L45316
36051G345542L40016L28505L15987L08818L10629L20326L33764L47789L62746
36042A0314122L80609M00070M13031M05768L64132K79641J53316m109j75280l40808
$$ plain form
36110 7740497 6955739 6181120 5461808 4850895 4396168 4125028 4033574 4084717 4217437 4365173
36100 4365173 4476742 4530901 4538294 4531073 4546649 4613995 4747912 4951141 5219666 5545855 5917386
36089 5917386 6314391 6708786 7067661 7359486 7560341 7657695 7650436 7545770 7355542 7094631
36079 7094631 6781451 6437881 6086380 5745177 5424470 5125792 4844806 4576510 4320706
36070 4320706 4084443 3879187 3714717 3595413 3522832 3502068 3545075 3666552 3874657 4163208
36060 4163208 4510822 4887726 5266472 5630872 5978731 6317573 6656650 7000226 7345542
36051 7345542 7685558 8014063 8330050 8638868 8949497 9269823 9603587 9951376 10314122
36042 10314122 10694731 11094801 11507832 11913600 12277732 12557373 12710689 12706580 12531300 12190492
36032A2190492m83185n88908o49149o60066o23170n45540m39432l20872k06881
36023G673289j11886m4716p510L682k484j4590k1455j5701M150L4624P0226J05681
36011G673310J36062J56021J60144J44749J09488N7300o963p7635j48285k11345
36001G992846k58504k82284k78552k48950k01733j49508j04454p4025o0046o0993
35991F273797p4334r6643j22050j41260j42739j16163n7245K8290J24294K08457
35981E884404K59246K62145K13374J21060L902j13118k05204k53882k50577j97397
35971E723953j06007N018J14365K02523K54834K62349K21633J34967J0987j35436
35961F689186k84835m15995n09331n50685n35199m69809l72165k65173j69312
$$ plain form
36032 12190492 11707307 11118399 10469250 9809184 9186014 8640474 8201042 7880170 7673289
36023 7673289 7561403 7516687 7509177 7512859 7510375 7495785 7474330 7458629 7462779 7497403 7567629 7673310
36011 7673310 7809372 7965393 8125537 8270286 8379774 8437074 8430111 8352476 8204191 7992846
36001 7992846 7734342 7452058 7173506 6924556 6722823 6573315 6468861 6394836 6334790 6273797
35991 6273797 6199463 6102820 5980770 5839510 5696771 5580608 5523363 5551653 5675947 5884404
35981 5884404 6143650 6405795 6619169 6740229 6744131 6631013 6425809 6171927 5921350 5723953
35971 5723953 5617946 5622964 5737329 5939852 6194686 6457035 6678668 6813635 6824622 6689186
35961 6689186 6404351 5988356 5479025 4928340 4393141 3923332 3551167 3285994 3116682
35952C116682r6618m9098k1180l839J1715L1658N8544R1693J28662J66762K03434
35941C638415K35532K59144K71504K74338K75555K86722L17060L68015M32105
35932F358390M96503N48756N81534N94844N95428N93871O00373O21117O57159
35923A1647975P06552P67886Q42003R29901J028325J126911J209698J259919J264423
35914B0783593J215009J107470R41021P19659M53979J61063j38613m25502o84077
35905B4133602r03432j076230j197495j264342j276926j240389j166801j075147
35897A4932840r87642r22806q88465q78881q78011q67359q34090p75232o96634
35888G203720o08854n23320m50310l97417l67032l54002l46821l33540l09117
$$ plain form
35952 3116682 3020064 2970966 2949786 2945947 2957662 2989320 3047864 3139557 3268219 3434981 3638415
35941 3638415 3873947 4133091 4404595 4678933 4954488 5241210 5558270 5926285 6358390
35932 6358390 6854893 7403649 7985183 8580027 9175455 9769326 10369699 10990816 11647975
35923 11647975 12354527 13122413 13964416 14894317 15922642 17049553 18259251 19519170 20783593
35914 20783593 21998602 23106072 24047093 24766752 25220731 25381794 25243181 24817679 24133602
35905 24133602 23230170 22153940 20956445 19692103 18415177 17174788 16007987 14932840
35897 14932840 13945198 13022392 12133927 11255046 10377035 9509676 8675586 7900354 7203720
35888 7203720 6594866 6071546 5621236 5223819 4856787 4502785 4155964 3822424 3513307
35879C513307k78634k53866k45778k57819k83342l07356l11293k79218k03700
35870A092301q9059M9902J93676L25643M37315N28256O01332O57216O92241P00640
35860E189463O78710O27738N54087M66637L72709K74405J68126M8876q2422k13809
35850H084520l23780l89133l94405l37671k30718r4883M4950J65847K50296K87397
35840G062420K73302K12479J19129J5756p2918j28536j45157j29413r5375n7837
35830G053850k7747j1410j2193l1682o8053j13102j51769j66563j44895q4806
35820F241630L978J03738J95177K63761L02886L12117K92159K41572J58943M9016
35810H164977p3353j86305k70171l16331l29603l22885l08472k92047k72554k46563
$$ plain form
35879 3513307 3234673 2980807 2735029 2477210 2193868 1886512 1575219 1296001 1092301
35870 1092301 1003242 1053144 1246820 1572463 2009778 2538034 3139366 3796582 4488823 5189463
35860 5189463 5868173 6495911 7049998 7516635 7889344 8163749 8331875 8380751 8298329 8084520
35850 8084520 7760740 7371607 6977202 6639531 6408813 6313930 6358880 6524727 6775023 7062420
35840 7062420 7335722 7548201 7667330 7683086 7610168 7481632 7336475 7207062 7111687 7053850
35830 7053850 7026103 7014693 7002500 6970818 6902765 6789663 6637894 6471331 6326436 6241630
35820 6241630 6245608 6349346 6544523 6808284 7111170 7423287 7715446 7957018 8115961 8164977
35810 8164977 8091624 7905319 7635148 7318817 6989214 6666329 6357857 6065810 5793256 5546693
35800E546693k12922j74149j34254r5876o0099k9567j1695j7899n7797j32030
35790D620405k28849l26894m02392m37066m23980l69819k92845k16551j61105
35781A760904j36507j40645j62455j87584k03796k04732j91537j71734j55020
35772B06894j47482j47741j48133j40457j21933r6578p1455n1740l8804l1719
35762g89148k9540l2303m0700n4980p3176q9726r6531q6943o0073k2162J5515
35751a359767M0545M3746K3334j3261n2363q1039r3260r0916q0115o6515n2490
35740a782101l6512j4192J9571O8450J33459K12186K97426L76100M31151M47220
35730A52758M17112L44853K44055J33310L0703n1343j09424j48686j77912k02728
$$ plain form
35800 5546693 5333771 5159622 5025368 4929492 4869393 4839826 4828131 4810232 4752435 4620405
35790 4620405 4391556 4064662 3662270 3225204 2801224 2431405 2138560 1922009 1760904
35781 1760904 1624397 1483752 1321297 1133713 929917 725185 533648 361914 206894
35772 206894 59412 -88329 -236462 -376919 -498852 -595430 -666885 -718625 -757429 -789148
35762 -789148 -818688 -850991 -891691 -946671 -1019847 -1109573 -1206104 -1293047 -1353120 -1375282 -1359767
35751 -1359767 -1319222 -1275476 -1252142 -1265403 -1317766 -1398805 -1492065 -1582981 -1663096 -1729611 -1782101
35740 -1782101 -1818613 -1832805 -1813234 -1744784 -1611325 -1399139 -1101713 -725613 -294462 152758
35730 152758 569870 914723 1158778 1292088 1322791 1271448 1162024 1013338 835426 632698
35720F32698k21048k23762k00408j46761o9545J5321R0608J46902J86874K22213
35710D33092K65751L23620L91136M53833M93098M93880M50780L69576K64137J51176
35700D090079M5612m2088j06534j46927j66643j73471j79309j97551k38050l02295
35690B582823l81826m60601n19788n43047n21220m55280l56130k40756j26446
35681a022271k6063N3367J08853J38703J41544J18088P3792J9235l3442p6004
35671e04198j07681j34314j64273k04248k57003l20989l90720m57596n11627n43952
35661c596601n49189n26524m79411m14411l39717k63416j91552j26662o7825j2440
35651f567748M1625R5426J50204K08520K73360L45703M22752M97993N62266O05270
$$ plain form
35720 632698 411650 187888 -12520 -159281 -228826 -213505 -122897 24005 210879 433092
35710 433092 698843 1022463 1413599 1867432 2360530 2854410 3305190 3674766 3938903 4090079
35700 4090079 4135691 4093603 3987069 3840142 3673499 3500028 3320719 3123168 2885118 2582823
35690 2582823 2200997 1740396 1220608 677561 156341 -298939 -655069 -895825 -1022271
35681 -1022271 -1048334 -994967 -886114 -747411 -605867 -487779 -413987 -394752 -428194 -504198
35671 -504198 -611879 -746193 -910466 -1114714 -1371717 -1692706 -2083426 -2541022 -3052649 -3596601
35661 -3596601 -4145790 -4672314 -5151725 -5566136 -5905853 -6169269 -6360821 -6487483 -6555308 -6567748
35651 -6567748 -6526123 -6430697 -6280493 -6071973 -5798613 -5452910 -5030158 -4532165 -3969899 -3364629
35641c364629O18076N96704N44320M69725L83057K92588K04869J26531O4538K3928
35631d0293M766O34Q0q767l2209o7131j02418j25080j26624j05064o2097R45Q4086
35618e79172J86030L00691M16376N18207N91612O24879O10766N47795M40856K99841
35608C957881J36555l7955k13661l79737n23052o29360o87449o94138o56517n89316
35598c16749n08886m27829l53634k90966k44714k20825k23946k53309k99967l48402
35588c489227l82317l90865l71156l26602k63929j91126j16113m5437J6525O7242
35578e493005J05481J31547J47755J57816J65104J71159J75327J75260J68062
35569d095494J52160J29207J04728Q6930Q4622J05263J53125K27415L21264M22602
$$ plain form
35641 -3364629 -2746553 -2149849 -1605529 -1135804 -752747 -460159 -255290 -128759 -64221 -40293
35631 -40293 -35527 -34893 -34813 -43580 -75789 -142920 -245338 -370418 -497042 -602106 -664203 -663258 -579172
35618 -579172 -393142 -92451 323925 842132 1433744 2058623 2669389 3217184 3658040 3957881
35608 3957881 4094436 4056481 3842820 3463083 2940031 2310671 1623222 929084 272567 -316749
35598 -316749 -825635 -1253464 -1607098 -1898064 -2142778 -2363603 -2587549 -2840858 -3140825 -3489227
35588 -3489227 -3871544 -4262409 -4633565 -4960167 -5224096 -5415222 -5531335 -5576772 -5560247 -5493005
35578 -5493005 -5387524 -5255977 -5108222 -4950406 -4785302 -4614143 -4438816 -4263556 -4095494
35569 -4095494 -3943334 -3814127 -3709399 -3622469 -3537847 -3432584 -3279459 -3052044 -2730780 -2308178
35559b308178N16739N89363O29464O32266O01609N49652M92592M44173M10988
35550B558668L92231L82659L75345L62333L34492K82730K01179R0757l9061j71826
35540D769507k89072l76570m28333m46056m35369m02748l55284l01657k51462
35531A482956k12591j89141j81658j88571k06275k27405k39889k29766j87321
35522c79661j12322j4281R2153J92783K76907L37722L71926L79786L65340L36220
35512A846573L02629K75011K60439K59241K64085K62508K41759J93803J18783
35503D024831K5671p0109j51140k02567k15496j89209j32193o0855N032M8854
35493C082819O2326M6631R659l8375q8537j34915j74739k07809k36223k64342
$$ plain form
35559 -2308178 -1791439 -1202076 -572612 59654 661263 1210915 1703507 2147680 2558668
35550 2558668 2950899 3333558 3708903 4071236 4405728 4688458 4889637 4980394 4941333 4769507
35540 4769507 4480435 4103865 3675532 3229476 2794107 2391359 2036075 1734418 1482956
35531 1482956 1270365 1081224 899566 710995 504720 277315 37426 -192340 -379661
35522 -379661 -491983 -506264 -414111 -221328 55579 393301 765227 1145013 1510353 1846573
35512 1846573 2149202 2424213 2684652 2943893 3207978 3470486 3712245 3906048 4024831
35503 4024831 4050502 3980393 3829253 3626686 3411190 3221981 3089788 3028933 3033965 3082819
35493 3082819 3145145 3191776 3201435 3163060 3074523 2939608 2764869 2557060 2320837 2056495
35483B056495k98198l43284m01363m68117n33482n84527o09221n99426n52685
35474b333808m72784l68790k52302j34039k1816P8981J63591K26991K64577K73184
35464b576215K51246J98769J18555J8527q7347j81537k48327k79018k74150k41915
35454c301412j94058j41792r3827n6630l4955l0695m0925n8106p3855q3764q9599
35443d199618r7608j14991j46727j93374k49808l05649l48008l65732l52988l10860
35433f685363k47040j74204j06872n6824k8612j8013j4704p080J4259N5607J20002
35422g148844K06079L06839M10611N04349N77078O21715O35723O21701N87494
35413b677255N44549N04119M72833M49942M28074L97560L52024K91707K22546
$$ plain form
35483 2056495 1758297 1415013 1013650 545533 12051 -572476 -1181697 -1781123 -2333808
35474 -2333808 -2806592 -3175382 -3427684 -3561723 -3583539 -3504558 -3340967 -3113976 -2849399 -2576215
35464 -2576215 -2324969 -2126200 -2007645 -1989118 -2076465 -2258002 -2506329 -2785347 -3059497 -3301412
35454 -3301412 -3495470 -3637262 -3731089 -3787719 -3822674 -3853369 -3894294 -3952400 -4026255 -4110019 -4199618
35443 -4199618 -4297226 -4412217 -4558944 -4752318 -5002126 -5307775 -5655783 -6021515 -6374503 -6685363
35433 -6685363 -6932403 -7106607 -7213479 -7270303 -7298915 -7316928 -7331632 -7338712 -7324453 -7268846 -7148844
35422 -7148844 -6942765 -6635926 -6225315 -5720966 -5143888 -4522173 -3886450 -3264749 -2677255
35413 -2677255 -2132706 -1628587 -1155754 -705812 -277738 119822 471846 763553 986099
35404I86099J52344Q7462L2265r572l4163l8174k0442J6946O8619J26519J80712
35393A548615K20780K38144K28739J94616J43524Q6779L6615L888l822J6039N9897
35382B773814J18506J79621K31995K68803K88986K96436K97882K99903L05458
35373E061404L11262L07928K83326K27364J36021J3816j25296k59670l65521m25154
35363E165480m33782m01055l46896k94385k62605k61253k88247l32098l78950
35354B166209m20662m58216m97738n42550n87810o21489o29676o01668n32261
35345b725861m21941k76603j07215P1570K44391L98973N28376O29758P00401P34690
35335b23461P25538O69713N72655M48692L16279J91701Q4881j177o8396j21239
$$ plain form
35404 986099 1138443 1225905 1258170 1248598 1214435 1176261 1155819 1172765 1241384 1367903 1548615
35393 1548615 1769395 2007539 2236278 2430894 2574418 2661197 2697812 2701700 2697878 2713917 2773814
35382 2773814 2892320 3071941 3303936 3572739 3861725 4158161 4456043 4755946 5061404
35373 5061404 5372666 5680594 5963920 6191284 6327305 6341121 6215825 5956155 5590634 5165480
35363 5165480 4731698 4330643 3983747 3689362 3426757 3165504 2877257 2545159 2166209
35354 2166209 1745547 1287331 789593 247043 -340767 -962256 -1591932 -2193600 -2725861
35345 -2725861 -3147802 -3424405 -3531620 -3460050 -3215659 -2816686 -2288310 -1658552 -958151 -223461
35335 -223461 502077 1171790 1744445 2193137 2509416 2701117 2785998 2784821 2716425 2595186
35325B595186j65164k05507k45726k85687l21995l50910l71270l84405l91549
35316a27027l92266l85556l71525l50908l23335k87264k42125j89874j33863p6450
35306b880193j8278L9955R5034J40190J66559J66890J39864R2158L6281j4501
35296b036041n0289o5481n7772k7864J9852P7507J35756J86202K22542K40574
35286a355014K38338K16715J79383J31282P6287J5721n1433j26928k11272l02199
35276a189120l94232m79587n49840n97137o14524n96389n40051m47690l26724
35267e735294j87959m3104R6793K22235L26251M04998M56954M81337M77797M48073
35257c051919L97719L35563K70720K09156J52012R6886M1813r994m8020n7494
$$ plain form
35325 2595186 2430022 2224515 1978789 1693102 1371107 1020197 648927 264522 -127027
35316 -127027 -519293 -904849 -1276374 -1627282 -1950617 -2237881 -2480006 -2669880 -2803743 -2880193
35306 -2880193 -2898471 -2858516 -2763482 -2623292 -2456733 -2289843 -2149979 -2057821 -2021540 -2036041
35296 -2036041 -2086330 -2151811 -2209583 -2237447 -2217595 -2140088 -2004332 -1818130 -1595588 -1355014
35286 -1355014 -1116676 -899961 -720578 -589296 -513009 -497288 -548721 -675649 -886921 -1189120
35276 -1189120 -1583352 -2062939 -2612779 -3209916 -3824440 -4420829 -4960880 -5408570 -5735294
35267 -5735294 -5923253 -5966357 -5869564 -5647329 -5321078 -4916080 -4459126 -3977789 -3499992 -3051919
35257 -3051919 -2654200 -2318637 -2047917 -1838761 -1686749 -1589863 -1548050 -1558044 -1606064 -1663558
35247a663558k6668M6373J52247K75031L99289N14091O12149O86720P30481P37837
35237B463992P08174O46671N61894M62504L55811K48317J46267N4639k4594r3051
35227E530624j54765k14478k76353l42434m09995m69359n05356n03501m57563
35218B196820l73369k66467j55903n8168J6453O5244R2443J06381J14702J20313
35208A858449J21315J15200J03624R3453R3132J07515J34910J67985J97534K16677
35198C209794K22877K16807J99789J72555J36189R3189M6733r96m8994r5610j36881
35187D015452j67248j82510j82794j73266j61868j55304j55816j60680j64201
35178B511765j60575j46215j21184q9554n8232l4393k2571k2619k9173l3183k5628
$$ plain form
35247 -1663558 -1690226 -1643853 -1491606 -1216575 -817286 -303195 308954 995674 1726155 2463992
35237 2463992 3172166 3818837 4380731 4843235 5199046 5447363 5593630 5648269 5623675 5530624
35227 5530624 5375859 5161381 4885028 4542594 4132599 3663240 3157884 2654383 2196820
35218 2196820 1823451 1556984 1401081 1342913 1359366 1424610 1517053 1623434 1738136 1858449
35208 1858449 1979764 2094964 2198588 2292041 2385173 2492688 2627598 2795583 2993117 3209794
35198 3209794 3432671 3649478 3849267 4021822 4158011 4251200 4297933 4296937 4247943 4152333 4015452
35187 4015452 3848204 3665694 3482900 3309634 3147766 2992462 2836646 2675966 2511765
35178 2511765 2351190 2204975 2083791 1994237 1936005 1901612 1879041 1856422 1827249 1794066 1768438
35167A768438k012L5066P6787J11220J26525J13582O8535n567r9589k01577k99988
35156A691420l85076m49198m87723n00237m90063m61527m17039l56512k79533
35147b135488j88583r1236LP0608J09100J12068Q6123M4998L376k8865m8829n9133
35135b125858o4741p0260p8676r1387j08695j29799j52380j73011j89091k00762
35125c384660k10340k18976k23741k18523j98502j64277j22065p9867m2911j1755
35115d875617J6145M3351P0202R4501J12778J22621J25127J25971J33594J55130
35105c876197J92728K42619K96892L46198L81913L97099L86354L45498K72843
35096a014053J72509N7292n2507j35188j75447j69325j23927n3023K8587J08873
$$ plain form
35167 1768438 1766426 1801492 1878279 1989499 2116024 2229606 2298141 2292574 2192985 1991408 1691420
35156 1691420 1306344 857146 369423 -130814 -620877 -1082404 -1499443 -1855955 -2135488
35147 -2135488 -2324071 -2415307 -2415304 -2344696 -2235596 -2123528 -2037405 -1992407 -1989031 -2017896 -2066725 -2125858
35135 -2125858 -2190599 -2260859 -2339535 -2430922 -2539617 -2669416 -2821796 -2994807 -3183898 -3384660
35125 -3384660 -3595000 -3813976 -4037717 -4256240 -4454742 -4619019 -4741084 -4820951 -4863862 -4875617
35115 -4875617 -4859472 -4816121 -4745919 -4651418 -4538640 -4416019 -4290892 -4164921 -4031327 -3876197
35105 -3876197 -3683469 -3440850 -3143958 -2797760 -2415847 -2018748 -1632394 -1286896 -1014053
35096 -1014053 -841544 -784252 -836759 -971947 -1147394 -1316719 -1440646 -1493669 -1465082 -1356209
35086a356209J79491K35095K73112K94304L02600L03198K99798K92500K77248
35077A101137K46969J94670J17787K1635q0309j69899k30315k52259k37630j98231
35067E13555j49693j04335o7123l5727k651M1690J04221J83523K67119L35298
35057A085877L70077L63527L20399K54276J80080J07174L6597l6436j16961k05783
35047B358827k98416l86827m61844n15341n42020n40470n12945m64520m02775
35038a766331l37651k79672k35921k05875j80325j44573q4613O273J23197K50107
35028b855384L65844M53168N05335N26089N23820N04600M68782M12587L33002
35019A237843K32869J23300K1929n2473q6717p8686l9568Q577M0247L6902m967
$$ plain form
35086 -1356209 -1176718 -941623 -668511 -374207 -71607 231591 531389 823889 1101137
35077 1101137 1348106 1542776 1660563 1682198 1601889 1431990 1201675 949416 711786 513555
35067 513555 363862 259527 192404 156677 154026 195716 299937 483460 750579 1085877
35057 1085877 1455954 1819481 2139880 2394156 2574236 2681410 2718007 2681571 2564610 2358827
35047 2358827 2060411 1673584 1211740 696399 154379 -386091 -899036 -1363556 -1766331
35038 -1766331 -2103982 -2383654 -2619575 -2825450 -3005775 -3150348 -3234961 -3228688 -3105491 -2855384
35028 -2855384 -2489540 -2036372 -1531037 -1004948 -481128 23472 492254 904841 1237843
35019 1237843 1470712 1594012 1615941 1563468 1476751 1398065 1358497 1367074 1407321 1444223 1439256
35008A439256p3172j47133k07532k42074k45753k19157j67872j02146l4440K4802
34998B4779O9960R9624J14290J15415J06513R4035Q5413Q4573Q7998Q5003O3062
34987A030665J5068n6463j40958k25279k98502l53008l83377l86858l66635l34167
34977a499514l05781k93989l00282l16031l30755l40110l46707l53947l59302
34968d446418l53665l27971k82016k27475j81361j54315j43139j33039j06582
34959f355981n2097L2476J39425K53096L53797M23565M51592M36459L84764L08184
34949c624720K21188J39827Q0191N5346P1340J24813K03998K92455L73258M32253
34939a630051M60511M55881M22824L70213L08249K45886J89207J40596R8788N9911
$$ plain form
35008 1439256 1366084 1218951 1011419 769345 523592 304435 136563 34417 -23 24779
34998 24779 94739 194363 308653 424068 530581 624616 710029 794602 882600 967603 1030665
34987 1030665 1045733 989270 848312 623033 324531 -28477 -411854 -798712 -1165347 -1499514
34977 -1499514 -1805295 -2099284 -2399566 -2715597 -3046352 -3386462 -3733169 -4087116 -4446418
34968 -4446418 -4800083 -5128054 -5410070 -5637545 -5818906 -5973221 -6116360 -6249399 -6355981
34959 -6355981 -6408078 -6375602 -6236177 -5983081 -5629284 -5205719 -4754127 -4317668 -3932904 -3624720
34949 -3624720 -3403532 -3263705 -3183514 -3128168 -3056828 -2932015 -2728017 -2435562 -2062304 -1630051
34939 -1630051 -1169540 -713659 -290835 79378 387627 633513 822720 963316 1062104 1122015
34929A122015J9184k7151p9728j34410j82458k13404k19632k00334j62595j18788
34919a97301q0830n3988l3996r934K8625Q4779J51811K16136K63599K85787K83174
34908I37862K63695K38106K15298J99803J91360J85450J74754J52093J13967O1923
34898B734311L26o7399j39992k15734k89192l51492l94530m15291m16527m03838
34888D0642l82121l53987l20584k83873k48893k24170k18910k37517k74667l14789
34878b818869l37409l25940k74885j91310q9969J4283J11619J96900K65466L09706
34868c140408L20236K91277K26309J39606N2237j5533n1686n6280m0236k0056
34858b294534j1082k2060n2679r4664j35989j66272j80532j79421j66866j47650
$$ plain form
34929 1122015 1141199 1114048 1034320 899910 717452 504048 284416 84082 -78513 -197301
34919 -197301 -278131 -332119 -366115 -376049 -347424 -262645 -110834 105302 368901 654688 937862
34908 937862 1201557 1439663 1654961 1854764 2046124 2231574 2406328 2558421 2672388 2734311
34898 2734311 2734637 2667238 2527246 2311512 2022320 1670828 1276298 861007 444480 40642
34888 40642 -341479 -695466 -1016050 -1299923 -1548816 -1772986 -1991896 -2229413 -2504080 -2818869
34878 -2818869 -3156278 -3482218 -3757103 -3948413 -4038382 -4024099 -3912480 -3715580 -3450114 -3140408
34868 -3140408 -2820172 -2528895 -2302586 -2162980 -2110743 -2126276 -2177962 -2234242 -2274478 -2294534
34858 -2294534 -2305616 -2327676 -2380355 -2475019 -2611008 -2777280 -2957812 -3137233 -3304099 -3451749
34848c451749j26297j06422q9492p3595n3451k1906K7948J00666J96526L10116
34838c287656M30055N40241O22522O60791O45991N80246M77213L57528K41397
34829A268328J42527O6232J1551k5009m6267n2805m3290j6351K7387Q4676J50613
34818A567592K19481K84060L34608L60209L52914L11860K44215J62655Q1569J3617
34808C932780l2912n5811n8966n0528m0193l6907m7289p4433j16956j69027k22024
34797C027734k67459k99387l14862l12757k92981k57260k10191j58480j08165
34788H06192o2022j9333K1995O2795J01488J34937J60263J75770J80371J72806
34778A735262J52357J20772Q3280M7146J8732J489l908J828J7536M1287O9485
$$ plain form
34848 -3451749 -3578046 -3684468 -3773960 -3847555 -3901006 -3922912 -3894964 -3794298 -3597772 -3287656
34838 -3287656 -2857601 -2317360 -1694838 -1034047 -388056 192190 669403 1026931 1268328
34829 1268328 1410855 1477087 1488638 1463629 1417362 1364557 1321267 1304916 1332303 1416979 1567592
34818 1567592 1787073 2071133 2405741 2765950 3118864 3430724 3674939 3837594 3919163 3932780
34808 3932780 3899868 3844057 3785091 3734563 3694370 3657463 3610174 3535741 3418785 3249758 3027734
34797 3027734 2760275 2460888 2146026 1833269 1540288 1283028 1072837 914357 806192
34788 806192 744170 724837 746832 809627 911115 1046052 1206315 1382085 1562456 1735262
34778 1735262 1887619 2008391 2091671 2138817 2157549 2159038 2155130 2156958 2174494 2215781 2285266
34767B285266R6656J16207J21285J05042O0994j5223j23116k55705m00692n43728
34757A446986o71326p71838q34880q51040q13511p21718n84922m22938k62068
34748d487255j27004l1981K4353N7031Q5931J24878J75473K29131K74658L05195
34738c369590L20390L24435L23002L21299L23341L31385L44952L60071L69950
34729c50765L67557L48649L12864K62125J98209J22190L6444n2918j35927k01871
34719I06557k43999k62712k64964k59906k53667k46763k35779k17249j90426j57016
34709a425924j19053p7205l0953J9473P0854J16407J48343J62415J60609J48988
34699h26046J32233J10164P9616L9706m598m3738o8688p6480p3018p1242q5350
$$ plain form
34767 2285266 2381922 2498129 2619414 2724456 2785450 2770227 2647111 2391406 1990714 1446986
34757 1446986 775660 3822 -831058 -1682098 -2495609 -3217327 -3802249 -4225187 -4487255
34748 -4487255 -4614259 -4646240 -4621887 -4564856 -4478925 -4354047 -4178574 -3949443 -3674785 -3369590
34738 -3369590 -3049200 -2724765 -2401763 -2080464 -1757123 -1425738 -1080786 -720715 -350765
34729 -350765 16792 365441 678305 940430 1138639 1260829 1297273 1244355 1108428 906557
34719 906557 662558 399846 134882 -125024 -378691 -625454 -861233 -1078482 -1268908 -1425924
34709 -1425924 -1544977 -1622182 -1653135 -1633662 -1562808 -1446401 -1298058 -1135643 -975034 -826046
34699 -826046 -693813 -583649 -504033 -464327 -468925 -512663 -581351 -657831 -730849 -802091 -887441
34688h87441j24174j87732k68337l54160m32096m89009n12854m95286m35282l41517
34678d527888k31159j24627l8563J9132M9408N8131N1512L4064R292j8808m5157
34667d764663o4072p0167n9228k8989K0315Q5652J60899K36678L01084L42041
34657c840450L50551L23163K62500J76573P7970j7240r2402j35150j41855j17953
34647c154293p3358j6481M7994J16245J81322K33252K63959K72508K65996K55718
34637a607138K52068K61217K84352L18793L60274M05163M50988M94753N30671
34628A751141N49698N41675M98845M19043L07361J75314L7169r4997k14415l18813
34618C652021m06950m75896n21032n37883n23933m79880m10875l27523k45062
$$ plain form
34688 -887441 -1011615 -1199347 -1467684 -1821844 -2253940 -2742949 -3255803 -3751089 -4186371 -4527888
34678 -4527888 -4759047 -4883674 -4922237 -4903105 -4853697 -4795566 -4744054 -4709990 -4700698 -4719506 -4764663
34667 -4764663 -4828735 -4898902 -4958130 -4987119 -4966804 -4881152 -4720253 -4483575 -4182491 -3840450
34657 -3840450 -3489899 -3166736 -2904236 -2727663 -2649693 -2666933 -2759335 -2894485 -3036340 -3154293
34647 -3154293 -3227651 -3244132 -3196138 -3079893 -2898571 -2665319 -2401360 -2128852 -1862856 -1607138
34637 -1607138 -1355070 -1093853 -809501 -490708 -130434 274729 725717 1220470 1751141
34628 1751141 2300839 2842514 3341359 3760402 4067763 4243077 4280246 4185249 3970834 3652021
34618 3652021 3245071 2769175 2248143 1710260 1186327 706447 295572 -31951 -277013
34609b77013j79530j41997j34247j48864j73542j95991k06360j97666j67021j18018
34599a940249o1116r662K5776M0053L1943J906m8010j13145j86202k58063l18114
34588b834883l54732l58066l24890k62071j85403j14066o4020m3602n2737q5279
34578d679749j32827j87717k43450k92536l24054l24051k79770j85205m3837J33170
34568f560026L30911N33116P22093Q78712R84987J028839J008071R30871Q12535
34559F70109O70400N19750L72349K37176J21602L1229l1883p1362r6850j21261
34549B301259j55838k05826k69011l37088l98382m40878m55332m37539l88386
34540g87021l11938k13848j02110J0969J08852J74776J98003J78456J26776N9957
$$ plain form
34609 -277013 -456543 -598540 -732787 -881651 -1055193 -1251184 -1457544 -1655210 -1822231 -1940249
34599 -1940249 -2001365 -2011027 -1985251 -1945198 -1913255 -1911349 -1959359 -2072504 -2258706 -2516769 -2834883
34588 -2834883 -3189615 -3547681 -3872571 -4134642 -4320045 -4434111 -4498131 -4541733 -4594470 -4679749
34578 -4679749 -4812576 -5000293 -5243743 -5536279 -5860333 -6184384 -6464154 -6649359 -6693196 -6560026
34568 -6560026 -6229115 -5695999 -4973906 -4095194 -3110207 -2081368 -1073297 -142426 670109
34559 670109 1340509 1860259 2232608 2469784 2591386 2622615 2590732 2519370 2422520 2301259
34549 2301259 2145421 1939595 1670584 1333496 935114 494236 38904 -398635 -787021
34540 -787021 -1098959 -1312807 -1414917 -1403948 -1295096 -1120320 -922317 -743861 -617085 -557128
34530e57128m501n2766p6360p2690m5655n388L4630O2869P4833P5103P5441R0011
34518d01601J29513J96314K82911L75010M57781N21296N61766N78904N73033N44723
34508C819650M96114M31361L55399K72784J87931J05716L0860l3552q6446j27292
34498E452525j54187j63671j53023j23753q3549m4293j6707n255p339j6867k8806
34487D655075m1448n6084p5485j01884j34688j69097j97097k10769k06054j84965
34477C277504j55491j29160j17210j26954j60187k13971k82458l58249m33144
34468A300680m99099n49799n82349n97826n99784n90960n70414n33894m77937
34459c701382m04703l23401k46849j85621j43490j16329r4311o6180k3957L3636
$$ plain form
34530 -557128 -561629 -614395 -690755 -763445 -809100 -814488 -779858 -716989 -642156 -567053 -491612 -401601
34518 -401601 -272088 -75774 207137 582147 1039928 1561224 2122990 2701894 3274927 3819650
34508 3819650 4315764 4747125 5102524 5375308 5563239 5668955 5699815 5666263 5579817 5452525
34498 5452525 5298338 5134667 4981644 4857891 4774342 4730049 4713342 4708087 4700748 4683881 4655075
34487 4655075 4613627 4557543 4482058 4380174 4245486 4076389 3879292 3668523 3462469 3277504
34477 3277504 3122013 2992853 2875643 2748689 2588502 2374531 2092073 1733824 1300680
34468 1300680 801581 251782 -330567 -928393 -1528177 -2119137 -2689551 -3223445 -3701382
34459 -3701382 -4106085 -4429486 -4676335 -4861956 -5005446 -5121775 -5216086 -5282266 -5306223 -5272587
34449e272587J00528J65832K18354K50857K62277K57284K43492K27439K11134
34440c335390J91432J63048J23325P5212K6494j3310l5842l5601j1243L3324Q9175
34429b729376J44816J89979K19031K32588K37025K41956K56483K85605L28353
34420e93540L78403M27005M66656M93122N04053M95583M61012L94527K97922J84524
34410C509267P6162n540m8203n3260l4324j1040j295j4604m8877r1720j26035
34399C150531j37613j20979q0521k7048K7099P1153R6560R7032O9932J8740m5886
34388C119000j08510j54275j74022j66194j35057q7175k8399L7667J09528J86317
34378B598880K65765L43071M11426M63638M93551M96897M71955M20073L45188
$$ plain form
34449 -5272587 -5172059 -5006227 -4787873 -4537016 -4274739 -4017455 -3773963 -3546524 -3335390
34440 -3335390 -3143958 -2980910 -2857585 -2782373 -2755879 -2769189 -2805031 -2840632 -2851875 -2818551 -2729376
34429 -2729376 -2584560 -2394581 -2175550 -1942962 -1705937 -1463981 -1207498 -921893 -593540
34420 -593540 -215137 211868 678524 1171646 1675699 2171282 2632294 3026821 3324743 3509267
34410 3509267 3585429 3579889 3531686 3478426 3444102 3433062 3431767 3417163 3368286 3276566 3150531
34399 3150531 3012918 2891939 2811418 2784370 2811469 2882622 2979182 3076214 3146146 3164886 3119000
34388 3119000 3010490 2856215 2682193 2515999 2380942 2293767 2265368 2303035 2412563 2598880
34378 2598880 2864645 3207716 3619142 4082780 4576331 5073228 5545183 5965256 6310444
34369F310444K52030J44203K4153j04382k33346l49781m39081m90684n02896m84227
34359D126433m50399m18495m00937m02156m19183m44853m70880m89239m92450
34350A37841m74253m31063l63612k78133j86437j04011m5788k1054l0133o4366
34340a861009j08864j46740j64009j54153j20413p4279l0823l230J513j5134m3616
34329b720757o9816q0743o9698l8159N985N2249R1355J17639J29135J25564J05970
34318b351276O8354J1931n9951j38745k12363k68740k99904l05216k91812k71192
34308d118914k53420k42801k37699k33422k24708k06320j73337j22924n6789J8159
34298e852175R1790J53759J96065K15134K13692K00963J89497J89498K04377K30403
$$ plain form
34369 6310444 6562474 6706677 6730830 6626448 6393102 6043321 5604240 5113556 4610660 4126433
34359 4126433 3676034 3257539 2856602 2454446 2035263 1590410 1119530 630291 137841
34350 137841 -336412 -767475 -1131087 -1409220 -1595657 -1699668 -1745456 -1766510 -1796643 -1861009
34340 -1861009 -1969873 -2116613 -2280622 -2434775 -2555188 -2629467 -2660290 -2663520 -2662007 -2677141 -2720757
34329 -2720757 -2790573 -2871316 -2941014 -2979173 -2973188 -2920939 -2829584 -2711945 -2582810 -2457246 -2351276
34318 -2351276 -2282922 -2270991 -2330942 -2469687 -2682050 -2950790 -3250694 -3555910 -3847722 -4118914
34308 -4118914 -4372334 -4615135 -4852834 -5086256 -5310964 -5517284 -5690621 -5813545 -5870334 -5852175
34298 -5852175 -5760385 -5606626 -5410561 -5195427 -4981735 -4780772 -4591275 -4401777 -4197400 -3966997
34288c966997K59987K85656L02534L09054L06261K96190K80249K59003K33601
34279a434462K07385J85863J74907J78400J96361K23812K51082K66612K61781
34270E11741K34954J91581J40193Q7624L6935j1279n6291r5615j25267j41472
34260G73104j42960j32647j17603j06948j08458j25283j54212j86558k11668k21741
34250g34974k15395j98097j79422j68582j70138j81567j94020j96330j80159j43173
34240b561857q8555k1913N1818J29406K07852K81611L40947L73626L69749L26670
34230e90646K50472J53238M8639n1168j36598k01105k42528k64706k77002k90095
34220a601499l09556l31357l42738l28093k76480j87196p1523M9717J51977K13965
$$ plain form
34288 -3966997 -3707010 -3421354 -3118820 -2809766 -2503505 -2207315 -1927066 -1668063 -1434462
34279 -1434462 -1227077 -1041214 -866307 -687907 -491546 -267734 -16652 249960 511741
34270 511741 746695 938276 1078469 1166093 1203028 1191749 1135458 1039843 914576 773104
34260 773104 630144 497497 379894 272946 164488 39205 -115007 -301565 -513233 -734974
34250 -734974 -950369 -1148466 -1327888 -1496470 -1666608 -1848175 -2042195 -2238525 -2418684 -2561857
34240 -2561857 -2650412 -2672325 -2620507 -2491101 -2283249 -2001638 -1660691 -1287065 -917316 -590646
34230 -590646 -340174 -186936 -138297 -189465 -326063 -527168 -769696 -1034402 -1311404 -1601499
34220 -1601499 -1911055 -2242412 -2585150 -2913243 -3189723 -3376919 -3448442 -3398725 -3246748 -3032783
34210c032783K23338J79772R5590o307r8378j57576j73493j50576j03439m9109
34200c272961q91L4165N4864O3815O5010O2383N9858O1928P3215R6525J30540
34189b571549J68804K01142K17736K14526J96840J78193J73962J93497K35700
34180g91149K90329L43112L80490L91799L69887L12326K23015J11665j0016j32971
34170A488487k52108l63006m57208n20922n39254n03806m18721l00857j73860
34161b041255n9977K5322P3944Q2972N2707j3815j10551k28191l54038m72004
34151c044886n63476o10078n98412n25046l98593k37338o4024R8635K30656L17806
34141e394756L56235L55974L38783L29980L49001M03984M91761O01004P15908
$$ plain form
34210 -3032783 -2809445 -2629673 -2534083 -2540390 -2638768 -2796344 -2969837 -3120413 -3223852 -3272961
34200 -3272961 -3273852 -3239687 -3184823 -3121008 -3055998 -2993615 -2933757 -2871829 -2798614 -2702089 -2571549
34189 -2571549 -2402745 -2201603 -1983867 -1769341 -1572501 -1394308 -1220346 -1026849 -791149
34180 -791149 -500820 -157708 222782 614581 984468 1296794 1519809 1631474 1621458 1488487
34170 1488487 1236379 873373 416165 -104757 -644011 -1147817 -1566538 -1867395 -2041255
34161 -2041255 -2101232 -2075910 -2001966 -1918994 -1866287 -1880102 -1990653 -2218844 -2572882 -3044886
34151 -3044886 -3608362 -4218440 -4816852 -5341898 -5740491 -5977829 -6041853 -5943218 -5712562 -5394756
34141 -5394756 -5038521 -4682547 -4343764 -4013784 -3664783 -3260799 -2769038 -2168034 -1452126
34132a452126Q19074Q93745R25974R07191Q36150P18767N65600L88921K01628
34123D804924J8039j45409k71676l47197l66897l36893k72163j89549j00486q460
34113B784233Q7755J88341K88602L79028M48567M89173M99053M82646M47550M01109
34103F496057L48926K94632K38874J77835J04532J4318q9026j92591k80860l44608
34093F768089l85123m10958m30489m45908m51912m38410l94757l13598j93724
34084C303210m1588J29320L01180M55045N72653O36951O33840N56557M10906K17025
34074G175099N261j92591l52468m63306n26283n49337n41055n07892m55426l90940
34064C201062l24127k65085k20965j93435j78353j67988j54449j32224r8756n3878
$$ plain form
34132 -1452126 -633052 260693 1186667 2093858 2930008 3648775 4214375 4603296 4804924
34123 4804924 4822963 4677554 4405878 4058681 3691784 3354891 3082728 2893179 2792693 2784233
34113 2784233 2871988 3060329 3348931 3727959 4176526 4665699 5164752 5647398 6094948 6496057
34103 6496057 6844983 7139615 7378489 7556324 7660856 7675174 7586148 7393557 7112697 6768089
34093 6768089 6382966 5972008 5541519 5095611 4643699 4205289 3810532 3496934 3303210
34084 3303210 3261622 3390942 3692122 4147167 4719820 5356771 5990611 6547168 6958074 7175099
34074 7175099 7180360 6987769 6635301 6171995 5645712 5096375 4555320 4047428 3592002 3201062
34064 3201062 2876935 2611850 2390885 2197450 2019097 1851109 1696660 1564436 1465680 1411802
34054A411802L79N9430J16269J62874J92571K02501J95196J78241J61612J54009
34044B834884J60442J82167K17629K62279L07336L39771L45525L14939K47050
34035E212022J50086L8599p0507j61452k22423k47763k38503k00569j41756o9559
34025D048175R010Q6351J53367J99783K15903J95260J36979M6912o2683j74908
34015D854149k71841l40073l76133l88359l93308m08317m44137n00888n68563
34006A162530o31518o74863o89408o72583o25728n51316m53098l38702k21002
33997c695688j15750l6508R790K4511J6213k564k0125l0420l4707l8213m4181
33986c967642n0329n0398l8726j3741K1767O2792J04631J43852J77063J98787
$$ plain form
34054 1411802 1412181 1471611 1587880 1750754 1943325 2145826 2341022 2519263 2680875 2834884
34044 2834884 2995326 3177493 3395122 3657401 3964737 4304508 4650033 4964972 5212022
34035 5212022 5362108 5400707 5330200 5168748 4946325 4698562 4460059 4259490 4117734 4048175
34025 4048175 4057185 4143536 4296903 4496686 4712589 4907849 5044828 5091740 5029057 4854149
34015 4854149 4582308 4242235 3866102 3477743 3084435 2676118 2231981 1731093 1162530
34006 1162530 531012 -143851 -833259 -1505842 -2131570 -2682886 -3135984 -3474686 -3695688
33997 -3695688 -3811438 -3847946 -3838156 -3813645 -3797432 -3799996 -3820121 -3850541 -3885248 -3923461 -3967642
33986 -3967642 -4017971 -4068369 -4107095 -4120836 -4099069 -4036277 -3931646 -3787794 -3610731 -3411944
33976c411944K01650J80617J38854Q9901N2928M3326O4645J06778J50950J78196
33966b204099J76840J46143R5815M2155J625j6651j5850r752j3863l4778o5209
33955a897624q7990q5561m8565K0593J09151J98172K67630L01642K93123K46467
33945f82962J76291J01665L8269o995l5670n2925o2619o5528o0592m7021k6277
33934g24364l823J0101K596l6746j10382k10814l23192m30408n17626n74728n96914
33923c516300n84389n41628m76428l98508l17502k40621j70829j06440m2441K7107
33913f367979J06491J96274K92334L86474M68634N29650N63313N67162N42526
33904b715121M94101M28713L53323K73448J93195J16511M7921q315m9905p7711
$$ plain form
33976 -3411944 -3210294 -3029677 -2890823 -2800922 -2747994 -2704668 -2640023 -2533245 -2382295 -2204099
33966 -2204099 -2027259 -1881116 -1785301 -1743146 -1741521 -1758172 -1774022 -1783774 -1797637 -1832415 -1897624
33955 -1897624 -1985614 -2071175 -2119740 -2099147 -1989996 -1791824 -1524194 -1222552 -929429 -682962
33945 -682962 -506671 -405006 -366737 -373732 -409402 -462327 -524946 -590474 -651066 -698087 -724364
33934 -724364 -728187 -718086 -715490 -752236 -862618 -1073432 -1396624 -1827032 -2344658 -2919386 -3516300
33923 -3516300 -4100689 -4642317 -5118745 -5517253 -5834755 -6075376 -6246205 -6352645 -6395086 -6367979
33913 -6367979 -6261488 -6065214 -5772880 -5386406 -4917772 -4388122 -3824809 -3257647 -2715121
33904 -2715121 -2221020 -1792307 -1438984 -1165536 -972341 -855830 -807909 -816224 -866129 -943840
33894i43840r5657j09371j23954j41797j61684j79783j91839j95149j89419j76635
33884b509128j60456j45347j35326j32301j34745j37834j35311j21752r3644m9322
33874c755166J0940Q4241J64928K45774L19315L78110M14394M20939L93373L32476
33864i90676K44643J40223L0536p4798j68951k47175l05837l42671l57762l53245
33854b425713l31305k92456k36458j65562q7014j1689N1408J01281J46708K01386
33844c049414K75349L68497M69890N62325O29019O59362O51294O09292N39689
33835A715303M47548L37764K18629J03292O909n8327q6630p9216m3465P944N8480
33824B628231R1397R5202O7760J5675n0633j21927j91735k54839l05498l37062
$$ plain form
33894 -943840 -1039497 -1148868 -1272822 -1414619 -1576303 -1756086 -1947925 -2143074 -2332493 -2509128
33884 -2509128 -2669584 -2814931 -2950257 -3082558 -3217303 -3355137 -3490448 -3612200 -3705844 -3755166
33874 -3755166 -3744226 -3659985 -3495057 -3249283 -2929968 -2551858 -2137464 -1716525 -1323152 -990676
33864 -990676 -746033 -605810 -575274 -650072 -819023 -1066198 -1372035 -1714706 -2072468 -2425713
33854 -2425713 -2757018 -3049474 -3285932 -3451494 -3538508 -3550197 -3498789 -3397508 -3250800 -3049414
33844 -3049414 -2774065 -2405568 -1935678 -1373353 -744334 -84972 566322 1175614 1715303
33835 1715303 2162851 2500615 2719244 2822536 2829445 2771118 2684488 2605272 2561807 2569751 2628231
33824 2628231 2719628 2814830 2882590 2898265 2847632 2725705 2533970 2279131 1973633 1636571
33814A636571l42700l16766k57020j67085n7563N5367J53365K20111K45116K26300
33804A395696J70352R0540K700p8843j43923j87023k06337k02746j79377j40864
33794E20175r1315l2025L8445J20718K09918K93659L54511L75554L46033K64743
33784B400416J40218j1721j71608l19779m39040n16749n46679n30358m77007m01250
33774h73557l18817k41832j75781j19401o7394j4639L9885R1443J31331J51493
33764a397269J49616J31658J09852R6740R8684J13247J32515J49718J63981J79665
33754g1593K01072K26485K45737K43788K09079J41706N5700k6609q4579j07654
33744A033132r8232o8530l3601m163J6766L1857M4392N4270N7437M7759J9592
$$ plain form
33814 1636571 1293871 977105 720085 553000 495437 550804 704169 924280 1169396 1395696
33804 1395696 1566048 1656588 1659288 1580445 1436522 1249499 1043162 840416 661039 520175
33794 520175 428860 396835 435280 555998 765916 1059575 1414086 1789640 2135673 2400416
33784 2400416 2540634 2528913 2357305 2037526 1598486 1081737 535058 4700 -472307 -873557
33774 -873557 -1192374 -1434206 -1609987 -1729388 -1796782 -1811421 -1771536 -1680093 -1548762 -1397269
33764 -1397269 -1247653 -1115995 -1006143 -909403 -810719 -697472 -564957 -415239 -251258 -71593
33754 -71593 129479 355964 601701 845489 1054568 1196274 1251974 1225365 1140786 1033132
33744 1033132 934900 866370 832769 828606 845372 877229 921621 975891 1033328 1081087 1100679
33733A100679l0079j00338j86127k78965l67871m40486m85047m93598m65324m07930
33723b155086l35609k63797k02967j54793j12898o7413j0760N7741J29482J87802
33713b928298K13738J94781J31584L8281o3305j51284k09511k30621k16753j77709
33703c399097j26660p5171l0174O111L4380N6381P3834Q7996R9569J08882J16418
33692c047531J23552J32933J48001J71489K03513K40408K75128K99144L05196
33683a148167K89987K56114K12223J70697J43162J35903J47907J72798K03250
33674E83874K34769K66491K99375L33861L68695M00627M23951M30183M09471L54389
33664D105686K64207J46630J5923j11123k19142k96891l38695l44944l21400k77098
$$ plain form
33733 1100679 1070600 970262 784135 505170 137299 -303187 -788234 -1281832 -1747156 -2155086
33723 -2155086 -2490695 -2754492 -2957459 -3112252 -3225150 -3292563 -3303323 -3245582 -3116100 -2928298
33713 -2928298 -2714560 -2519779 -2388195 -2349914 -2413219 -2564503 -2774014 -3004635 -3221388 -3399097
33703 -3399097 -3525757 -3600928 -3631102 -3624991 -3590611 -3534230 -3460396 -3372400 -3272831 -3163949 -3047531
33692 -3047531 -2923979 -2791046 -2643045 -2471556 -2268043 -2027635 -1752507 -1453363 -1148167
33683 -1148167 -858180 -602066 -389843 -219146 -75984 59919 207826 380624 583874
33674 583874 818643 1085134 1384509 1718370 2087065 2487692 2911643 3341826 3751297 4105686
33664 4105686 4369893 4516523 4532446 4421323 4202181 3905290 3566595 3221651 2900251 2623153
33654B623153k21079j59623r6150l4329J8192M9397M7252O064o9531j65353k62419
33643A735574l42947l94694m11901l93509l41144k58904j54324l8295P7102J81400
33633c41642K67342L31187L72605L94490M01899L99938L91623L77060L54052L19220
33623C267774K69143K01856J18662K4859p2106j66436k56706l45081m33716n21426
33613B086823o02799o69422p11909p22548o98860o46583n79259n13137m60057
33604c517751m23050l97117l73636l44887l06428k57170j98086j30771n6798K1802
33594e983892J01765J78450K46494L00747L37436L55713L58817L53433L46984
33585c404053L44744L48787L58600L71587L82588L83680L66001L23542K56836
$$ plain form
33654 2623153 2402074 2242451 2146301 2111972 2130164 2179561 2226813 2232877 2163346 1997993 1735574
33643 1735574 1392627 997933 586032 192523 -148621 -407525 -561849 -600144 -523042 -341642
33633 -341642 -74300 256887 629492 1023982 1425881 1825819 2217442 2594502 2948554 3267774
33623 3267774 3536917 3738773 3857435 3882294 3810188 3643752 3387046 3041965 2608249 2086823
33613 2086823 1484024 814602 102693 -619855 -1318715 -1965298 -2544557 -3057694 -3517751
33604 -3517751 -3940801 -4337918 -4711554 -5056441 -5362869 -5620039 -5818125 -5948896 -6005694 -5983892
33594 -5983892 -5882127 -5703677 -5457183 -5156436 -4819000 -4463287 -4104470 -3751037 -3404053
33585 -3404053 -3059309 -2710522 -2351922 -1980335 -1597747 -1214067 -848066 -524524 -267688
33576b67688J74173Q9501J8093k8130m4119l3011m924K6498M8784N5179M7593
33565H1949L6213L4826N3184R0821J36554J74058J89764J78916J47621J10443
33555A234349Q3959P8887R5277J23730J51137J66756J65962J51320J30726J12632
33545B494735J00513R0666P5165M7196M459n0905j14086j79285k41035k95410
33535A932013l40602l76215m01800m16024m17171m04337l78145l40567k94255
$$ plain form
33576 -267688 -93515 -4014 14079 -14051 -58170 -91181 -96105 -69607 -20823 34356 81949
33565 81949 118162 152988 206172 296993 433547 607605 797369 976285 1123906 1234349
33555 1234349 1318308 1397195 1492472 1616202 1767339 1934095 2100057 2251377 2382103 2494735
33545 2494735 2595248 2685914 2761079 2808275 2812734 2761829 2647743 2468458 2227423 1932013
33535 1932013 1591411 1215196 813396 397372 -19799 -424136 -802281 -1142848 -1437103
$$ [...]
##END NTUPLES=NMR SPECTRUM
##END=
