##TITLE=31Pdec_B3e-N2
 CDCl3
  24 sc
 23.11.2023
##JCAMPDX= 6.0         $$ Bruker NMR JCAMP-DX V2.0
##DATA TYPE= NMR SPECTRUM
##DATA CLASS= NTUPLES
##ORIGIN= UXNMR, Bruker Analytische Messtechnik GmbH
##OWNER= root
$$ XWIN-NMR		Version 3.5
$$ Thu Nov 23 14:56:45 2023 Russian Standard Time (UT+4h)  she@DPX200
##.OBSERVE FREQUENCY= 81.013821
##.OBSERVE NUCLEUS= ^31P
##.ACQUISITION MODE= SIMULTANEOUS
##.ACQUISITION SCHEME= undefined
##.AVERAGES= 24
##.DIGITISER RES= 16
##SPECTROMETER/DATA SYSTEM= spect
##.PULSE SEQUENCE= zgpg30
##.SOLVENT NAME= CDCl3
##.SHIFT REFERENCE= (INTERNAL, CDCl3, 0, 248.564)
##AUDIT TRAIL= $$ (NUMBER, WHEN, WHO, WHERE, WHAT)
$$ ##TITLE= Audit trail, XWIN-NMR		Version 3.5
$$ ##JCAMPDX= 5.01
$$ ##ORIGIN= Bruker BioSpin GmbH
$$ ##OWNER= she
$$ F:/spectra/data/she/nmr/P31/1/pdata/1/auditp.txt
$$ ##AUDIT TRAIL=  $$ (NUMBER, WHEN, WHO, WHERE, WHAT)
(   1,<2023-11-23 14:55:52.35 +0400>,<she>,<DPX200>,
      <created by zg, POWCHK disabled, PULCHK disabled
       configuration hash MD5:
       00 E9 B6 7A A2 85 ED C7 34 08 36 98 17 FE 4E 26
       data hash MD5: 32K
       FC A1 AB 03 D8 E3 D7 D1 C2 7B A7 08 2D 7B AD B3>)
(   2,<2023-11-23 14:55:54.46 +0400>,<she>,<DPX200>,
      <Start of raw data processing
       efp BC_mod = 2 LB = 10 FT_mod = 6 PKNL = 1 PHC0 = -11344.07 PHC1 = -23.5066 SI = 64K 
       data hash MD5: 64K
       5F 80 99 11 F8 E6 19 BC 81 4D 2E 6B AC 47 2D 5C>)
(   3,<2023-11-23 14:56:08.85 +0400>,<she>,<DPX200>,
      <pk PHC0 = 15.53096 PHC1 = 0 
       data hash MD5: 64K
       93 B8 5A BC 8E 5B 53 B4 EC 22 56 CD 5E E9 26 F2>)
(   4,<2023-11-23 14:56:15.09 +0400>,<she>,<DPX200>,
      <abs ABSG = 5 
       data hash MD5: 64K
       CF 76 5A 8B 17 41 90 8E 40 E1 DA 1F CD 44 A1 B9>)
$$ ##END=
$$ 
$$ hash MD5
$$ 88 C9 A5 8E 21 96 C9 E2 36 C3 45 22 81 E1 19 89
##$RELAX= 
##$RELAX= 
##$RELAX= 
##$RELAX= 
##$RELAX= 
##$RELAX= 
##$RELAX= 
##$RELAX= 
##$RELAX= 
$$ Bruker specific parameters
$$ --------------------------
##$DU= <F:/spectra>
##$EXPNO= 1
##$NAME= <P31>
##$PROCNO= 1
##$TYPE= <nmr>
##$USER= <she>
##$AMP= (0..31)
100 100 100 100 100 100 100 100 100 100 100 100 100 100 100 100 100 100 
100 100 100 100 100 100 100 100 100 100 100 100 100 100 
##$AQSEQ= 0
##$AQ_mod= 1
##$AUNM= <au_zg>
##$AUTOPOS= <>
##$BF1= 81.014009
##$BF2= 200.13
##$BF3= 200.13
##$BF4= 200.13
##$BF5= 200.13
##$BF6= 200.13
##$BF7= 200.13
##$BF8= 200.13
##$BYTORDA= 1
##$CFDGTYP= 0
##$CFRGTYP= 5
##$CHEMSTR= <none>
##$CNST= (0..31)
1 1 145 1 1 1 1 1 1 1 1 1 1 1 1 1 1 1 1 1 1 1 1 1 1 1 1 1 1 1 1 1 
##$CPDPRG= <waltz16>
##$CPDPRG1= <>
##$CPDPRG2= <waltz16>
##$CPDPRG3= <>
##$CPDPRG4= <mlev>
##$CPDPRG5= <mlev>
##$CPDPRG6= <mlev>
##$CPDPRG7= <mlev>
##$CPDPRG8= <mlev>
##$CPDPRGB= <>
##$CPDPRGT= <>
##$D= (0..31)
0 1 0 0 0 0 0 0 0 0 0 0.03 2e-05 3e-06 0 0 0 0 0 0 0 0 0 0 0 0 0 0 0 0 
0 0 
##$DATE= 1700736951
##$DBL= (0..7)
120 120 120 11 120 120 24 19 
##$DBP= (0..7)
150 150 150 150 150 150 150 150 
##$DBP07= 0
##$DBPNAM0= <>
##$DBPNAM1= <>
$$ [...]
##$SUBNAM3= <"">
##$SUBNAM4= <"">
##$SUBNAM5= <"">
##$SUBNAM6= <"">
##$SUBNAM7= <"">
##$SUBNAM8= <"">
##$SUBNAM9= <"">
##$SW= 501.771253377433
##$SWIBOX= (0..15)
0 1 3 0 0 0 0 0 0 0 0 0 0 0 0 0 
##$SW_h= 40650.406504065
##$TD= 32768
##$TD0= 1
##$TE= 0
##$TE2= 300
##$TE3= 300
##$TEG= 300
##$TL= (0..7)
0 120 53 12 22 120 120 120 
##$TP= (0..7)
150 150 150 150 150 150 150 150 
##$TP07= 0
##$TPNAME0= <>
##$TPNAME1= <>
##$TPNAME2= <>
##$TPNAME3= <>
##$TPNAME4= <>
##$TPNAME5= <>
##$TPNAME6= <>
##$TPNAME7= <>
##$TPOAL= (0..7)
0.5 0.5 0.5 0.5 0.5 0.5 0.5 0.5 
##$TPOFFS= (0..7)
0 0 0 0 0 0 0 0 
##$TUNHIN= 0
##$TUNHOUT= 0
##$TUNXOUT= 0
##$USERA1= <user>
##$USERA2= <user>
##$USERA3= <user>
##$USERA4= <user>
##$USERA5= <user>
##$V9= 5
##$VALIST= <valist>
##$VCLIST= <CCCCCCCCCCCCCCC>
##$VD= 0
##$VDLIST= <DDDDDDDDDDDDDDD>
##$VPLIST= <PPPPPPPPPPPPPPP>
##$VTLIST= <TTTTTTTTTTTTTTT>
##$WBST= 1024
##$WBSW= 4
##$XGAIN= (0..3)
0 0 0 0 
##$XL= 0
##$YL= 0
##$YMAX_a= 13292
##$YMIN_a= -13382
##$ZGOPTNS= <>
##$ZL1= 120
##$ZL2= 120
##$ZL3= 120
##$ZL4= 120
##$ABSF1= 248.5645
##$ABSF2= -253.2056
##$ABSG= 5
##$ABSL= 3
##$ALPHA= 0
##$AQORDER= 0
##$ASSFAC= 0
##$ASSFACI= 0
##$ASSFACX= 0
##$ASSWID= 0
##$AUNMP= <proc_1d>
##$AZFE= 0.1
##$AZFW= 0.5
##$BCFW= 0
##$BC_mod= 2
##$BYTORDP= 0
##$COROFFS= 0
##$CY= -3
##$DATMOD= 1
##$DC= 0
##$DFILT= <>
##$DTYPP= 0
##$F1P= 0
##$F2P= 0
##$FCOR= 1
##$FTSIZE= 65536
##$FT_mod= 6
##$GAMMA= 0
##$GB= 0
##$INTBC= 1
##$INTSCL= 6.047779e-11
##$ISEN= 30
##$LB= 10
##$LEV0= 0
##$LPBIN= 0
##$MAXI= 10000
##$MC2= 0
##$MEAN= 0
##$ME_mod= 0
##$MI= 50
##$NCOEF= 0
##$NC_proc= -6
##$NLEV= 6
##$NOISF1= 182.463
##$NOISF2= 159.3651
##$NSP= 0
##$NTH_PI= 0
##$NZP= 0
##$OFFSET= 248.5645
##$PC= 4
##$PHC0= -11328.54
##$PHC1= -23.5066
##$PH_mod= 1
##$PKNL= yes
##$PPARMOD= 0
##$PSCAL= 0
##$PSIGN= 0
##$REVERSE= no
##$SF= 81.0140089999694
##$SI= 65536
##$SIGF1= 159.3651
##$SIGF2= -187.1042
##$SINO= 113.3802
##$SIOLD= 16384
##$SREGLST= <1H.CDCl3>
##$SSB= 0
##$STSI= 65536
##$STSR= 0
##$SW_p= 40650.406504065
##$SYMM= 0
##$S_DEV= 0
##$TDeff= 32768
##$TDoff= 0
##$TI= <>
##$TILT= no
##$TM1= 0
##$TM2= 0
##$TOPLEV= 0
##$USERP1= <user>
##$USERP2= <user>
##$USERP3= <user>
##$USERP4= <user>
##$USERP5= <user>
##$WDW= 1
##$XDIM= 65536
##$YMAX_p= 464671642
##$YMIN_p= -7680592
$$ End of Bruker specific parameters
$$ ---------------------------------
##NTUPLES= NMR SPECTRUM
##VAR_NAME=  FREQUENCY,     SPECTRUM/REAL,   SPECTRUM/IMAG
##SYMBOL=    X,             R,               I
##VAR_TYPE=  INDEPENDENT,   DEPENDENT,       DEPENDENT
##VAR_FORM=  AFFN,          ASDF,            ASDF
##VAR_DIM=   65536,         65536,           65536
##UNITS=     HZ,            ARBITRARY UNITS, ARBITRARY UNITS
##FACTOR=    0.620285442955139, 1,           1
##FIRST=     20137.2065510682, 0,            0
##LAST=      -20513.1999529968, 0,           0
##MIN=       -20513.1999529968, -7680592,    0
##MAX=       20137.2065510682, 464671642,    0
$$ Real data points
##PAGE= N=1
##DATA TABLE= (X++(R..R)), XYDATA
$$ [...]
$$ plain form
40049 21822 32654 43780 57108 74866 98848 129598 165948 205104 243308 276788 302641 319350
40037 319350 326855 326286 319451 308252 294191 278200 260741 242029 222194 201397 179982 158510
40025 158510 137625 117826 99496 83261 70372 62691 62156 69947 85822 108011 133715 159941
40013 159941 184129 204332 219038 226912 226561 216262 193827 156775 103076 32192 -54069 -151402
40001 -151402 -253635 -353873 -445601 -523428 -583324 -622555 -639526 -633738 -605819 -557525 -491554
39990 -491554 -411140 -319565 -219795 -114403 -5842 103079 208819 307187 393909 465422 519469
39979 519469 555321 573702 576619 567144 549062 526407 502997 482085 466113 456553 453807 457276
39967 457276 465555 476579 487622 495275 495788 485904 463848 429888 386153 335884 282590 229386
$$ packed form
40049B1822J0832J1126J3328J7758K3982L0750L6350L9156L8204L3480K5853J6709
40037C19350P505n69o835j1199j4061j5991j7459j8712j9835k0797k1415k1472
40025A58510k0885j9799j8330j6235j2889p681n35P791J5875K2189K5704K6226
40013A59941K4188K0203J4706P874l51j0299k2435l7052n3699p0884q6261r7333
40001a51402j02233j00238r1728p7827n9896l9231j6971N788K7919M8294O5971
39990d91554Q0414R1575R9770J05392J08561J08921J05740R8368Q6722P1513N4047
39979E19469L5852J8381K917r475j8082k2655k3410k0912j5972r560k746L469
39967D57276Q279J1024J1043P653N13r884k2056l3960m3735n0269n3294n3204
$$ plain form
39955 229386 178610 131656 88992 50355 15093 -17412 -47279 -73775 -95260 -109538 -114444 -108405
39943 -108405 -90843 -62441 -25246 17596 62576 106672 147788 184582 216057 241395 260106
39932 260106 272287 278779 281239 282173 284803 292627 308722 335053 372108 418943 473451 532535 592151
39919 592151 647461 693574 726788 745820 752223 749674 742497 734125 726162 718300 708917 695952 677626
39906 677626 652837 621280 583414 540372 493893 446229 399985 357708 321255 291189 266578
39895 266578 245406 225436 205099 184038 163132 144095 128920 119400 116762 121383 132601 148831
39883 148831 168041 188342 208316 226962 243494 257356 268482 277504 285568 293684 301942 309164
39871 309164 313310 312436 305587 293106 276269 256571 235128 212504 189024 165269 142338 121681
$$ packed form
39955B29386n0776m6954m2664l8637l5262l2505k9867k6496k1485j4278m906O039
39943a08405J7562K8402L7195M2842M4980M4096M1116L6794L1475K5338J8711
39932B60106J2181O492K460R34K630P824J6095K6331L7055M6835N4508N9084N9616
39919E92151N5310M6113L3214J9032O403k549p177q372p963p862r383j2965j8326
39906F77626k4789l1557l7866m3042m6479m7664m6244m2277l6453l0066k4611
39895B66578k1172j9970k0337k1061k0906j9037j5175r520k638M621J1218J6230
39883A48831J9210K0301J9974J8646J6532J3862J1126R022Q064Q116Q258P222
39871C09164M146q74o849j2481j6837j9698k1443k2624k3480k3755k2931k0657
$$ plain form
39859 121681 104684 92282 84713 81416 81134 82220 82987 81855 77410 68609 55186 37896 18254
39846 18254 -2125 -22234 -42089 -62762 -86002 -113554 -146352 -183879 -224002 -263405 -298418 -325779
39834 -325779 -343000 -348480 -341755 -323944 -297945 -267914 -238215 -212276 -191721 -175811 -161348 -143377
39822 -143377 -116646 -77301 -24046 41577 115663 192789 266987 332686 385598 423462 446435
39811 446435 456840 458240 454166 447096 438076 426916 412718 394473 371602 344293 313528 280860
39799 280860 248166 217594 191633 173024 164307 167147 181801 206991 240222 278361 318291 357434
39787 357434 394033 427142 456361 481440 501892 516800 524866 524695 515137 495664 466722 429919
39775 429919 387778 342977 297451 252000 206756 162092 119140 79434 44037 12999 -14468
$$ packed form
39859A21681j6997j2402p569l297k82J086P67j132m445q801j3423j7290j9642
39846A8254k0379k0109j9855k0673k3240k7552l2798l7527m0123l9403l5013k7361
39834c25779j7221n480O725J7811K5999L0031K9699K5939K0555J5910J4463J7971
39822a43377K6731L9345N3255O5623P4086P7126P4198O5699N2912L7864K2973
39811D46435J0405J400m074p070r020j1160j4198j8245k2871k7309l0765l2668
39799B80860l2694l0572k5961j8609q717K840J4654K5190L3231L8139L9930L9143
39787C57434L6599L3109K9219K5079K0452J4908Q066j71r558j9473k8942l6803
39775D29919m2141m4801m5526m5451m5244m4664m2952l9706l5397l1038k7467
$$ plain form
39764 -14468 -39402 -62730 -85363 -108425 -133175 -160482 -190091 -220074 -246910 -266371 -274916 -270922
39752 -270922 -255115 -230132 -199469 -166306 -132658 -99241 -66109 -33630 -3136 23113 42444
39741 42444 52414 51407 39165 17049 -12278 -45787 -81054 -116567 -151171 -183274 -210540 -230340
39729 -230340 -240508 -239919 -228683 -208136 -180664 -149201 -116253 -82789 -47602 -7626 40908 101134
39717 101134 174687 261515 360061 467506 580023 693099 801869 901368 986744 1053640 1098766
39706 1098766 1120423 1118661 1095066 1052392 994258 924940 849121 771406 695535 623585 555662
39695 555662 490457 426498 363348 302076 244814 193872 151030 117371 93559 80111 77293 84616
39683 84616 100287 121107 143045 162278 176141 183501 184505 180045 171388 160082 147947 136966
$$ packed form
39764a4468k4934k3328k2633k3062k4750k7307k9609k9983k6836j9461q545L994
39752b70922J5807K4983L0663L3163L3648L3417L3132L2479L0494K6249J9331
39741D2444R970j007j2242k2116k9327l3509l5267l5513l4604l2103k7266j9800
39729b30340j0168N89J1236K0547K7472L1463L2948L3464L5187L9976M8534O0226
39717A01134P3553Q6828R8546J07445J12517J13076J08770R9499Q5376O6896M5126
39706A098766K1657j762k3595m2674n8134o9318p5819p7715p5871p1950o7923
39695E55662o5205o3959o3150o1272n7262n0942m2842l3659k3812j3448k818P323
39683H4616J5671K0820K1938J9233J3863P360J004m460q657j1306j2135j0981
$$ plain form
39671 136966 129045 125724 127839 135271 146974 161451 177469 194552 212912 232869 254170 275591
39659 275591 295080 310368 319758 322650 319611 312085 301958 291105 280887 271652 262459 251255 235508
39646 235508 213113 183178 146399 104844 61299 18527 -21293 -56790 -87287 -112430 -131827
39635 -131827 -145029 -151944 -153364 -151090 -147549 -145162 -145910 -151185 -161728 -177410 -196891 -217459 -235325
39622 -235325 -246442 -247443 -236269 -212197 -175502 -127200 -69111 -4087 63998 130737 192060 245131
39610 245131 288865 323841 351672 374177 392805 408591 422528 435902 450206 466714 486061
39599 486061 508255 533042 560233 589617 620416 650681 677119 695644 702431 694988 672767 637138
39587 637138 590779 536698 477192 413087 343570 266683 180340 83581 -22355 -133588 -244131
$$ packed form
39671A36966p921l321K115P432J1703J4477J6018J7083J8360J9957K1301K1421
39659B75591J9489J5288R390K892l039p526j0127j0853j0218r235r193j1204j5747
39646B35508k2395k9935l6779m1555m3545m2772l9820l5497l0497k5143j9397
39635a31827j3202o915j420K274L541K387p48n275j0543j5682j9481k0568j7866
39622b35325j1117j001J1174K4072L6695M8302N8089O5024O8085O6739O1323N3071
39610B45131M3734L4976K7831K2505J8628J5786J3937J3374J4304J6508J9347
39599D86061K2194K4787K7191K9384L0799L0265K6438J8525O787p443k2221l5629
39587F37138m6359n4081n9506o4105o9517p6887q6343r6759j05936j11233j10543
$$ plain form
39576 -244131 -347292 -437365 -510761 -566162 -603907 -625171 -631458 -624473 -606222 -579080 -545671 -508580
39564 -508580 -470037 -431884 -395865 -364019 -338776 -322584 -317233 -323235 -339451 -363084 -390031 -415484
39552 -415484 -434650 -443345 -438454 -418351 -383227 -335131 -277547 -214771 -151416 -92126 -41203 -1991
39540 -1991 23759 36075 36393 26957 10378 -10521 -32747 -53239 -69202 -78623 -80790 -76518 -67954
39527 -67954 -58039 -49858 -45954 -47700 -54759 -64864 -74095 -77676 -71102 -51232 -16988 30555 88660
39514 88660 153806 222598 292306 360777 425893 485086 535364 573929 598982 610333 609557 599633
39502 599633 584162 566515 549301 534336 522942 516222 515181 520719 533594 554322 583019 619254
39490 619254 662039 710079 762167 817480 875532 935805 997361 1058686 1117815 1172549 1220617
$$ packed form
39576b44131j03161r0073p3396n5401l7745k1264o287O985J8251K7142L3409L7091
39564e08580L8543L8153L6019L1846K5243J6192N351o002j6216k3633k6947k5453
39552d15484j9166q695M891K0103L5124M8096N7584O2776O3355N9290N0923L9212
39540a991K5750J2316L18r436j6579k0899k2226k0492j5963r421k167M272Q564
39527f7954R915Q181L904j746p059j0105r231l581O574J9870L4244M7543N8105
39514H8660O5146O8792O9708O8471O5116N9193N0278L8565K5053J1351p76r924
39502E99633j5471j7647j7214j4965j1394o720j041N538J2875K0728K8697L6235
39490F19254M2785M8040N2088N5313N8052O0273O1556O1325N9129N4734M8068
$$ plain form
39479 1220617 1259735 1287628 1302103 1301212 1283445 1247929 1194623 1124627 1040494 946204 846518 745902
39467 745902 647596 553302 463493 377942 296211 217977 143239 72406 6338 -53676 -106051
39456 -106051 -149261 -182414 -205741 -220618 -229036 -232812 -233106 -230493 -225515 -219260 -213540 -210384 -210999 -214792
39442 -214792 -219123 -220131 -214237 -199530 -176414 -147352 -115895 -85407 -57982 -33906 -11828 10608
39430 10608 36025 66703 104137 148679 199274 253375 307263 356815 398631 431083 454817 472398
39418 472398 487192 501978 517945 534481 549749 561631 568617 570323 567559 562004 555672 550307 546868
39405 546868 545162 543807 540668 533696 521768 505063 484762 462198 437975 411591 381862 347887
39393 347887 309907 269460 228781 189852 153694 120205 88504 57411 25735 -7727 -44181
$$ packed form
39479A220617L9118K7893J4475q91j7767l5516n3306o9996q4133r4290r9686j00616
39467G45902r8306r4294q9809q5551q1731p8234p4738p0833o6068o0014n2375
39456a06051m3210l3153k3327j4877q418l776k94K613M978O255N720L156o15l793
39442b14792m331j008N894J4707K3116K9062L1457L0488K7425K4076K2078K2436
39430A0608K5417L0678L7434M4542N0595N4101N3888M9552M1816L2452K3734J7581
39418D72398J4794J4786J5967J6536J5268J1882O986J706k764n555o332n365l439
39405E46868j706j355l139o972j1928j6705k0301k2564k4223k6384k9729l3975
39393C47887l7980m0447m0679l8929l6158l3489l1701l1093l1676l3462l6454
$$ plain form
39382 -44181 -84520 -128774 -175679 -222761 -266904 -305072 -334883 -354976 -365223 -366779 -361812 -352873
39370 -352873 -342159 -331031 -320028 -309220 -298535 -287771 -276355 -263075 -246193 -224048 -195964
39359 -195964 -162839 -126981 -91221 -57908 -28430 -3404 16910 32540 44161 53432 62796 74719
39347 74719 90863 111716 136754 164877 194785 225158 254699 282048 305704 324005 335273 338216
39335 338216 332552 319627 302608 285875 273652 268381 269568 273769 275793 270659 255332 229520 195321
39322 195321 156163 115670 76930 42373 14081 -5857 -15401 -13027 1683 27803 63299 105607
39310 105607 152289 201553 252436 304530 357301 409311 457819 499099 529451 546440 549789 541536
39298 541536 525489 506203 487863 473377 463878 458716 455867 452624 446373 435222 418301 395704
$$ packed form
39382d4181m0339m4254m6905m7082m4143l8168k9811k0093j0247j556M967Q939
39370c52873J0714J1128J1003J0808J0685J0764J1416J3280J6882K2145K8084
39359a95964L3125L5858L5760L3313K9478K5026K0314J5630J1621R271R364J1923
39347G4719J6144K0853K5038K8123K9908L0373K9541K7349K3656J8301J1268K943
39335C38216n664j2925j7019j6733j2223n271J187M201K024n134j5327k5812l4199
39322A95321l9158m0493l8740l4557k8292j9938r544K374J4710K6120L5496M2308
39310A05607M6682M9264N0883N2094N2771N2010M8508M1280L0352J6989L349q253
39298E41536j6047j9286j8340j4486r499n162k849l243o251j1151j6921k2597
$$ plain form
39286 395704 368220 337012 303371 268695 234684 203558 178046 161025 155024 161914 182835 218242
39274 218242 267888 330616 403975 483922 565044 641533 708557 763206 804402 831977 845687
39263 845687 844914 829199 799176 757239 707478 654856 604040 558384 519373 486510 457578 429246
39251 429246 398091 361802 320129 275090 230318 189890 157109 133672 119442 112871 111914 114951
39239 114951 121185 130235 141211 152033 159573 160625 153171 137292 115345 91491 70724 57696
39227 57696 55589 65455 86335 116100 152595 194365 240602 290412 342018 392522 438343 476045
39215 476045 503107 518438 522544 517308 505360 489163 470197 448577 423264 392688 355456 310916
39203 310916 259504 202992 144591 88809 40880 5847 -12472 -12423 4877 35451 73013 110091
$$ packed form
39286C95704k7484l1208l3641l4676l4011l1126k5512j7021o001O890K0921L5407
39274B18242M9646O2728P3359P9947Q1122P6489O7024N4649M1196K7575J3710
39263H45687p73j5715l0023m1937m9761n2622n0816m5656l9011l2863k8932k8332
39251D29246l1155l6289m1673m5039m4772m0428l2781k3437j4230o571r57L037
39239A14951O234R050J0976J0822P540J052p454j5879k1947k3854k0767j3028
39227E7696k107R866K0880K9765L6495M1770M6237M9810N1606N0504M5821L7702
39215D76045K7062J5331M106n236j1948j6197j8966k1620k5313l0576l7232m4540
39203C10916n1412n6512n8401n5782m7929l5033j8319M9J7300L0574L7562L7078
$$ plain form
39191 110091 139374 154855 152543 130800 90435 34587 -31813 -103099 -174221 -241914 -305157 -364854
39179 -364854 -422943 -481371 -541309 -602889 -665412 -727767 -788609 -846296 -898779 -943837 -979604
39168 -979604 -1005125 -1020578 -1027069 -1026213 -1019755 -1009342 -996329 -981530 -964977 -945804 -922388 -892763
39156 -892763 -855277 -809349 -755970 -697681 -638026 -580708 -528758 -483885 -446237 -414723 -387732
39145 -387732 -363860 -342282 -322771 -305547 -290999 -279235 -269555 -260114 -248019 -229914 -202911 -165566
39133 -165566 -118533 -64646 -8431 44672 89164 120244 134447 130115 107614 69279 19109 -37695
39121 -37695 -95187 -147184 -187976 -213320 -221332 -212752 -190322 -157576 -117670 -72716 -23778 28619
39109 28619 83816 140541 196792 250020 297476 336725 366300 386269 398359 405406 410420 415783
$$ packed form
39191A10091K9283J5481k312k1743m0365n5848o6400p1286p1122o7693o3243n9697
39179c64854n8089n8428n9938o1580o2523o2355o0842n7687n2483m5058l5767
39168i79604k5521j5453o491Q56O458J0413J3013J4799J6553J9173K3416K9625
39156h92763L7486M5928N3379N8289N9655N7318N1950M4873L7648L1514K6991
39145c87732K3872K1578J9511J7224J4548J1764R680R441J2095J8105K7003L7345
39133a65566M7033N3887N6215N3103M4492L1080J4203m332k2501l8335n0170n6804
39121c7695n7492n1997m0792k5344q012Q580K2430L2746L9906M4954M8938N2397
39109B8619N5197N6725N6251N3228M7456L9249K9575J9969J2090P047N014N363
$$ plain form
39097 415783 423023 433123 446955 465368 488787 516671 547329 578359 607539 633674 656966 678813
39085 678813 701203 725980 754200 785692 818870 850850 877800 895499 899985 888197 858367 810008
39073 810008 743621 660509 562942 454461 339780 224105 112134 7375 -87949 -172548
39063 -172548 -245660 -306930 -356445 -394790 -422905 -441858 -452723 -456638 -454908 -448995 -440305 -429946
39051 -429946 -418557 -406215 -392401 -376038 -355705 -330127 -298840 -262659 -223639 -184487 -147727
39040 -147727 -115085 -87339 -64586 -46621 -33135 -23594 -17004 -11964 -7205 -2443 921 -188 -9700
39027 -9700 -30907 -65057 -110656 -163881 -219783 -273624 -321775 -362006 -393275 -415219 -427629 -430265
39015 -430265 -423231 -407712 -386544 -364047 -344997 -333180 -330222 -335222 -345192 -356006 -363500 -364497 -357536
$$ packed form
39097D15783P240J0100J3832J8413K3419K7884L0658L1030K9180K6135K3292K1847
39085F78813K2390K4777K8220L1492L3178L1980K6950J7699M486j1788k9830m8359
39073H10008o6387q3112r7567j08481j14681j15675j11971j04759r5324q4599
39063a72548p3112o1270m9515l8345k8115j8953j0865l915J730N913Q690J0359
39051d29946J1389J2342J3814J6363K0333K5578L1287L6181L9020L9152L6760
39040a47727L2642K7746K2753J7965J3486R541O590N040M759M762L364j109r512
39027i700k1207l4150m5599n3225n5902n3841m8151m0231l1269k1944j2410k636
39015d30265P034J5519K1168K2497J9050J1817K958n000r970j0814p494r97O961
$$ plain form
39002 -357536 -343062 -323000 -299999 -276816 -256051 -240077 -230863 -229667 -236777 -251483 -272279 -297135
38990 -297135 -323764 -349847 -373169 -391741 -403885 -408324 -404240 -391353 -370037 -341481 -307822 -272114
38978 -272114 -238025 -209258 -188780 -178111 -177017 -183820 -196245 -212297 -230668 -250572 -271448 -292894
38966 -292894 -314786 -337220 -360268 -383841 -407839 -432416 -457922 -484364 -510618 -533917 -550143
38955 -550143 -555073 -546114 -523565 -490647 -452281 -413390 -377642 -347081 -322439 -303656 -290176 -281000
38943 -281000 -274778 -270186 -266412 -263304 -260946 -258949 -255982 -249922 -238587 -220774 -197136 -170479 -145265
38930 -145265 -126435 -118028 -122165 -138728 -165703 -199864 -237460 -274770 -308550 -336389 -356874 -369586
38918 -369586 -375053 -374653 -370321 -364019 -357212 -350716 -344977 -340475 -337939 -338368 -342938 -352764 -368518 -389975
$$ packed form
39002c57536J4474K0062K3001K3183K0765J5974R214J196p110j4706k0796k4856
38990b97135k6629k6083k3322j8572j2144m439M084J2887K1316K8556L3659L5708
38978b72114L4089K8767K0478J0669J094o803j2425j6052j8371j9904k0876k1446
38966b92894k1892k2434k3048k3573k3998k4577k5506k6442k6254k3299j6226
38955e50143m930Q959K2549L2918L8366L8891L5748L0561K4642J8783J3480R176
38943b81000O222M592L774L108K358J997K967O060J1335J7813K3638K6657K5214
38930a45265J8830Q407m137j6563k6975l4161l7596l7310l3780k7839k0485j2712
38918c69586n467M00M332O302O807O496N739M502K536m29m570r826j5754k1457
$$ plain form
38904 -389975 -415811 -443795 -471370 -496380 -517625 -534937 -548776 -559626 -567653 -572874 -575645 -577008
38892 -577008 -578489 -581318 -585529 -589527 -590419 -584924 -570411 -545654 -511113 -468662 -420965 -370743 -320221
38879 -320221 -270874 -223382 -177838 -134270 -93251 -56270 -25622 -3880 6756 5049 -8792 -32860
38867 -32860 -63645 -96618 -127245 -152272 -170802 -184614 -197458 -213615 -236469 -267728 -307354 -353913
38855 -353913 -404996 -457502 -507835 -552208 -587148 -610137 -620109 -617475 -603617 -580053 -547650 -506363
38843 -506363 -455642 -395264 -325998 -249776 -169435 -88348 -10086 61984 125155 177690 218836
38832 218836 248572 267299 275696 274699 265445 249018 226107 196845 161048 118720 70471 17647
38820 17647 -37770 -93327 -146268 -193854 -233816 -264826 -286752 -300560 -307934 -310763 -310548 -307799 -301645
$$ packed form
38904c89975k5836k7984k7575k5010k1245j7312j3839j0850q027n221k771j363
38892e77008j481k829m211l998q92N495J4513K4757L4541M2451M7697N0222N0522
38879c20221M9347M7492M5544M3568M1019L6981L0648K1742J0636j707j3841k4068
38867c2860l0785l2973l0627k5027j8530j3812j2844j6157k2854l1259l9626m6559
38855c53913n1083n2506n0333m4373l4940k2989r972K634J3858K3564L2403M1287
38843e06363N0721O0378O9266P6222Q0341Q1087P8262P2070O3171N2535M1146
38832B18836K9736J8727Q397r97r254j6427k2911k9262l5797m2328m8249n2824
38820A7647n5417n5557n2941m7586l9962l1010k1926j3808p374k829K15K749O154
$$ plain form
38807 -301645 -289966 -270260 -240897 -202118 -156308 -107471 -60244 -18947 12983 33138 40110 33685
38795 33685 15198 -12281 -44272 -75636 -101440 -117685 -121858 -113249 -92857 -62869 -25834 16038
38783 16038 61150 108172 155353 200029 238865 268911 288936 300175 305977 310447 316814 326354
38771 326354 338321 350667 361032 367428 368464 363198 350851 330600 301555 263012 214870 157982
38759 157982 94238 26233 -43335 -112205 -178787 -242012 -300984 -354656 -401629 -440183 -468470
38748 -468470 -484890 -488476 -479023 -456972 -423233 -379237 -327168 -269980 -211004 -153320 -99372 -51074
38736 -51074 -10144 21751 43210 53466 52531 40957 19419 -11486 -51035 -97987 -150386 -205734
38724 -205734 -261330 -314495 -362634 -403240 -433926 -452513 -457197 -446915 -421791 -383376 -334398 -278067
$$ packed form
38807c01645J1679J9706K9363L8779M5810M8837M7227M1297L1930K0155O972o425
38795C3685j8487k7479l1991l1364k5804j6245m173Q609K0392K9988L7035M1872
38783A6038M5112M7022M7181M4676L8836L0046K0025J1239N802M470O367R540
38771C26354J1967J2346J0365O396J036n266j2347k0251k9045l8543m8142n6888
38759A57982o3744o8005o9568o8870o6582o3225n8972n3672m6973l8554k8287
38748d68470j6420l586R453K2051L3739M3996N2069N7188N8976N7684N3948M8298
38736e1074M0930L1895K1459J0256r35j1574k1538l0905l9549m6952n2399n5348
38724b05734n5596n3165m8139m0606l0686j8587m684J0282K5124L8415M8978N6331
$$ plain form
38712 -278067 -217321 -154489 -91566 -30826 24753 71739 107092 129214 138661 138176 131983 124465
38700 124465 118667 115233 112246 106035 92570 68887 34012 -11017 -63927 -122250 -183949 -247339
38688 -247339 -310637 -371614 -427595 -475677 -512982 -536779 -544515 -533886 -503165 -451900 -381719 -296776
38676 -296776 -203458 -109370 -21981 52634 110572 150243 172018 177627 169546 150495 123104 89748
38664 89748 52584 13744 -24340 -58640 -85529 -101270 -102924 -89209 -60924 -20789 27179 78635
38652 78635 130014 179366 226532 272628 319261 367790 418667 470824 521347 565810 599260 617392
38640 617392 617326 597823 559092 502522 430414 345763 251971 152562 50967 -49637 -146492 -237432
38628 -237432 -321011 -396476 -463579 -522308 -572651 -614507 -647860 -673064 -691014 -702902 -709706 -711795
$$ packed form
38712b78067O0746O2832O2923O0740N5579M6986L5353K2122R447m85o193p518
38700A24465n798l434k987o211j3465k3683l4875m5029n2910n8323o1699o3390
38688b47339o3298o0977n5981m8082l7305k3797p736J0629L0721N1265P0181Q4943
38676b96776R3318R4088Q7389P4615N7938L9671K1775N609q081j9051k7391l3356
38664H9748l7164l8840l8084l4300k6889j5741j654J3715K8285M0135M7968N1456
38652G8635N1379M9352M7166M6096M6633M8529N0877N2157N0523M4463L3450J8132
38640F17392o6j9503l8731n6570p2108q4651r3792r9409j01595j00604r6855r0940
38628b37432q3579p5465o7103n8729n0343m1856l3353k5204j7950j1888o804k089
$$ plain form
38616 -711795 -709024 -701336 -689524 -675688 -662924 -654226 -651102 -652731 -656194 -657624 -653547 -641749 -621407
38603 -621407 -592773 -556873 -515496 -471266 -427425 -387263 -353588 -328553 -313694 -309679 -315764 -329495
38591 -329495 -347156 -364862 -379614 -389839 -395362 -397075 -396521 -395518 -395869 -399173 -406647 -418838 -435235
38578 -435235 -454058 -472449 -487114 -495152 -494783 -485804 -469662 -449085 -427362 -407519 -391851 -381881
38566 -381881 -378478 -381746 -390650 -402727 -414203 -420593 -417560 -401771 -371515 -327008 -270282 -204720
38554 -204720 -134390 -63447 4199 64945 115475 152862 174855 180277 169409 144164 107841 64343
38542 64343 17070 -32043 -82926 -137015 -196290 -262032 -333782 -408938 -483123 -551128 -607990 -649934
38530 -649934 -675038 -683561 -677847 -661787 -639960 -616679 -595206 -577233 -562700 -549840 -535523 -515973
$$ packed form
38616g11795K771P688J1812J3836J2764Q698L124j629l463j430M077J1798K0342
38603f21407K8634L5900M1377M4230M3841M0162L3675K5035J4859M015o085j3731
38591c29495j7661j7706j4752j0225n523j713N54J003l51l304p474j2191j6397
38578d35235j8823j8391j4665q038L69Q979J6142K0577K1723J9843J5668R970
38566c81881L403l268q904j2077j1476o390L033J5789L0256M4507N6726O5562
38554b04720P0330P0943O7646O0746N0530L7387K1993N422j0868k5245l6323m3498
38542F4343m7273m9113n0883n4089n9275o5742p1750p5156p4185o8005n6862m1944
38530f49934k5104q523N714J6060K1827K3281K1473J7973J4533J2860J4317J9550
$$ plain form
38518 -515973 -487893 -449631 -401787 -346782 -287669 -226878 -165626 -104050 -41753 21705 86536
38507 86536 152709 220121 288782 358853 430402 502990 575319 645159 709600 765550 810368 842429
38495 842429 861443 868436 865432 855013 839841 822172 803437 783996 763231 740060 713747 684693
38483 684693 654747 626775 603689 587453 578557 576041 577925 581766 585314 587104 586868 585534 584867 586824
38469 586824 592898 603632 618467 635953 654147 670948 684150 691371 690050 677789 652952 615340
38457 615340 566645 510441 451570 394976 344387 301461 265773 235574 208860 184246 161354
38446 161354 140680 123110 109395 99797 93906 90465 87233 81140 68963 48472 19481 -15710
38434 -15710 -52825 -86817 -113323 -129714 -135403 -131339 -118970 -99276 -72504 -38909 -47 40355
$$ packed form
38518e15973K8080L8262M7844N5005N9113O0791O1252O1576O2297O3458O4831
38507H6536O6173O7412O8661P0071P1549P2588P2329O9840O4441N5950M4818L2061
38495H42429J9014O993l004j0419j5172j7669j8735j9441k0765k3171k6313k9054
38483F84693k9946k7972k3086j6236q896k516J884L841L548J790k36j334o67J957
38469E86824O074J0734J4835J7486J8194J6801J3202P221j321j2261k4837l7612
38457F15340m8695n6204n8871n6594n0589m2926l5688l0199k6714k4614k2892
38446A61354k0674j7570j3715r598n891l441l232o093j2177k0491k8991l5191
38434a5710l7115l3992k6506j6391n689M064J2369J9694K6772L3595L8862M0402
$$ plain form
38422 40355 76742 103217 115280 110970 91103 58845 18961 -23027 -61633 -92127 -111072 -116726
38410 -116726 -109183 -90264 -63063 -31222 1842 33520 62130 86656 106276 120050 126977 126371
38398 126371 118332 103991 85400 65173 46021 30234 19091 12452 8833 6117 2471 -3007 -10086
38385 -10086 -17500 -23206 -24792 -20093 -7832 11914 37630 66709 96248 124081 149625 174100
38373 174100 199919 229554 264488 304803 349488 397000 445537 492922 536421 572919 599479
38362 599479 614032 615825 605373 583961 552929 513114 464697 407431 341162 266429 184930 99590
38350 99590 14157 -67527 -142314 -208346 -265352 -314549 -358127 -398496 -437464 -475462 -511076 -541294
38338 -541294 -562725 -573333 -573627 -566465 -555599 -543854 -532005 -518799 -501965 -479577 -451057 -417430
$$ packed form
38422D0355L6387K6475J2063m310j9867l2258l9884m1988l8606l0494j8945n654
38410a16726P543J8919K7201L1841L3064L1678K8610K4526J9620J3774O927o06
38398A26371q039j4341j8591k0227j9152j5787j1143o639l619k716l646n478p079
38385a0086p414n706j586M699J2261J9746K5716K9079K9539K7833K5544K4475
38373A74100K5819K9635L4934M0315M4685M7512M8537M7385M3499L6498K6560
38362E99479J4553J793j0452k1412l1032l9815m8417n7266o6269p4733q1499q5340
38350I9590q5433q1684p4787o6032n7006m9197m3578m0369l8968l7998l5614l0218
38338e41294k1431j0608k94P162J0866J1745J1849J3206J6834K2388K8520L3627
$$ plain form
38326 -417430 -380899 -344081 -309295 -278022 -250603 -226211 -203124 -179338 -153350 -124848 -95032
38315 -95032 -66415 -42223 -25596 -18787 -22647 -36551 -58839 -87426 -120151 -154754 -188752 -219598
38303 -219598 -245161 -264255 -276951 -284513 -288955 -292273 -295641 -298979 -301262 -301461 -299601 -297338 -297723 -304312
38289 -304312 -320181 -347271 -386226 -436516 -496524 -563531 -633778 -702849 -766486 -821515 -866289
38278 -866289 -900316 -923296 -934456 -932861 -918509 -893381 -861593 -828555 -799597 -778689 -767575 -765502
38266 -765502 -769595 -775773 -780030 -779654 -773901 -763863 -751615 -739188 -727922 -718400 -710723 -704808 -700524
38253 -700524 -697739 -696377 -696505 -698267 -701595 -705827 -709580 -711125 -709049 -702688 -691981 -676935 -657244 -632495
38239 -632495 -602771 -569106 -533236 -496707 -460000 -422330 -382267 -338756 -291960 -243587 -196653
$$ packed form
38326d17430L6531L6818L4786L1273K7419K4392K3087K3786K5988K8502K9816
38315i5032K8617K4192J6627O809l860j3904k2288k8587l2725l4603l3998l0846
38303b19598k5563j9094j2696p562m442l318l368l338k283j99J860K263l85o589
38289c04312j5869k7090l8955n0290o0008o7007p0247o9071o3637n5029m4774
38278h66289l4027k2980j1160J595J4352K5128L1788L3038K8958K0908J1114K073
38266g65502m093o178m257L76N753J0038J2248J2427J1266R522P677N915M284
38253g00524K785J362j28j762l328m232l753j545K076O361J0707J5046J9691K4749
38239f32495K9724L3665L5870L6529L6707L7670M0063M3511M6796M8373M6934
$$ plain form
38228 -196653 -154824 -121657 -100054 -92081 -98972 -121099 -157963 -208240 -269842 -339762 -413830 -486736
38216 -486736 -552664 -606409 -644519 -666080 -672913 -669081 -659831 -650204 -643739 -641643 -642623 -643457 -640180 -629374
38202 -629374 -608898 -577654 -534809 -479305 -410240 -327846 -234386 -134416 -34447 57864 134960
38191 134960 190814 222092 228410 211610 174605 120593 52991 -24251 -106512 -188808 -266471 -335771
38179 -335771 -394177 -440199 -473041 -492348 -498261 -491662 -474343 -448849 -418077 -384847 -351697 -320833
38167 -320833 -294032 -272278 -255247 -241034 -226567 -208679 -185360 -156457 -123463 -88725 -54619
38156 -54619 -23087 4466 27108 44288 55726 61324 61093 55209 44136 28673 9774 -11848
38144 -11848 -36110 -63700 -95850 -133722 -177589 -226054 -275789 -322036 -359694 -384424 -393341 -385294
$$ packed form
38228a96653M1829L3167K1603P973o891k2127l6864n0277o1602o9920p4068p2906
38216d86736o5928n3745l8110k1561o833L832R250R627O465K096r80q34L277J0806
38202f29374K0476L1244M2845N5504O9065Q2394R3460R9970R9969R2311P7096
38191A34960N5854L1278O318j6800l7005n4012o7602p7242q2261q2296p7663o9300
38179c35771n8406m6022l2842j9307n913O599J7319K5494L0772L3230L3150L0864
38167c20833K6801K1754J7031J4213J4467J7888K3319K8903L2994L4738L4106
38156e4619L1532K7553K2642J7180J1438N598k31n884j1073j5463j8899k1622
38144a1848k4262k7590l2150l7872m3867m8465m9735m6247l7658k4730q917Q047
$$ plain form
38132 -385294 -360917 -322560 -273898 -219304 -163223 -109796 -62608 -24288 4110 23516 36557
38121 36557 46411 55277 63335 68854 69443 63704 52310 38005 24729 16439 16116 25137 43079 68011
38107 68011 97196 127925 158202 187023 214237 240033 264356 286597 305746 320858 331459 337720
38095 337720 340433 340867 340398 339937 339417 337755 333430 325437 314123 301478 290658 284942 286608 296312
38081 296312 313071 334570 357401 377263 389390 389282 373461 340017 288911 222161 143794 59365
38069 59365 -24999 -103717 -172585 -229113 -272398 -302724 -321069 -328710 -327055 -317652 -302197 -282417
38057 -282417 -259812 -235426 -209768 -182942 -154897 -125664 -95449 -64475 -32676 507 35909
38046 35909 73955 113827 153010 187586 213210 226376 225360 210554 184231 150131 113087 78594
$$ packed form
38132c85294K4377L8357M8662N4594N6081N3427M7188L8320K8398J9406J3041
38121C6557R854Q866Q058N519N89n739j1394j4305j3276q290l23R021J7942K4932
38107F8011K9185L0729L0277K8821K7214K5796K4323K2241J9149J5112J0601O261
38095C37720K713M34m69m61n20j662m325p993j1314j2645j0820n716J666R704
38081B96312J6759K1499K2831J9862J2127j08j5821l3444n1106o6750p8367q4429
38069E9365q4364p8718o8868n6528m3285l0326j8345p641J655R403J5455J9780
38057b82417K2605K4386K5658K6826K8045K9233L0215L0974L1799L3183L5402
38046C5909L8046L9872L9183L4576K5624J3166j016j4806k6323l4100l7044l4493
$$ plain form
38034 78594 52023 37550 37196 50536 75183 107677 144268 181303 215283 242916 261434 269165
38022 269165 266023 253636 234974 213653 193017 175266 160941 149054 137829 125593 111477 95769
38010 95769 79993 66645 58436 57158 62690 72838 84308 94298 101802 107832 114585 124232 138115
37997 138115 156622 179577 206683 237724 272319 309329 346265 379179 403387 414797 411184 392655
37985 392655 361040 318705 267565 208792 143094 71060 -6703 -89602 -176998 -267924 -360728
37974 -360728 -452839 -540960 -621590 -691632 -748668 -790890 -816884 -825591 -816499 -789900 -747054 -690176
37962 -690176 -622204 -546333 -465494 -382039 -297821 -214470 -133588 -56738 14688 79582 137173
37951 137173 186987 228722 262075 286691 302267 308685 305975 294123 272961 242372 202725 155306
$$ packed form
38034G8594k6571j4473l54J3340K4647L2494L6591L7035L3980K7633J8518P731
38022B69165l142j2387j8662k1321k0636j7751j4325j1887j1225j2236j4116j5708
38010I5769j5776j3348q209j278N532J0148J1470R990P504O030O753R647J3883
37997A38115J8507K2955K7106L1041L4595L7010L6936L2914K4208J1410l613j8529
37985C92655l1615m2335n1140n8773o5698p2034p7763q2899q7396r0926r2804
37974c60728r2111q8121q0630p0042n7036m2222k5994q707R092K6599M2846N6878
37962f90176O7972P5871Q0839Q3455Q4218Q3351Q0882P6850P1426O4894N7591
37951A37173M9814M1735L3353K4616J5576O418k710j1852k1162l0589l9647m7419
$$ plain form
37939 155306 102474 47481 -5863 -53542 -91754 -117485 -129140 -126853 -112188 -87428 -54967 -17185
37927 -17185 23271 63266 99326 128198 147474 155999 153922 142596 124559 103636 84926 74316
37915 74316 77395 97959 136738 190961 255079 322362 386690 443912 492367 532480 565568 592348
37903 592348 611948 622052 620093 604777 576972 539579 496645 452282 409849 371488 338048 309381
37891 309381 284931 264336 247750 235767 229022 227689 231062 237393 244045 247830 245391 233613 210150
37878 210150 173977 125640 67102 1353 -67847 -136010 -198012 -248537 -282960 -298328 -293984 -271442
37866 -271442 -233641 -184069 -126242 -63563 664 63284 121345 172129 213163 242380 258472
37855 258472 261329 252300 234051 210077 184069 159393 138690 123609 114705 111545 112979 117472 123490
$$ packed form
37939A55306n2832n4993n3344m7679l8212k5731j1655K287J4665K4760L2461L7782
37927a7185M0456L9995L6060K8872J9276Q525k077j1326j8037k0923j8710j0610
37915G4316L079K0564L8779N4223O4118O7283O4328N7222M8455M0113L3088K6780
37903E92348J9600J0104j959j5316k7805l7393m2934m4363m2433l8361l3440k8667
37891C09381k4450k0595j6586j1983o745j333L373O331O652L785k439j1778k3463
37878B10150l6173m8337n8538o5749o9200o8163o2002n0525l4423j5368M344K2542
37866b71442L7801M9572N7827O2679O4227O2620N8061N0784M1034K9217J6092
37855B58472K857r029j8249k3974k6008k4676k0703j5081q904l160J434M493O018
$$ plain form
37842 123490 129828 135822 141335 146692 152757 161095 173865 193188 220141 253884 291548 329121 362881
37829 362881 390516 411291 425405 433257 435188 431670 423591 412347 399679 387238 375995 365790
37817 365790 355324 342641 325798 303444 275167 241633 204499 166120 129107 95919 68627
37806 68627 48845 37637 35276 40925 52506 67001 81224 92848 101239 107649 114604 124835 140359
37793 140359 162081 189765 222008 256096 288098 313573 328855 332300 324715 308686 287222 262536
37781 262536 235616 206616 175729 143936 113164 85689 63118 45664 32209 21037 10693
37770 10693 488 -9430 -18290 -25128 -29290 -30822 -30470 -29241 -27787 -26056 -23474 -19493 -14027 -7466
37756 -7466 -289 7348 15744 25413 36663 49188 61856 72776 79642 80263 73192 58282 36895
$$ packed form
37842A23490O338N994N513N357O065Q338J2770J9323K6953L3743L7664L7573L3760
37829C62881K7635K0775J4114P852J931l518q079j1244j2668j2441j1243j0205
37817C65790j0466j2683j6843k2354k8277l3534l7134l8379l7013l3188k7292
37806F8627j9782j1208k361N649J1581J4495J4223J1624Q391O410O955J0231J5524
37793A40359K1722K7684L2243L4088L2002K5475J5282L445p585j6029k1464k4686
37781B62536k6920k9000l0887l1793l0772k7475k2571j7454j3455j1172j0344
37770A0693j0205r918q860o838m162j532L52J229J454J731K582L981N466O561
37756g466P177P637Q396R669J1250J2525J2668J0920O866O21p071j4910k1387
$$ plain form
37743 36895 11517 -15159 -41205 -65887 -89372 -112093 -134342 -156357 -178708 -202563 -229595 -261465
37731 -261465 -299043 -341668 -386862 -430754 -469010 -497779 -514265 -516874 -505149 -479621 -441556 -392613
37719 -392613 -334580 -269301 -198773 -125374 -52144 16949 76968 122480 148618 152427 133868 95987
37707 95987 44118 -15481 -76974 -135776 -188739 -233925 -270244 -297238 -315037 -324454 -327043 -324930
37695 -324930 -320362 -315185 -310564 -307060 -304914 -304308 -305551 -309198 -315959 -326213 -339305 -353142 -364509
37682 -364509 -369998 -366939 -353864 -330405 -296993 -254569 -204340 -147383 -84141 -14200 63216 148099
37670 148099 238551 330481 418308 496200 559135 603426 626822 628553 609487 572163 520384 458342
37658 458342 389670 316869 241283 163512 83994 3552 -76272 -153120 -223955 -285453 -334676
$$ packed form
37743C6895k5378k6676k6046k4682k3485k2721k2249k2015k2351k3855k7032l1870
37731b61465l7578m2625m5194m3892l8256k8769j6486k609J1725K5528L8065M8943
37719c92613N8033O5279P0528P3399P3230O9093O0019M5512K6138L809j8559l7881
37707I5987n1869n9599o1493n8802n2963m5186l6319k6994j7799r417k589K113
37695c24930M568N177M621L504K146O06j243l647o761j0254j3092j3837j1367
37682c64509n489L059J3075K3459L3412M2424N0229N6957O3242O9941P7416Q4883
37670A48099R0452R1930Q7827P7892O2935M4291K3396J731j9066l7324n1779o2042
37658D58342o8672p2801p5586p7771p9518q0442p9824p6848p0835o1498m9223
$$ plain form
37647 -334676 -369943 -391473 -401437 -403394 -401458 -399550 -400781 -406891 -417876 -432079 -446978 -460450 -471817
37634 -471817 -482058 -493071 -506589 -523441 -543381 -565253 -587195 -606914 -622190 -631619 -635316 -635143
37622 -635143 -634134 -635201 -639729 -646760 -653191 -654829 -647864 -630163 -601893 -565214 -523338 -479565 -436649
37609 -436649 -396406 -359370 -324565 -289670 -251725 -208166 -157844 -101644 -42461 15522 67974
37598 67974 111554 144644 167386 180986 186571 184257 172992 151226 117982 73746 20880 -36479
37586 -36479 -93000 -143107 -182188 -207773 -220180 -222189 -217756 -210407 -202168 -193410 -183320 -170594 -154196
37573 -154196 -134165 -112204 -91541 -75894 -67943 -68100 -74249 -82565 -88970 -90415 -85405 -73689 -55467
37560 -55467 -30616 1738 43090 94782 156752 226375 298148 364648 418472 454312 470332 468411
$$ packed form
37647c34676l5267k1530r964j957J936J908j231o110j0985j4203j4899j3472j1367
37634d71817j0241j1013j3518j6852j9940k1872k1942j9719j5276r429l697J73
37622f35143J009j067m528p031o431j638O965J7701K8270L6679M1876M3773M2916
37609d36649M0243L7036L4805L4895L7945M3559N0322N6200N9183N7983N2452
37598F7974M3580L3090K2742J3600N585k314j1265k1766l3244m4236n2866n7359
37586c6479n6521n0107l9081k5585j2407k009M433P349Q239Q758J0090J2726J6398
37573a54196K0031K1961K0663J5647P951j57o149q316o405j445N010J1716J8222
37560e5467K4851L2354M1352N1692O1970O9623P1773O6500N3824L5840J6020j921
$$ plain form
37548 468411 453298 431097 407706 387756 374235 368683 371696 383553 404771 436228 478682 531873
37536 531873 593850 661008 728831 792925 849873 897657 935613 963965 983189 993581 995288 988725
37524 988725 974982 955881 933723 910992 890199 873742 863654 861286 867141 880858 901225 926100
37512 926100 952468 976884 996269 1008733 1014001 1013256 1008516 1001880 994998 988909 984136 980753 978356
37499 978356 976025 972411 965888 954746 937520 913588 883801 850558 816943 785301 756153 728192
37487 728192 699274 667671 632721 594574 553375 508616 459247 404482 344649 281511 217916
37476 217916 157113 102136 55393 18468 -7882 -23560 -28859 -24257 -10285 12506 43554 82226
37464 82226 127696 178733 233519 289643 344361 395065 439738 477262 507540 531447 550551 566645
$$ packed form
37548D68411j5113k2201k3391j9950j3521n552L013J1857K1218L1457M2454N3191
37536E31873O1977O7158O7823O4094N6948M7784L7956K8352J9224J0392J707o563
37524I88725j3743j9101k2158k2731k0793j6457j0088k368N855J3717K0367K4875
37512I26100K6368K4416J9385J2464N268p45m740o636o882o089m773l383k397
37499I78356k331l614o523j1142j7226k3932k9787l3243l3615l1642k9148k7961
37487G28192k8918l1603l4950l8147m1199m4759m9369n4765n9833o3138o3595
37476B17916o0803n4977m6743l6925k6350j5678n299M602J3972K2791L1048L8672
37464H2226M5470N1037N4786N6124N4718N0704M4673L7524L0278K3907J9104J6094
$$ plain form
37452 566645 581261 595409 609650 624352 639841 656280 673371 690154 705074 716312 722155 721283
37440 721283 712965 697199 674797 647347 617025 586288 557581 533101 514503 502459 496236 493684
37428 493684 491883 488144 480712 468808 452160 430509 403405 370373 331362 287265 240219 193461
37416 193461 150724 115337 89237 72151 61297 51885 38321 15794 -18256 -63142 -114861 -167144
37404 -167144 -213335 -248291 -269480 -276948 -272451 -258263 -236256 -207555 -172809 -132778 -88823 -43085
37392 -43085 1715 42711 77384 103958 121591 130398 131322 125868 115765 102739 88539 75117
37380 75117 64608 58852 58689 63538 71614 80642 88613 94252 97223 98335 99594 103812 113536 129803
37366 129803 151476 175628 198762 218132 232565 242491 249324 254597 259350 263963 268278 271621 272663
$$ packed form
37452E66645J4616J4148J4241J4702J5489J6439J7091J6783J4920J1238N843q72
37440G21283q318j5766k2402k7450l0322l0737k8707k4480j8598j2044o223k552
37428D93684j801l739p432j1904j6648k1651k7104l3032l9011m4097m7046m6758
37416A93461m2737l5387k6100j7086j0854r412j3564k2527l4050m4886n1719n2283
37404a67144m6191l4956k1189p468M497J4188K2007K8701L4746M0031M3955M5738
37392d3085M4800M0996L4673K6574J7633Q807R24n454j0103j3026j4200j3422
37380G5117j0509n756j63M849Q076R028P971N639K971J112J259M218R724J6267
37366A29803K1673K4152K3134J9370J4433R926O833N273M753M613M315L343J042
$$ plain form
37353 272663 269351 259258 240449 212514 177294 138944 103277 76555 64053 68755 90672 127025
37341 127025 173247 224308 275870 324952 370099 411179 448947 484543 519066 553259 587287
37330 587287 620646 652295 680942 705334 724383 737186 743100 741845 733587 718908 698738 674342
37318 674342 647287 619334 592271 567733 547062 531152 520421 514931 514656 519638 529883 545035
37306 545035 564056 585207 606464 626205 643811 659707 674819 689810 704665 718775 731178
37295 731178 740516 744744 741049 726372 698393 656430 601765 537343 467073 395047 324881 259407
37283 259407 200781 150854 111367 83653 68002 63165 66500 74837 85711 98362 113907 134507
37271 134507 161987 196694 237272 281260 326009 369394 410154 447962 483311 517242 550978
$$ packed form
37353B72663l312j0093j8809k7935l5220l8350l5667k6722j2502M702K1917L6353
37341A27025M6222N1061N1562M9082M5147M1080L7768L5596L4523L4193L4028
37330E87287L3359L1649K8647K4392J9049J2803N914j255q258j4679k0170k4396
37318F74342k7055k7953k7063k4538k0671j5910j0731n490k75M982J0245J5152
37306E45035J9021K1151K1257J9741J7606J5896J5112J4991J4855J4110J2403
37295G31178R338M228l695j4677k7979m1963n4665o4422p0270p2026p0166o5474
37283B59407n8626m9927l9487k7714j5651m837L335Q337J0874J2651J5545K0600
37271A34507K7480L4707M0578M3988M4749M3385M0760L7808L5349L3931L3736
$$ plain form
37260 550978 585637 622170 661575 705110 754129 809477 870700 935606 1000511 1061046 1113143
37249 1113143 1153766 1181187 1194821 1194844 1181814 1156514 1120011 1073841 1020116 961384 900294 839261
37237 839261 780412 725760 677355 637139 606482 585653 573570 568098 566839 568058 571113 576111
37225 576111 583135 591754 601260 611361 622727 636876 655465 679406 708275 740267 772648 802458
37213 802458 827193 845271 856128 859974 857390 849075 835858 818760 798911 777308 754686 731519
37201 731519 708075 684335 659962 634508 607916 580970 555370 533236 516219 504684 497476 492455
37189 492455 487533 481594 474826 468341 463450 461053 461549 465354 473717 489191 515291 555356 611196
37176 611196 682229 765520 856583 950491 1042792 1129917 1209105 1278125 1335143 1378787 1408315
$$ packed form
37260E50978L4659L6533L9405M3535M9019N5348O1223O4906O4905O0535N2097
37249A113143M0623K7421J3634K3j3030k5300l6503m6170n3725n8732o1090o1033
37237H39261n8849n4652m8405m0216l0657k0829j2083n472j259J219L055M998
37225E76111P024Q619R506J0101J1366J4149J8589K3941K8869L1992L2381K9810
37213H02458K4735J8078J0857L846k584q315j3217j7098j9849k1603k2622k3167
37201G31519k3444k3740k4373k5454k6592k6946k5600k2134j7017j1535p208n021
37189D92455m922n939o768o485m891k397M96L805Q363J5474K6100M0065N5840
37176F11196P1033Q3291R1063R3908R2301Q7125P9188O9020N7018M3644K9528
$$ plain form
37165 1408315 1423776 1426292 1418381 1404014 1387997 1374783 1367319 1366609 1372074 1382342 1395936 1411647
37153 1411647 1428626 1446322 1464349 1482342 1499881 1516467 1531615 1545062 1557123 1568972 1582617
37142 1582617 1600472 1624693 1656566 1696150 1742235 1792589 1844536 1895709 1944686 1991085 2035050
37131 2035050 2076436 2114283 2146926 2172602 2190090 2198946 2199230 2191044 2174299 2148854 2114845 2072918
37119 2072918 2024159 1969808 1910942 1848336 1782576 1714414 1645149 1576802 1511869 1452740 1401076
37108 1401076 1357497 1321714 1292963 1270405 1253382 1241504 1234650 1232875 1236226 1244478 1256816 1271537
37096 1271537 1285890 1296319 1299334 1292807 1277055 1255042 1231487 1211304 1198123 1193591 1197569 1208855
37084 1208855 1225842 1246792 1269882 1293411 1316257 1338304 1360540 1384780 1413200 1447858 1490208
$$ packed form
37165A408315J5461K516p911j4367j6017j3214p464p10N465J0268J3594J5711
37153A411647J6979J7696J8027J7993J7539J6586J5148J3447J2061J1849J3645
37142A582617J7855K4221L1873L9584M6085N0354N1947N1173M8977M6399M3965
37131B035050M1386L7847L2643K5676J7488Q856K84q186j6745k5445l4009m1927
37119B072918m8759n4351n8866o2606o5760o8162o9265o8347o4933n9129n1664
37108A401076m3579l5783k8751k2558j7023j1878o854j775L351Q252J2338J4721
37096A271537J4353J0429L015o527j5752k2013k3555k0183j3181m532L978J1286
37084A208855J6987K0950K3090K3529K2846K2047K2236K4240K8420L4658M2350
$$ plain form
37073 1490208 1540653 1598256 1660809 1725285 1788456 1847386 1899612 1943056 1975925 1996855 2005336
37062 2005336 2002217 1989949 1972320 1953632 1937586 1926366 1920407 1918959 1921003 1925976 1933979 1945643
37050 1945643 1961953 1984031 2012621 2047303 2085929 2124798 2159637 2186762 2203720 2209219 2202719 2184152
37038 2184152 2153907 2112936 2062737 2005284 1942912 1878176 1813535 1750881 1691155 1634362 1580053
37027 1580053 1528031 1478945 1434539 1397536 1371225 1358899 1363299 1386203 1428149 1488122 1563268
37016 1563268 1648799 1738466 1825628 1904647 1972058 2027080 2071210 2107209 2138024 2166162 2193625
37005 2193625 2222018 2252396 2284884 2318425 2351100 2380980 2407055 2429740 2450702 2472186 2496197
36994 2496197 2523828 2554925 2588197 2621742 2653748 2683033 2709254 2732940 2755499 2779019 2805709
$$ packed form
37073A490208N0445N7603O2553O4476O3171N8930N2226M3444L2869K0930Q481
37062B005336l119j2268j7629j8688j6046j1220n959j448K044M973Q003J1664
37050A945643J6310K2078K8590L4682L8626L8869L4839K7125J6958N499o500j8567
37038B184152l0245m0971n0199n7453o2372o4736o4641o2654n9726n6793n4309
37027A580053n2022m9086m4406l7003k6311j2326M400K2904M1946N9973P5146
37016A563268Q5531Q9667Q7162P9019O7411N5022M4130L5999L0815K8138K7463
37005B193625K8393L0378L2488L3541L2675K9880K6075K2685K0962K1484K4011
36994B496197K7631L1097L3272L3545L2006K9285K6221K3686K2559K3520K6690
$$ plain form
36983 2805709 2837057 2873199 2912916 2954245 2995384 3035431 3074571 3113634 3153280 3193371 3232933
36972 3232933 3270650 3305521 3337286 3366494 3394273 3421943 3450637 3481026 3513156 3546413 3579624
36961 3579624 3611299 3639994 3664698 3685180 3702159 3717277 3732940 3752131 3778099 3813788 3861016
36950 3861016 3919819 3988385 4063643 4142266 4221632 4300389 4378500 4456907 4537265 4621926 4713947
36939 4713947 4816721 4933243 5065460 5214077 5378679 5557985 5750054 5952514 6162751
36930 6162751 6378021 6595495 6812236 7025074 7230417 7424155 7601925 7759583 7893641
36921 7893641 8001423 8081071 8131527 8152596 8145158 8111480 8055561 7983298 7902233 7820830 7747428
36910 7747428 7689100 7650698 7634300 7639298 7663140 7702547 7754690 7817849 7891450 7975669 8070942
$$ packed form
36983B805709L1348L6142L9717M1329M1139M0047L9140L9063L9646M0091L9562
36972C232933L7717L4871L1765K9208K7779K7670K8694L0389L2130L3257L3211
36961C579624L1675K8695K4704K0482J6979J5118J5663J9191K5968L5689M7228
36950C861016N8803O8566P5258P8623P9366P8757P8111P8407Q0358Q4661R2021
36939D713947J02774J16522J32217J48617J64602J79306J92069K02460K10237
36930F162751K15270K17474K16741K12838K05343J93738J77770J57658J34058
36921G893641J07782P9648N0456K1069p438l3678n5919p2263q1065q1403p3402
36910G747428n8328l8402j6398M998K3842L9407N2143O3159P3601Q4219R5273
$$ plain form
36899 8070942 8177530 8295140 8422583 8557553 8696753 8836450 8973388 9105600 9232741
36890 9232741 9355792 9476461 9596754 9718860 9845232 9978627 10121995 10278220 10449754
36881 10449754 10638205 10843923 11065819 11301562 11548268 11803427 12065653 12334829 12611527
36872 12611527 12896004 13187256 13482791 13779428 14074836 14369102 14665461 14969819 15289233
36863 15289233 15630021 15996315 16389655 16809697 17255443 17726301 18222538 18745202 19295790
36854 19295790 19875874 20486793 21129527 21804970 22514576 23261219 24049752 24886994 25781064
36845 25781064 26740270 27771869 28881028 30070405 31340553 32691053 34122002 35635487
36837 35635487 37236650 38934130 40739704 42667418 44732704 46951898 49342339 51922885
$$ packed form
36899H070942J06588J17610J27443J34970J39200J39697J36938J32212J27141
36890I232741J23051J20669J20293J22106J26372J33395J43368J56225J71534
36881A0449754J88451K05718K21896K35743K46706K55159K62226K69176K76698
36872A2611527K84477K91252K95535K96637K95408K94266K96359L04358L19414
36863A5289233L40788L66294L93340M20042M45746M70858M96237N22664N50588
36854A9295790N80084O10919O42734O75443P09606P46643P88533Q37242Q94070
36845B5781064R59206J031599J109159J189377J270148J350500J430949J513485
36837C5635487J601163J697480J805574J927714K065286K219194K390441K580546
$$ plain form
36829 51922885 54714645 57741613 61031167 64614665 68528458 72815138 77524467 82713638
36821 82713638 88447099 94796268 101839091 109659234 118344894 127987556 138680947 150520327
36813 150520327 163601741 178020244 193865314 211211575 230103410 250532908 272411588
36806 272411588 295537971 319565491 343978959 368092585 391084898 412078834 430254299
36799 430254299 444954797 455740039 462359740 464671642 462566569 455961663 444876149
36792 444876149 429543970 410488498 388506682 364564583 339652390 314656645 290283979
36785 290283979 267039252 245241699 225059557 206548792 189688027 174406639 160605764
36778 160605764 148172942 136991323 126944943 117921773 109815851 102528748 95970354
$$ packed form
36829E1922885K791760L026968L289554L583498L913793M286680M709329N189171
36821H2713638N733461O349169P042823P820143Q685660R642662J0693391J1839380
36813A50520327J3081414J4418503J5845070J7346261J8891835K0429498K1878680
36806B72411588K3126383K4027520K4413468K4113626K2992313K0993936J8175465
36799D30254299J4700498J0785242O619701K311902k105073o604906j1085514
36792D44876149j5332179j9055472k1981816k3942099k4912193k4995745k4372666
36785B90283979k3244727k1797553k0182142j8510765j6860765j5281388j3800875
36778A60605764j2432822j1181619j0046380r023170q105922p287103o558394
$$ plain form
36771 95970354 90059120 84722132 79895075 75522079 71555350 67954445 64684974 61716817
36763 61716817 59022227 56574492 54347431 52315894 50456989 48751539 47185039 45747736
36755 45747736 44433995 43241292 42169027 41217229 40385308 39671154 39070829 38579084 38190631
36746 38190631 37901734 37711344 37621302 37635705 37760032 38000511 38364022 38858445 39493246 40279978
36736 40279978 41232588 42367530 43703606 45261500 47063017 49130504 51486826 54156030
36728 54156030 57164247 60540304 64315524 68522844 73195660 78366645 84065844 90316684
36720 90316684 97128665 104486110 112332826 120553290 128952559 137239985 145025141 151837187
36712 151837187 157177258 160603158 161827354 160793495 157698180 152947097 147064811 140594917
$$ packed form
36771I5970354n911234n336988m827057m372996l966729l600905l269471k968157
36763F1716817k694590k447735k227061k031537j858905j705450j566500j437303
36755D5747736j313741j192703j072265r51798q31921p14154o00325m91745l88453
36746C8190631k88897j90390r0042J4403J24327K40479L63511M94423O34801P86732
36736D0279978R52610J134942J336076J557894J801517K067487K356322K669204
36728E4156030L008217L376057L775220M207320M672816N170985N699199O250840
36720I0316684O811981P357445P846716Q220464Q399269Q287426P785156O812046
36712A51837187N340071L425900J224196j033859l095315m751083n882286o469894
$$ plain form
36704 140594917 134022847 127735201 122011774 117038055 112926356 109737593 107499788 106221838
36696 106221838 105902423 106534507 108106311 110599765 113986913 118224112 123243192 128938851
36688 128938851 135152202 141652190 148119542 154141850 159231060 162872577 164604885 164112062
36680 164112062 161297958 156311488 149511217 141383638 132447159 123172858 113938311 105013919
36672 105013919 96571711 88705063 81450847 74809041 68757686 63263030 58285668 53784016
36664 53784016 49716222 46041410 42720630 39717720 36999981 34538501 32308035 30286477
36656 30286477 28454153 26793105 25286521 23918392 22673544 21538068 20499941 19549510
36648 19549510 18679476 17884348 17159533 16500425 15901773 15357373 14859976 14401438 13973273
$$ packed form
36704A40594917o572070o287646n723427m973719m111699l188763k237805j277950
36696A06221838l19415O32084J571804K493454L387148M237199N019080N695659
36688A28938851O213351O499988O467352O022308N089210L641517J732308m92823
36680A64112062k814104m986470o800271q127579q936479r274301r234547q924392
36672A05013919q442208p866648p254216o641806o051355n494656m977362m501652
36664E3784016m067794l674812l320780l002910k717739k461480k230466k021558
36656C0286477j832324j661048j506584j368129j244848j135476j038127r50431
36648A9549510q70034p95128p24815o59108n98652n44400m97397m58538m28165
$$ plain form
36639 13973273 13567650 13178572 12802662 12439161 12089131 11754100 11434694 11129856 10837080
36630 10837080 10553530 10277330 10008197 9747019 9494753 9251406 9015820 8786270 8561303
36621 8561303 8340167 8122688 7909049 7699801 7496041 7299353 7111373 6933204 6764986
36612 6764986 6605865 6454338 6308892 6168634 6033555 5904288 5781480 5665179 5554532
36603 5554532 5447886 5343255 5239049 5134922 5032460 4935239 4848045 4775478 4720598 4684208
36593 4684208 4664904 4659626 4664342 4674677 4686361 4695528 4698907 4693950 4678981 4653341 4617510 4573085
36581 4573085 4522491 4468406 4413035 4357563 4301961 4245157 4185420 4120896 4050144 3972614 3888914
36570 3888914 3800804 3711011 3622891 3539982 3465343 3400838 3346721 3301889 3264646 3233329 3206228
$$ packed form
36639A3973273m05623l89078l75910l63501l50030l35031l19406l04838k92776
36630A0837080k83550k76200k69133k61178k52266k43347k35586k29550k24967
36621H561303k21136k17479k13639k09248k03760j96688j87980j78169j68218
36612F764986j59121j51527j45446j40258j35079j29267j22808j16301j10647
36603E554532j06646j04631j04206j04127j02462r7221q7194p2567n4880l6390
36593D684208j9304n278M716J0335J1684R167L379m957j4969k5640l5831m4425
36581D573085n0594n4085n5371n5472n5602n6804n9737o4524p0752p7530q3700
36570C888914q8110q9793q8120q2909p4639o4505n4117m4832l7243l1317k7101
$$ plain form
36559 3206228 3181027 3154585 3123658 3086251 3042645 2995454 2948843 2907563 2876245 2858971 2858935 2878166
36547 2878166 2917405 2976132 3052476 3142939 3242162 3343164 3438129 3519403 3580217 3615080 3620076
36536 3620076 3593297 3535296 3449178 3340168 3214758 3079714 2941227 2804350 2672841 2549470
36526 2549470 2436530 2336206 2250540 2181045 2128303 2091799 2070121 2061445 2063940 2075768 2094656
36515 2094656 2117515 2140730 2161175 2177177 2188683 2196512 2201271 2202630 2199187 2188911 2169952 2141496
36503 2141496 2104270 2060526 2013606 1967364 1925568 1891301 1866470 1851545 1845592 1846543 1851711 1858526
36491 1858526 1865350 1871980 1879465 1889182 1901499 1914633 1924280 1924282 1908197 1871197 1811508 1730833 1633660
36478 1633660 1525842 1413098 1300015 1189777 1084467 985620 894683 813140 742268 682707
$$ packed form
36559C206228k5201k6442l0927l7407m3606m7191m6611m1280l1318j7274l6J9231
36547B878166L9239N8727P6344R0463R9223J01002R4965Q1274O0814L4863M996
36536C620076k6779n8001q6118j09010j25410j35044j38487j36877j31509j23371
36526B549470j12940j00324q5666o9495n2742l6504k1678q676K495J1828J8888
36515B094656K2859K3215K0445J6002J1506P829M759J359l443j0276j8959k8456
36503B141496l7226m3744m6920m6242m1796l4267k4831j4925n953R51N168O815
36491A858526O824O630P485R717J2317J3134R647Kj6085l7000n9689q0675r7173
36478A633660j07818j12744j13083j10238j05310r8847r0937q1543p0872n9561
$$ plain form
36468 682707 634192 595726 566082 544262 529617 521688 520099 524712 535754 553614 578286 608889
36456 608889 643639 680256 716433 750076 779415 803093 820220 830331 833285 829327 819287 804702
36444 804702 787601 769939 752988 737022 721513 705777 689702 674043 659963 647901 636423
36433 636423 621946 599777 566075 519623 462488 399453 336760 280761 236674 207508 193482
36422 193482 192247 199908 212315 225892 237737 245266 246087 238502 222451 200217 176217 155747 143259
36409 143259 140985 148507 163342 182074 201462 219118 233761 245146 253843 261002 268170 277173 289992
36396 289992 308463 333844 366402 405317 448916 495083 541514 585729 625045 656807 678946
36385 678946 690485 691676 683690 668174 646919 621691 594134 565605 536919 508196 479041 449239
$$ packed form
36468F82707m8515l8466k9644k1820j4645p929j589M613J1042J7860K4672L0603
36456F08889L4750L6617L6177L3643K9339K3678J7127J0111K954l958j0040j4585
36444H04702j7101j7662j6951j5966j5509j5736j6075j5659j4080j2062j1478
36433F36423j4477k2169l3702m6452n7135o3035o2693n5999m4087k9166j4026
36422A93482j235P661J2407J3577J1845P529Q21p585j6051k2234k4000k0470j2488
36409A43259k274P522J4835J8732J9388J7656J4643J1385Q697P159P168R003J2819
36396B89992J8471K5381L2558L8915M3599M6167M6431M4215L9316L1762K2139
36385F78946J1539J191p986j5516k1255k5228k7557k8529k8686k8723k9155k9802
$$ plain form
36373 449239 419690 392964 372916 363340 366309 381112 404278 430625 454730 472164 480141 477523
36361 477523 464455 441890 411245 374254 333014 290050 248267 210598 179382 155727 139335
36350 139335 128968 123266 121331 122806 127670 136075 148236 164233 183707 205781 229385 253823
36338 253823 279182 306249 336017 369106 405450 444358 484887 526262 568115 610333 652664
36327 652664 694371 734309 771435 805390 836718 866620 896514 927626 960634 995315 1030241
36316 1030241 1062820 1089782 1108021 1115469 1111665 1097850 1076710 1052007 1028238 1010118 1001614 1004724
36304 1004724 1018689 1040303 1065286 1089886 1111759 1129707 1142751 1149353 1147440 1135212 1112145 1079582
36292 1079582 1040583 999089 958750 921926 889321 860288 833425 806966 778915 747159 709721
$$ packed form
36373D49239k9549k6726k0048r576K969J4803K3166K6347K4105J7434P977k618
36361D77523j3068k2565l0645l6991m1240m2964m1783l7669l1216k3655j6392
36350A39335j0367n702j935J475M864Q405J2161J5997J9474K2074K3604K4438
36338B53823K5359K7067K9768L3089L6344L8908M0529M1375M1853M2218M2331
36327F52664M1707L9938L7126L3955L1328K9902K9894L1112L3008L4681L4926
36316A030241L2579K6962J8239P448l804j3815k1140k4703k3769j8120q504L110
36304A004724J3965K1614K4983K4600K1873J7948J3044O602j913j2228k3067l2563
36292A079582l8999m1494m0339l6824l2605k9033k6863k6459k8051l1756l7438
$$ plain form
36281 709721 665094 612467 551840 484025 410479 333076 254046 176131 102661 37188 -17226
36270 -17226 -58583 -86003 -99452 -99456 -87050 -63804 -31725 7045 50566 97280 146005 195845
36258 195845 246128 296233 345235 391532 432805 466475 490371 503280 505157 497031 480589 457537
36246 457537 428909 394670 353917 305668 249928 188466 124868 63795 9805 -33820 -65872
36235 -65872 -87368 -100919 -109569 -115650 -120189 -123002 -123213 -119880 -112604 -102007 -89899 -79097 -72859
36222 -72859 -74125 -84714 -104714 -132311 -164199 -196493 -225800 -249924 -267853 -279168 -283472 -280397
36210 -280397 -270105 -253723 -233253 -210914 -188311 -165777 -142240 -115680 -84088 -46386 -2878
36199 -2878 44940 95038 145578 195419 244157 291650 337244 379197 414680 440463 453966 454151
$$ packed form
36281G09721m4627n2627o0627o7815p3546p7403p9030p7915p3470o5473n4414
36270a7226m1357k7420j3449mJ2406K3246L2079L8770M3521M6714M8725M9840
36258A95845N0283N0105M9002M6297M1273L3670K3896J2909J877q126j6442k3052
36246D57537k8628l4239m0753m8249n5740o1462o3598o1073n3990m3625l2052
36235f5872k1496j3551q650o081m539k813k11L333P276J0597J2108J0802O238
36222g2859j266j0589k0000k7597l1888l2294k9307k4124j7929j1315m304L075
36210b80397J0292J6382K0470K2339K2603K2534K3537K6560L1592L7702M3508
36199b878M7818N0098N0540M9841M8738M7493M5594M1953L5483K5783J3503J85
$$ plain form
36187 454151 441771 418872 387788 350205 306759 257287 201473 139511 72537 2794 -66437
36176 -66437 -131202 -187507 -232067 -262904 -279648 -283481 -276790 -262592 -244033 -224192 -206160 -193043
36164 -193043 -187615 -191741 -205924 -229192 -259342 -293406 -328295 -361414 -390970 -415803 -434867 -446797
36152 -446797 -449928 -442829 -425036 -397429 -361984 -321102 -276999 -231428 -185648 -140486 -96410 -53680
36140 -53680 -12461 27171 65354 102490 139170 175903 212746 248946 282804 311969 334159 348022
36128 348022 353699 352819 348021 342289 338352 338259 343057 352631 365827 380889 396102 410314 423199 435209
36114 435209 447330 460654 475899 493109 511749 531181 551227 572438 595943 622934 653919
36103 653919 687974 722238 751994 771499 775376 760050 724622 670798 601998 522223 435340 345079
$$ packed form
36187D54151j2380k2899l1084l7583m3446m9472n5814o1962o6974o9743o9231
36176f6437o4765n6305m4560l0837j6744l833O691J4198J8559J9841J8032J3117
36164a93043N428m126j4183k3268l0150l4064l4889l3119k9556k4833j9064j1930
36152d46797l131P099J7793K7607L5445M0882M4103M5571M5780M5162M4076M2730
36140e3680M1219L9632L8183L7136L6680L6733L6843L6200L3858K9165K2190J3863
36128C48022N677q80m798n732l937r3M798R574J3196J5062J5213J4212J2885J2010
36114D35209J2121J3324J5245J7210J8640J9432K0046K1211K3505K6991L0985
36103F53919L4055L4264K9756J9505L877j5326l5428n3824o8800p9775q6883r0261
$$ plain form
36091 345079 255365 170412 94333 30471 -19156 -54102 -75387 -85015 -85177 -77485 -62620 -40556
36079 -40556 -11105 25578 68738 116993 168484 221160 273152 323169 370879 417134 463879 513556
36067 513556 568149 628299 692920 759469 824535 884400 935439 974474 999158 1008322 1002172 982260
36055 982260 951156 911840 867030 818883 769275 720349 674715 635058 603507 581270 568685
36044 568685 565437 570726 583374 602006 625369 652612 683333 717212 753355 789700 822865 848630
36032 848630 862892 862749 847312 817870 777382 729552 677979 625594 574309 524786 476486 428244
36020 428244 379340 330504 284195 243884 212684 192046 181151 177165 176096 173794 166768 152624
36008 152624 130187 99375 60902 15845 -34828 -90540 -150985 -215681 -283505 -352534 -420248
$$ packed form
36091C45079q9714q4953p6079o3862m9627l4946k1285r628j62P692J4865K2064
36079d0556K9451L6683M3160M8255N1491N2676N1992N0017M7710M6255M6745M9677
36067E13556N4593O0150O4621O6549O5066N9865N1039L9035K4684R164o150j9912
36055I82260l1104l9316m4810m8147m9608m8926m5634l9657l1551k2237j2585
36044E68685l248N289J2648J8632K3363K7243L0721L3879L6143L6345L3165K5765
36032H48630J4262j43j5437k9442m0488m7830n1573n2385n1285m9523m8300m8242
36020D28244m8904m8836m6309m0311l1200k0638j0895l986j069k302p026j4144
36008A52624k2437l0812l8473m5057n0673n5712o0445o4696o7824o9029o7714
$$ plain form
35997 -420248 -483892 -540765 -588440 -625001 -649369 -661661 -663346 -657068 -646131 -633788 -622500 -613323
35985 -613323 -605532 -596738 -583656 -563394 -534786 -499094 -459701 -420949 -386750 -359614 -340385 -328497
35973 -328497 -322374 -319742 -317957 -314485 -307591 -296997 -284193 -272232 -265003 -266245 -278586 -302957 -338514
35960 -338514 -382932 -432807 -483995 -531989 -572531 -602578 -621379 -631252 -637477 -647078 -666720 -700522
35948 -700522 -748700 -807555 -870681 -930808 -981520 -1018303 -1038796 -1042559 -1030794 -1006130 -972291 -933418
35936 -933418 -893204 -854177 -817365 -782339 -747572 -711042 -670926 -626125 -576419 -522227 -464195
35925 -464195 -402843 -338518 -271658 -203200 -134860 -69040 -8360 45056 90241 127633 158789
35914 158789 185670 209863 232079 252094 269154 282719 293167 301993 311249 322432 335439 348154
$$ packed form
35997d20248o3644n6873m7675l6561k4368j2292j685O278J0937J2343J1288R177
35985f13323P791Q794J3082K0262K8608L5692L9393L8752L4199K7136J9229J1888
35973c28497O123K632J785L472O894J0594J2804J1961P229j242j2341k4371l5557
35960c38514m4418m9875n1188m7994m0542l0047j8801r873o225r601j9642l3802
35948g00522m8178n8855o3126o0127n0712l6783k0493l763J1765K4664L3839L8873
35936i33418M0214L9027L6812L5026L4767L6530M0116M4801M9706N4192N8032
35925d64195O1352O4325O6860O8458O8340O5820O0680N3416M5185L7392L1156
35914A58789K6881K4193K2216K0015J7060J3565J0448Q826R256J1183J3007J2715
$$ plain form
35902 348154 356841 357197 345602 320100 280711 229106 168049 101081 32529 -32481 -88489 -130730
35890 -130730 -156424 -165760 -162160 -151576 -140853 -135549 -138028 -146774 -157405 -164946 -166151 -160705 -150872
35877 -150872 -140099 -131488 -126856 -126497 -129451 -134004 -138397 -141666 -144312 -148361 -156670 -171812 -195117 -226261
35863 -226261 -263434 -303865 -344448 -382304 -415245 -441998 -462087 -475278 -480915 -477668 -464065 -439572
35851 -439572 -405549 -365516 -324595 -288386 -261674 -247466 -246756 -258988 -282692 -315764 -355328 -397628
35839 -397628 -438326 -473192 -498894 -513605 -517257 -511365 -498450 -481208 -461745 -441155 -419524 -396295
35827 -396295 -370778 -342618 -312047 -279952 -247716 -216941 -189055 -164919 -144487 -126662 -109538
35816 -109538 -91080 -70013 -46449 -21963 826 18833 28988 28697 16375 -7923 -41947 -81096
$$ packed form
35902C48154Q687L56j1595k5502l9389n1605o1057o6968o8552o5010n6008m2241
35890a30730k5694r336L600J0584J0723N304k479q746j0631p541j205N446R833
35877a50872J0773Q611M632L59k954m553m393l269k646m049q309j5142k3305l1144
35863b26261l7173m0431m0583l7856l2941k6753k0089j3191n637L247J3603K4493
35851d39572L4023M0033M0921L6209K6712J4208P10j2232k3704l3072l9564m2300
35839c97628m0698l4866k5702j4711l652N892J2915J7242J9463K0590K1631K3229
35827c96295K5517K8160L0571L2095L2236L0775K7886K4136K0432J7825J7124
35816a09538J8458K1067K3564K4486K2789J8007J0155k91j2322k4298l4024l9149
$$ plain form
35804 -81096 -119064 -149342 -167131 -170850 -162503 -146868 -129957 -117377 -113014 -118225 -131630 -149571
35792 -149571 -167192 -179942 -184996 -182031 -172978 -160917 -148807 -138701 -131674 -128114 -127938 -130614 -135163
35779 -135163 -140371 -145232 -149426 -153564 -159004 -167322 -179701 -196687 -218402 -245026 -277063 -315195 -359780
35766 -359780 -410351 -465351 -522243 -577985 -629790 -675917 -716141 -751682 -784627 -817078 -850248
35755 -850248 -883659 -914680 -938693 -950041 -943469 -915543 -865561 -795736 -710764 -617019 -521609 -431371
35743 -431371 -351824 -286281 -235441 -197743 -170200 -149201 -130907 -111410 -87060 -55095 -14382
35732 -14382 34093 87245 140541 189201 229604 260367 282644 299474 314472 330306 347598 364720
35720 364720 378650 386486 386779 379846 366921 348822 325186 294804 256746 211480 161288 109878
$$ packed form
35804h1096l7968l0278j7789l719Q347J5635J6911J2580M363n211j3405j7941
35792a49571j7621j2750n054K965R053J2061J2110J0106P027L560J76k676m549
35779a35163n208m861m194m138n440q318j2379j6986k1715k6624l2037l8132m4585
35766c59780n0571n5000n6892n5742n1805m6127m0224l5541l2945l2451l3170
35755h50248l3411l1021k4013j1348O572K7926M9982O9825Q4972R3745R5410R0238
35743d31371P9547O5543N0840L7698K7543K0999J8294J9497K4350L1965M0713
35732a4382M8475N3152N3296M8660M0403L0763K2277J6830J4998J5834J7292J7122
35720C64720J3930P836K93o933j2925j8099k3636l0382l8058m5266n0192n1410
$$ plain form
35708 109878 61424 19601 -12934 -34531 -44310 -42110 -28676 -5793 23929 57551 92310 125924
35696 125924 156662 183393 205783 224500 241056 257009 272779 286849 295896 295836 283211 256328
35684 256328 215793 164430 106625 47345 -8881 -58747 -100536 -134091 -160472 -181468 -199059
35673 -199059 -214916 -230046 -244588 -257818 -268348 -274565 -275235 -270061 -259864 -246305 -231304 -216450
35661 -216450 -202507 -189043 -174268 -155253 -128646 -91690 -43148 16335 84581 158665 235640
35650 235640 312828 387773 458217 522372 579324 629086 671997 707747 734723 750303 751932 738277
35638 738277 709682 667844 615125 553964 486616 415186 341876 269288 200635 139588 89680
35627 89680 53328 30951 20700 19056 21930 25736 28052 27856 25491 22347 20364 21524 27438 39034
$$ packed form
35708A09878m8454m1823l2535k1597r779K200J3434K2883K9722L3622L4759L3614
35696A25924L0738K6731K2390J8717J6556J5953J5770J4070R047o0j2625k6883
35684B56328m0535n1363n7805n9280n6226m9866m1789l3555k6381k0996j7591
35673a99059j5857j5130j4542j3230j0530o217o70N174J0197J3559J5001J4854
35661b16450J3943J3464J4775J9015K6607L6956M8542N9483O8246P4084P6975
35650B35640P7188P4945P0444O4155N6952M9762M2911L5750K6976J5580J629j3655
35638G38277k8595m1838n2719o1161o7348p1430p3310p2588o8653o1047m9908
35627H9680l6352k2377j0251j644K874L806K316j96k365l144j983J160N914J1596
$$ plain form
35613 39034 56355 78560 104268 132108 161204 191472 223696 259373 300281 347822 402389 462994
35601 462994 527306 592052 653687 709065 755899 792944 820043 838127 849014 854873 857636 858702
35589 858702 859134 860002 862546 868088 877875 892936 913899 940651 971980 1005474 1037879 1065879 1086856
35576 1086856 1099171 1101923 1094613 1077132 1049976 1014213 971061 921341 865255 802531 732791 656075
35564 656075 573510 487860 403536 325849 259758 208577 173063 151082 137999 127838 115015
35553 115015 96118 71033 42800 16211 -4203 -15713 -17783 -11415 1843 20524 43276 68575
35541 68575 94467 118561 138282 151254 155743 151067 137889 118298 95551 73578 56325 47102
35529 47102 47930 58945 77988 100765 121810 136214 141447 138336 130625 123323 120842 125857 139227
$$ packed form
35613C9034J7321K2205K5708K7840K9096L0268L2224L5677M0908M7541N4567O0605
35601D62994O4312O4746O1635N5378M6834L7045K7099J8084J0887N859K763J066
35589H58702M32Q68K544N542R787J5061K0963K6752L1329L3494L2405K8000K0977
35576A086856J2315K752p310j7481k7156l5763m3152m9720n6086o2724o9740p6716
35564F56075q2565q5650q4324p7687o6091n1181l5514k1981j3083j0161j2823
35553A15015j8897k5085k8233k6589k0414j1510k070O368J3258J8681K2752K5299
35541F8575K5892K4094J9721J2972M489m676j3178j9591k2747k1973j7253r223
35529D7102Q28J1015J9043K2777K1045J4404N233l111p711p302k481N015J3370
$$ plain form
35516 139227 160564 188847 222765 260782 301088 341565 379955 414278 443299 466828 485755
35505 485755 501876 517520 534854 554977 577134 598637 615590 624130 621630 607382 582553 549567
35493 549567 511302 470524 429747 391412 358008 331855 314485 305997 304904 308743 315103 322498
35481 322498 330659 340316 352741 369358 391502 420322 456566 500196 549965 603302 656610 705886
35469 705886 747426 778585 798402 807816 809137 804921 796717 784342 765935 738612 699322 645634
35457 645634 576428 492512 396941 294791 192372 96188 11973 -56136 -106272 -139104 -157460
35446 -157460 -165304 -166642 -164851 -162609 -162062 -164848 -171752 -182241 -194269 -204728 -210491 -209629 -202251 -190519
35432 -190519 -177856 -167703 -162497 -163326 -170176 -182309 -198381 -216393 -233839 -248254 -257966 -262493 -262315
$$ packed form
35516A39227K1337K8283L3918L8017M0306M0477L8390L4323K9021K3529J8927
35505D85755J6121J5644J7334K0123K2157K1503J6953Q540k500j4248k4829l2986
35493E49567l8265m0778m0777l8335l3404k6153j7370q488j093L839O360P395
35481C22498Q161R657J2425J6617K2144K8820L6244M3630M9769N3337N3308M9276
35469G05886M1540L1159J9817R414J321m216q204j2375j8407k7323l9290n3688
35457F45634o9206q3916r5571j02150j02419r6184q4215o8109n0136l2832j8356
35446a57460p844j338J791K242N47k786o904j0489j2028j0459n763Q62P378J1732
35432a90519J2663J0153N206q29o850j2133j6072j8012j7446j4415r712m527J78
$$ plain form
35419 -262315 -258158 -250348 -238649 -222586 -201902 -176801 -147865 -115803 -81284 -45064 -8370 26890
35407 26890 58536 85119 106852 125778 145065 167950 196874 232955 275755 323344 372764 420803
35395 420803 464770 503015 535036 561257 582642 600388 615816 630382 645576 662495 681178
35384 681178 700061 715946 724682 722427 707098 679403 642982 603489 566895 537721 517864 506458
35372 506458 500628 496666 491129 481597 467075 448106 426559 405103 386378 372078 362294 355513 349352
35359 349352 341640 331207 317936 302244 284504 264744 242662 217820 189977 159589 128330 99253
35347 99253 76248 62815 60550 68180 81707 95725 105322 107578 102026 90028 73689 54955 35317
35334 35317 15953 -2045 -17602 -29753 -37783 -41305 -40275 -35089 -26754 -17078 -8646 -4341 -6486
$$ packed form
35419b62315M157P810J1699J6063K0684K5101K8936L2062L4519L6220L6694L5260
35407B6890L1646K6583K1733J8926J9287K2885K8924L6081M2800M7589M9420M8039
35395D20803M3967L8245L2021K6221K1385J7746J5428J4566J5194J6919J8683
35384F81178J8883J5885Q736k255j5329k7695l6421l9493l6594k9174j9857j1406
35372E06458n830l962n537r532j4522j8969k1547k1456j8725j4300r784o781o161
35359C49352p712j0433j3271j5692j7740j9760k2082k4842k7843l0388l1259k9077
35347I9253k3005j3433k265P630J3527J4018R597K256n552j1998j6339j8734j9638
35334C5317j9364j7998j5557j2151q030l522J030N186Q335R676Q432M305k145
$$ plain form
35321 -6486 -15870 -31103 -48594 -63271 -69898 -64626 -46089 -15539 23987 68984 116560 164901
35309 164901 213116 260699 306938 350608 390052 423565 449720 467442 475933 474744 464025 444806
35297 444806 419007 389110 357711 327177 299521 276255 258102 244618 234080 223878 211369
35286 211369 194733 173380 147764 118799 87351 54041 19392 -15816 -50122 -81062 -105259
35275 -105259 -119187 -120414 -108617 -85818 -55799 -23278 6760 29560 41034 38274 20053 -12729
35263 -12729 -56860 -107255 -158098 -204227 -242043 -269686 -286791 -294208 -293618 -286848 -275048 -258289
35251 -258289 -235923 -207366 -172693 -132731 -88893 -43128 2016 43505 78240 103625 117847
35240 117847 119793 108761 84363 46735 -3105 -63064 -130171 -201084 -272583 -341849 -406432 -464157
$$ packed form
35321f486r384j5233j7491j4677o627N272J8537L0550L9526M4997M7576M8341
35309A64901M8215M7583M6239M3670L9444L3513K6155J7722Q491j189j0719j9219
35297D44806k5799k9897l1399l0534k7656k3266j8153j3484j0538j0202j2509
35286B11369j6636k1353k5616k8965l1448l3310l4649l5208l4306l0940k4197
35275a05259j3928j227J1797K2799L0019L2521L0038K2800J1474k760j8221l2782
35263a2729m4131n0395n0843m6129l7816k7643j7105p417N90O770J1800J6759
35251b58289K2366K8557L4673L9962M3838M5765M5144M1489L4735K5385J4222
35240A17847J946j1032k4398l7628m9840n9959o7107p0913p1499o9266o4583n7725
$$ plain form
35228 -464157 -513120 -551865 -579640 -596529 -603323 -601159 -591228 -574772 -553381 -529244 -505033 -483405
35216 -483405 -466325 -454555 -447563 -443888 -441852 -440289 -438973 -438626 -440503 -445739 -454617 -466106 -478010
35203 -478010 -487881 -494335 -497936 -501019 -506468 -516266 -530724 -548700 -568489 -588726 -608935 -629503 -651174
35190 -651174 -674265 -698019 -720487 -738977 -750805 -754001 -747818 -733009 -711882 -688101 -666170 -650689
35178 -650689 -645424 -652444 -671476 -699782 -732681 -764646 -790696 -807535 -814085 -811246 -801135 -786108
35166 -786108 -767862 -746841 -722124 -691965 -654734 -609843 -558218 -502240 -445340 -391415 -344203
35155 -344203 -306660 -280575 -266483 -263828 -271168 -286424 -307177 -331042 -355960 -380347 -403163 -423982
35143 -423982 -443041 -461121 -479184 -497847 -516946 -535386 -551408 -563093 -568896 -568003 -560458 -547103
$$ packed form
35228d64157m8963l8745k7775j6889o794K164R931J6456K1391K4137K4211K1628
35216d83405J7080J1770O992L675K036J563J316L47j877n236q878j1489j1904
35203d78010r871o454l601l083n449r798j4458j7976j9789k0237k0209k0568k1671
35190f51174k3091k3754k2468j8490j1828l196O183J4809K1127K3781K1931J5481
35178f50689N265p020j9032k8306l2899l1965k6050j6839o550K839J0111J5027
35166g86108J8246K1021K4717L0159L7231M4891N1625N5978N6900N3925M7212
35155c44203L7543K6085J4092K655p340j5256k0753k3865k4918k4387k2816k0819
35143d23982j9059j8080j8063j8663j9099j8440j6022j1685n803Q93P545J3355
$$ plain form
35131 -547103 -529373 -508978 -487551 -466364 -446117 -426906 -408357 -389987 -371568 -353259 -335335
35120 -335335 -317642 -299166 -278017 -252011 -219657 -181123 -138590 -95758 -56688 -24670 -1617
35109 -1617 11907 16290 12334 769 -18032 -43848 -75997 -112705 -151114 -188037 -221085 -249398
35097 -249398 -273545 -294609 -313068 -328133 -337943 -340484 -334627 -320777 -300810 -277424 -253197 -229924
35085 -229924 -208542 -189632 -173943 -162423 -155709 -153527 -154476 -156402 -157180 -155518 -151353 -145575 -139229 -132723
35071 -132723 -125530 -116448 -104034 -86889 -63786 -33862 3067 46220 93799 143112 190732 232713
35059 232713 265033 284317 288538 277301 251697 214036 167669 116781 65922 19268 -19992 -49861
35047 -49861 -69362 -78375 -77697 -69198 -55736 -40514 -26070 -13306 -1210 12543 30306 53185
$$ packed form
35131e47103J7730K0395K1427K1187K0247J9211J8549J8370J8419J8309J7924
35120c35335J7693J8476K1149K6006L2354L8534M2533M2832L9070L2018K3053
35109a617J3524M383l956j1565j8801k5816l2149l6708l8409l6923l3048k8313
35097b49398k4147k1064j8459j5065r810k541N857J3850J9967K3386K4227K3273
35085b29924K1382J8910J5689J1520O714K182r49j926p78J662M165N778O346O506
35071a32723P193R082J2414J7145K3103K9924L6929M3153M7579M9313M7620M1981
35059B32713L2320J9284M221j1237k5604l7661m6367n0888n0859m6654l9260k9869
35047d9861j9501r013O78Q499J3462J5222J4444J2764J2096J3753J7763K2879
$$ plain form
35035 53185 80395 109468 137055 159968 176180 185500 189602 191251 193108 196837 203012 211644 222835
35022 222835 237091 255265 278164 306030 337999 371813 403882 429747 444914 445941 431468 402744
35010 402744 363363 318290 272723 231288 197806 175305 165943 170704 189103 219118 257360 299424
34998 299424 340445 375879 402281 417722 421725 415009 399376 377715 353757 331396 313765 302515
34986 302515 297634 297732 300558 303593 304738 302995 298842 293955 290313 289316 291449 296611 304616 315351 328475
34971 328475 342926 356806 367859 374336 375608 372173 365234 356273 346834 338305 331673 327434 325844
34958 325844 327225 331913 339819 350042 361026 371131 379261 385123 389162 392391 396233 402408 412779
34945 412779 429212 453421 486746 529771 581807 640504 701840 760514 810648 846618 864029
$$ packed form
35035E3185K7210K9073K7587K2913J6212R320M102J649J857L729O175Q632J1191
35022B22835J4256J8174K2899K7866L1969L3814L2069K5865J5167J027j4473k8724
35010D02744l9381m5073m5567m1435l3482k2501r362M761J8399L0015L8242M2064
34998B99424M1021L5434K6402J5441M003o716j5633k1661k3958k2361j7631j1250
34986C02515m881R8K826L035J145j743m153m887l642r97K133N162Q005J0735J3124
34971C28475J4451J3880J1053O477J272l435o939q961r439q529o632m239j590
34958C25844J381M688P906J0223J0984J0105Q130N862M039L229L842O175J0371
34945D12779J6433K4209L3325M3025N2036N8697O1336N8674N0134L5970J7411
$$ plain form
34934 864029 860705 837475 798368 749899 699543 653813 616787 589645 571385 560109 554103 552265
34922 552265 553909 558339 564536 571059 576209 578301 575904 567864 553091 530375 498433 456269 403689
34909 403689 341733 272881 200830 129810 63621 4923 -44834 -84892 -114628 -133435 -141163 -138723
34897 -138723 -128451 -114018 -99985 -91237 -92375 -107024 -137048 -181822 -237994 -299964 -361047 -414882
34885 -414882 -456607 -483483 -494904 -491970 -476936 -452647 -422012 -387478 -350666 -312399 -273116 -233464
34873 -233464 -194690 -158625 -127337 -102663 -85855 -77481 -77525 -85614 -101203 -123614 -151929 -184845
34861 -184845 -220601 -257046 -291834 -322715 -347927 -366502 -378346 -384007 -384333 -380253 -372781 -363100 -352600
34848 -352600 -342845 -335519 -332416 -335370 -346001 -365249 -392774 -426686 -463848 -500644 -533787 -560756
$$ packed form
34934H64029l324k3230l9107m8469n0356m5730l7026k7142j8260j1276o006j838
34922E52265J644M430O197O523N150K092k397q040j4773k2716l1942m2164n2580
34909D03689o1956o8852p2051p1020o6189n8698m9757m0058k9736j8807p728K440
34897a38723J0272J4433J4033Q748j138j4649l0024m4774n6172o1970o1083n3835
34885d14882m1725k6876j1421K934J5034K4289L0635L4534L6812L8267L9283L9652
34873b33464L8774L6065L1288K4674J6808Q374m4q089j5589k2411k8315l2916
34861a84845l5756l6445l4788l0881k5212j8575j1844n661l26M080P472R681J0500
34848c52600R755P326L103k954j0631j9248k7525l3912l7162l6796l3143k6969
$$ plain form
34836 -560756 -579774 -589572 -589134 -577639 -554731 -521003 -478420 -430355 -381175 -335492 -297222 -268665
34824 -268665 -249961 -239237 -233443 -229483 -225156 -219536 -212757 -205374 -197777 -189997 -181878 -173101 -162794
34811 -162794 -149031 -128844 -99057 -57509 -3943 59843 130591 204609 278780 351176 421044
34800 421044 488243 552563 613331 669360 719049 760499 791729 811097 817800 812189 795808 771253
34788 771253 741913 711594 684051 662551 649506 646128 652075 665303 682348 698969 710882 714407
34776 714407 707029 687956 658567 622355 584079 548257 517723 493057 473185 456579 442223 429801
34764 429801 419216 409886 400350 388508 372362 350804 324045 293582 261909 232027 206772 188138
34752 188138 176947 172954 175050 181224 188450 192949 190983 179876 158796 128941 93152 55139 18613
$$ packed form
34836e60756j9018r798M38J1495K2908L3728M2583M8065M9180M5683L8270K8557
34824b68665J8704J0724N794L960M327N620O779P383P597P780Q119Q777J0307
34811a62794J3763K0187K9787M1548N3566O3786P0748P4018P4171P2396O9868
34800D21044O7199O4320O0768N6029M9689M1450L1230J9368O703n611j6381k4555
34788G71253k9340l0319k7543k1500j3045l378N947J3228J7045J6621J1913L525
34776G14407p378j9073k9389l6212l8276l5822l0534k4666j9872j6606j4356j2422
34764D29801j0585r330r536j1842j6146k1558k6759l0463l1673k9882k5255j8634
34752A88138j1191l993K096O174P226M499j966j1107k1080k9855l5789l8013l6526
$$ plain form
34739 18613 -13464 -39349 -58653 -72136 -81297 -87974 -94105 -101561 -111887 -126002 -144019 -165341
34727 -165341 -188974 -213895 -239309 -264612 -289039 -311207 -329023 -340198 -343278 -338595 -328515 -316689
34715 -316689 -306587 -300118 -297083 -295678 -293561 -288824 -280550 -268969 -255280 -241185 -228245 -217334 -208488
34702 -208488 -201218 -195030 -189783 -185533 -182050 -178424 -173207 -165008 -153123 -137771 -120028 -101625 -84734
34689 -84734 -71611 -64134 -63510 -70302 -84685 -106613 -135849 -171885 -213826 -260195 -308753 -356421
34677 -356421 -399432 -433733 -455622 -462546 -453769 -430566 -395828 -353316 -306916 -260059 -215320 -174210
34665 -174210 -137241 -104141 -74192 -46589 -20886 2590 22593 37229 44575 43325 33158 14685
34653 14685 -10853 -41835 -76184 -111131 -143263 -169118 -186137 -193397 -191726 -183208 -170359 -155409
$$ packed form
34739A8613l2077k5885j9304j3483r161o677o131p456j0326j4115j8017k1322
34727a65341k3633k4921k5414k5303k4427k2168j7816j1175l080M683J0080J1826
34715c16689J0102O469L035J405K117M737Q274J1581J3689J4095J2940J0911Q846
34702b08488P270O188N247M250L483L626N217Q199J1885J5352J7743J8403J6891
34689h4734J3123P477O24o792j4383k1928k9236l6036m1941m6369m8558m7668
34677c56421m3011l4301k1889o924Q777K3203L4738M2512M6400M6857M4739M1110
34665a74210L6969L3100K9949K7603K5703K3476K0003J4636P346j250j0167j8473
34653A4685k5538l0982l4349l4947l2132k5855j7019p260J671Q518J2849J4950
$$ plain form
34641 -155409 -139891 -124529 -109293 -93573 -76468 -57204 -35446 -11368 14524 41500 68466
34630 68466 93682 114728 129042 134914 132321 123015 109802 95569 82677 72811 66950 65164 66291
34617 66291 67853 66457 58738 42534 17864 -12828 -45300 -74844 -97791 -112529 -119594 -120758 -117629
34604 -117629 -110598 -98642 -80071 -53749 -20255 17446 54187 83597 99636 98044 77131 37699
34592 37699 -17772 -86191 -164633 -250546 -341554 -435328 -529762 -623230 -714527 -802428 -885204 -960409
34580 -960409 -1025008 -1075751 -1109781 -1125388 -1122579 -1103044 -1069529 -1025118 -972962 -916426 -859202 -804973
34568 -804973 -756671 -715710 -681604 -652156 -624116 -594013 -558947 -517171 -468408 -413814 -355485
34557 -355485 -295715 -236281 -178099 -121382 -66137 -12736 37762 83791 123892 157482 185335
$$ packed form
34641a55409J5518J5362J5236J5720J7105J9264K1758K4078K5892K6976K6966
34630F8466K5216K1046J4314N872k593r306j3213j4233j2892r866n861j786J127
34617F6291J562j396p719j6204k4670l0692l2472k9544k2947j4738p065j164L129
34604a17629P031J1956J8571K6322L3494L7701L6741K9410J6039j592k0913l9432
34592C7699n5471o8419p8442q5913r1008r3774r4434r3468r1297q7901q2776p5205
34580i60409o4599n0743l4030j5607K809J9535L3515M4411N2156N6536N7224N4229
34568h04973M8302M0961L4106K9448K8040L0103L5066M1776M8763N4594N8329
34557c55485N9770N9434N8182N6717N5245N3401N0498M6029M0101L3590K7853
$$ plain form
34546 185335 209523 232861 258185 287731 322714 363029 407078 451902 493686 528350 551925
34535 551925 560718 551702 523339 476512 414858 344217 271460 203249 145185 101346 74048 63623
34523 63623 68235 83998 105636 127596 145209 155485 157390 151755 140995 128714 119104 116090 122411
34510 122411 139107 165647 200548 241910 287550 334889 381037 423234 459407 488540 510734
34499 510734 527071 539292 549258 558329 567004 575075 582154 588115 593045 596779 598427 596355 588721 574264
34485 574264 552869 525612 494347 461122 427719 395367 364622 335391 307130 279192 251273
34474 251273 223720 197520 173824 153196 135006 117385 97741 73597 43328 6602 -35535
34463 -35535 -80931 -126808 -170373 -209443 -243029 -271683 -297340 -322599 -349727 -379917 -413154 -448736
$$ packed form
34546A85335K4188K3338K5324K9546L4983M0315M4049M4824M1784L4664K3575
34535E51925Q793r016k8363m6827o1654p0641p2757o8211n8064m3839k7298j0425
34523F3623M612J5763K1638K1960J7613J0276J905n635j0760j2281r610l014O321
34510A22411J6696K6540L4901M1362M5640M7339M6148M2197L6173K9133K2194
34499E10734J6337J2221R966R071Q675Q071P079N961M930L734J648k072p634j4457
34485E74264k1395k7257l1265l3225l3403l2352l0745k9231k8261k7938k7919
34474B51273k7553k6200k3696k0628j8190j7621j9644k4144l0269l6726m2137
34463c5535m5396m5877m3565l9070l3586k8654k5657k5259k7128l0190l3237l5582
$$ plain form
34451 -448736 -486060 -525193 -566755 -611177 -657806 -704475 -747775 -783848 -809328 -822073 -821492 -808407
34439 -808407 -784671 -752871 -716258 -678631 -643839 -614916 -593313 -578776 -569955 -565381 -564313 -567118
34427 -567118 -575127 -590042 -613086 -644159 -681290 -720779 -758057 -788971 -810831 -822742 -825239 -819595
34415 -819595 -807139 -788802 -764989 -735890 -702133 -665329 -628076 -593399 -564003 -541756 -527438
34404 -527438 -520653 -519856 -522595 -526097 -528073 -527422 -524491 -520802 -518412 -519294 -524906 -535957 -552273 -572754
34390 -572754 -595431 -617665 -636522 -649366 -654512 -651685 -642075 -628041 -612668 -599134 -589883 -585860
34378 -585860 -586297 -589289 -592801 -595435 -596505 -595581 -592026 -585009 -574093 -559959 -544711 -531497 -523716 -524211
34364 -524211 -534659 -555055 -583358 -615527 -646219 -669972 -682384 -680855 -664782 -635374 -595217 -547737
$$ packed form
34451d48736l7324l9133m1562m4422m6629m6669m3300l6073k5480j2745N81J3085
34439h08407K3736L1800L6613L7627L4792K8923K1603J4537Q821M574J068k805
34427e67118q009j4915k3044l1073l7131l9489l7278l0914k1860j1911k497N644
34415h19595J2456J8337K3813K9099L3757L6804L7253L4677K9396K2247J4318
34404e27438O785P97k739l502j976O51K931L689K390q82n612j1051j6316k0481
34390e72754k2677k2234j8857j2844n146K827R610J4034J5373J3534R251M023
34378e85860m37k992l512k634j070R24L555P017J0916J4134J5248J3214P781m95
34364e24211j0448k0396k8303l2169l0692k3753j2412J529J6073K9408M0157M7480
$$ plain form
34352 -547737 -496716 -446038 -399560 -360785 -332147 -314302 -306027 -304912 -308386 -314342 -321118 -327094 -330326
34339 -330326 -328504 -319227 -300575 -271817 -234026 -190190 -144593 -101587 -64402 -34613 -12484 2325
34327 2325 10224 11516 6378 -5165 -23188 -47573 -77672 -112135 -149135 -186835 -223849 -259495
34315 -259495 -293720 -326790 -358918 -389967 -419323 -445891 -468130 -484082 -491455 -487930 -471750 -442297
34303 -442297 -400284 -347415 -285865 -218092 -147120 -76923 -12374 41413 80030 100488 101454 83094
34291 83094 46904 -4247 -65945 -132232 -196058 -250147 -287955 -304365 -295998 -261348 -201011 -118055
34279 -118055 -18245 90328 198429 297423 381026 446380 494080 527166 549444 563823 571384
34268 571384 571645 563764 547787 525073 497700 467420 434876 399473 359837 314581 263019 205526
$$ packed form
34352e47737N1021N0678M6478L8775K8638J7845Q275J115l474n956o776n976l232
34339c30326J822R277J8652K8758L7791M3836M5597M3006L7185K9789K2129J4809
34327B325P899J292n138j1543j8023k4385l0099l4463l7000l7700l7014l5646
34315b59495l4225l3070l2128l1049k9356k6568k2239j5952p373L525J6180K9453
34303d42297M2013N2869O1550O7773P0972P0197O4549N3787L8617K0458R66j8360
34291H3094l6190n1151o1698o6287o3826n4089l7808j6410Q367L4650O0337Q2956
34279a18055R9810J08573J08101R8994Q3603O5354M7700L3086K2278J4379P561
34268E71384K61p881j5977k2714k7373l0280l2544l5403l9636m5256n1562n7493
$$ plain form
34256 205526 143466 78860 14029 -48745 -107606 -161506 -210404 -255081 -296672 -336137 -373883
34245 -373883 -409585 -442128 -469624 -489562 -499258 -496563 -480580 -452041 -413106 -366792 -316387 -265208
34233 -265208 -216632 -173981 -139963 -115814 -100733 -92021 -85873 -78394 -66473 -48311 -23445 7699
34221 7699 44372 85724 130495 176528 220643 259180 289045 308850 319581 324401 327518 332581
34209 332581 341306 352994 365096 374556 379200 378552 373830 367327 361568 358460 358563 360714 362277 360020
34195 360020 351226 334448 309543 277046 237381 190456 135914 73869 5701 -65432 -134599 -195636
34183 -195636 -242194 -268970 -272711 -252789 -211324 -152978 -84459 -13722 51074 102723 136062 148752
34171 148752 141505 117705 82595 42277 2681 -31462 -57391 -74589 -84402 -89184 -91331 -92621
$$ packed form
34256B05526o2060o4606o4831o2774n8861n3900m8898m4677m1591l9465l7746
34245c73883l5702l2543k7496j9938r696K695J5983K8539L8935M6314N0405N1179
34233b65208M8576M2651L4018K4149J5081Q712O148P479J1921J8162K4866L1144
34221G699L6673M1352M4771M6033M4115L8537K9865J9805J0731M820L117N063
34209C32581Q725J1688J2102R460M644o48m722o503n759l108J03K151J563k257
34195C60020q794j6778k4905l2497l9665m6925n4542o2045o8168p1133o9167o1037
34183a95636m6558k6776l741J9922M1465N8346O8519P0737O4796N1649L3339J2690
34171A48752p247k3800l5110m0318l9596l4143k5929j7198r813m782k147j290
$$ plain form
34159 -92621 -94120 -96605 -101090 -108933 -121318 -138519 -159561 -182614 -205915 -228647 -251283 -275185
34147 -275185 -301673 -331066 -362177 -392489 -418853 -438312 -448709 -448940 -438924 -419488 -392257 -359517
34135 -359517 -323889 -287808 -253022 -220457 -190530 -163661 -140552 -121996 -108408 -99447 -94059 -90966
34123 -90966 -89261 -88699 -89455 -91557 -94434 -96953 -97880 -96423 -92510 -86703 -79890 -72942 -66419 -60328 -53935
34108 -53935 -45698 -33484 -15125 10823 44524 84764 129212 174693 217288 252502 275854 283892
34096 283892 275123 250384 212607 166198 116207 67247 22327 -17827 -54423 -89320 -123668 -157372
34084 -157372 -189656 -220180 -249826 -280628 -314950 -354475 -399498 -448632 -498851 -545858 -584784
34073 -584784 -611096 -621349 -613562 -587347 -544041 -486734 -419901 -348564 -277428 -210576 -151720 -104438
$$ packed form
34159i2621j499k485m485p843j2385j7201k1042k3053k3301k2732k2636k3902
34147b75185k6488k9393l1111l0312k6364j9459j0397k31J0016J9436K7231L2740
34135c59517L5628L6081L4786L2565K9927K6869K3109J8556J3588Q961N388L093
34123i0966J705N62p56k102k877k519r27J457L913N807O813O948O523O091O393
34108e3935Q237J2214J8359K5948L3701M0240M4448M5481M2595L5214K3352Q038
34096B83892q769k4739l7777m6409m9991m8960m4920m0154l6596l4897l4348l3704
34084a57372l2284l0524k9646l0802l4322l9525m5023m9134n0219m7007l8926
34073e84784k6312j0253P787K6215M3306N7307O6833P1337P1136O6852N8856M7282
$$ plain form
34061 -104438 -71736 -54922 -52521 -60112 -71385 -79999 -81451 -74239 -59981 -42543 -26614 -16293
34049 -16293 -14159 -20971 -35862 -56772 -80853 -104679 -124393 -136136 -136875 -125255 -101787 -68170
34037 -68170 -26204 23019 79387 143513 216068 296890 384286 475067 565327 651349 729928 798051
34025 798051 852565 890448 909667 910020 893408 863326 823863 778644 730206 680085 629557 580440
34013 580440 535281 496707 466395 444413 429278 418692 410555 403782 398464 395220 394092 393796 391844
34000 391844 385434 372504 352359 325656 293854 258473 220504 180220 137343 91443 42427 -8991
33988 -8991 -61077 -111301 -156976 -196012 -227460 -251668 -269991 -284069 -294938 -302427 -305287 -302028
33976 -302028 -291992 -275987 -256194 -235429 -216239 -200325 -188512 -181201 -178907 -182449 -192626 -209615
$$ packed form
34061a04438L2702J6814K401p591j1273q614j452P212J4258J7438J5929J0321
34049a6293K134o812j4891k0910k4081k3826j9714j1743p39J1620K3468L3617
34037f8170M1966M9223N6368O4126P2555Q0822Q7396R0781R0260Q6022P8579O8123
34025G98051N4514L7883J9219L53j6612l0082l9463m5219m8438n0121n0528m9117
34013E80440m5159l8574l0312k1982j5135j0586q137o773n318l244j128k96j952
34000C91844o410j2930k0145k6703l1802l5381l7969m0284m2877m5900m9016n1418
33988h991n2086n0224m5675l9036l1448k4208j8323j4078j0869p489k860L259
33976c02028J0036J6005J9793K0765J9190J5914J1813P311K294l542j0177j6989
$$ plain form
33964 -209615 -232559 -259659 -288590 -316852 -341846 -360933 -371877 -373628 -367032 -354923 -341451 -330928
33952 -330928 -326664 -330213 -341261 -358103 -378399 -399809 -420336 -438445 -453198 -464470 -473134 -480927
33940 -480927 -489927 -501907 -517935 -538401 -563244 -592098 -624202 -658248 -692358 -724378 -752524 -776197
33928 -776197 -796507 -816041 -837834 -864040 -894993 -929110 -963552 -995311 -1022166 -1043073 -1057887
33917 -1057887 -1066751 -1069690 -1066619 -1057553 -1042574 -1021445 -993138 -955733 -906886 -844664 -768364 -678970
33905 -678970 -579200 -473156 -365757 -262044 -166517 -82618 -12363 43777 86741 118405 140932
33894 140932 156111 164927 167500 163509 152888 136440 116009 94220 74038 58347 49447 48413
33882 48413 54602 65747 78836 91357 102253 112110 122549 135166 150513 167560 183844 196209
$$ packed form
33964b09615k2944k7100k8931k8262k4994j9087j0944j751O596J2109J3472J0523
33952c30928M264l549j1048j6842k0296k1410k0527j8109j4753j1272q664p793
33940d80927r000j1980j6028k0466k4843k8854l2104l4046l4110l2020k8146k3673
33928g76197k0310j9534k1793k6206l0953l4117l4442l1759k6855k0907j4814
33917a057887q864k939L071R066J4979K1129K8307L7405M8847O2222P6300Q9394
33905f78970R9770J06044J07399J03713R5527Q3899P0255N6140M2964L1664K2527
33894A40932J5179Q816K573l991j0621j6448k0431k1789k0182j5691q900j034
33882D8413O189J1145J3089J2521J0896R857J0439J2617J5347J7047J6284J2365
$$ plain form
33870 196209 201789 198729 186404 165197 136131 100597 60144 16297 -29596 -76404 -123034 -168107
33858 -168107 -209642 -244981 -271091 -285184 -285329 -270813 -242175 -201115 -150456 -94043 -36366 18189
33846 18189 66197 105748 136385 158484 172481 178351 175565 163476 141862 111322 73290 29736
33834 29736 -17257 -65751 -113920 -159765 -200819 -234109 -256625 -266180 -262287 -246561 -222425 -194279
33822 -194279 -166586 -143251 -127352 -121043 -125399 -140147 -163406 -191719 -220563 -245256 -262020 -268845
33810 -268845 -265878 -255289 -240664 -226028 -214661 -208112 -205807 -205479 -204157 -199268 -189478 -175123 -158172
33797 -158172 -141716 -129012 -122387 -122476 -128117 -136913 -146080 -153182 -156575 -155604 -150608 -142726 -133450 -123975
33783 -123975 -114505 -103751 -89004 -66985 -35235 6702 57004 112238 168356 221398 267730 304132
$$ packed form
33870A96209N580l060j2325k1207k9066l5534m0453m3847m5893m6808m6630m5073
33858a68107m1535l5339k6110j4093j45J4516K8638M1060N0659N6413N7677N4555
33846A8189M8008L9551L0637K2099J3997N870k786j2089k1614l0540l8032m3554
33834B9736m6993m8494m8169m5845m1054l3290k2516r555L893J5726K4136K8146
33822a94279K7693K3335J5899O309m356j4748k3259k8313k8844k4693j6764o825
33810b68845K967J0589J4625J4636J1367O549K305L28J322M889R790J4355J6951
33797a58172J6456J2704O625q9n641q796r167p102l393R71M996P882R276R475
33783a23975R470J0754J4747K2019L1750M1937N0302N5234N6118N3042M6332L6402
$$ plain form
33771 304132 327967 337413 331609 310677 275710 228854 173518 114491 57695 9449 -24685 -41104
33759 -41104 -39058 -20920 8300 42120 74018 98667 112612 114243 103312 80408 46738 4180
33747 4180 -44726 -97126 -150382 -202419 -251688 -296928 -337008 -370952 -398076 -418202 -431941 -440850
33735 -440850 -447230 -453446 -461020 -470072 -479391 -487070 -491344 -491234 -486846 -479245 -469888 -459817 -449006 -436290
33721 -436290 -420050 -399363 -374967 -349447 -326549 -310007 -302554 -305521 -318870 -341386 -370848 -404259
33709 -404259 -438218 -469270 -494099 -509605 -513071 -502505 -476965 -436627 -382559 -316484 -240841 -159088
33697 -159088 -75853 3495 73724 130613 171415 194896 201204 191698 168715 135293 94953 51599
33685 51599 9420 -27386 -55094 -71024 -74096 -65174 -47009 -23694 293 21026 35708 42778
$$ packed form
33771C04132K3835R446n804k0932l4967m6856n5336n9027n6796m8246l4134j6419
33759d1104K046J8138K9220L3820L1898K4649J3945J631j0931k2904l3670m2558
33747D180m8906n2400n3256n2037m9269m5240m0080l3944k7124k0126j3739q909
33735d40850o380o216p574r052r319p679m274J10M388P601R357J0071J0811J2716
33721d36290J6240K0687K4396K5520K2898J6542P453k967j3349k2516k9462l3411
33709d04259l3959l1052k4829j5506l466J0566K5540M0338N4068O6075P5643Q1753
33697a59088Q3235P9348P0229N6889M0802K3481O308r506k2983l3422m0340m3354
33685E1599m2179l6806k7708j5930l072Q922J8165K3315K3987K0733J4682P070
$$ plain form
33673 42778 41694 32708 16771 -4473 -28773 -53632 -76949 -97590 -115578 -131730 -147006 -161994
33661 -161994 -176783 -191217 -205303 -219533 -234850 -252147 -271472 -291495 -309740 -323562 -331283 -332726
33649 -332726 -328950 -321524 -311879 -301072 -289772 -278271 -266348 -253198 -237669 -218752 -195989 -169614
33637 -169614 -140535 -110497 -82288 -59586 -46091 -44150 -53616 -71614 -93428 -114151 -130252 -140421
33625 -140421 -145483 -147725 -150101 -155471 -165907 -182170 -203594 -228441 -254469 -279400 -301160 -317961
33613 -317961 -328321 -330997 -324895 -309076 -283131 -247852 -205804 -161165 -118567 -81434 -50766 -25092
33601 -25092 -1575 22401 48005 74636 100584 124130 144386 161382 175517 186809 194401 196538
33589 196538 190997 175831 150129 114531 71398 24683 -20428 -58138 -82834 -90001 -77056 -43903
$$ packed form
33673D2778j084q986j5937k1244k4300k4859k3317k0641j7988j6152j5276j4988
33661a61994j4789j4434j4086j4230j5317j7297j9325k0023j8245j3822p721j443
33649c32726L776P426R645J0807J1300J1501J1923J3150J5529J8917K2763K6375
33637a69614K9079L0038K8209K2702J3495J941r466j7998k1814k0723j6101j0169
33625a40421n062k242k376n370j0436j6263k1424k4847k6028k4931k1760j6801
33613c17961j0360k676O102J5819K5945L5279M2048M4639M2598L7133L0668K5674
33601b5092K3517K3976K5604K6631K5948K3546K0256J6996J4135J1292P592K137
33589A96538n541j5166k5702l5598m3133m6715m5111l7710k4696p167J2945L3153
$$ plain form
33577 -43903 6996 71156 142955 216580 286809 349692 403138 447144 483325 513875 540535 564081
33565 564081 584419 600949 612913 619624 620631 615807 605379 590083 571477 552236 535839 525452
33553 525452 522419 525334 530406 532969 529258 517516 498090 472742 443749 413140 382305 352018
33541 352018 322791 295379 271083 251634 238671 233148 234960 242972 255316 269834 284580 298253
$$ packed form
33577d3903N0899O4160P1799P3625P0229O2883N3446M4006L6181L0550K6660K3546
33565E64081K0338J6530J1964O711J007m824j0428j5296j8606j9241j6397j0387
33553E25452l033K915N072K563l711j1742j9426k5348k8993l0609l0835l0287
33541C52018k9227k7412k4296j9449j2963n523J812Q012J2344J4518J4746J3673
$$ [...]
##END NTUPLES=NMR SPECTRUM
##END=
